##TITLE=1H_B3e-N2
 CDCl3
 8 sc, 
 23.11.2023
##JCAMPDX= 6.0         $$ Bruker NMR JCAMP-DX V2.0
##DATA TYPE= NMR FID
##DATA CLASS= NTUPLES
##ORIGIN= UXNMR, Bruker Analytische Messtechnik GmbH
##OWNER= root
$$ XWIN-NMR		Version 3.5
$$ Thu Nov 23 14:54:47 2023 Russian Standard Time (UT+4h)  she@DPX200
##.OBSERVE FREQUENCY= 200.1313
##.OBSERVE NUCLEUS= ^1H
##.DELAY= (6, 6)
##.ACQUISITION MODE= SIMULTANEOUS
##.ACQUISITION SCHEME= undefined
##.AVERAGES= 8
##.DIGITISER RES= 18
##SPECTROMETER/DATA SYSTEM= spect
##.PULSE SEQUENCE= zg30
##.SOLVENT NAME= DMSO
##.SHIFT REFERENCE= (INTERNAL, DMSO, 0, 15.7039)
##AUDIT TRAIL= $$ (NUMBER, WHEN, WHO, WHERE, WHAT)
$$ ##TITLE= Audit trail, XWIN-NMR		Version 3.5
$$ ##JCAMPDX= 5.01
$$ ##ORIGIN= Bruker BioSpin GmbH
$$ ##OWNER= she
$$ F:/spectra/data/she/nmr/H-F/1/audita.txt
$$ ##AUDIT TRAIL=  $$ (NUMBER, WHEN, WHO, WHERE, WHAT)
(   1,<2023-11-23 14:53:33.51 +0400>,<she>,<DPX200>,
      <created by zg, POWCHK disabled, PULCHK disabled
       configuration hash MD5:
       00 E9 B6 7A A2 85 ED C7 34 08 36 98 17 FE 4E 26
       data hash MD5: 16K
       A0 EF EA 76 AC A9 82 1F 78 FD 68 A0 AF 62 18 10>)
$$ ##END=
$$ 
$$ hash MD5
$$ 25 A3 5E 31 D4 B7 4B 26 8E B4 BA 2D 48 DF 95 23
##$RELAX= 
##$RELAX= 
##$RELAX= 
##$RELAX= 
##$RELAX= 
##$RELAX= 
$$ Bruker specific parameters
$$ --------------------------
##$DU= <F:/spectra>
##$EXPNO= 1
##$NAME= <H-F>
##$PROCNO= 1
##$TYPE= <nmr>
##$USER= <she>
##$AMP= (0..31)
100 100 100 100 100 100 100 100 100 100 100 100 100 100 100 100 100 100 
100 100 100 100 100 100 100 100 100 100 100 100 100 100 
##$AQSEQ= 0
##$AQ_mod= 1
##$AUNM= <au_zg>
##$AUTOPOS= <>
##$BF1= 200.13
##$BF2= 200.13
##$BF3= 200.13
##$BF4= 200.13
##$BF5= 200.13
##$BF6= 200.13
##$BF7= 200.13
##$BF8= 200.13
##$BYTORDA= 1
##$CFDGTYP= 0
##$CFRGTYP= 5
##$CHEMSTR= <none>
##$CNST= (0..31)
1 1 145 1 1 1 1 1 1 1 1 1 1 1 1 1 1 1 1 1 1 1 1 1 1 1 1 1 1 1 1 1 
##$CPDPRG= <>
##$CPDPRG1= <>
##$CPDPRG2= <>
##$CPDPRG3= <>
##$CPDPRG4= <mlev>
##$CPDPRG5= <mlev>
##$CPDPRG6= <mlev>
##$CPDPRG7= <mlev>
##$CPDPRG8= <mlev>
##$CPDPRGB= <>
##$CPDPRGT= <>
##$D= (0..31)
0 1.2 0 0 0 0 0 0 0 0.06 0 0.03 0 0 0 0 0.0002 0 0 0 0 0 0 0 0 0 0 0 0 
0 0 0 
##$DATE= 1700736812
##$DBL= (0..7)
120 120 120 120 120 120 120 120 
##$DBP= (0..7)
150 150 150 150 150 150 150 150 
##$DBP07= 0
##$DBPNAM0= <>
##$DBPNAM1= <>
##$DBPNAM2= <>
##$DBPNAM3= <>
##$DBPNAM4= <>
##$DBPNAM5= <>
##$DBPNAM6= <>
##$DBPNAM7= <>
##$DBPOAL= (0..7)
0.5 0.5 0.5 0.5 0.5 0.5 0.5 0.5 
##$DBPOFFS= (0..7)
0 0 0 0 0 0 0 0 
##$DE= 6
##$DECBNUC= <off>
##$DECIM= 32
##$DECNUC= <off>
##$DECSTAT= 4
##$DIGMOD= 1
##$DIGTYP= 9
##$DL= (0..7)
0 120 120 120 120 120 120 120 
##$DP= (0..7)
150 150 150 150 150 150 150 150 
##$DP07= 0
##$DPNAME0= <>
##$DPNAME1= <>
##$DPNAME2= <>
##$DPNAME3= <>
##$DPNAME4= <>
##$DPNAME5= <>
##$DPNAME6= <>
##$DPNAME7= <>
##$DPOAL= (0..7)
0.5 0.5 0.5 0.5 0.5 0.5 0.5 0.5 
##$DPOFFS= (0..7)
0 0 0 0 0 0 0 0 
##$DQDMODE= 0
##$DR= 18
##$DS= 0
##$DSLIST= <SSSSSSSSSSSSSSS>
$$ [...]
##$SUBNAM2= <"">
##$SUBNAM3= <"">
##$SUBNAM4= <"">
##$SUBNAM5= <"">
##$SUBNAM6= <"">
##$SUBNAM7= <"">
##$SUBNAM8= <"">
##$SUBNAM9= <"">
##$SW= 18.0517328524113
##$SWIBOX= (0..15)
0 0 2 0 0 0 0 0 0 0 0 0 0 0 0 0 
##$SW_h= 3612.71676300578
##$TD= 16384
##$TD0= 1
##$TE= 0
##$TE2= 300
##$TE3= 300
##$TEG= 300
##$TL= (0..7)
0 120 120 120 120 120 120 120 
##$TP= (0..7)
150 150 150 150 150 150 150 150 
##$TP07= 0
##$TPNAME0= <>
##$TPNAME1= <>
##$TPNAME2= <>
##$TPNAME3= <>
##$TPNAME4= <>
##$TPNAME5= <>
##$TPNAME6= <>
##$TPNAME7= <>
##$TPOAL= (0..7)
0.5 0.5 0.5 0.5 0.5 0.5 0.5 0.5 
##$TPOFFS= (0..7)
0 0 0 0 0 0 0 0 
##$TUNHIN= 0
##$TUNHOUT= 0
##$TUNXOUT= 0
##$USERA1= <user>
##$USERA2= <user>
##$USERA3= <user>
##$USERA4= <user>
##$USERA5= <user>
##$V9= 5
##$VALIST= <valist>
##$VCLIST= <CCCCCCCCCCCCCCC>
##$VD= 0
##$VDLIST= <DDDDDDDDDDDDDDD>
##$VPLIST= <PPPPPPPPPPPPPPP>
##$VTLIST= <TTTTTTTTTTTTTTT>
##$WBST= 1024
##$WBSW= 4
##$XGAIN= (0..3)
0 0 0 0 
##$XL= 0
##$YL= 0
##$YMAX_a= 295139
##$YMIN_a= -407403
##$ZGOPTNS= <>
##$ZL1= 120
##$ZL2= 120
##$ZL3= 120
##$ZL4= 120
##$ABSF1= 10
##$ABSF2= 0
##$ABSG= 5
##$ABSL= 3
##$ALPHA= 0
##$AQORDER= 0
##$ASSFAC= 0
##$ASSFACI= 0
##$ASSFACX= 0
##$ASSWID= 0
##$AUNMP= <proc_1d>
##$AZFE= 0.1
##$AZFW= 0.1
##$BCFW= 1
##$BC_mod= 2
##$BYTORDP= 1
##$COROFFS= 0
##$CY= 11.3945322036743
##$DATMOD= 1
##$DC= 2
##$DFILT= <>
##$DTYPP= 0
##$F1P= 15.7292609196834
##$F2P= 12.9074282941183
##$FCOR= 0.5
##$FTSIZE= 0
##$FT_mod= 4
##$GAMMA= 1
##$GB= 0.15
##$INTBC= 1
##$INTSCL= 1
##$ISEN= 128
##$LB= 0.24
##$LEV0= 0
##$LPBIN= 0
##$MAXI= 10000
##$MC2= 0
##$MEAN= 0
##$ME_mod= 0
##$MI= 1.114404
##$NCOEF= 0
##$NC_proc= 0
##$NLEV= 6
##$NOISF1= 3.799351
##$NOISF2= 2.8
##$NSP= 1
##$NTH_PI= 0
##$NZP= 0
##$OFFSET= 15.70392
##$PC= 1
##$PHC0= -24027.03
##$PHC1= 10.25269
##$PH_mod= 1
##$PKNL= yes
##$PPARMOD= 0
##$PSCAL= 0
##$PSIGN= 0
##$REVERSE= no
##$SF= 200.130013532006
##$SI= 16384
##$SIGF1= 3
##$SIGF2= 2
##$SINO= 400
##$SIOLD= 16384
##$SREGLST= <1H.CDCl3>
##$SSB= 0
##$STSI= 0
##$STSR= 0
##$SW_p= 3612.71676300578
##$SYMM= 0
##$S_DEV= 0
##$TDeff= 0
##$TDoff= 0
##$TI= <>
##$TILT= no
##$TM1= 0
##$TM2= 0
##$TOPLEV= 0
##$USERP1= <user>
##$USERP2= <user>
##$USERP3= <user>
##$USERP4= <user>
##$USERP5= <user>
##$WDW= 1
##$XDIM= 8192
##$YMAX_p= 0
##$YMIN_p= 0
$$ End of Bruker specific parameters
$$ ---------------------------------
##NTUPLES= NMR FID
##VAR_NAME=  TIME,          FID/REAL,        FID/IMAG
##SYMBOL=    X,             R,               I
##VAR_TYPE=  INDEPENDENT,   DEPENDENT,       DEPENDENT
##VAR_FORM=  AFFN,          ASDF,            ASDF
##VAR_DIM=   8192,          8192,            8192
##UNITS=     SECONDS,       ARBITRARY UNITS, ARBITRARY UNITS
##FACTOR=    0.0002768,     1,               1
##FIRST=     0,             0,               0
##LAST=      2.2672688,     0,               0
##MIN=       0,             -407403,         0
##MAX=       2.2672688,     295139,          0
$$ Real data points
##PAGE= N=1
##DATA TABLE= (X++(R..R)), XYDATA
0@%%%%%%%%%%%%%%%mNrJ6j6J6k0K8l2L6m4N2o0O9q1R3j04J18j37J56j74J98k23
$$ 0 0 0 0 0 0 0 0 0 0 0 0 0 0 0 0 -4 1 -8 8 -8 8 -12 16 -16 20 -24 28 -32 37 -44 49 -55 63 -74 82 -92 106 -117
38a17K49k80L13l49L89m32M79n31N87o48P15p89Q69r56J055j162J278j410J559
$$ -117 132 -148 165 -184 205 -227 252 -279 308 -340 375 -414 455 -501 554 -608 670 -740 819
57H19j725J912k129K381k676L027l453L982m651N509o589P555n381K34870q8779
$$ 819 -906 1006 -1123 1258 -1418 1609 -1844 2138 -2513 2996 -3593 3962 -1419 233451 144672
72A44672q8268J72848k82528l54127K40142L15301k5775O3838o198l15710r5644
$$ 144672 56404 229252 -53276 -407403 -167261 148040 122265 186103 179905 -135805 -231449
83b31449K38952L1553p7460P5985j7067p6319J29853N1087j89773q9146P3694
$$ -231449 7503 39056 -38404 37581 20514 -55805 74048 125135 -64638 -153784 -80090
94h0090M8410Q8049Q7918n5741p9120k9244o9363r666P9793K8285O8124J34095
$$ -80090 -31680 56369 144287 88546 9426 -19818 -89181 -98847 -19054 9231 77355 211450
106B11450r2681k49365n0370O3657M7928J88719J29901j97169j82653N3513J0567
$$ 211450 118769 -130596 -180966 -117309 -69381 119338 249239 52070 -130583 -77070 -66503
117f6503K300J51284P087j58890N5095J23663j09145o7982Q9007m8159p0265J38634
$$ -66503 -64203 87081 94168 -64722 -9627 114036 4891 -63091 25916 -22243 -92508 46126
129D6126O9727j15331n096O6327q5321q1925M7969L5088L6576J07217J2850j41854
$$ 46126 115853 522 -4574 61753 -23568 -105493 -57524 -22436 14140 121357 134207 -7647
141g647j14478q827N7150J19513J02410l1560j13607o6277KK4591L4602L4521
$$ -7647 -122125 -130952 -73802 45711 148121 116561 2954 -63323 -63321 -38730 -4128 30393
153C0393J2135j0517m729k106m0092n2646J1649N4242K3276R240J5834k0224l8654
$$ 30393 42528 32011 27282 25176 -14916 -67562 -55913 -1671 21605 30845 46679 26455 -12199
166a2199p024j1989l1302K2737P9263N4079j973n3465r5639o4664L8289J01842
$$ -12199 -19223 -31212 -62514 -39777 39486 93565 91592 38127 -57512 -122176 -83887 17955
178A7955P5311O725n1092p1224n0344k670M3022M5846J8905J7094R733m4776o2250
$$ 17955 93266 99991 48899 -22325 -72669 -75339 -32317 13529 32434 49528 59261 14485 -47765
191d7765r517J5205J9398N9079M1548m0922m1280K554k5303k6667L4555K6417
$$ -47765 -57282 -42077 -22679 36400 77948 37026 -4254 -1700 -27003 -53670 -19115 7302
203G302r57M5139K7100p0466o5515k065p75L4410R1193K3742o1447l3869j9813
$$ 7302 6345 51484 78584 8118 -57397 -59462 -60237 -25827 65366 89108 27661 -6208 -26021
216b6021m1210J6447O1774J6305P941K7838l1173o8149j6795P087J0311N6351
$$ -26021 -67231 -50784 10990 27295 35236 63074 31901 -36248 -53043 -45956 -35645 20706
228B0706M8755k3223l5866j8230l4856j3010L6001K7333J4731K9615l853m9586
$$ 20706 69461 46238 10372 -7858 -42714 -55724 -19723 7610 22341 51956 48103 -1483
240a483l3555j2458k883M0930N6043N631k1866j9087l7521k6814K0174K4892J2662
$$ -1483 -35038 -47496 -50379 -9449 46594 52225 30359 11272 -26249 -53063 -32889 -7997 4665
253D665L1047J7032k9343l2693k0621k4492R366N4576L8009L483q721l7519n4018
$$ 4665 35712 52744 23401 -9292 -29913 -54405 -45039 9537 47546 51029 42308 4789 -49229
266d9229j2575K6990L0680L8972L0160k0687m8910l3068j8050O223M6477M6710
$$ -49229 -61804 -34814 -4134 34838 64998 44311 -4599 -37667 -55717 -49494 -3017 43693
278D3693P692j5554k7453l8372j7102J8539K4432J9024J9627K092k0491k0972
$$ 43693 51385 35831 8378 -29994 -47096 -28557 -4125 14899 34526 36618 16127 -4845
290d845j7554j7150L522K9607L1280J8774j96k9941m5245k4742R251L4514M5531
$$ -4845 -22399 -39549 -36027 -6420 24860 43634 43438 13497 -31748 -56490 -47239 -12725 32806
303C2806K9569j0558m1033m3084k4171Q985M0058M4229J9964j2418l6560m0247
$$ 32806 62375 51817 10784 -32300 -56471 -47486 -7428 36801 56765 44347 7787 -32460
315c2460j8141J3160L1184K8938J3000p607j9946j8856j1535l725N006J4889K1258
$$ -32460 -50601 -37441 -6257 22681 35681 28074 8128 -10728 -22263 -25988 -20982 -6093 15165
328A5165J8905M728j7131l2842k9101m980K4058L9156L1170K791k9305m3180l0841
$$ 15165 34070 38798 21667 -11175 -40276 -45256 -21198 17958 49128 51919 22614 -20566 -51407
341e1407k046K8485M4361L2277m20l1094m2921k9493M669L4826L8405K0066n860
$$ -51407 -53453 -24968 19393 51670 51250 20156 -22765 -52258 -47589 -12763 25642 45708 39848
354C9848k7054k8563j1408L261R837J6047J5613O896K04r407k5131k4297l086
$$ 39848 12794 -15769 -27177 -23916 -14079 1968 17581 24477 24681 15274 -9857 -34154 -37240
367c7240J5140K6200L0602J0789k1060l2002k5964j3900J4644M1523L4707Q602
$$ -37240 -22100 4100 34702 45491 24431 -7571 -33535 -47435 -32791 8732 43439 52041
379E2041j5259l9374m3623q584K9381L8107K9765O933k7583l9381j9103J815J4088
$$ 52041 36782 -2592 -46215 -54799 -25418 12689 42454 49387 21804 -17577 -36680 -34865 -20777
392b0777K4135K0606M046p642j4224j9017j4257k21J4934K3897J7511J983r312
$$ -20777 3358 23964 28010 20368 6144 -12873 -27130 -27351 -12417 11480 28991 30974 21662
405B1662k1060k7204r598J3216J8593K4758K5272q347l9132k9207j2797J196L6432
$$ 21662 602 -26602 -36200 -22984 -4391 20367 45639 37292 -1840 -31047 -43844 -42648 -6216
418f216M7955O006k3654k1348k9843k1861K2921L6103J1287Q767M756k8479l1671
$$ -6216 41739 47745 24091 2743 -27100 -48961 -26040 10063 21350 30117 34873 6394 -25277
431b5277n34M923M662K6676K2006j0368j5288p626j7560j2871J1498J8396J2837
$$ -25277 -25811 -20888 -16226 10450 32456 22088 6800 -826 -18386 -31257 -19759 -1363 11474
444A1474J4502N842j7343l0340k0084K622K0216K7529K5996L666l1469l6030j0947
$$ 11474 25976 31818 14475 -15865 -35949 -33327 -13111 14418 40414 44080 12611 -23419 -34366
457c4366K75J1704L8986K8971j5192k1798j2457l0388j4741L6463L2365N95J0557
$$ -34366 -34091 -22387 16599 45570 30378 8580 -3877 -34265 -49006 -12543 19822 20417 30974
470C0974O97m2683k5984J8051M647r9L6160K0546k5740j4119k156l1596j5037
$$ 30974 31671 -11012 -36996 -18945 -14298 -14397 21763 42309 16569 2450 294 -31302 -46339
483d6339L7049L0100L142J1178n556m6187l0330J3839J8481J8027L3210J2596
$$ -46339 -9290 20810 23952 35130 29574 -16613 -46943 -33104 -14623 3404 36614 49210
495D9210l1713l5372j2893o207Q654L8917L3891o654k4451j8313k3738j5006K4264
$$ 49210 17497 -17875 -30768 -36975 -28321 10596 44487 37833 13382 -4931 -28669 -43675 -19411
508a9411L5892P124j351L867k1871l3742N63J5711J467J7604L2109o123l1609
$$ -19411 16481 23605 22254 26121 4250 -29492 -28929 -13218 -11751 5853 37962 31839 230
521B30j0425q252j8293J5800M1081R529j0120J680j7159l8485l297K8764J2507
$$ 230 -10195 -18447 -36740 -20940 20141 29670 19550 21230 4071 -34414 -37711 -8947 3560
534C560J0440K4484q249m3315j6272J0621k532J0655L8124P514k7892o611m29
$$ 3560 14000 38484 30235 -13080 -29352 -18731 -21263 -10608 27516 35030 7138 527 98
547I8k8004n220L5057J2941o180J8362O8m2360j5654J9006k678K809L8643J0048
$$ 98 -27906 -33126 1931 14872 8692 27054 27122 -15238 -30892 -11886 -14564 -11755 26888 36936
561C6936l1152q159J36k8892m253L9208J7670n467J0508o579m0173j5933J8479
$$ 36936 5784 -2375 -2239 -31131 -35384 3824 21494 16027 26535 19956 -20217 -36150 -17671
574a7671R890R690K6407P012k5005k1400q155r506K927K9291K8900L70j6425j6274
$$ -17671 -7781 1909 28316 35328 10323 -11077 -19232 -28738 -25811 3480 32380 32750 16325 51
588E1k2860j8658J6841L6576J3389j035K547k1672l7686r01K2611N403J5352K9955
$$ 51 -22809 -41467 -24626 11950 25339 24304 26851 5179 -32507 -33408 -10797 -5394 9958 39913
602C9913j1437l7133o001j298j6683J8009L9697j67j2480P591j7972l7494M192
$$ 39913 28476 -8657 -14658 -15956 -32639 -14630 25067 24900 12420 20011 2039 -35455 -31263
615c1263K4472M989J8520K7175j8226m0055j1666k287m79L0987L5714l703k1529
$$ -31263 -6791 -1802 16718 43893 25667 -14388 -26054 -28341 -28820 2167 37881 34178 12649
628A2649j5714k1419j2354K0029K8495J1125R66p495k0603j7642J353J2089J0458
$$ 12649 -3065 -24484 -36838 -16809 11686 22811 23777 16282 -4321 -21963 -20610 -8521 1937
641A937P626M873k134q639p371l898o054l136J1505J7682P813n49q888k3136j9586
$$ 1937 9563 14436 12302 3663 -3708 -7606 -13660 -16796 -5291 12391 20204 19655 10767 -12369 -31955
656c1955P133K1656J8247J5124j44k6698k7910m386Q855J5817K5141J1585j6778
$$ -31955 -24822 -3166 15081 30205 30061 3363 -24547 -28933 -20078 -4261 20880 32465 15687
669A5687k0805r328o229M136J9661J1245n304k108K49r195n871K398m594l176
$$ 15687 -5118 -14446 -20675 -16539 3122 14367 9063 6955 7204 -1991 -7862 -5464 -10058 -13234
683a3234J4814J6326J759m552j2625k4901j1394J7637K4800J7337Q529j4720l4977
$$ -13234 1580 17906 19665 15113 2488 -22413 -33807 -16170 8630 25967 34496 19776 -15201
696a5201k1177O071J9091K6050K1672o270k8064k1688p649N091K0816K1058J536
$$ -15201 -36378 -30307 -11216 14834 36506 30236 2172 -19516 -27165 -22074 -1258 19800 21336
709B1336j0379r597r285m173N170L952k02M323P384L828l2q225j6923j1188M576
$$ 21336 10957 1360 -7925 -12098 -6928 -2976 -3178 1145 8529 12357 12325 4100 -12823 -24011 -19435
724a9435J6570K1868J3474r457k5559k2912q920J2566L0580K4155q9j7764k5872
$$ -19435 -2865 19003 32477 23020 -2539 -25451 -34371 -21805 8775 32930 32841 15077 -10795
737a0795k1857K411K4350K1241Q852k295j7684k0107j730Q781N102P108O653l759
$$ -10795 -32652 -30241 -5891 15350 24202 21907 4223 -15884 -17614 -8833 -3731 3377 10030 6271
751F271k714M403m248j2574m882J088M990J7232J6672m706j8413j7720j4199J884
$$ 6271 3557 7960 3712 -8862 -13744 -12656 -7666 9566 26238 21532 3119 -14601 -28800 -26916
765b6916K5130K6030O886r623k2205k5998p103J7644K4197J6870L048j5857k2710
$$ -26916 -1786 24244 31130 21507 -698 -26696 -33799 -16155 8042 24912 27960 12103 -10607
778a0607j0514L870J0834J3070O896l389n533l305m386l914j673p03M155J1602
$$ -10607 -21121 -17251 -6417 6653 13549 10160 4627 1322 -3064 -6978 -8651 -9354 -5199 6403
792F403R367mq239j5085j4523j35J5333J9029J3717j81j9009k4702j1026O703
$$ 6403 15770 15766 7527 -7558 -22081 -22216 -6883 12146 25863 25682 6673 -18029 -29055 -22352
806b2352J9355K3006R870j1726k1154j5793m673R311J7301J1514P77n240q746
$$ -22352 -2997 20009 29879 18153 -3001 -18794 -23467 -14156 3145 14659 15436 10196 1450
819A450r154l669J689L745O484Q191M071j995o829j0290r139p92Q683J3964J2169
$$ 1450 -7704 -11373 -9684 -5939 545 8736 12807 10812 3983 -6307 -15446 -16238 -7555 6409 18578
834A8578K210j1370j8595j3930K04J5015K0019J2209l142j6342j8398q452N170
$$ 18578 20788 9418 -9177 -23107 -22903 -7888 12131 24340 21198 4856 -13542 -21994 -16824
847a6824J3314J4195P545l557j0338j0779p811p43P978J0815P257K575l967j0114
$$ -16824 -3510 10685 18230 14673 4335 -6444 -14255 -14998 -7020 3795 11052 13627 9660 -454
861d54r103l341J231P030J1451Q138q0p181j2845j2220j045J0734J4372J0978
$$ -454 -9557 -12898 -11667 -4637 6814 14952 14872 7691 -5154 -17374 -18419 -7685 6687 17665
875A7665P28j1245j4450q789m28Q480J3126Q415J345m647j1577j2031k260N741
$$ 17665 18393 7148 -7302 -16091 -16519 -8039 5087 13502 14847 10200 -1377 -13408 -15668 -9927
889i927R017J2163O640p216j1153p092o836k58J2233J1255L007J729m708j5903
$$ -9927 -910 11253 17893 10677 -476 -7568 -14404 -14662 -2429 8826 11833 13562 8854 -7049
903g049j0220L913O804R432J3187J268j2737r430m837n243M463J3579P445J315
$$ -7049 -17269 -13356 -6552 2880 16067 17335 4598 -4832 -9669 -14912 -10449 3130 10575 11890
917A1890L20q275j4695o016M531Q410J1725R462k402j2021j1964o285J215Q489
$$ 11890 12210 3935 -10760 -16776 -12245 -3835 7890 17352 14950 2929 -9035 -15320 -14105 -5616
931e616J2503R666j148j0813j0709p421k783R472J5866N043m276l496q570j1184
$$ -5616 6887 16553 15405 4592 -6117 -13538 -16321 -6849 9017 14060 9784 6288 -2282 -13466
945a3466K248Q683J313M629J0124k647j1124l662m647p150Q157J6287M172j788
$$ -13466 -11218 -2535 -1222 3407 13531 10884 -240 -3902 -8549 -15699 -7542 8745 12917 11129
959A1129j685j1910j4403J375J0101P915R861O303r420j6261p875P98O155J1723
$$ 11129 9444 -2466 -16869 -15494 -5393 2522 12383 18686 9266 -6995 -14870 -14072 -7917 3806
973C806J0899o10j0549q198k308k223J009R130O345k034J652J769j1066j0237
$$ 3806 14705 14095 3546 -4652 -6960 -9183 -8174 956 7301 5267 6919 8688 -2378 -12615
987a2615M061L221Q05J3665R912j1314j0829k368j0283k742K0112J5246k703j866
$$ -12615 -8554 -5333 -4528 9137 19049 7735 -3094 -5462 -15745 -18487 1625 16871 14168 12302
1001A2302p609k1437o509J6025J1596N544Q194n797j8434o690K913Q68O889J1554
$$ 12302 4693 -16744 -23253 -7228 4368 9912 18106 12309 -6125 -12815 -9902 -9034 -2145 9409
1015I409K258m272l854p037p144l33M912Q117Q038J900k894o711j2861p293P507
$$ 9409 11667 7395 3541 -3496 -10640 -10973 -6061 2056 10094 11994 9100 2389 -10472 -17765 -10258
1030a0258R950Q528J1482k249k1147j2947J708J672J1404K1150Q31j6263o369
$$ -10258 -308 8220 19702 17453 -3694 -16641 -14933 -13261 -1857 19293 20124 3861 -2508
1043b508n866j0540Q907J8326O92j822M895j0474j4956M659N794l151Q532J0769
$$ -2508 -8374 -18914 -10007 8319 9011 7189 12084 1610 -13346 -8687 -2893 -6044 2488 13257
1057A3257o627o000K017q180q963P060Q943L712P466P92j3399j1403j745K805
$$ 13257 6630 630 2647 -5533 -14496 -7436 1507 5219 12685 13477 78 -11325 -13070 -10265
1071a0265R594J2367K226o505p964q544l201N645O960N808M199l520p615k847
$$ -10265 -671 11696 13922 7417 -547 -9091 -12292 -6647 313 6121 10320 6800 -815 -3662
1085c662k426k074O401O182j720J675L599o490p086R19k559j033J2168R245m631
$$ -3662 -6088 -8162 -1761 4421 2701 4376 7975 1485 -5601 -4682 -7241 -8274 3894 13139 8508
1100H508m439n241j2311j457J3731P732J511M417n513j4703l963M504J619P003
$$ 8508 4069 -1172 -13483 -14940 -1209 6523 8034 12451 6938 -7765 -11728 -7224 -5605 1398
1114A398J0868j032q587m796m633l867M814P855L524J726J17m867o713m537r80
$$ 1398 12266 11234 2647 -2149 -6782 -10649 -5835 2020 5544 7270 7387 2520 -4193 -8730 -9710
1129i710M541Q195P612K314o725j1507o403O2M767J1307R785k737q238n584q026
$$ -9710 -5169 3026 10638 12952 6227 -5280 -11683 -11621 -6854 4453 14238 11501 3263 -2321 -10347
1144a0347m471R558J1344K457J986j416j3114q943M786L963K879J0262L429q937
$$ -10347 -14818 -5260 6084 8541 10527 9111 -4003 -12946 -8160 -4197 -1318 8944 12373 3436
1158C436m411r07p757j347J0516O014J271L799m194j3076m973L548L344P358Q894
$$ 3436 -975 -1882 -9639 -10986 -470 5544 6815 10614 6420 -6656 -11629 -8081 -4737 2621 11515
1173A1515j251p546n235n193k992N339Q357M775J723l168p795o124j280K872O887
$$ 11515 10264 2718 -2517 -7710 -10702 -5363 2994 7769 9492 6324 -1471 -7595 -8875 -6003 884
1188H84N419L49j063k995p170l686K775K113L548Q453J886p730n394k902m797
$$ 884 6303 6652 5589 2594 -4576 -8262 -5487 -3374 174 8627 10513 2783 -2611 -5513 -10310
1203a0310L477J1174L667j805M87n387j0247l87N646J786N369P976l347r639l197
$$ -10310 -6833 4341 8008 6203 6690 1303 -8944 -9331 -3685 -1899 3470 11446 8099 -1540 -4737
1218d737j981k512O457R441R73k198r53o129p027P90M564L806N867L911m380p982
$$ -4737 -6718 -9230 -2773 6668 7641 5443 4490 -1639 -8666 -7876 -3312 494 6361 10272 5892 -2090
1234b090m887j874K101P204O982J316l201n091n691l436J512N865O319L320p21
$$ -2090 -6977 -8851 -6750 454 7436 8752 5551 460 -5231 -8667 -7155 -1290 5029 8349 7628
1249G628m475p279n232J332N662N641M447J088n032p162l846n64K190O714O808
$$ 7628 3153 -4126 -9358 -8026 -2364 3277 7724 8812 3780 -3382 -7228 -7792 -5602 1112 7920
1264G920R92l809n349o245l418M031P407M546J713j161n908o591j519J819L016
$$ 7920 8912 5103 -246 -6491 -9909 -5878 1529 6075 7788 6627 719 -5872 -7391 -5572 -2556
1279b556N533N200q50n023m673m516j975M655P464L860M53k323o483o396l68L429
$$ -2556 2977 8177 7327 2304 -2369 -6885 -8860 -4205 3259 7119 7572 5249 -1234 -7630 -7998 -4569
1295d569M783N966L165l584o612n043k697J726O952O212J299j924m562n955k579
$$ -4569 214 6180 9345 5761 -851 -5894 -8591 -6865 87 6299 7598 5674 1112 -4843 -7422
1310g422J973L653M447M116J08l723m677m415k036L290O160M546J782k189o420
$$ -7422 -5449 -1796 2651 6767 6875 3152 -1525 -5940 -7976 -4686 1474 6020 7802 5613 -807
1325h07n718j249K102M981O557K751k957m948n453l842J909O351N167K454o49
$$ -807 -6525 -7774 -5672 -691 5866 8617 5660 712 -4741 -8583 -6674 -323 4844 7298 6649
1340F649n244o079j734J134K502M893M010l82k490l438m941k586K798N121M560
$$ 6649 1405 -4674 -6408 -5274 -2772 2121 6131 5749 3259 -179 -5120 -7706 -4908 213 4773
1355D773L358j520o493n819j849J327N028O622K734k114m552n881l969J473N548
$$ 4773 8131 6611 118 -5701 -7550 -6223 -1195 5427 8161 6047 1495 -4386 -8355 -6882 -1334
1370a334N498L212q72n038n298k385P43L507M275K393M58j475l832l846j543M39
$$ -1334 4164 7376 6504 1466 -3832 -6217 -5474 -1967 2308 4701 5159 3684 -148 -3994 -5537 -5098
1386e098L353N762L273j763m024n021m322J001N737M778K688O70m249o771l118
$$ -5098 -1745 4017 7290 5527 1503 -3518 -7840 -6839 -1102 3676 6364 7034 2785 -3986 -7104
1401g104R19L053N975N091j130m912m488l431k85M025M442J993N20j055l286l486
$$ -7104 -6185 -3132 2843 7934 6804 1892 -2596 -6027 -6312 -2287 2155 4148 4668 3613 327 -3159
1417c159k031j23L147M892L522L89l666o210l716P04L222N351N069l99m498m124
$$ -3159 -5190 -5313 -2166 2726 6248 6637 2971 -3239 -6955 -6251 -3029 2322 7391 6992 2494 -1630
1433a630m234k663M422P366K827L53j604o974n848K280L933K071M260K261m137
$$ -1630 -5864 -8527 -4105 3261 6088 6441 4837 -2137 -7985 -5705 -1772 299 4559 6820 2683
1448B683l500o53l250j745N057M789J325J376k042p249m233J807K741M210N343
$$ 2683 -817 -1470 -4720 -6465 -1408 3381 4706 6082 4040 -3209 -7442 -5635 -2894 1316 6659
1463F659N01m437m331l750k123L078O291M493R23l161o073m296k9L078M910L416
$$ 6659 7160 2723 -1608 -5358 -7481 -4403 1888 6381 7304 4143 -1930 -6226 -6255 -3177 1733 5149
1479E149p05k102j845l331k124J742J898J949M180J360m351l975j379j983J570
$$ 5149 4444 2342 497 -2834 -4958 -3216 -1318 631 4811 6171 1820 -2155 -3534 -5517 -3947
1494c947O176K759j194o5k545o189j538L350K496L748M480k238o710l000n91K39
$$ -3947 2229 4988 3794 3729 1184 -5005 -6543 -3193 -697 3051 7531 5293 -1417 -4417 -5008 -4769
1510d769M551M927k49j857q02l056l388O20K172J876L543K473k543m677k697j264
$$ -4769 -218 4709 4460 2603 1801 -1255 -4643 -4023 -1851 25 3568 6041 3498 -1179 -3876 -5140
1526e140R05M070M207J004j304k369l851l451L35M106M657K887J60m056o132k705
$$ -5140 -4235 -165 4042 5046 3742 1373 -2478 -5929 -5594 -1488 3169 6056 6216 2160 -3972 -6677
1542f677J941L381L753L397n71l946l109k080j873J761N688L404J57j172m106
$$ -6677 -4736 -1355 2398 5795 5224 1278 -1831 -3911 -5784 -4023 1665 5069 5226 4054 -52
1557e2n581r12L888L353K740K430j330m788l247j038m42K700N705K963j724l332
$$ -52 -5633 -6545 -2657 696 3436 5866 4536 -252 -3499 -4537 -4979 -2279 3426 6389 4665 1333
1573A333l641l861J30N220M236P01M20j183n256l677J522J690J841N272K599m842
$$ 1333 -2308 -6169 -6039 -819 3417 4118 4538 3355 -1901 -5578 -4056 -2366 -525 4747 7346 2504
1589B504m864j044j862N84O610L649k523j005n68m902k294L942K049J98L800J166
$$ 2504 -2360 -3404 -5266 -4682 1928 5577 3054 2049 1481 -3421 -5715 -1773 276 474 4274 5440
1605E440n261l153P08j128K11M836K583j757m79n76m217k628K065L120K442K639
$$ 5440 179 -2974 -2266 -3394 -3183 1653 4236 2479 2000 1424 -2793 -5421 -3356 -236 2206 4845
1621D845L16m391n013q71J994K296L304K930j431m382j735m34j808J895N302J077
$$ 4845 5161 770 -4243 -5114 -3120 -824 2480 5410 3979 -403 -2138 -2572 -4380 -2485 2817 3894
1637C894k044M78j582n066NL807o4N74M929L6n219j341p08l937K208Q005K056
$$ 3894 1850 2328 746 -4320 -4315 -508 -572 2 4931 4967 -252 -1593 -2301 -6238 -4030 3975 6031
1654F031k266o09m282o810J429O495K499J742K316l982o832j087J809J127L848
$$ 6031 3765 3156 -1126 -7936 -6507 -12 2487 4229 6545 2563 -4269 -5356 -3547 -2420 1428
1669A428M375j118m004k006j397j272J521L222J752K03K15q34l453l251L01K313
$$ 1428 5803 4685 681 -1325 -2722 -3994 -2473 749 2501 2704 2919 2085 -1368 -4619 -4318 -2005
1685b005K689L742K196l625o030k062J18J238N621N465j724m512k538l694j982
$$ -2005 684 4426 6622 2997 -3033 -5095 -4977 -3739 1882 7347 5623 1111 -1427 -5121 -7103
1700g103N304O032J24q47p78m915l439L000K658m19K197K234k475j907N15k182
$$ -7103 -1799 4233 4357 3510 2732 -2183 -5622 -2622 36 -383 1814 4048 1573 -334 181 -2001
1716b001k710K613L589J042J401L09m424m715j40J891K788M558K423k991n114
$$ -2001 -4711 -2098 1491 2533 3934 4243 -181 -4896 -5036 -3145 -357 4201 6624 3633 -1481
1731a481l341q32K190M889M049k38l383l571k026j07K009L141J433n29n10p52
$$ -1481 -4822 -5654 -3464 1425 5474 5236 1853 -1718 -3744 -3851 -1842 1299 2732 2203 1693 941
1747I41k174j560M53P29J077K736J946j388k570k072k535l24L960M532J350p27
$$ 941 -1233 -2793 -2340 -1611 -534 2202 4148 2760 190 -1882 -4417 -4741 -781 3751 5101 4374
1763D374k998n391k759K862M447L241J803j643n011l345L92J461K381L096Q92
$$ 4374 1376 -4015 -6774 -3912 535 3776 5579 3936 -1075 -4420 -4028 -2567 -186 2910 3802
1778C802j811j725j287j685k45J896J753J121J066j77k291k359j395l07J908L787
$$ 3802 1991 266 -1021 -2706 -2951 -1055 698 1819 2885 2708 417 -1942 -3337 -3644 -1736 2051
1794B051K560j74k880m142k895O85L833M291K041j206l635l606j458J019K994
$$ 2051 4611 4437 1557 -2585 -5480 -4795 -962 3329 5370 4164 529 -3077 -4535 -3516 -522
1809e22L089J237p43k056k622j694L24J679J933J683P09j109j723j568j558l08
$$ -522 2567 3804 3061 1005 -1617 -3311 -2987 -1308 625 2308 3017 1908 185 -1383 -2941 -3249
1825c249J899K841K070N51j863l988k889L28K598L606K784k68l109l459j901M0
$$ -3249 -1350 1491 3561 4112 2249 -1739 -4628 -4300 -1702 1904 4688 4420 1311 -2148 -4049 -4009
1841d009K242L515K043j40j770k942k492p9J885K397K054O68j285k129j789j203
$$ -4009 -1767 1748 3791 3651 1881 -1061 -3553 -3632 -1747 650 2704 3372 2087 -42 -1831 -3034
1857c034O7J806K579J920J84j717l214k436j15K136L204K434J76k076l069k242
$$ -3034 -2967 -1161 1418 3338 3522 1805 -1409 -3845 -3960 -1824 1380 3814 3990 1914 -1155 -3397
1873c397m38J615K842K508Q60j392k963k641q85J184K660K681R44j096k081k340
$$ -3397 -3835 -2220 622 3130 3990 2598 -365 -3006 -3891 -2707 -47 2634 3578 2482 401 -1939
1889a939j479M07K080K402J897K61j959l173k016LJ803K947K166M0j904k220k023
$$ -1939 -3418 -3011 -931 1471 3368 3629 1670 -1503 -3519 -3516 -1713 1234 3400 3440 1536 -684 -2707
1906b707p33J188K458K056J043m04k347k884j286Q31J958K584J868l37k247k454
$$ -2707 -3440 -2252 206 2262 3305 2901 554 -2330 -3616 -2785 -827 1757 3625 3288 1041 -1413
1922a413j771m54J821L120K187P0j626l006k696j87K404K612J920M79j580k719
$$ -1413 -3184 -3638 -1817 1303 3490 3560 1934 -1072 -3768 -3955 -1551 1061 2981 3460 1880 -839
1938h39j611k58N53J867K386Q85o29j432k243j931K03J883K158J886O64j611k883
$$ -839 -2450 -2708 -2155 -288 2098 2983 2354 922 -1321 -3252 -3049 -1166 992 2878 3542 1931 -952
1955i52k090o45J043L112L173O48j872l052k799r68J986L541K248J50j501k522
$$ -952 -3042 -3687 -2644 468 3641 4289 2417 -635 -3434 -4402 -2416 1125 3373 3523 2022 -500
1971e00k306m72J342J904J708J096k21j980j935j044k02R95K416J931J64r50j727
$$ -500 -2806 -3278 -1936 -32 1676 2772 2551 571 -1364 -2408 -2610 -1615 801 2732 2896 1946 219
1988B19k778j452J511K643K412J727q43l972l194k54J281K731L585P81k624k611
$$ 219 -2559 -4011 -2500 143 2555 4282 3439 -533 -3727 -3981 -2700 31 3616 4397 1773 -838
2004h38j334j272Q10L350J755m05n6j006k701j028J273O05O15K089R58j539j289
$$ -838 -2172 -3444 -2634 716 2471 2066 2010 1004 -1697 -2725 -1452 -847 -232 1857 2815 1276 -13
2021a3r40j996m26K894K722R04j1j699l907k028J699K722K159J729n14l311k813
$$ -13 -953 -2949 -3375 -481 2241 3145 3134 1435 -2472 -4500 -2801 -79 2080 3809 3295 -16 -2829
2038b829j84P59J475K615J461j365j945q77r47o79J584K031K37M2P44j143k645
$$ -2829 -3013 -2254 -779 1836 3297 1932 -13 -890 -1837 -2516 -932 1099 1336 1378 2122 979 -1666
2055a666p09N60N5K008L541r3l037j888j418j747K231M697J221j251n87k559l773
$$ -1666 -2375 -1815 -1760 248 3789 3696 659 -1229 -2647 -4394 -2163 2534 3755 2504 1917 -642 -4415
2072d415P31L628J253J043J677k059m127m95J160k73J683L123m76j848k7j012
$$ -4415 -3684 -56 1197 2240 3917 1858 -2269 -2764 -1604 -1877 -194 2929 2453 605 578 -434
2088d34k700K36K632J240J047J562j328l946j823P59J066K241L207M06l021k703
$$ -434 -3134 -2898 -266 974 2021 3583 2255 -1691 -3514 -2755 -1689 552 3759 4165 1144 -1559
2104a559j210q40J183L941K405j040j698j472k675r49K999K464jO90M07k848k358
$$ -1559 -2769 -3609 -2426 1515 3920 2880 1182 -290 -2965 -3914 -915 1549 1548 2238 2645 -203 -2561
2121b561J058J75m68K741K642j610j654j61k411j859K848L071K7N92M68l548l155
$$ -2561 -1503 -1328 -1796 945 3587 1977 323 162 -2249 -4108 -1260 1811 1838 2430 2898 -650 -3805
2138c805J154J648O43K797J861k775k973m15n04k14K831K613p26j169k04j791
$$ -3805 -2651 -1003 -360 2437 4298 1523 -1450 -1865 -2369 -2583 248 2861 2135 966 762 -1029
2154a029j868R01J916O62J060J234j235k837r53K74m7J559L060L76j817j111j335
$$ -1029 -2897 -1996 -80 582 1642 2876 1641 -1196 -2149 -1875 -1922 -363 2697 3073 1256 145 -1190
2171a190k249N31L341J770J6L71j423l697r57J946J198J111K348j36k828j490
$$ -1190 -3439 -2908 433 2203 2219 2590 1167 -2530 -3487 -1541 -343 768 3116 2980 152 -1338
2187a338k79j053P45L281J467q69n00j326k833p39K242J713J007J420k27l035
$$ -1338 -1617 -2670 -1925 1356 2823 1954 1454 128 -2705 -3444 -1202 511 1518 2938 2711 -324
2203c24k187L0M25J259K793J571j461k007j426j457j37K394K419M22j32q43k394
$$ -324 -2511 -2481 -2056 -797 1996 3567 2106 99 -1327 -2784 -2921 -527 1892 2314 2182 1339 -1055
2220a055j849N36J325J361J849R98j632k353j130n71L46K311K371J73j063j293
$$ -1055 -2904 -2368 -1043 318 2167 3165 1533 -820 -1950 -2521 -2175 136 2507 2680 1617 324
2236C24k011j473Q96K210J618R24l4j839k479q00O28J246J841J608k87j665j499
$$ 324 -1687 -3160 -2264 -54 1564 2488 2454 615 -1864 -2664 -2036 -790 1051 2659 2372 707 -792
2253g92j097n64R38K275J255J39l71j599k271p21J103J486J597J391m54k125j744
$$ -792 -1889 -2453 -1515 760 2015 2154 1783 184 -2087 -2808 -1705 -219 1378 2769 2315 190 -1554
2270a554q48l7J585K384J187m55j341j921j659K55J618J720J241K45j282j916
$$ -1554 -2402 -2439 -854 1530 2717 2262 921 -1000 -2659 -2404 -786 934 2175 2420 1138 -778
2286g78j293j84Q58J573J527O29o55j556j604q67L27J498J934J063k94j341j900
$$ -778 -2071 -2255 -1397 176 1703 2332 1677 121 -1483 -2350 -2023 -525 1409 2472 2178 837 -1063
2303a063j542P2J588J814J430L95j465k260j365j10J009K199J751j4j162j652
$$ -1063 -2605 -2533 -945 869 2299 2694 1229 -1031 -2396 -2506 -1497 702 2453 2439 1277 -375
2319c75j574n42J121J646J237O86m14j626j614o09J21J156J882J035k00r86j629
$$ -375 -1949 -2491 -1370 276 1513 2199 1785 159 -1455 -2064 -1943 -787 1095 2130 1930 944 -685
2336f85j558j51J236J631J648N75j117k060j577o65Q80K289J924K70r73j880j997
$$ -685 -2243 -2394 -1158 473 2121 2696 1579 -481 -2058 -2723 -1843 446 2370 2640 1667 -213 -2210
2353b210m60J152J573J546Q10o94j687j274q82K45J435J572P10K4q25j658j138
$$ -2210 -2670 -1518 55 1601 2411 1717 30 -1244 -2126 -1881 -446 1126 1836 1860 1035 -623 -1761
2370a761j28M84J359J785O25p33j449j718j327O82K062J892R08l67k053k282n62
$$ -1761 -1889 -1405 -46 1739 2364 1631 182 -1536 -2863 -2181 -119 1773 2681 2314 261 -2021 -2583
2387b583O87J558K063R38p12j737j570r88L15J626J565P50j09j116j423r31k9
$$ -2583 -1896 -338 1725 2663 1951 214 -1356 -2344 -2029 -403 1162 1912 1803 687 -736 -1667 -1696
2404a696N98J263J193N43j78j201j722j070K05J354J994J487m42j753j870j387
$$ -1696 -1098 165 1358 1901 1723 522 -1200 -2270 -2065 -711 1283 2770 2328 575 -1295 -2682
2420b682P9J924K151R71j29j380k324j332O31J456J632J406j80j733j451n78l08
$$ -2682 -2603 -679 1472 2443 2314 934 -1390 -2722 -2091 -635 997 2403 2223 490 -961 -1539 -1847
2437a847Q42J425Q75J12m2r64j525q42K56R09J598J466K9j491j760j216j48J167
$$ -1847 -1005 420 1295 1407 1365 401 -1124 -1966 -1710 -801 797 2263 2292 801 -959 -2175 -2323 -1156
2455a156K077J498J9j314j842j688k41J486K174J175o8r69j836j509L48J218P54
$$ -1156 921 2419 2438 1124 -718 -2406 -2647 -1161 1013 2188 2120 1151 -685 -2194 -1846 -628 126
2472A26R80Q63p78j251n83p22o73J245J936M39q0j02j755j894K77J030R15J656
$$ 126 1106 1969 1191 -60 -643 -1365 -2038 -793 1143 1582 1502 1400 -355 -2249 -1972 -942 -27 1629
2490A629J098j217k214j026n80L35K234K201m0j247j313j558q56J165J834Q00
$$ 1629 2727 1510 -704 -1730 -2310 -1975 259 2460 2420 1173 -140 -1698 -2554 -1389 445 1245
2506A245M01M2j225j710o46M92O05J218J617J09j545j258n06r16M94K072J343
$$ 1245 1646 1688 463 -1247 -1893 -1401 -796 422 2039 2148 603 -655 -1161 -2077 -1583 489 1832
2523A832k04p9q89k439j031J555J358R90J441l25k564j602L56RP88K324R00j221
$$ 1832 1628 1549 660 -1779 -2810 -1255 103 1093 2534 2209 -355 -1957 -1601 -1592 -804 1520 2420 1199
2541A199p93p06j740l78K075J456K66M69m25k295j314P62O30N64J725R26j407
$$ 1199 406 -300 -2040 -2418 -343 1113 1379 1848 1423 -872 -2186 -1424 -794 -230 1495 2421 1014
2558A014j375m98r33k72K035J819j27m53l79j768j449R62J420K09J072J006j368
$$ 1014 -361 -859 -1792 -2064 -29 1790 1663 1210 831 -937 -2386 -1424 -4 205 1277 2283 915
2575I15j987l03j80k46J930K282m40j209o18j493j283J221K157N80J56L78j511
$$ 915 -1072 -1375 -1555 -1801 129 2411 1971 762 144 -1349 -2632 -1411 746 1326 1482 1860 349
2592C49k234k7Q69N73J266J491o65j835o64k23n95O92J862N53k64J17p01k161
$$ 349 -1885 -1912 -1043 -470 796 2287 1622 -213 -877 -1100 -1695 -1003 859 1412 1148 1265 564 -1597
2610a597q22J366R99R04J607j47k580j637J70q3R30K742R94j610j085j001j794
$$ -1597 -2419 -1053 -54 850 2457 2310 -270 -1907 -1737 -1820 -890 1852 2846 1236 151 -850 -2644
2627b644K35K724J502k67J26q89k372n49J381M85M15J430J58j423n90l11j155
$$ -2644 -2409 315 1817 1550 1676 787 -1585 -2134 -753 -268 147 1577 1735 312 -278 -589 -1744
2644a744j14J846J354K94O9q70k155j198P47J472J362J291J26j918k271p23N20
$$ -1744 -1858 -12 1342 1636 1705 835 -1320 -2518 -1771 -299 1063 2354 2480 562 -1709 -2432 -1912
2661a912J205K106J514j128k023j097n09N0J642J655j11o71l8q94j162K95O94
$$ -1912 -707 1399 2913 1785 -238 -1335 -1844 -1794 -152 1503 1392 721 683 -211 -1373 -1078 -384
2678c84J9P41J383l47j286n44p67r09R39K133Q29j24k69j987k000K18J721J475
$$ -384 -365 376 1759 1412 126 -418 -1185 -2094 -1155 978 1807 1683 1414 -573 -2573 -2355 -634 841
2696H41J365L15j767k346o08O44J036J576R82o81j308o15m71j76N16J009L57J52
$$ 841 2206 2521 754 -1592 -2200 -1556 -520 1056 2038 1357 49 -566 -1037 -1213 -697 312 669 821
2714H21J71m12j027o74j17K63R67J369O46p10j478j329q15P16K062J743J01j077
$$ 821 992 580 -447 -1121 -1238 -975 -8 1361 2007 1297 -181 -1510 -2325 -1609 453 2196 2297 1220
2732A220j790j636j31J539J699R57J2j047j624q18L29P04Q75R15Q0o39o70m63
$$ 1220 -570 -2206 -2337 -798 901 1858 1870 823 -801 -1619 -1290 -586 289 1204 1284 645 -25 -488
2750d88n24j06N67Q03M45N80J9j180j324o33L77J160J794R07q09j719j470o46
$$ -488 -1012 -1118 -551 252 697 1277 1296 116 -1208 -1841 -1464 -304 1490 2397 1588 -131 -1601 -2247
2768b247O51J871J614J62q48j449j306m86J060J299Q45K73l28j175q60j79K32
$$ -2247 -1596 275 1889 2051 1203 -246 -1552 -2038 -978 321 1166 1439 1111 -64 -924 -1103 -871
2785h71M38Q13O44Ql04m82j032p14K43J027J126Q62j27j339j463q03K95J329J606
$$ -871 -433 380 1024 1032 728 246 -786 -1500 -1257 -230 896 1758 1631 292 -1171 -1974 -1679 -350 1256
2804A256P98m71j354j430q11N15J324J357N91m08j157j156m97J91R46Q99M84R8
$$ 1256 2054 1583 229 -1201 -2012 -1497 -173 1184 1775 1367 210 -946 -1443 -1252 -306 593 1077 1175
2822A175n53q31p71k40K61P92R83O76k97q79r99q99P8J055J326O96n2r23j444
$$ 1175 622 -209 -980 -1220 -959 -167 816 1492 1195 316 -683 -1582 -1504 -449 877 1573 1521 598 -846
2841h46r21K77Q81J264R94p7j098j151o86k6P32J157P79ll99r79j067j80M41Q21
$$ -846 -1767 -1490 -609 655 1649 1572 474 -677 -1363 -1389 -657 500 1279 1276 877 -102 -1169 -1349 -908 -87
2861h7R50N69l07r26r38p11O9Q82J146P89n5p19j238q38nP56J190R20j0o43j110
$$ -87 863 1432 1125 199 -739 -1450 -1381 -499 647 1436 1381 662 -576 -1414 -1419 -663 527 1447 1437 794 -316
2882c16r87j68N81J014R62M10n26j063r21m59K66J047J144M34k48q37j082p21
$$ -316 -1303 -1471 -890 124 1086 1496 970 -93 -1014 -1473 -1207 -160 984 1418 1170 333 -749 -1470
2900a470K14Q90R76P66N6q72j268n34k6N84J145P55n4n49o95r15l41M28R56P47
$$ -1470 -1256 -366 610 1376 1432 560 -708 -1242 -1268 -684 461 1216 1162 613 -82 -997 -1338 -910 46 793
2920G93N17m3r97j111n23K06O84J134Q18p6r92r77q27j65Q48J475P06r5o96j210
$$ 793 1310 1267 270 -841 -1364 -1158 -474 660 1478 1402 410 -567 -1394 -1559 -711 764 1470 1375 679 -531
2940e31j082J89J038Q88O53K36o87j169n11RJ25O58J098K84m35m65p06q94O1Q27
$$ -531 -1613 -1424 -386 502 1155 1391 704 -465 -976 -967 -842 -184 914 1198 763 298 -408 -1302 -1241 -414
2960d14Q03O07M10m69j317q66j11L86J091J372L00r92j260q62k90O17J530R42
$$ -414 389 996 1406 937 -380 -1246 -1357 -971 120 1492 1792 800 -460 -1322 -1612 -995 535 1477
2978A477k22o23q02j046j71Q57P91L14M39l6r33p78N6r8J80Q70P84j99k89l11
$$ 1477 1255 632 -170 -1216 -1387 -530 261 575 1014 978 45 -733 -677 -775 -595 275 1059 860 571 260
2998B60j072p79N93J054P26O49Q2j437j447k02N29Q65J341P38q97j294o82l35
$$ 260 -812 -1591 -998 56 782 1431 1513 76 -1371 -1573 -1044 -179 1162 1900 1003 -291 -973 -1308
3016a308J16J184J210on73l91q15p00N31P54K13K97M95m53p99k23k25m23N76J397
$$ -1308 -1192 -8 1202 1196 623 232 -583 -1283 -752 2 215 512 1007 554 -245 -468 -693 -1116 -540 857
3036H57M59l18m69r74j301J76J412R50N03K51j013j707m88O71O26R92J106m41
$$ 857 1316 998 529 -445 -1746 -1570 -158 792 1295 1546 533 -1174 -1662 -991 -365 627 1733 1292
3054A292j360p31j70j36O76J242K40n37j01l65q10j77N14K02L41R06J49q51q45
$$ 1292 -68 -799 -969 -1105 -429 813 1053 516 415 50 -760 -937 -423 -221 120 1026 1175 324 -521
3073e21m10l63M11J460R92l18p54o76j322k94J291J310M75P9n82j625q66O60Q41
$$ -521 -931 -1294 -883 577 1569 1251 497 -179 -1501 -1795 -504 806 1281 1360 778 -847 -1713 -1053 -212
3092b12N89Q55N1j141q17J03j63m9R70O40k38L4o1r67p38L19M55L39R54N35q09
$$ -212 377 1232 1283 142 -675 -572 -735 -784 186 826 588 622 561 -406 -1144 -825 -370 -31 923 1458 649
3113F49j056n21m29K69J309J185K7p22q51j123l46R23J242O08j9m55r63q35O6
$$ 649 -407 -928 -1357 -1088 221 1406 1433 711 -140 -1263 -1609 -686 556 1164 1145 690 -273 -1108 -1042
3132a042O34M59M91N08l77q25l10r8l14L53R84L72q3o2n97j088k41O01O51O76
$$ -1042 -408 51 542 1050 673 -152 -462 -560 -874 -521 463 835 752 690 93 -995 -1236 -635 16 692
3152F92Q11m45j288p50k17L3J057J327J35p31n51q65o95O23J101N14J23R9q04
$$ 692 1503 1058 -230 -980 -1197 -1164 -107 1220 1355 624 73 -792 -1487 -864 237 751 874 973 169
3171A69r47r4J70L48O23P39p4n98m65n79l59L50Q45O51J87k06o12r55m17M44P83
$$ 169 -778 -872 -702 -354 269 1008 934 336 -129 -708 -1067 -717 128 779 966 760 148 -807 -1224 -780 3
3192CO43N95k09r79r19k66K54N48J044M66l77n95o07n93p7P63P53L55J05l12r17
$$ 3 646 1241 1032 53 -866 -1132 -878 -330 714 1180 803 208 -399 -992 -1069 -306 447 802 907 595 -322
3213c22o34J64K88M71Q36L26n85o24m49m81J39Q98O65J67q9m07r16n11L25M84
$$ -322 -956 -792 -504 -33 803 1129 544 -80 -529 -1010 -871 27 692 859 770 363 -553 -1064 -739 -255
3233b55N12O33J26o61q25k67k27L96P84P22p6k95o00p49m33N77P37N26L27q2q17
$$ -255 257 890 1016 355 -470 -737 -964 -568 216 938 862 567 -33 -782 -1215 -638 99 625 952 870 53
3254E3q37j63K36N28P20M85k96n86n53m35m7O10O32L66R5l20o20n78j92L49M92
$$ 53 -784 -947 -711 -183 537 1022 726 140 -413 -848 -895 -285 347 713 808 488 -132 -710 -902 -553 -61
3275f1O80M13k77p66o61k50J25O02Q99M14l61o58o65n57K17Q11P14K69Oo05q92
$$ -61 619 1032 755 -11 -672 -922 -797 -195 704 1118 757 99 -566 -1123 -906 -95 619 888 894 289 -603
3296f03l96K79M64N11N85ln86m11l53k56K12N94M31K60Om44q23l67Q9M56P44N85
$$ -603 -999 -720 -256 255 840 837 251 -160 -513 -769 -557 37 468 728 734 290 -533 -900 -811 -355 389 974
3318I74%o97p26m99j21P08Q72N10j6o55q27m83J7O58O83M70j23m28n81m27m0L58
$$ 974 974 277 -449 -948 -1069 -361 511 1021 1005 350 -477 -960 -943 -285 398 868 745 317 -264 -691 -731 -373
3340c73M30M05L16j96m86m56k80o2L77P38L19M7l02p02p28o6N53P19O47J62m95
$$ -373 57 462 778 582 96 -360 -640 -702 -325 413 732 779 477 -225 -953 -1019 -466 253 900 1062 567
3361E67r54n67m6M64Q56N87Mm90n50n96j94M97O01M20J31k07n49m00j80J0M01
$$ 567 -387 -954 -1000 -536 320 907 911 421 -129 -725 -919 -422 179 599 730 523 -26 -426 -606 -596 -195
3382a95M49L52j9j95n22m83k05K70O08N93J81k00o29p52k63M27O36O43K99l25
$$ -195 254 606 587 392 -130 -613 -818 -548 60 653 834 634 5 -747 -1010 -583 53 696 995 670
3402F70p30o68k14K83N74P05K51l11n26n41k45J24N16M99K10M2k68n88l41J0J08
$$ 670 -60 -728 -942 -659 -85 620 871 560 34 -507 -752 -628 -112 387 597 639 371 -217 -558 -548 -440
3423d40M25O04J91k83m89n15k93P4O00P07J81j16m49o36n36K40O48N94L75p1o77
$$ -440 -15 589 780 497 8 -507 -800 -726 -126 581 762 646 197 -439 -975 -735 -87 507 882 811 134
3444A34p00k18R1M43O33M17j61m53l42m11j90M00M98L37J19k5n16n91j12J50K11
$$ 134 -566 -784 -693 -250 383 800 639 186 -156 -567 -757 -357 141 478 597 572 56 -535 -647 -497 -286
3465b86O26M87j87m61l91n13k00N51P40L56Lk79p45n92O5N33N94M33ol16o77m48
$$ -286 340 827 640 179 -212 -725 -925 -374 366 722 725 446 -299 -891 -826 -293 301 734 728 412 -265 -713
3487g13L8J88O12N34M4m22l54k75l45J46N34L61J01J48j86p34l73Q7K04M37P02
$$ -713 -675 -487 125 659 703 281 -73 -348 -693 -547 -13 348 449 597 411 -323 -696 -609 -405 32 734
3508G34J35n47m94m18k92K78Q28M91j33q1m34p59j12L71M91L93M11k43o99m17
$$ 734 869 322 -172 -590 -882 -604 224 715 582 501 67 -692 -804 -433 58 451 862 619 -80 -497
3528d97o7Q9K96N97K19j82k89l59m06j23M70M61K54K67k47o38m91n4K74L16O29
$$ -497 -564 -475 -179 418 637 455 166 -193 -599 -722 -252 209 463 730 483 -155 -646 -700 -426 -110 519
3549E19K92l74m38l95k84m5O36O39J09j30k46o86l97L38L33K75M76Q4m74n41k08
$$ 519 811 437 -1 -396 -680 -725 -89 550 659 529 283 -403 -800 -462 -129 146 622 706 232 -309 -517
3570e17p9J66O11M94n9k55l56n40k65L73N85K51J54K2n08o13q0J69K97M55M30
$$ -517 -596 -430 181 675 616 361 5 -535 -800 -427 158 409 563 585 77 -536 -616 -447 -150 305 735
3591G35j25m83l14l23k16M12O26J91J09j58m64o53r1L68L61N00L97l18p58l39
$$ 735 610 127 -187 -510 -726 -314 312 503 612 454 -10 -663 -754 -386 -25 475 872 554 -204 -543
3611e43r4R6N01P19l0l47k28m18l93K33N10K64J51J38l07o16j86J29R1K92N80
$$ -543 -637 -541 -40 679 649 302 74 -344 -737 -504 6 270 421 559 252 -364 -550 -421 -330 -38 542
3632E42O2k82k86l56l14nO52M98Q0J03n40p97j83L48M53M67M02j68p85l91p8J3
$$ 542 604 322 36 -320 -634 -639 13 511 591 694 154 -643 -826 -478 -25 442 844 676 -109 -500 -578 -565
3654e65L94O92J19l03k19k56l35J9M01J63J46J38L4m04l26j16q7J38O84M47k19
$$ -565 -171 521 640 337 118 -138 -473 -454 -53 110 256 394 428 24 -302 -418 -505 -367 317 764 545
3675E45l79m27m99o1O61O50J32j3l42p23m06K94N50L48K81O3n87o03O3J22P2M41
$$ 545 166 -261 -760 -821 -160 490 622 609 267 -456 -862 -568 -18 330 611 674 87 -516 -453 -331 -259 182
3697A82K94k15j67P8k64m08J56K53J00L90L19l42o32k82q4N3O89O47r3m32l82
$$ 182 476 261 94 172 -92 -500 -344 -91 9 399 718 376 -256 -538 -622 -569 120 767 674 242 -140
3718a40n59j50N55P00K80j10k97n48m56K37L81L01J94Nk62k83r7O7q8J22L15J90
$$ -140 -699 -849 -294 406 686 576 279 -269 -725 -488 -107 194 388 393 131 -152 -249 -182 -270 -148 167 357
3740C57N3q7k65n19j20K42L62L87L18j81o56n45L1J74M78O29K00m74o23l49j17
$$ 357 410 323 58 -461 -581 -339 23 410 728 547 -109 -654 -623 -449 29 658 858 384 -239 -588 -705
3761g05L35O89K89k72r4l10l70K1L07Q3J17K42N8k84k00j03k27K9L74L81J33p6
$$ -705 -370 319 608 336 242 -68 -438 -417 -110 -27 90 332 390 106 -94 -197 -424 -395 -21 360 493 417
3783D17l00n37k59J85M86M79K53j84n54m86j62L04M20M08J68l17l47k92j77J11
$$ 417 117 -420 -679 -494 -8 471 724 540 -14 -500 -662 -358 62 470 638 321 -26 -318 -495 -384
3803c84L76K76J14m0k10k09k77oJ24K13K29K57q4k68m67j67J3L62N00K37r8m21
$$ -384 -8 268 382 342 132 -77 -354 -360 -236 -23 206 463 379 111 -356 -523 -510 -148 352 589 491 70
3825G0m04l66J47N17M33J85r3l99m46j52J23L09L00K42o3k38k78k46o3J22M13
$$ 70 -334 -700 -553 -36 397 582 489 90 -356 -508 -385 -76 224 466 403 165 -113 -359 -422 -300 113
3846A13J88N0j7k78l31k10Q6L14K90L22q2k81m64k23K4K98M36L43j22l30m02k49
$$ 113 301 351 334 56 -275 -485 -399 -85 205 527 445 164 -300 -523 -499 -201 235 578 456 126 -276 -525
3868e25J34K29L10J86J03j88l74k53l1J31K83L29J47j49k91l05k32J10K82L52
$$ -525 -391 -162 148 334 437 249 -125 -378 -409 -278 5 334 481 332 41 -264 -496 -386 -104 248
3888B48K13m1k88l29k99N2K23M30K27mk07m45k36P0J21L87K99k3k18k09k35j64
$$ 248 461 420 132 -197 -496 -444 -221 209 436 432 225 -220 -456 -386 -265 122 421 398 180 -29 -264 -428
3910d28J52K35L10J46Kl39l29j79O6J77M17K29kk95l04k43j43K96M01L14l9j76
$$ -428 -276 -41 269 415 417 78 -251 -430 -364 -187 230 459 457 162 -142 -385 -528 -232 169 483 444 268
3932B68m13l14n5L36K94K20J08j93k97k10j44Q2K30K84J75K3k51k70k83k7K71
$$ 268 -145 -459 -514 -178 116 336 444 251 -46 -256 -400 -318 -88 196 371 394 143 -127 -410 -437 -166
3953a66K89K00J78k27m61k78j3J48L42M93K9k81l72l13o4J71M36K78J1p8l72k55
$$ -166 123 323 501 274 -187 -465 -478 -330 12 505 534 253 -119 -432 -496 -325 111 389 400 322 -50 -305
3975c05j57J63L36J65J56j15k03j98p7j38J62K86J85P2r1j59l63k16K28K45L06
$$ -305 -462 -299 37 202 358 243 40 -158 -235 -373 -211 75 260 332 241 82 -281 -497 -269 -24 282
3996B82K36o1m15m37j52J71L22M02J36k08l56j98j84O1M21L17Qm7k18k88j46J88
$$ 282 518 457 42 -395 -547 -376 -54 348 484 276 -80 -278 -462 -401 20 337 345 298 80 -208 -354 -166
4018a66R4J21P2J96r0j74j81j66n2K28L52J44j0j85m08l55J42L08L78K49N2m33
$$ -166 -72 49 121 317 227 53 -128 -294 -346 -118 234 378 368 183 -225 -580 -438 -130 248 497 549 116
4040A16m03k08P3K63M33L02j92l61k65j67O7L00K57O1p9J9j72k53L8L5N2J30L25
$$ 116 -287 -495 -422 -159 274 576 384 23 -242 -409 -342 -42 215 276 197 216 44 -209 -171 -136 -84 46 371
4063C71J5k52j41l18j77K34M87J59J04q0m71m85j0L68L90K93P4m09m68j16Q8K47
$$ 371 386 134 -7 -325 -502 -268 219 378 482 402 -69 -554 -564 -196 194 487 561 152 -316 -432 -344 -97
4085i7K69K54r2l42j22k8p8O7K56J7mQ5Kk68j14%j35J63N04K01k22l49k60l00
$$ -97 172 426 334 -8 -130 -158 -236 -169 87 104 100 185 187 -81 -195 -195 -330 -167 337 538 316 -33 -293 -593
4109e93J50N22M58m3j63m05m83k5L97L69J75Q1k12l58k29J31J35J33J72K5k03
$$ -593 -443 79 537 494 331 -74 -557 -582 -185 184 359 440 228 -130 -359 -228 -93 40 212 237 34
4130C4k7L9j84j57R5J97Q3J92J56l17l96j37J05J33M79L19k32m29k50j47PM61
$$ 34 7 46 -138 -295 -200 -3 80 272 428 111 -285 -422 -317 -184 295 614 382 -47 -297 -444 -437 24
4152B4M45J1k65j88l31j62K11L01J38M9K8j73l21J17q1j2K11K52m2o4o2j91k96
$$ 24 469 480 215 27 -304 -466 -255 46 184 233 261 88 -233 -116 -197 -209 2 254 212 148 86 -105 -401
4175d01J9L69J57K51qk27n08r2Q5J94L08L12q3m25j77j42k1K96L65J22k02n2j79
$$ -401 -382 -13 144 395 387 160 -348 -440 -355 -161 147 459 376 -49 -226 -368 -389 -93 272 394 192 140 -39
4198c9k99L0K44J39O4K22j00k89k20l3m4J40L72K37j61j65j71l01L0K81K86M0
$$ -39 -338 -308 -64 75 139 361 261 -28 -248 -281 -325 -185 187 424 263 98 -73 -374 -344 -63 223 263
4220B63M9j05l81j28R5R5J43K46J05k12k46j01k31K4L50L44M5j36j02l50j97J66
$$ 263 312 207 -174 -302 -207 -112 31 277 382 170 -76 -177 -408 -384 -34 310 355 219 117 -233 -430 -264
4242b64K06K35J95n5k39l43k1O6J26L25K2p4j22j29j32q4Q9K57Q4J07j1q7k88
$$ -264 -58 177 372 317 78 -265 -286 -220 -94 231 253 179 57 -72 -204 -288 -199 58 142 249 238 151 -137
4265a37j71J5R5L18K61Mk85k69k91oL23M39J38o7k36l47k17Q9L72K25Q6o5k57
$$ -137 -308 -293 -198 120 381 385 100 -169 -460 -466 -143 296 434 367 131 -216 -433 -344 28 253 339 274 17
4288A7k32n9J24J03J10K1N0m0J5j32j84j15Q2K74J92J95r9m21l26n2K04M40K53
$$ 17 -215 -274 -150 -47 63 84 134 94 109 -23 -207 -322 -240 34 226 421 322 -99 -425 -477 -273 167 420
4311D20P2k58m88k00%K73M17K17j27l17k20j26J04K53J44k1l2j23Pn6Nn6m2N8
$$ 420 492 234 -254 -454 -454 -181 236 453 326 9 -211 -337 -233 20 164 143 111 -12 -5 -61 -56 -112 -154 -96
4335i6J91J88M9j83l66k71J02L42M33J79j78m18m54r4K84M48L04K9l46l71k00
$$ -96 95 283 332 149 -217 -488 -386 -44 389 568 390 -28 -482 -576 -292 156 460 489 143 -228 -428
4356d28J04K50L00L1o6k23l4j5O9k7k8J0L2K08Q4j61j70k40p9K03L84K70o6l06
$$ -428 -324 -74 226 257 191 -32 -66 -81 -12 -39 -67 -57 -25 183 267 106 -64 -304 -383 -180 204 474 408 102
4380A02l86l00J31M53L33J85j46m31m28l2M16K53K37n9k72k09l7K0J29J07Ll0
$$ 102 -284 -584 -453 0 333 518 372 -59 -487 -519 -103 150 387 328 56 -153 -190 -170 -41 66 69 39
4402C9mO7J5j39j90J7L6J57L45M9j70l93k90lL33L67L08q6l81l67k27J76L80L79
$$ 39 35 102 117 -22 -212 -195 -159 -2 343 392 222 -171 -461 -464 -131 236 544 458 77 -290 -517 -341 39 418
4426D18qk36k74j69j8J38K12J27l0q5k9k0r2p1m8Q5J42R8J79j41j91l12o9K22
$$ 418 410 174 -100 -269 -287 -149 63 190 160 75 46 26 -66 -137 -185 -100 42 140 319 178 -13 -325 -394 -172
4450a72K42L29J6k44l81k10K6K77L73K15j19l33k10j07O8J82K11O0n8j31j10r8
$$ -172 70 399 415 171 -210 -420 -394 -117 256 471 352 19 -191 -298 -230 -48 163 223 165 34 -76 -174
4472a74%L6P7J34J29N0j02j49j93j56R2L19K32N4o5l65l44J8K29L24J89N4k66
$$ -174 -174 -138 -61 73 202 252 150 1 -192 -348 -256 63 295 349 284 -81 -425 -407 -178 146 335 389 123
4495A23l14o5p0J55K60J89Mj87q6j86j02J05J80J06J4J52j63k00j91M2M4J70K95
$$ 123 -191 -256 -326 -171 89 278 282 95 9 -177 -279 -174 6 112 126 278 115 -85 -276 -234 -190 -20 275
4518B75K4j22k45k16n7J32K97J98q5J6k45k29n5K20R0K00J04p7k60r2j01L2O6
$$ 275 299 177 -68 -284 -341 -209 88 286 201 217 -28 -257 -312 -92 -2 198 302 225 -35 -127 -228 -196 -130
4541a30K14J74p5p5j05k30j13K39J89P6J86q0l15k19J1Q4K29J61Q5j08k73j37
$$ -130 84 258 183 108 3 -227 -340 -101 88 164 350 270 -45 -264 -253 -169 60 221 306 198 -75 -212
4563b12n4L0K67J75K2n3k7k69j75J10J03O4K07J53j78k14j29j03n2L13K72M0m3
$$ -212 -266 -236 31 206 228 175 148 -121 -296 -186 -83 -19 188 341 163 -51 -180 -283 -335 -22 250 290 247
4586B47k43k31j49J73K22J82N5j5k60j86m5M3J45J37K38r0j86q5j60m0R8L24P
$$ 247 4 -227 -376 -203 19 201 256 241 -19 -205 -250 -207 -62 75 313 223 37 -48 -208 -248 -150 174 181
4609A81oO3j79k52j09J05J45J79K16j1l60j60q0J3K04K89P8j15j24k34j53N5K15
$$ 181 175 238 59 -193 -302 -197 -52 127 343 332 -28 -188 -268 -255 -51 238 316 201 77 -157 -310 -255 -40
4632d0K33K7M6j49k51p7M3R6L8K77J4j48j08j04j65PK31K27M0K7j09l55j44Q4
$$ -40 193 220 266 117 -134 -211 -168 -72 -34 243 257 109 1 -103 -268 -261 -30 197 237 264 155 -200 -344 -260
4656b60J66K13J63%j86k73n3j8P9K32K85j11j61j44j87m4K02J44J20O5l2j98j67
$$ -260 -94 119 282 282 96 -177 -230 -248 -169 63 348 237 76 -68 -255 -299 -97 47 167 232 200 2 -165
4679a65n2L6J05J28K80r0j40j43j39r4J62K33J03jk0k31k33k6J49J85K15Q6j66
$$ -165 -217 -181 -76 52 332 242 102 -41 -180 -274 -112 121 224 223 203 -28 -261 -287 -138 47 262 348 182
4702A82k88j06p7N4K62K26m0p2r7k51j04J25J68J77Q3k7j48k35l3N1o1K60J60
$$ 182 -106 -212 -289 -235 27 253 213 141 44 -207 -311 -186 -18 159 242 215 67 -168 -201 -150 -211 49 209
4725B09O3j33j20j65k02J62K56J47Q3pk29k70j09J10J62K25J28m2k46k42j14J03
$$ 209 272 139 19 -146 -348 -186 70 217 300 293 64 -206 -315 -205 -43 182 310 268 22 -220 -334 -231
4747b31J67K41J42r6j89j04j80N7J14J53P0N2Mj97j69k8L1O7K27J18m1j50j81
$$ -231 -64 177 319 223 34 -70 -250 -193 -79 74 144 196 200 3 -166 -194 -163 -96 131 249 208 58 -123
4770a23j54k9K55K56N8J6j28l51j77J08K32J66J46m5j85j59j20lJ51J56J15k3
$$ -123 -277 -306 -51 205 263 279 151 -200 -377 -269 -37 129 275 230 45 -114 -234 -237 -86 70 185 162
4792A62j11m7j11j21N2J44J46J24%j40j68j55k8P2K80J56N9j55k79j52n8J52K61
$$ 162 51 4 -107 -228 -176 -32 114 238 238 98 -70 -225 -253 -181 99 255 314 159 -120 -272 -330 -178 83
4815H3K31K4j66k63j74K9J32J33K12N1j70j85j12j8JJ93J54L7lj26j73j09L3O6
$$ 83 314 338 172 -91 -265 -236 -104 29 241 292 122 -63 -175 -193 -192 1 155 192 189 63 -110 -219 -186 -120
4839a20J35J99Q5j41k02j77l3N2K18K14J40j66k54j94n6J15K00K10O5j25j57j72
$$ -120 15 214 299 158 -44 -221 -254 -202 16 230 370 204 -50 -244 -300 -185 15 225 290 165 8 -164
4861a64p9M3K10J60M2K0j63j74p5o2J36J69J19Ol9k15o6j41J00J73J17J56q3j12
$$ -164 -243 -200 10 170 212 232 69 -105 -180 -242 -106 63 182 188 149 -66 -132 -273 -173 0 117 273 190 78
4885G8k59r2J21M3K69J61n7j77k81j00N1J16K77J19Kj91j69k76J05J38J49J91
$$ 78 -181 -273 -152 -109 160 321 264 87 -194 -294 -243 -127 150 269 271 80 -89 -365 -260 -122 27 218
4907B18np9k24r8rQ6P6J92L6r7k8j58q7J6P2J97P0N1m9k08j80l6N8K08K20P3j39
$$ 218 213 134 -90 -188 -197 -111 -35 157 193 96 68 -90 -177 -161 -89 108 178 229 180 -28 -208 -244 -186 22 242 315 176
4934A76j82k69k1J33K36J63K5o8k78k22O6J03J46J60Q7r3k43n3k5J1R9J12J25
$$ 176 -6 -275 -296 -163 73 236 261 193 -85 -307 -241 -138 8 168 255 162 -81 -134 -159 -148 -49 63 188
4957A88m1k7r7j93n5J9J96J37K10q2k60k20j65J92J51L07Q5j28k64k64K0J10K63
$$ 188 147 120 23 -170 -225 -206 -10 127 337 255 -5 -225 -390 -198 -47 260 345 217 -47 -311 -291 -181 82
4980H2J38J25k03j41j83MM7R1L8J30L1o7n3j32n6qM7J94J74N6j56l04j89K2J91
$$ 82 220 345 142 1 -182 -178 -131 -40 -2 128 159 92 39 -93 -149 -157 -110 84 258 314 158 -146 -335 -313 -122
5005a22K69K57q4k32l39j47J17K69K60J67k00k24j75j39J50J94J57Np4j04n9m5
$$ -122 147 404 320 88 -251 -398 -281 -12 248 415 215 -9 -184 -323 -173 21 178 183 109 5 -54 -99
5027i9Rl3P9M7K10N6q3j99k04j55J90L03K17J2j61l17k88R1K12L32J87o5l09k76
$$ -99 -90 -123 -44 3 213 269 186 -13 -217 -372 -182 121 338 350 189 -128 -416 -325 -113 219 406 341 32 -244
5051b44j69J95J99K13K9p4j49j39P1p9P1P0M4J2J17K3k37j43j4l4J64L18J17k08
$$ -244 -413 -218 -19 194 223 149 0 -139 -68 -147 -76 -6 38 50 167 190 -47 -190 -204 -238 -74 244 361 153
5075A53j98k88j20J88L81K84k4k27l11j89L5K02K94J18q4j80k39m6O1Q5J44P3
$$ 153 -45 -333 -453 -265 116 400 376 149 -162 -351 -316 -114 180 298 214 34 -205 -251 -190 -105 39 112
5097A12K9j12MK1j61o6J7J21J47J19L1j77k89j30J08K00K74J87j98k79k59r3J64
$$ 112 141 29 33 54 -107 -173 -156 -35 112 231 262 85 -204 -334 -226 -26 248 435 237 -42 -301 -394 -230
5120b30L12J98L7j83j92j37q7J35J65J01K0p2m5j15qj8j2M6K34L7m4j00j51k58
$$ -230 82 280 317 134 -58 -195 -282 -147 18 119 139 67 22 -93 -101 -119 -131 -85 149 186 142 42 -109 -367
5144c67P1K78J82J70Ml09l12p6J12K31K10J82j45k91j63jO0J83J73Q1j43n2j64
$$ -367 -296 -18 164 334 338 29 -283 -359 -247 -16 194 376 231 -60 -223 -224 -164 19 192 273 130 78 -86
5167h6q9o8K10Q1L3J35o7j19j97K4p5J53K35J05o0k31j33j37j5K23K59O5M2k36
$$ -86 -175 -243 -33 48 81 216 149 30 -167 -143 -218 -65 170 275 215 -16 -149 -286 -301 -78 181 246 288 52
5191E2k67j01J24J68J77O8M7j43j96r5o9P0K85N1N2p9r7k33n1R0R4K21O1m5j97
$$ 52 -215 -316 -192 -24 153 221 268 125 -71 -166 -235 -165 120 171 223 144 47 -186 -237 -147 -53 168 229 184 -13
5216a3j13j37O7J00K03J19n1q8k06o1n2J48J70J04N6n3k24j78J7NJ45J81J40m8
$$ -13 -126 -263 -196 -96 107 226 175 87 -119 -180 -232 -84 86 190 246 193 -31 -209 -192 -187 -42 139 279 231
5240B31k48j57j51J48J34K13J13j13j15k03j23K4K55P9R1M2j72j75j00O7K4J62
$$ 231 -17 -174 -325 -177 -43 170 283 170 55 -148 -271 -247 8 87 178 220 48 -127 -227 -160 -136 26
5262B6J21L6l6j15j70p5J4J46K06J04mj54k13j64M2J37K19J55Lk59j80p4j1J61
$$ 26 147 183 147 32 -138 -213 -199 -53 153 257 253 99 -114 -278 -236 -99 120 275 278 19 -161 -235 -246 -85
5286h5K58N5n5r6j86j54P6P1J44J10nK4j91n4r1pP6K20J51j2j91j28k00m2K35
$$ -85 173 228 173 77 -109 -263 -187 -116 28 138 133 157 -34 -88 -179 -186 -110 110 261 249 58 -70 -270 -312 -77
5311g7J71J56L8j45l09j33O3J29K05K00p5j26j82j56P1R4J20J23Mj07Jk07n4L
$$ -77 94 250 288 143 -166 -299 -236 -107 98 298 223 97 -85 -241 -170 -76 44 167 171 64 65 -142 -196 -193
5335a93J54N8K31k3j26k02r2q5J24J86K11N6j75k13k31J0J47K39J55O9j52k39
$$ -193 -39 19 250 227 101 -101 -193 -278 -154 32 243 299 124 -89 -320 -310 -163 76 231 300 148 -91
5357i1j52M5O6J90J40k0p0j30n4j02N2J04J06R5J7o9j90j50m2Q7K43J51Q4j22
$$ -91 -243 -198 -132 58 198 178 108 -22 -76 -178 -126 -22 84 179 196 127 -63 -213 -255 -168 75 226 310 188
5381A88k47j56n5N8K40J94R6j23k39j48j18J76J96J03N9l7k14q6q5J5J35Q9J60
$$ 188 -59 -215 -270 -212 28 222 318 195 -44 -192 -310 -134 62 165 224 187 -27 -113 -198 -183 -48 41 201
5404B01J4r2j49j23p9j2K44J61N7j5j49k36j03Q0K33J84L4j5k37k41l3M6K27J89
$$ 201 215 123 -26 -149 -228 -240 4 165 222 207 58 -178 -281 -201 32 216 250 235 -2 -243 -276 -230 -3 186
5428A86P3j02q0j83o4l6J02K09P9J4n0j71j43p6J44O5K31J05j17j59k38n1O1K20
$$ 186 259 157 77 -106 -170 -206 -104 105 184 198 148 -23 -166 -242 -98 -33 198 303 186 27 -211 -262 -201 19
5452A9J50N5l2j24k18q2pJ87J75R1Pj82j75l6k0J00J74R0M9r8j47j43j03Q6J89
$$ 19 169 224 192 68 -150 -232 -239 -52 123 214 221 39 -136 -172 -192 -92 82 172 221 123 -24 -167 -270 -184 5
5477EJ39Q7o1j59j52j67R4K06J55R7j4j66j38j15l0J78J17J45L6j40j91j24o5
$$ 5 144 231 170 11 -141 -308 -214 -8 147 244 230 64 -74 -189 -219 -41 76 221 257 117 -74 -198 -263
5500b63J51J79O2P5n5j60j46m9RJ97J36Q3k1j22k22q5NK07J98P3l4j63j63j64
$$ -263 -112 67 129 204 149 -11 -157 -206 -197 0 136 219 198 76 -146 -231 -226 -19 179 252 218 55 -108 -272
5524b72Q6Q4J51J78M0j84j29j07o8P3K46J20J0l7j97j82p9J56O4J23J71J4k54
$$ -272 -186 -102 49 227 267 83 -46 -153 -221 -148 98 218 228 191 -6 -188 -267 -111 -47 76 247 261 7
5547Gj19r8OR8J79J37Kq8j90j73J3J45J45J54Om2l15p1OQ4J18J39M4n9j13j51
$$ 7 -112 -210 -204 -106 73 210 212 124 -66 -239 -226 -81 64 218 224 182 -133 -204 -198 -114 4 143 187 128 15 -136
5573a36n2MJ14K32j2K9q0j87j80J37rK47J16M8j58j82r2j04J23J95J42M1n4j50
$$ -136 -188 -184 -70 162 150 179 99 -88 -268 -131 -140 107 223 271 113 -69 -161 -265 -142 53 195 236 182 32
5597C2j99n4M4J72J86koj26j68p9M8J15J26R2J7j59j02j20n8J46J84Q2l8Oj06
$$ 32 -167 -221 -177 -5 181 179 173 47 -121 -200 -152 -37 89 181 198 39 -63 -183 -241 -95 89 171 133 139 33
5622C3j96p2J10J00J93J24r0j93j36j03jJ90J58J51q0j14j87j39M0J80K11OO5
$$ 33 -163 -235 -125 -25 168 292 202 9 -127 -230 -231 -41 117 268 188 74 -113 -252 -212 -32 179 185 250
5645B50j27k58p8L1P3J31J43R8k31n3p7j47J15J28J07M7O0r7j86j52n6J98J73
$$ 250 123 -135 -213 -182 -109 22 165 263 32 -21 -98 -245 -130 -2 105 152 212 115 -71 -223 -279 -81 92
5668I2J57L4j47k60j43Q2J11J30K14r5o6j72j79l4K48J20J07l7r4j02j20j1J3
$$ 92 249 283 136 -124 -267 -185 -74 56 270 175 109 -63 -242 -276 -28 92 199 162 68 -34 -154 -165 -152
5691a52J03J19J36k1j32q7j39j07J25J75J95j9q1j85j90j9J66J62J66J07j98k03
$$ -152 -49 70 206 185 53 -34 -173 -280 -155 20 215 196 115 -70 -260 -279 -113 49 215 322 124 -79
5713g9j93RJ06K03J25L2q0j99n3q2K8K22K9N4K9r6j63n0j0P2P9J46R5n7j70j39
$$ -79 -272 -263 -157 46 171 203 123 -76 -129 -211 -183 39 68 122 151 55 -108 -158 -168 -96 -17 129 224 167 -3 -142
5739a42j06R5J43J87R8m7k15k38J6LK00J98O3j13j55j16q9P7J46Q1Q1p5p9m1j44
$$ -142 -248 -153 -10 177 275 228 13 -225 -209 -206 -6 192 255 142 -13 -129 -218 -141 5 86 167 92 13 -28 -172
5764a72OJ15M7J21N6l8j46j18p7K7J56J44J47r1j48k11j18Q9K25K05Oo4j41j35
$$ -172 -166 -51 -4 117 173 135 -11 -129 -206 -179 -23 121 268 177 29 -182 -300 -211 14 219 225 161 20 -115
5788a15r0L7J88J34N3k2j15j58m0nP2J08J42J5r3q0j30n1l6J33J41J48k8j43k25
$$ -115 -205 -168 20 154 207 185 70 -88 -128 -133 -61 47 189 204 111 31 -99 -150 -186 -53 88 236 208 65 -160
5813a60q5Q1M6K18J57r2j25j50r3%J99J34Q2n6o8k06r0K4J41J02P2N5j02r3j38
$$ -160 -245 -164 -118 100 257 165 40 -110 -203 -203 -4 130 212 156 88 -118 -208 -184 -43 59 131 186 84 -9 -147
5838a47q1P7Q0K20j2J01j39j81j60L3J38J38J66L6j94j73l6p2J44J08J76k3r2
$$ -147 -228 -151 -71 149 137 238 99 -82 -242 -209 -71 67 233 269 75 -98 -134 -206 -62 46 222 199 107
5861A07j70j95L4J04J84J37j9o4p9j21q3P5K6J56J33o5l3k15j35qJ59J56J35o2
$$ 107 -63 -258 -224 -120 64 201 182 118 39 -82 -165 -90 -64 92 225 160 127 -88 -223 -231 -72 84 219 157
5885A57kj70k20k3J90J75M7n2M3k53m1l7J7K08P1J45j05j07j75j17J16P6J65J00
$$ 157 155 -15 -235 -258 -68 107 154 102 145 -108 -149 -186 -169 39 110 255 150 43 -132 -249 -133 -57 108 208
5909B08L9j66j82q4L9Q7J44L6N6m2k02p8r4J56J32J12j8l8j13n4j77Q1J64Q0R2
$$ 208 247 81 -101 -185 -146 -59 85 121 177 135 -67 -145 -239 -83 49 161 143 105 -8 -62 -239 -158 6 86 178
5934A78jj70r9j00M9Q8J31J07M5r4j58j79K7Q0J71J14Rj13o0j92j0Q0J45J01n
$$ 178 177 7 -92 -192 -143 -55 76 183 228 134 -24 -203 -176 -96 75 189 198 85 25 -167 -177 -97 48 149 144
5959A44l3l3j97r1L2Q8J48J46n0j25p1j55KL1K34J22pq0j87j42K5J15J18J36P0
$$ 144 111 78 -119 -210 -178 -90 58 204 154 29 -42 -197 -195 -164 70 192 185 105 -82 -224 -199 -84 34 170 240
5984B40q4k14j15o9R1J46J40j7k7l0j68p3MJ22J08J29Mo3j16j70o0P2J98J44o
$$ 240 156 -58 -173 -242 -151 -5 135 118 91 61 -107 -180 -176 -54 54 183 187 124 8 -162 -222 -150 48 192 186
6009A86j20o6j47p2J00J87R6j3rj74j07rL2J01J83l3k8j16o5l4p2J35J51J6O0
$$ 186 66 0 -147 -219 -119 68 164 151 142 -32 -139 -148 -116 -15 168 135 107 -9 -74 -108 -180 -45 106 122 182
6034A82l0j68j12n9R6P6J76R9q6j50j09j28K8J78J36R4p8j40j28j05Q0J22J20
$$ 182 152 -16 -128 -187 -91 -15 161 260 174 24 -85 -213 -185 -7 129 223 145 5 -123 -228 -148 -26 94
6057I4Q2m2m6j91k5k6J59P3J03m0o2r0r4p9L3J17J29J08m3j88l8j94J45Q7J40
$$ 94 176 134 88 -103 -128 -154 5 78 181 141 79 -11 -105 -184 -151 -34 95 203 160 -28 -66 -260 -115 -28 112
6082A12J32q8j16k01k8J0J40J31P9n5n1j27q2J0N1J45OQ0m0j41p6n0J6P2J77Q9
$$ 112 244 156 40 -161 -189 -179 -39 92 171 116 65 -62 -144 -134 -83 62 68 148 108 -33 -109 -159 -143 -71 106 195
6108A95k5j39o6j78K4J52R2J17j3j00j76j04J03L6J81O1L8j45j34k4j7Q8L4J20
$$ 195 170 31 -35 -213 -189 -37 55 172 159 59 -117 -221 -118 -82 99 160 198 53 -81 -105 -122 -34 0 120
6132A20l5N9r1k01n2R0Q5Q0J57K3j54j52j36P4L7J25K03l1j41j12j00qJ22R9J24
$$ 120 85 144 53 -148 -200 -110 -25 55 212 235 81 -71 -207 -133 -96 29 232 201 60 -52 -152 -160 -38 61 185
6157A85ml8j25k33M5N8J15J12O9r0o3j29%q5J29J65O1k1r2j07j10j2J10J24J03
$$ 185 181 143 18 -215 -170 -112 3 115 184 94 31 -98 -98 -183 -54 111 172 151 59 -48 -158 -170 -60 64 167
6182A67Mp9o1j57o7N4J25J50N8q9r9j07m4oJ43J00O5l0m2j90q1M9J40M3J44j03
$$ 167 171 92 31 -126 -193 -139 -14 136 194 105 6 -101 -145 -151 -8 92 157 127 85 -105 -186 -137 3 46 190 87
6208H7kj68n2L9k1J85P0N6r0p6j96PO1J47O6N0nj35j12j14R7N7J37R5o8o9j44
$$ 87 85 -83 -135 -96 -117 68 138 194 104 28 -168 -161 -100 47 113 163 158 23 -89 -203 -106 -49 88 183 115 46 -98
6235i8k6k3O7J45Q3mj29p9j00K4M3J07J02N2n3j56m5m8o3J96J58J5q0l5j55o3
$$ -98 -124 -147 -80 65 148 144 15 -64 -164 -140 -97 10 112 164 111 -45 -90 -138 -201 -5 153 168 88 53 -102 -165
6261a65N1Q3J27O5n2k5j55n8k1N4J74N2K0j11o5j31l7J03Q7J37L0k0j56j22m6
$$ -165 -114 -31 96 161 109 84 -71 -129 -150 -96 78 130 150 39 -26 -157 -194 -91 -4 133 163 143 -13 -135 -181
6286a81J07J51MO8l6j04p8n1p1J28J29L9L7r8o4j26rN3J20Q1Q2n2j16j65m6P6
$$ -181 -74 77 81 149 113 9 -69 -120 -191 -63 66 105 142 44 -20 -146 -155 -102 18 99 181 129 13 -152 -198 -122
6312a22J58Q3M5o3j16j25J7J8P7J24J4j1j04o9j7l6L1J25Q6pro9j15p6M2J10J40
$$ -122 36 119 164 101 -15 -140 -123 -105 -28 96 110 99 -5 -74 -91 -127 -96 29 115 108 99 30 -85 -161 -119 -9 131
6339A31NK1j49j02q7L4J18J93Kj1j09j49o8RJ48J27M8Kj23j04n0p4Q0J57L1mL
$$ 131 136 157 8 -94 -181 -147 -29 164 166 155 46 -103 -171 -162 -14 113 161 163 40 -64 -114 -188 -108 49 80 76 79
6366G9k4j37m0rP9J56P2m1p5j22r9O1P7J08Q2k4l9j98n9m3J27J75N8Jp9j53j04
$$ 79 55 -82 -122 -131 -52 104 176 135 60 -62 -161 -100 -23 85 167 143 104 -94 -153 -196 -69 106 164 165 86 -67 -171
6393a71M4M9J03Q5j0K8j62l2o7KL8J75O5Mj30j14o6Q3l5J26J69l2j8j72p9l8J04
$$ -171 -127 -78 25 110 100 128 -34 -66 -133 -131 -93 82 147 151 21 -93 -159 -76 -111 15 184 152 134 -38 -117 -155 -51
6420e1R8Q2J6l6j29q4q3Q7J10J10L5j18n1p7l8l8R1J22K9km9q4q0L3kJ07J80m6
$$ -51 47 129 145 109 -20 -104 -187 -100 10 120 155 37 -14 -91 -129 -167 -76 46 75 73 24 -60 -140 -107 -109 -2 178 132
6448A32q9m9r5n8J05J54J5K5o6j38j0o6M2P2J76m1m3L3j29l5o7J33O4M2N4o5j46
$$ 132 43 -6 -101 -159 -54 100 115 140 74 -64 -74 -140 -98 -26 150 109 66 99 -30 -65 -132 1 65 107 161 96 -50
6475e0j13J0N8R4R7L0K0j90j8r4L3J22K4R2jr8q4l0j6R0P8M5m2l8p3l2j5Q1Q7
$$ -50 -163 -153 -95 -1 96 126 146 -44 -62 -156 -123 -1 23 115 114 16 -68 -98 -114 -24 54 99 57 19 -54 -86 -101 -20 67
6504F7L4l9L2j49n1o2Q8R4P4R3q4p7p3r7J8J19P6J29r2p6r8p6K2R5J42k3j7m0
$$ 67 101 62 94 -55 -106 -168 -80 14 88 181 97 20 -53 -150 -132 -13 63 192 100 24 -74 -150 -128 -33 109 86 69 29
6532B9j32k7L8M9Q5Q1m0l7o4p5q5J01Q2O8N9Lo2j68l3oJ34M9Q7%j08k5r8k2P1
$$ 29 -103 -130 -92 -43 42 123 83 46 -18 -93 -178 -77 5 73 132 135 73 -95 -128 -134 0 49 136 136 28 3 -95 -117 -46
6561d6R6N0o0ko6q3PN1N7M6N9K2j42r0L2l9Q9N3J45n3j05p4r0k7J39J09%O0o9
$$ -46 50 100 40 38 -28 -111 -104 -53 4 50 109 131 -11 -101 -69 -108 -19 34 179 126 21 -53 -143 -170 -31 78 78 138 69
6590F9r4r2k2J19K2J27M4j09p3q5K5o3J42J17J7l4q5q5r1L1J27O5L2l1Jj35rj0
$$ 69 -25 -117 -139 -20 2 129 173 64 -9 -94 -69 -132 10 127 144 110 25 -60 -151 -120 7 72 104 73 74 -61 -70 -80
6618h0O4N5Q3K2p2r4K5j16L7Q9N2N4m0j4j44p0j4J21J39N7o6o5j05m3N6K5J07
$$ -80 -16 39 122 144 72 -22 3 -113 -76 13 65 119 79 65 -79 -149 -163 -42 97 154 88 23 -82 -125 -69 -44 63
6645F3M4J7r1l8j20j8Q9R0M0J2k3o5j02m4P4N3Q7N1o4p6m6q3K3J12J18J1o0q4
$$ 63 107 124 33 -5 -125 -143 -54 36 76 88 65 0 -102 -146 -72 -19 68 119 55 -21 -67 -150 -127 -15 103 114 54 -30
6673c0k1m8k1J14N6Q0n1r5k9p1J6L5J23J3K6k7j4j14n8rJ04P1K6J4j14mj52R3
$$ -30 -51 -99 -120 -6 50 130 79 -16 -45 -116 -100 -65 58 71 97 70 56 -58 -116 -125 -21 50 76 90 -24 -28 -180 -87
6701h7Q5N6L2kpr4n6l1O9O4P6J1p3m7r9L1QJ04Q5Op4m8o6m8J0J27M9N1M0j17q9
$$ -87 -2 54 86 84 77 -17 -73 -104 -35 29 105 116 43 -4 -103 -72 -64 40 125 131 57 9 -57 -105 -95 32 81 132 172 55 -34
6732c4r3J0R9K0J37po0n4r6k5P2N0R9l8k5r6p0n2O3J06N8Q0n5o0j09k6N1M8L1
$$ -34 -127 -117 -18 2 139 132 72 18 -78 -103 -31 19 118 80 55 -41 -111 -163 -100 6 64 144 89 29 -80 -106 -55 -7 24
6761B4J18q8%j07K5p5L5LJ06N7k0q5j04j4K0R0P1Q9j4j69r3j9Q1JJ56l5Rq3m8
$$ 24 142 54 54 -53 -28 -103 -68 -65 41 98 78 -7 -111 -125 -105 -15 56 145 131 -38 -131 -150 -69 -68 88 53 62 -21 -69
6790f9k6MN4L3R1J9o7l6m3p1K0P8P7N2k7q1j26L8M3lP4Q3pp4n5j01LP5R6M9J1
$$ -69 -95 -91 -37 -4 87 106 39 3 -40 -111 -91 -13 64 116 89 8 -118 -80 -37 -40 34 117 110 36 -19 -120 -117 -42 54 103 114
6821A14q8p1J0j9rJ49Lj7k3o6r6O2m7Q3Q0ML0p3j41N2o8P5J15N3K6r6p1p4PN5
$$ 114 26 -45 -35 -54 -63 86 89 72 49 -17 -113 -51 -98 -15 65 69 99 26 -115 -63 -131 -56 59 112 138 42 -29 -103 -96 -41
6851d1J21Nom7r5m8N9L2J3R5L1k6j43j0k3M8k4R8M8jq5j06k2K0O4R7J3L7n6j18
$$ -41 80 85 79 32 -63 -111 -52 -20 -7 88 119 93 -50 -60 -83 -35 -59 39 87 86 1 -105 -127 -107 -43 54 67 104 48 -70
6881g0Ml9N9J02J0K7m9o9p3k0P2O1N3kJ8l0k5j22L0lO6O3J0p4m1p6L4N7P3L0M1
$$ -70 -66 -105 -46 56 66 93 44 -25 -98 -118 -46 15 68 66 84 54 29 -93 -63 -66 0 63 73 -1 -42 -118 -84 -27 46 76 117
6912A17o2j49L7k0L3P9J2N4r0q5nm2M4O6M0M1L8p4p3k7p3N5J49j1kmq1q5j3J27
$$ 117 55 -94 -57 -77 -44 35 47 101 11 -74 -79 -121 -77 -11 29 70 108 34 -39 -66 -139 -84 65 54 52 48 -33 -118 -131 -4
6942dM3P8n8l7p5n9M0PL6J10m1l4L7q7n5L9JJ10l3L9j0j52N7k9N0M7P6J2o1n9
$$ -4 39 117 59 22 -53 -112 -72 -65 -29 81 40 6 43 -44 -99 -60 -59 51 18 57 47 -105 -48 -77 -27 20 96 108 47 -12
6972a2l8n4L6J06J3O7o5m9p9qN6L3M1RN2j10J5j1o6M1N8J6M8n7m4k6l6lM4J03
$$ -12 -50 -104 -68 38 51 118 53 4 -75 -83 -27 6 47 56 108 -2 13 2 -64 -23 35 51 99 42 -2 -28 -64 -67 -23 80
7002H0qk6m4r1L5j3Q4J33rn7j01r5M6n4Q6J03L2m4o2l2n4L2O6N3J9M1j8j26K3
$$ 80 72 46 2 -89 -54 -67 17 150 141 84 -17 -112 -66 -120 -34 69 101 57 -5 -37 -91 -59 7 60 79 120 102 -24 -1
7031ap7J0Q9R6o3J3p4r0jJ2P4M0K7Nj21m1j9L0J03j6J16qr1k7j8m3J32kL3p5M5
$$ -1 -78 -68 21 117 54 67 -7 -97 -98 -86 -12 28 55 60 -61 -102 -121 -91 12 -4 112 104 13 -14 -32 -75 57 55 88 13 58
7062E8o4m1LJ1L2l4J32m8qj00j2J8L5R6R0j00k4j14n0N0O2OO4%l1n3o1K3kJ07
$$ 58 -6 -47 -44 -33 -1 -35 97 49 41 -59 -71 -53 -18 78 168 68 44 -70 -120 -70 -8 -2 62 62 31 -22 -83 -60 -62 45
7092D5M1K5p6o7l9N2l3L3L9N4j1l9o1Ll7K3J20j2L5n4n2k5o1N3Q0P8j9j7p4j13
$$ 45 86 111 35 -32 -71 -19 -52 -19 20 74 63 24 -37 -34 -71 -48 72 60 95 41 -11 -36 -97 -44 36 114 95 78 4 -109
7122a09M5qQ6N0qj4K3j34k5Q0j9J39j4n6k8j3k9kJ1K8R2lmo9r8l6P1J12K6j8m0
$$ -109 -64 -72 14 64 56 42 65 -69 -94 -14 -33 106 92 36 8 -5 -34 -36 -25 3 95 92 88 19 -79 -115 -44 68 94 76 36
7153C6j02k3nJ0M2R0M0j1m8j34kMR7O1mN4r7k4q1Q8N5M6m7O2p7j09Q4p2n5J43
$$ 36 -66 -89 -94 -84 -42 48 88 77 29 -105 -107 -103 -6 55 51 105 8 -16 -97 -9 46 92 45 107 30 -79 5 -67 -122 21
7183B1O5m2J3m9j5q5Q3rM5R5mn7n9p1K5KQ2K5l3K3r4j0QL3K6K4J8n8Qj07K9qL7
$$ 21 86 44 57 8 -7 -92 -9 -18 27 122 118 61 2 -69 -44 -42 40 65 32 55 -39 -49 -41 -8 18 42 60 2 10 -97 -68 -76 -39
7216c9R4j9k1on7Ln4O8Q4m8R5m4q1o5M8J9M3L2N5p7j13J4%N5K2QL2qOj31L2n7
$$ -39 55 36 15 9 -48 -45 -99 -31 53 5 100 56 -25 -90 -42 -23 20 52 107 30 -83 -69 -69 -14 8 16 48 40 46 -85 -53 -110
7248a10J32L5J1Jl2o7p1P1mP3M6Rr6N3p2l7j2J37l0K6k6Lj06n6M5L7K8Q1K1n7
$$ -110 22 57 68 69 37 -30 -101 -30 -34 39 85 94 -2 51 -21 -58 -70 67 37 63 37 40 -66 -122 -77 -40 -12 69 90 33
7278C3n8l6K9JN7M7k2Kj39R2j13L3J15k9P1m2n3p1J1O7l4R2rJ2l1q2k4k5M4J06
$$ 33 -25 -61 -32 -31 26 73 51 53 -86 6 -107 -74 41 12 83 41 -12 -83 -72 -5 -39 53 44 56 25 -57 -81 -106 -62 44
7308D4j3M0k5q3k1j8O2J9Q2J8r9l7l2j0N4M8L6l1M6N2j80nJ3L5O8k4Qj4p8k1K6
$$ 44 31 71 46 -37 -58 -76 -14 5 87 105 6 -31 -63 -73 -19 29 65 34 80 132 -48 -53 -40 -5 63 39 47 33 -45 -66 -40
7339d0j4L7K9M4m4k9j8k9K3N6P5n3jn8ml4J6M5P1j2Nl8o4n4K3N7Q2M1j0l7q2n7
$$ -40 -54 -17 12 56 12 -17 -35 -64 -41 15 90 37 36 -22 -26 -60 -44 1 72 60 65 27 -37 -91 -68 -11 71 112 102 65 -17 -74
7371g4QN0M5O4k4o0m9n0RJ5L7R7Pn8jp9J8QJ8N1P0m7r5j1L5k6J4P7M8K5j05o7
$$ -74 -66 -16 29 93 69 9 -40 -90 -81 -66 -29 68 75 17 16 -63 -45 -37 -19 32 102 55 -40 -51 -16 -42 -28 49 97 122 17 -50
7403e0j1m0N4J15N0o5k5j07K2k2O4J6R3r5M9j2j08K9PQP2K6k3n5On0k3J4N3R8
$$ -50 -61 -101 -47 68 118 53 28 -79 -57 -79 -15 1 94 -1 48 36 -72 -43 -36 -28 44 70 47 -8 -2 -52 -75 -61 -8 90
7433I0l6l5l0Rl8MP1LL4m5m2n5OKK1O9L5p9L8l4o7K3M2j6Q4k0j2k7m0J2QPJ7o
$$ 90 54 19 -11 -2 -40 -36 35 38 72 27 -15 -70 -64 -62 -41 28 63 -16 22 -12 -79 -56 -14 -30 54 34 22 -5 -45 -33 -25 -18 -1 -7
7467gL2l4Jpl9N5K7K8k5p2j9jK0M2L8M1q6K6l0m2K8J2J9J7Rj4J5k5j26N3J03m0
$$ -7 25 -9 -8 -15 -54 1 28 56 31 -41 -60 -61 -41 1 39 80 -6 20 -10 -52 -24 -12 7 24 33 19 34 9 -117 -64 39 -1
7499aP7m2j6o7j5NL8O2ok3J2p2k2K9rN9J18q5M0j55QJ0L7M1jJ4k5Kj26j2J01O
$$ -1 76 34 18 -49 -64 -59 -21 41 35 12 24 -48 -70 -41 -50 9 127 42 82 -73 -65 -55 -18 23 22 36 11 13 -113 -125 -24 -18
7531a8R0l1jqm8J8l4Q1n5O4M9r1or1P5O3q5O8m9j7pm1j3L3P2j0P5m2l6p5lL6M1
$$ -18 72 41 40 32 -16 2 -32 49 -6 58 107 16 10 -81 -6 57 -28 40 -9 -26 -33 -74 -87 -54 18 8 83 41 5 -70 -73 -37 4
7564DN6N0j6q0o5K0o2J30K0lK0k6r0n2O4QO5P7l8l7k0r6LL0LJ08o9LJ9o8o5R3
$$ 4 60 110 94 14 -51 -31 -93 37 57 54 74 48 -42 -94 -30 -22 43 120 82 45 25 -71 -68 -38 -35 73 4 7 26 -42 -107 -14
7596a4K0K0M8mr2M8n1k2L9L6O7l5m7p3J2lJ9R2M6k1lp6p8P2n4M8M6J9Lp7j9p9
$$ -14 6 26 74 70 -22 26 -25 -47 -8 28 95 60 13 -60 -48 -51 -32 60 106 85 82 6 -72 0 -54 -6 40 59 62 -15 -34 -113
7628a13J06l4J15Jj5o0nn0K6lN8L3M8q5n1l3pj6MJ40ol5l8qJ4k2l1J45m5K6m3
$$ -113 -7 -41 74 75 60 0 -5 -55 -29 -32 26 59 107 22 -29 -62 -69 -85 -81 59 53 18 -20 -28 -14 -36 -67 78 33 59 16
7659A6k0p3k5Q3j9J16J3r3n8k5L2J0N8k6K2L3m9m4p1K8P2Q5Pm0l2r0J0J2O8K6
$$ 16 -4 -77 -102 -19 -38 78 91 -2 -60 -85 -53 -43 15 -11 11 44 -5 -49 -120 -92 -20 65 72 32 0 -90 -80 -68 0 26
7689B6K7Lj3o8J4k6M7J3oK2ll0n0j8O1K3K7nL4j05k1J0RN4N8n4J9q0K9p0K8RK8
$$ 26 53 56 43 -25 -11 -37 10 23 17 39 36 6 -44 -62 -1 22 49 44 78 -27 -48 -38 -29 25 83 29 48 -32 -3 -73 -45 -36 -8
7722hP7n4Lo6pN9j2jJ13m3j8m2p7k2R0%R2j1m2j3n0l7J6M7M7M6p1Rpn2rO0jK9
$$ -8 69 15 18 -48 -55 4 -8 -9 104 61 43 1 -76 -98 -8 -8 84 73 31 18 -32 -69 -53 -6 41 87 16 25 18 -34 -43 17 16 45
7756D5jl3o4kJ2LM6L7o6Q2p5o4M3j1L8L4L6kj4o7q0K9O0K6N6l5L8r2m6L4j9J21
$$ 45 44 11 -53 -55 -43 -40 6 43 -23 59 -16 -80 -37 -48 -10 24 60 58 44 -23 -103 -74 -14 12 68 33 71 -21 -67 -33 -52 69
7788F9l0NOj27j9N7K2K0L0L4l1k3m2k1K2J8M9N5l1n1o6K9L8l4R4j6J1n5k5j3j8
$$ 69 39 44 50 -77 -96 -39 -17 3 33 67 36 13 -29 -50 -28 -10 39 94 63 12 -54 -25 13 -21 73 57 68 13 -12 -25 -43
7819d3P6o5P6O8m8kj07PL1K8P9j7J3q6l8o7J11j7L6k6J2n7J9l0K6K5K4m8J00o5
$$ -43 33 -32 44 112 64 62 -45 -38 -7 21 100 83 96 10 -28 -95 16 -1 35 9 21 -36 -17 -47 -21 4 28 -20 80 15
7849A5J2o5K5k3nJ12m2l3k5P0j14P5NN9K1q0m0J2k3j9J2J31l1k9L8r3k4L2J3n
$$ 15 27 -38 -13 -36 -41 71 29 -4 -29 41 -73 2 7 66 87 7 -33 -21 -44 -63 -51 80 49 20 58 -35 -59 -27 -14 -19
7879a9Q1k5k7l4qn0J8K7R3k6l5Rp2l0O4J4M1K2rm4nk3o0J16j6N4p4K7Qp2j2K8
$$ -19 62 37 10 -24 -32 -82 -64 -37 56 30 -5 4 -68 -98 -34 -20 21 43 34 -10 -15 -38 -98 18 2 56 -18 9 17 -55 -67 -39
7911c9QR3n1Ll0n1L2LJ8M4J4j7p0k9M7m5K0O5L0M8j24pj5pL6J5K0rj0Lr3J8J2
$$ -39 -31 62 11 14 -16 -67 -35 -32 -14 30 44 27 -43 -72 -25 -70 -50 15 45 93 -31 -38 -53 -60 -24 -9 11 2 -8 -5 -98 -80 -68
7944f8J09J5L5p9J2j4j09J09l6M7k8N8p4K3o7M5PJ0N1J0p1R6j20o2Q3l0R6o4L4
$$ -68 41 56 91 12 24 10 -99 10 -26 21 -7 51 -23 0 -67 -22 -15 -5 46 56 -15 81 -39 -101 -18 -48 48 -16 18
7973A8lr6J7RM2L8M2k9n9K0o7J9M5L5jo5N3q3L1opO9N4k5k0n5kJ6n4L3L6R2j06
$$ 18 15 -81 -64 -55 -13 25 67 38 -21 -1 -68 -49 -4 31 30 -35 18 -65 -34 -40 -47 22 76 51 31 -24 -26 -10 -64 -31 5 97 -9
8006iJ7k6l8l8N3Q0k7O8p3mop2O5L4j0L3p6J2j6m4P2PJ0L9Mr0rM3Lj0l8Q0o1l
$$ -9 8 -18 -56 -94 -41 39 12 80 7 3 -3 -75 -10 24 14 47 -29 -17 -33 -77 -5 2 12 51 55 -35 -44 -1 2 -8 -46 34 -27 -30
8040c0pq8N6M6P7K4o1k3Oo2J7J0M3K6K8n7k6no4P1K6J7oK6p0K4k8NL9O6n5l3L2
$$ -30 -37 -125 -69 -23 54 78 17 -6 0 -62 -45 -35 8 34 62 5 -21 -26 -90 -19 7 24 18 44 -26 -2 -30 -25 14 80 25 -8 24
8073B4q7K9o1J25rM5K4p3o7L6l1M2QJ13r7m8L2l5jK2K8O4q3K9j2m5K0l8L2J01
$$ 24 -63 -34 -95 30 21 66 90 17 -50 -14 -45 -3 5 118 21 -27 5 -30 -31 -9 19 83 0 29 17 -28 -8 -46 -14 87
8103H7m5n7K5o2RjK7M5L6n0K5j8l5p4N9M1K3J1p3M7k6L1p4J8J04q5P7q8R1j58
$$ 87 42 -15 10 -52 -43 -44 -17 28 64 14 39 21 -14 -88 -29 12 35 46 -27 20 -6 25 -49 -31 73 -12 65 -23 68 -90
8133i0K5N2K8k4O1n8J4m7p9J52pl8J7ql2m3P5k6k8Q8k7ORp6J%L1O3J4k8q8N2k0
$$ -90 -65 -13 15 -9 52 -6 8 -39 -118 34 27 -11 6 -2 -34 -77 -2 -28 -56 32 5 11 20 -56 -55 -55 -24 39 53 25 -63 -11 -31
8166c1k3K7N9J3M6q0o5LJ7j7KM4N6Jl6r9N0j4N2jN2q4M2l4l2
$$ -31 -54 -27 32 45 91 11 -54 -51 -34 -51 -49 -5 51 52 16 -83 -33 -47 5 4 56 -28 14 -20 -52
8191e2
$$ Imaginary data points
##PAGE= N=2
##DATA TABLE= (X++(I..I)), XYDATA
0@%%%%%%%%%Qj6J6j6K4l2M0m8N6p2Q8j04J20j44J76k05K37k74L15l65M21m82N50
$$ 0 0 0 0 0 0 0 0 0 0 8 -8 8 -8 16 -16 24 -24 32 -40 48 -56 64 -80 96 -109 128 -146 169 -196 225 -257 293
32B93o26P10q03R07j019J141j278J426j587J766j960K173k406K657k933L236l566
$$ 293 -333 377 -426 481 -538 603 -675 751 -836 930 -1030 1143 -1263 1394 -1539 1697 -1869
49a869L928m328M769n256N796o401P083p853Q735r756J0955j2385J4123j6293
$$ -1869 2059 -2269 2500 -2756 3040 -3361 3722 -4131 4604 -5152 5803 -6582 7541 -8752
63h752J9091k2852K8201l6473N1074q4358K95484M3708n05625J30248k6890r7682
$$ -8752 10339 -12513 15688 -20785 30289 -54069 241415 285123 -220502 -90254 -117144 -214826
75b14826K64108K45857k53112o3646J26024j52865j66111J63592N3097j2323J58412
$$ -214826 49282 295139 42027 -21619 104405 -48460 -214571 -50979 2118 -10205 148207
86A48207J4569k39858k6297J10958k3950n967O5823n4164q03J34550K5741j28590
$$ 148207 162776 -77082 -103379 7579 -16371 -22338 43485 -10679 -11482 123068 148809 20219
98B0219j25489r0016P3369K33484R9767q9658q7950j37829j22141J31154J83248
$$ 20219 -105270 -195286 -121917 111567 211334 121676 33726 -104103 -226244 -95090 88158
109H8158l0128k854P4979j12179j31210O2191N072l5217J71904J01971j72076
$$ 88158 58030 55176 130155 17976 -113234 -51043 -45971 -81188 90716 192687 20611
120B0611p9911O3370o2841m371J58236l7062j70137P6653J41742n5230m5620L618
$$ 20611 -59300 4070 -58771 -63142 95094 58032 -112105 -35452 106290 51060 5440 9058
132I058j17395m9773J69632J25646l7436m7997n9817r4498J944Q7727M4691K4832
$$ 9058 -108337 -158110 11522 137168 99732 51735 -8082 -102580 -100636 -12909 31782 56614
144E6614M0025k3345q7985o3371j2645L0457P8572P9188j473q4840p5519R73L7765
$$ 56614 96639 73294 -14691 -78062 -90707 -60250 18322 97510 96037 11197 -64322 -63349 -25584
157b5584K0384J3525O102j4659J1885M6382j1952q1310m5887J9600M7432P0719
$$ -25584 -5200 8325 14427 -232 11653 58035 46083 -35227 -81114 -61514 -14082 56637
169E6637N0231l8666q4456m7215j0201J4082N2230O1063K4279j6560m7909o6851
$$ 56637 106868 68202 -16254 -63469 -73670 -59588 -7358 53705 77984 61424 13515 -53336
181e3336m7104J7434Q3275Q1750R535m8345n5911m9702j1001N4185M7172q370
$$ -53336 -100440 -83006 269 82019 91554 43209 -12702 -62404 -73405 -19220 27952 19582
193A9582M055K3377k5629l8391n562k5340j7005O7323O5973j6350k3698j8569
$$ 19582 23637 47014 21385 -17006 -22568 -47908 -64913 2410 68383 52033 28335 9766
205I766o3304k4736N6230L0691L822M6213J0297o7561m1390p067k0790L5516R0574
$$ 9766 -53538 -78274 -22044 8647 12469 58682 68979 1418 -39972 -47039 -67829 -32313 58261
218E8261K1145m1626k6590m1464m3534K9769N1430P934J6883K3035l1328m2313
$$ 58261 79406 37780 11190 -30274 -73808 -44039 7391 15325 32208 55243 23915 -18398
230a8398j2456j9641J74N8430M7015m458j5923l4022n1749n873L5041K1949K4307
$$ -18398 -30854 -50495 -50321 8109 55124 50666 34743 721 -51028 -56901 -21860 89 24396
243B4396K8374j5139l7043j7813k2212j4010L6761M6379J1809K347j3887m8930
$$ 24396 52770 37631 588 -17225 -39437 -53447 -16686 29693 41502 43849 29962 -18968
255a8968l1138J2160J4713K1143M2549J5255k6637k7772l0866l4069J2008N4224
$$ -18968 -50106 -37946 -23233 -2090 40459 55714 29077 1305 -29561 -63630 -51622 2602
267B602L9788J5915n949m7978n6138q998K5569L3585M2010K1602k5620l9096k4262
$$ 2602 42390 58305 52356 4378 -51760 -60758 -35189 -1604 40406 62008 36388 -2708 -26970
280b6970j6477M346L3874L0096Q925L66j4997l2719k1554N53R611K1931L1869
$$ -26970 -43447 -39101 -5227 24869 33794 34160 19163 -13556 -35110 -34557 -24946 -3015 28854
293B8854J4762j0725k3218l1368k6915L336L3966M0304K7784j092l8482n1816
$$ 28854 43616 32891 9673 -21695 -48610 -45274 -11308 28996 56780 55688 17206 -34610
305c4610k7703J0894M0842M8544K4093j7478m2559l8753j5652J4474L4027L0316
$$ -34610 -62313 -51419 -10577 37967 62060 44582 2023 -36730 -52382 -37908 -3881 26435
317B6435J2018o909k0319k4015j5604q61J2271K0360K0130R971n230j8359k3975
$$ 26435 38453 31544 11225 -12790 -28394 -29255 -16984 3376 23506 33477 28247 9888 -14087
330a4087j9575m129J6886L1387K9282Q712k1075m2736l7602n447L1434M8518L5714
$$ -14087 -33662 -37791 -20905 10482 39764 48476 27401 -15335 -52937 -58384 -26950 21568 57282
343E7282j104l7338m5868k5009P027L2884L8268J9267o810k3557k9216k1076O90
$$ 57282 56178 18840 -27028 -52037 -45010 -12126 26142 45409 38599 15042 -14174 -35250 -34560
356c4560J8238K2054J8845O480j2752j9882j4542j1056k389J4789K1701J7844
$$ -34560 -16322 5732 24577 31057 18305 -1577 -16119 -27175 -29564 -14775 6926 24770
368B4770J3088n866l3365l4902j0805J4226L6716M3073J1621k9571m0759l1424
$$ 24770 37858 31992 -1373 -36275 -47080 -32854 3862 46935 58556 28985 -11774 -43198
380d3198j0602K4419M3670K6132R05j6217l3470l2450l596K1396K7614K5624R366
$$ -43198 -53800 -29381 14289 40421 41326 25109 -8361 -40811 -44407 -23011 4603 30227 39593
393C9593j7041k7395j7573m440P473J5419J5625J1886L036r487j7366k0775j7701
$$ 39593 22552 -4843 -22416 -26856 -19383 -3964 11661 23547 26583 17096 -270 -21045 -38746
406c8746O566L2270K7802R843m871l0049m1202r112K1555K2567K8681K5686j5646
$$ -38746 -32180 90 27892 37735 32864 2815 -38387 -47499 -25944 -3377 25304 50990 35344
419C5344m0087k1103j0850k225L4953M2969J585j8032j5444l0157k0854K1062
$$ 35344 -4743 -25846 -36696 -38921 -3968 39001 40586 22554 7110 -23047 -43901 -22839
431b2839K6465N767J0705P911j9729k0774l295o876l112K2426K6453O298n483
$$ -22839 3626 9393 20098 28009 8280 -12494 -15789 -22665 -25777 -3351 23102 29400 23917
444B3917j3532k4942j9852L571K3132K5163J4629K390j4983l5261k8098O748K3226
$$ 23917 10385 -14557 -34409 -30838 -7706 17457 32086 34476 19493 -15768 -43866 -37118 -13892
457a3892K2282K9517J0453l6606l8324m815j248P293M2398K7583j9955j4877l700
$$ -13892 8390 37907 48360 11754 -26570 -31385 -32633 -25340 17058 44641 24686 9809 6109
470F109l1848j7562L1620K1364j196K2212Q722m1130k7474Q510n520J224M2210
$$ 6109 -25739 -43301 -11681 9683 8487 30699 39421 -1709 -29183 -20673 -26193 -24969 17241
483A7241K5319j9233j3412r354l4783j5097L3933L3459J1595J1193q873m5306
$$ 17241 42560 23327 9915 561 -34222 -49319 -15386 18073 29668 40861 31988 -13318
495a3318l3658R455K3375K1579K8386J0906k9747l6392j0245o43L896K9822L3136
$$ -13318 -46976 -37521 -14146 7433 35819 46725 16978 -19414 -29659 -30302 -26406 3416 36552
508C6552m004k0840r437j9527k3322J5773L4550P491K217J1914j7439l6915m377
$$ 36552 32548 11708 2271 -17256 -40578 -24805 9745 17236 19453 31367 13928 -22987 -27364
521b7364J1592k411J7149L6961L48k9573j2727j2219k2505J3528M4064J3902j0347
$$ -27364 -15772 -18183 -1034 35927 36275 6702 -6025 -18244 -40749 -27221 16843 30745 20398
534B0398O46j5004l7908m821K9071J0411M932K5561r18l9523j5765Q990r185M817
$$ 20398 21044 6040 -31868 -36689 -7618 2793 7725 33286 32368 -7155 -22920 -13930 -23115 -18298
548a8298L9840J1590k4524k163j24l2881q573L2722R774l148K5933L116m2812
$$ -18298 21542 33132 8608 6445 6321 -26560 -35133 -2411 7363 4215 30148 33264 -9548
561i548j7567J2571p194N794M1624J2031k7084q394m149k8136m975L2335J7926
$$ -9548 -27115 -14544 -21738 -15944 25680 37711 10627 2233 -1916 -30052 -35027 -2692 15234
574A5234J751J1648n252l5070k1982P723J2474J4761K4986J1906j9882k8745j2471
$$ 15234 16985 28633 23381 -11689 -33671 -25948 -13474 1287 26273 38179 18297 -10448 -22919
587b2919m311M67K4537L4654L004k0766j2913j9239k4876J4490M0102J0672k703
$$ -22919 -27230 -26763 -2226 32428 35432 14666 1753 -17486 -42362 -27872 12230 22902 20199
600B0199Q234j9685l8828J635J9807k850J4188L3968p515l0451l296r827k4698
$$ 20199 28433 8748 -30080 -28445 -8638 -11488 2700 36668 29153 -1298 -4594 -14421 -39119
613c9119J7219M0443N527l721O516k5238l8790L049K2157J0538K3223K2188k0019
$$ -39119 -21900 18543 24070 20349 26865 1627 -37163 -34114 -11957 -1419 21804 43992 23973
626B3973l6415j3831l305N685L0048K7513m230j9286j5885j4992m863J4147J8084
$$ 23973 -12442 -26273 -29578 -23893 6155 33668 29438 10152 -5733 -20725 -25588 -11441 6643
639F643P154k34k579o986j0785o632J386L728N338J2932J1445m442j3372j2048
$$ 6643 13797 13563 10984 3998 -6787 -13419 -12033 -8305 -2967 9965 21410 16968 3596 -8452
653h452j3470m933J8870K6294R599l671j4275k8682j8799J3201K5639J7252J1063
$$ -8452 -21922 -26855 -7985 18309 27908 24237 9962 -18720 -37519 -24318 1321 18573 29636
666B9636n110k7578k1448K973R903J0458J6406N272j3128q568n0o649m679P155
$$ 29636 24526 -3052 -24500 -21527 -11624 -1166 15240 20512 7384 -1184 -1234 -7883 -12562 -5407
680e407L829N75J1926R504r735j4425j0352j1349L129K6912K3720J409j1766k3243
$$ -5407 -1578 -1003 10923 20427 10692 -3733 -14085 -25434 -22305 4607 28327 29736 17970 -5273
694e273k8433m102K6489K8558J5556K96k2946l2677j1176J2395J8724J9606J0495
$$ -5273 -33706 -37808 -11319 17239 32795 33091 10145 -22532 -33708 -21313 -2589 17017 27512
707B7512j1138j9358r215j906K396R404P300L7J694L160k897o805q414r395J82
$$ 27512 16374 -2984 -12199 -14105 -11709 -2305 4995 5032 6726 9886 6989 184 -8230 -17625 -17443
722a7443J4720J8194J0944l204k1236k6229r521J1647K5082K6996P524k0690k9075
$$ -17443 -2723 15471 26415 23211 1975 -24254 -33775 -22128 2954 29950 37474 16784 -12291
735a2291j8371j864J9633K9984J3207q852j5789j7872j2087P999J7118O884K079
$$ -12291 -30662 -32526 -12893 17091 30298 21446 5657 -12215 -24302 -16303 815 7699 9778
748I778K013p027p956J397k118q370J535R515P249R870N838j4465k2820j0027
$$ 9778 11791 4764 -3192 -1795 -3913 -12283 -10748 -1233 6016 15886 21724 7259 -15561 -25588
762b5588K849J5307K7024J5833j2417k5359k1290r847J1924K8887K0325j17j3965
$$ -25588 -22739 -7432 19592 35425 23008 -2351 -23641 -33488 -21564 7323 27648 27531 13566
775A3566k1167j6833J577J5476J4626Q787m6j0038j0297l567p05J259M027L535
$$ 13566 -7601 -24434 -22857 -7381 7245 16032 15986 5948 -4349 -7916 -8621 -7362 -3335 200
789B00L742O850K752p350j2347j1160m082J1237K1570J4093j977j5870k3118j4891
$$ 200 3942 10792 13544 6194 -6153 -17313 -21395 -10158 11412 25505 23528 7658 -15460 -30351
803c0351O986K1638K0110R623o859k1411j9864m667Q705J6337J6513M628r533
$$ -30351 -23365 -1727 18383 28006 21147 -264 -20128 -24795 -16090 247 16760 21388 11855
816A1855j3394r907l796M724R410O327K875J864j625o062p858p319k326P607J4447
$$ 11855 -1539 -11446 -15242 -10518 -1108 5219 8094 9958 8333 2271 -5587 -12906 -15232 -7625 6822
831F822J1699J047j1141j7769j2830Q02J3946J8371J1590j977j4054j7918j1331
$$ 6822 18521 19568 8427 -9342 -22172 -21370 -7424 10947 22537 20560 6506 -11412 -22743
844b2743K836J4754J6703R309k776j3806j4984o417L299R218J1002O484j186n081
$$ -22743 -19907 -5153 11550 20859 18083 4277 -10707 -17124 -13825 -4607 6395 12879 11693 6612
858F612o709q621n382K675P979J0330Q870l19j0687j2655p952l74R566J4163Q760
$$ 6612 -97 -8718 -14100 -11425 -3446 6884 15754 15435 4748 -7907 -15859 -16233 -6667 7496 16256
873A6256J6p784j3616j1369j031Q489J3501J2059J229r785j2216r767k868Q171
$$ 16256 16272 8488 -5128 -16497 -17528 -9039 4462 16521 17750 7965 -4251 -14018 -16886 -8715
887h715J2200O748L268j395j0932j1567k961J166O207J4863R677n757r757q513
$$ -8715 3485 10233 13501 12106 1174 -10393 -13354 -12188 -5981 8882 18559 12802 3045 -5468
901e468j0523o61J3511J0632L287L412m517j5130q593J644K769Q914J4773L089
$$ -5468 -15991 -16652 -3141 7491 10778 14190 9673 -5457 -14050 -12406 -9637 -723 14050 17139
915A7139r179q490q098p498L832J2449Q514M408Q74q272j3884q356J414R393J3111
$$ 17139 7960 -530 -8628 -16126 -12294 155 8669 13077 13951 5679 -8205 -16561 -15147 -5754 7357
930G357R628k31j1505j5134o407L944P304J0415J0204k173j0849n962m847o287
$$ 7357 16985 16754 5249 -9885 -16292 -12348 -5044 5371 15575 13402 2553 -3409 -8256 -14543
944a4543N988J3870L650q07K202p654j3546j27N077l21P613J3217r59r671n591
$$ -14543 -8555 5315 8965 8158 10360 2706 -10840 -10967 -5890 -6211 1402 14619 13660 3989 -1602
959a602r035q515R232J7622P202k21m796j4288j3326K134J1092R064O836K947
$$ -1602 -10637 -19152 -9920 7702 14904 14683 9887 -4401 -17727 -15593 -4501 4563 11399 14346
973A4346o673j2667o862J968L863N045R457M039p613n747K28o378n555Q457P870
$$ 14346 7673 -4994 -11856 -9888 -6025 -980 8477 12516 4903 -844 -616 -6994 -12549 -4092 3778
988C778k03P139N068j5680j4868K195K048M311J9962R946j5102j2659m591j0130
$$ 3778 3575 10714 15782 102 -14766 -12571 -10523 -6212 13750 23696 8594 -4065 -8656 -18786
1002a8786K290K1724J1348l914j706q494j7647k899J2071P734O040O748m877j1602
$$ -18786 -16496 5228 16576 12662 10956 2462 -15185 -18084 -6013 1721 7761 14509 9632 -1970
1016a970m960j568q53M549P183N988L475l258q599q392p044J502J5050J2847P95
$$ -1970 -6930 -8498 -9351 -4802 2381 8369 11844 8586 -13 -8405 -15449 -13947 1103 13950 14745
1031A4745k267r025j9029n801J3371R741P208J1858n713k2345p708L117p22J2044
$$ 14745 12478 3453 -15576 -21377 -8006 1735 8943 20801 15088 -7257 -14965 -11848 -12570 -526
1045e26J9057l788j3285j077o161r959R451J1726l500K594Q346q340j1085J458
$$ -526 18531 14743 1458 381 -5780 -15739 -6288 5438 1938 4532 12878 4538 -6547 -5089
1059e089k540l910J1741J1886k057l153l887j2008o303O998Q217P705P054l527
$$ -5089 -7629 -11539 202 12088 10031 6878 2991 -9017 -15320 -8322 -105 7600 14654 11127
1073A1127j1901q729l463L286J1031Q629M92l647p454p390R32L531N53M762N499
$$ 11127 -774 -9503 -12966 -9680 1351 9980 10472 6825 -629 -8019 -7087 -3556 -3003 1759 7258
1088G258k680k159J240p135p343N097N441J246P796L926j0509q004o19m569K127
$$ 7258 4578 2419 3659 -3476 -10819 -5722 -281 965 8761 12687 2178 -5826 -6445 -11014 -8887
1103h887J5157P366m944l120p317j3177Q59J3169O394K736L551o581j1569k069
$$ -8887 6270 13636 8692 5572 -1745 -14922 -14063 -894 5500 8236 11787 5206 -6363 -8432
1117h432K209M88N485P817J229k630l872o931n571J162O093P414N349Q9m952q418
$$ -8432 -6223 -5735 -250 7567 8796 6166 2294 -4637 -10208 -9046 -2953 4461 9810 9899 4947 -3471
1133c471p847k60O459P542Q427M303q440j3088n012k19L575J2969J0123m924p536
$$ -3471 -11318 -11578 -5119 2423 10850 15153 6713 -6375 -11387 -11606 -8031 4938 15061 10137 2601
1148B601l930q382l645R799P558M93N058O82j2096p361K328n79K970J2363M279
$$ 2601 -1329 -9711 -13356 -3557 4001 4494 9552 10234 -1862 -9223 -6895 -7474 -4504 7859 12138
1163A2138o692l133l951r062k77R082N306L927M478n345j1575n066O35L422Q983
$$ 12138 5446 2313 -1638 -10700 -10977 -1895 3411 7338 11816 6471 -5104 -10170 -9535 -6113 2870
1178B870P766j192n664n734n447j094L770N061N334K998k777m907m427n225k2
$$ 2870 10636 9444 3780 -1954 -7401 -8495 -4725 336 5670 8668 5891 984 -3443 -8668 -8690
1193h690P764N671J078J994k653r498m036K702M67M073R941J679o873l786m667
$$ -8690 -926 4745 5823 7817 5164 -4334 -8370 -5668 -5201 -1128 8813 10492 3619 -167 -4834
1208d834o954L994J1421L198l43J534o331j0027J39M108Q34N515P785k009o813
$$ -4834 -11788 -7794 3627 6825 6482 8016 1685 -8342 -8203 -4095 -3261 2254 10039 8030 1217
1223A217l465m437l451N686Q808K976J03j752p001o735j20L544M400O088L708
$$ 1217 -2248 -6685 -10136 -4450 4358 7334 7437 5685 -1316 -8051 -8171 -4627 -227 5861 9569
1238I569k921o826n933k930J609O287P327L165k689n573n400l615J31N204O705
$$ 9569 6648 -178 -6111 -9041 -7432 -1145 6182 9347 6658 1085 -4315 -7930 -7799 -2595 4110
1253D110L558K2k984o997o487j33M883N837N687K188m871p458m214j074J869O430
$$ 4110 7668 7690 4706 -2291 -8778 -8911 -4028 1809 7496 9684 4813 -2645 -6859 -7933 -6064 366
1269C66O663J133k812m183n964m403K403O421M819K915K63n346o956k390P39K391
$$ 366 7029 8162 5350 1167 -4797 -9200 -6797 -376 4443 7358 7621 2275 -4681 -7071 -6332 -3941
1285c941N728N816J47m016m671n524l047L966P496M895J705k303p159o532o31
$$ -3941 1787 7603 7750 3734 -937 -6461 -9508 -5542 1954 6849 8554 6251 -908 -7440 -8071
1300h071L075M815N967K806l171n194m459l501Q16N560N396K744L1l998o141l200
$$ -8071 -4996 -181 5786 8592 5421 227 -4232 -7733 -6917 -1357 4039 6783 6814 2816 -3325 -6525
1316f525K17K518N192N002Q50k594m507n841l040K967N866N335L402k097p123
$$ -6525 -6308 -3790 1402 6404 7254 4660 153 -5688 -8728 -5761 105 5440 8842 6745 -378
1331c78n921j622J746N429O443J982k445l836m848l834J258M518M059L569J080
$$ -378 -6299 -7921 -6175 -746 5697 7679 5234 1398 -3450 -7284 -6026 -1508 2551 6120 7200
1346G200m108n659k775j047J715N577M721P41j364l909o111l193K215M742N787
$$ 7200 3092 -2567 -5342 -6389 -4674 903 5624 6365 5001 1092 -5019 -8212 -5997 -1255 4532
1361D532M443j527o707o156k760J421N830O320K063j944m170n064k854R47L351
$$ 4532 8975 7448 741 -5415 -8175 -6754 -924 5396 7459 5515 1345 -3719 -6573 -5626 -2275
1376b275M354L499K24k756m109l855j225K506L992L376K366p09m444m352k395
$$ -2275 2079 5578 5802 3046 -1063 -4918 -6143 -3637 355 3731 6097 5388 944 -3408 -5803
1391e803q06L527O946L866j206l790o145n445J453O296M966K794J27m789n657
$$ -5803 -6609 -3082 3864 7730 6524 2734 -3411 -8856 -7403 -1107 3859 6653 6780 1991 -3666
1406c666j909M58J995M591M019J70k222l577m300j751K078L645L750K264p54k921
$$ -3666 -5575 -5117 -3122 1469 5488 5658 3436 -141 -4441 -6192 -4114 -469 3281 5545 4791 1870
1422A870l878l888p02L510M912M454K143m096p686l993M14K957O654N744j878
$$ 1870 -2008 -5896 -6598 -3088 1824 6278 8421 4325 -3361 -7354 -6940 -3983 2671 8415 6537
1437F537m992k971l858k341M525N508J223J687M00o144n516R91J306J767N716
$$ 6537 1545 -1426 -5284 -7625 -3100 2408 3631 5318 5718 -426 -5942 -4951 -3645 -1878 3838
1452C838L005l164k530j848m661j592M289M492L119K740k570p722m827K28L273
$$ 3838 6843 3679 1149 -699 -5360 -6952 -2663 1829 4948 7688 5118 -2604 -7431 -7203 -3930
1467c930O074N219m38m313m658l510m54L000L980L486J749k483m275l027j793
$$ -3930 2144 7363 6925 2612 -2046 -5556 -6010 -3010 970 4456 6205 3722 -553 -3580 -5373
1482e373P58M878L642k92k48j154m416k371J352L44J782N668K280l827l441l102
$$ -5373 -4615 263 3905 3613 3365 2211 -2205 -4576 -3224 -2880 -1098 4570 6850 3023 -418 -3520
1498c520l776K143P439K991o59m30l793n691j30K827J326L438M042j492m489k512
$$ -3520 -7296 -5153 2286 5277 4618 4188 395 -5296 -5426 -2599 -1273 2165 6207 4715 226 -2286
1514b286k252r72M041M730O83m14p18l342l348k17J046J677M115L423j126m403
$$ -2286 -4538 -5510 -1469 3261 3944 3530 2812 -530 -3878 -4095 -3049 -1372 2743 6166 5040 637
1530F37m376k450O33M519N320J935j966l217l619l152L35L895L925K587J160k871
$$ 637 -3739 -6189 -5556 -1037 4283 6218 4252 1035 -2584 -5736 -5401 -1506 2419 5006 6166 3295
1546C295o166l354J066K528M189M403j70m132k964k059k233J255N055L319R72
$$ 3295 -2871 -6225 -5159 -2631 1558 5961 5791 1659 -1305 -3364 -5597 -4342 713 4032 5004
1561E004m2l638n983k119K886L711L494K857j105m970l471q47l55J710N197L497
$$ 5004 4962 1324 -4659 -6778 -3892 -181 3313 6170 5065 95 -3376 -4223 -4578 -2868 2329 5826
1577E826j234k450k910m801j451N180M966Q81Q49q36n913l798K115J507R11N167
$$ 5826 4592 2142 -768 -5569 -7020 -1840 3126 4007 4856 4020 -1893 -5691 -3576 -2069 -1158 4009
1593D009K780m453l659r00k866j44O433L564k158j16m03m778k020L023P67PM194
$$ 4009 6789 2336 -1323 -2223 -5089 -5233 1200 4764 2606 2490 2087 -2691 -4711 -1688 -921 -914 3280
1610C280K140l404l026j125k338J1M842L775j92j043j759l911k777J518L738K659
$$ 3280 5420 2016 -1010 -2135 -4473 -4462 380 4155 3963 2920 1161 -2750 -5527 -4009 -271 2388
1626B388J788Q56l424n417j229K402J568K393L672j126m397o04K15l143M74M991
$$ 2388 4176 5032 1608 -3809 -5038 -2636 -1068 1325 4997 3871 -526 -1130 -915 -4058 -3584 1407
1642A407R80o72K616j456o702j376K940K7K462O308l85n945k047j664l554L272
$$ 1407 2387 1715 4331 2875 -3827 -5203 -2263 -2236 226 6534 6149 204 -1843 -3507 -7061 -3789
1658c789Q138J870k048j179m752n932J858N881K474J470J139l342m868o98J074
$$ -3789 4349 6219 4171 2992 -1760 -7692 -5834 47 2521 3991 5130 1788 -3080 -3778 -2704
1673b704M01K245L349P98j742j843j831k396p61K870L758J564M65o54m550n067
$$ -2704 -2303 -58 3291 4089 2347 504 -1327 -3723 -4484 -1614 2144 3708 4173 3519 -1031 -6098
1689f098L38L661L038M206K592m906o872j535Q16J543N861M689l108m209j198
$$ -6098 -5760 -2099 939 5145 7737 2831 -4041 -5576 -4760 -3217 2644 7333 4225 16 -1182
1704a182k614j615M327L973r09K61R76l453l060J387L54j064L035L495o26j291
$$ -1182 -3796 -5411 -1084 2889 1980 2241 3217 -236 -3296 -1909 -1555 -2619 416 3911 3285 1994
1720A994r44l890l291K474M668K827J782j129n371m793j34L018L921L562R69l054
$$ 1994 1050 -2840 -6131 -3657 1011 3838 5620 4491 -880 -5673 -5807 -2789 1132 4694 5663 2609
1736B609m530k440K43J954L100K764J05k315k117r60q37J5J810J503M91J257N72
$$ 2609 -1921 -4361 -4118 -2164 936 3700 3805 1490 -627 -1587 -2424 -2409 -599 904 1395 2652 3224
1753C224k704l298j131J71K072M782K998k080l921l260k482P53N096M403M94j383
$$ 3224 520 -2778 -3909 -3738 -1666 3116 6114 4034 113 -3147 -5629 -4876 220 4623 5117 3734
1769C734l171m602j703K792L602K318J369j281l693k217K88M40J095K098J192
$$ 3734 563 -4039 -5742 -2950 652 2970 4339 3058 -635 -2852 -2564 -2124 -1029 1069 2261
1784B261j01k07j042k711j867N41K084K979K516j75l223l693k070L05L100M107
$$ 2261 2160 1953 911 -1800 -3667 -3126 -1042 1937 4453 4278 1055 -2638 -4708 -4403 -1303 2804
1800B804K297o74l334m147k083R93L381L823J688j238l150k704j085O69K015J998
$$ 2804 5101 4427 1093 -3054 -5137 -4144 -763 3060 4748 3510 360 -2344 -3429 -2760 -745 1253
1816A253J026K72m77j926k180j064L04J596K998K044m17k163k759k437k39K587
$$ 1253 2279 2551 2074 148 -2032 -3096 -2792 -1196 1802 3846 3429 1266 -1493 -3930 -4169 -1582
1832a582L364K269L65k152m174k699L36K492L617K677m48k920k973j723L7J933
$$ -1582 1782 4051 4416 2264 -1910 -4609 -4273 -1781 1836 4513 4065 1145 -1828 -3551 -3514 -1581
1848a581K676J594L73p62k140k439r51O01J848K706J781n34k130k542j877k09
$$ -1581 1095 2689 3062 2300 160 -2279 -3230 -2629 -781 1925 3706 3172 1042 -1500 -3377 -3586
1864c586J872K849K238N04j672l235k666n29J896L307K702L40j854k886k433m62
$$ -3586 -1714 1135 3373 3877 2205 -1030 -3696 -4225 -2329 978 3680 4020 2166 -720 -3153 -3615
1880c615J490K269K253J165p57k411k539j482L50K347L009J514m92j996k667j964
$$ -3615 -2125 144 2397 3562 2805 394 -2145 -3627 -3277 -930 2079 3593 3101 1105 -1562 -3526
1896c526K53J982K423J936N55j597k880k165n31J260K759K588M34j381k180k219
$$ -3526 -3273 -1291 1132 3068 3623 2026 -854 -3019 -3550 -2290 469 3057 3491 2110 -70 -2289
1912b289j154P86K148K136J532J59j859l167j883J92J828K966K505j03k476k681
$$ -2289 -3443 -2657 -509 1627 3159 3318 1459 -1708 -3591 -3399 -1571 1395 3900 3797 1321 -1360
1928a360j862m21J785L088J944M3j231k424k597n25J691K219J969R12j003k271
$$ -1360 -3222 -3643 -1858 1230 3174 3217 1986 -438 -3035 -3560 -1869 350 2319 3231 2228 -43
1944d3j580q89j66J502K461J482K98r91k718k820n32J867K719K803Q83j936l455
$$ -43 -1623 -2512 -2678 -1176 1285 2767 3065 2074 -644 -3464 -3996 -2129 590 3393 4276 2340 -1115
1961a115k357m06J412L038K928N00j804k758k307q67J432K814K130K67r19j711
$$ -1115 -3472 -3878 -2466 572 3500 4000 2196 -562 -2869 -3736 -2304 510 2640 2907 1988 277
1977B77k042r39O43J092J406J845Q72j306k241j887j285P42L187K904M86j122
$$ 277 -1765 -2704 -2061 -969 437 2282 3154 1848 -393 -2280 -3565 -2823 364 3268 3754 2632
1993B632k435l475j240K099K850K185J569j072l882k698R9J011K210L207O16k358
$$ 2632 197 -3278 -4518 -2419 431 2616 4185 3113 -769 -3467 -3368 -2357 -147 3060 3676 1318
2009A318j746o74j361J19K297J190n8J091J00k533j975jj9J067L174J858j504
$$ 1318 -428 -1102 -2463 -2344 -47 1143 1085 2176 2276 -257 -2232 -2233 -2252 -1185 1989 3847 2343
2026B343j979j783k242n6L278L084P96l64j985l588j753J742K768J726J171n14
$$ 2343 364 -1419 -3661 -3717 -439 2645 3441 3077 1092 -2496 -4249 -2507 261 1987 3158 2644
2042B644k641k252J42O36L75J559J709l71j004k27j326k136M02K399J085R39J577
$$ 2644 3 -2249 -2107 -1471 -1096 463 2172 1801 797 570 -756 -2892 -2490 -91 994 1933 3510
2059C510j579l865j210O65L50K497L998j95l592j960j431j648K514M780P90j500
$$ 3510 1931 -1934 -3144 -2479 -2129 368 4366 4171 579 -1381 -2812 -4460 -1946 2834 3624 2124
2075B124m76k223l251Q94K943M05Q12K063j147l214n87Q6j108J271L477P86j194
$$ 2124 1648 -575 -3826 -2932 11 416 1228 3291 2144 -1070 -1657 -1571 -2679 -1408 2069 2855 1661
2092A661k10j707l188k94K689K182J391J439j389m152k409Q51J638K192K933N53
$$ 1661 1451 -256 -3444 -3738 -1049 1133 2524 3963 2574 -1578 -3987 -3136 -1498 694 3627 4180
2108D180l182k851m69n45M43L406K327j200j100l39k567j680K190K109j86J474
$$ 4180 998 -1853 -2322 -2867 -2424 982 3309 2109 1009 670 -1897 -3577 -1387 722 536 2010
2124B010J355k741k564M29m42o63L155L165j226j532n51k881k001K939L333K41
$$ 2010 3365 624 -1940 -1511 -1953 -2616 539 3704 2478 946 395 -2486 -4487 -1548 1785 2026
2140B026O69N0l356k935J185J461N12K199J853j999k430m83o74o82J994K661L5
$$ 2026 2695 2745 -611 -3546 -2361 -900 -388 1811 3664 1665 -765 -1248 -1922 -2604 -610 2051 2086
2157B086o60j07j573k385N0J767Q53J285J882p18l164j615R5k24J619L543P74
$$ 2086 1426 1319 -254 -2639 -2589 -822 31 1316 3198 2480 -684 -2299 -2204 -2428 -809 2734 3508
2174C508k141j238j157k296K69L307J679nO85j168l418j230J494Q09J248K558
$$ 3508 1367 129 -1028 -3324 -3055 252 1931 1926 2611 1443 -1975 -3205 -1711 -902 346 2904
2190B904K24k530j508n95j283M98L064J838l27l29j387k926j270J837K075J254
$$ 2904 3128 598 -910 -1505 -2788 -2290 774 2612 2285 1956 569 -2357 -3627 -1790 285 1539
2206A539J418j41k775k308k49L57J168K507J744r28j808j425j616m86J929K416
$$ 1539 2957 2816 41 -2267 -2516 -2159 -991 1516 3260 2332 524 -901 -2517 -3003 -1074 1342
2222A342P73K38n77k385k072J59J130J298K038J367j330k411j383o93J07K192
$$ 1342 2115 2353 1776 -609 -2681 -2522 -1392 -94 1944 3311 1981 -430 -1813 -2506 -2399 -207
2238b07K422O05r25j405j941j454N43J986J612R79K52j466k291j071K32Q42J773
$$ -207 2215 2820 1895 490 -1451 -2905 -2362 -376 1236 2215 2467 1001 -1290 -2361 -2129 -1287 486
$$ [...]
8191b
##END NTUPLES=NMR FID
##END=
