##TITLE=1H_B3dm2808K
 CDCl3
 8 sc, 
 30.8.2023
##JCAMPDX= 6.0         $$ Bruker NMR JCAMP-DX V2.0
##DATA TYPE= NMR FID
##DATA CLASS= NTUPLES
##ORIGIN= UXNMR, Bruker Analytische Messtechnik GmbH
##OWNER= root
$$ XWIN-NMR		Version 3.5
$$ Wed Aug 30 13:51:01 2023 Russian Standard Time (UT+4h)  she@DPX200
##.OBSERVE FREQUENCY= 200.13135
##.OBSERVE NUCLEUS= ^1H
##.DELAY= (6, 6)
##.ACQUISITION MODE= SIMULTANEOUS
##.ACQUISITION SCHEME= undefined
##.AVERAGES= 8
##.DIGITISER RES= 18
##SPECTROMETER/DATA SYSTEM= spect
##.PULSE SEQUENCE= zg30
##.SOLVENT NAME= D2O
##.SHIFT REFERENCE= (INTERNAL, D2O, 0, 15.7039)
##AUDIT TRAIL= $$ (NUMBER, WHEN, WHO, WHERE, WHAT)
$$ ##TITLE= Audit trail, XWIN-NMR		Version 3.5
$$ ##JCAMPDX= 5.01
$$ ##ORIGIN= Bruker BioSpin GmbH
$$ ##OWNER= she
$$ F:/spectra/data/she/nmr/H-F/1/audita.txt
$$ ##AUDIT TRAIL=  $$ (NUMBER, WHEN, WHO, WHERE, WHAT)
(   1,<2023-08-30 13:49:49.42 +0400>,<she>,<DPX200>,
      <created by zg, POWCHK disabled, PULCHK disabled
       configuration hash MD5:
       00 E9 B6 7A A2 85 ED C7 34 08 36 98 17 FE 4E 26
       data hash MD5: 16K
       E6 A2 EB F8 01 D0 4D D5 19 9F 4C 4D 2F 16 EB 7D>)
$$ ##END=
$$ 
$$ hash MD5
$$ 6D 84 8A 8C 2A 25 42 CC 4E DE 70 7A BD 45 C9 CC
##$RELAX= 
##$RELAX= 
##$RELAX= 
##$RELAX= 
##$RELAX= 
##$RELAX= 
$$ Bruker specific parameters
$$ --------------------------
##$DU= <F:/spectra>
##$EXPNO= 1
##$NAME= <H-F>
##$PROCNO= 1
##$TYPE= <nmr>
##$USER= <she>
##$AMP= (0..31)
100 100 100 100 100 100 100 100 100 100 100 100 100 100 100 100 100 100 
100 100 100 100 100 100 100 100 100 100 100 100 100 100 
##$AQSEQ= 0
##$AQ_mod= 1
##$AUNM= <au_zg>
##$AUTOPOS= <>
##$BF1= 200.13
##$BF2= 200.13
##$BF3= 200.13
##$BF4= 200.13
##$BF5= 200.13
##$BF6= 200.13
##$BF7= 200.13
##$BF8= 200.13
##$BYTORDA= 1
##$CFDGTYP= 0
##$CFRGTYP= 5
##$CHEMSTR= <none>
##$CNST= (0..31)
1 1 145 1 1 1 1 1 1 1 1 1 1 1 1 1 1 1 1 1 1 1 1 1 1 1 1 1 1 1 1 1 
##$CPDPRG= <>
##$CPDPRG1= <>
##$CPDPRG2= <>
##$CPDPRG3= <>
##$CPDPRG4= <mlev>
##$CPDPRG5= <mlev>
##$CPDPRG6= <mlev>
##$CPDPRG7= <mlev>
##$CPDPRG8= <mlev>
##$CPDPRGB= <>
##$CPDPRGT= <>
##$D= (0..31)
0 1.2 0 0 0 0 0 0 0 0.06 0 0.03 0 0 0 0 0.0002 0 0 0 0 0 0 0 0 0 0 0 0 
0 0 0 
##$DATE= 1693388988
##$DBL= (0..7)
120 120 120 120 120 120 120 120 
##$DBP= (0..7)
150 150 150 150 150 150 150 150 
##$DBP07= 0
##$DBPNAM0= <>
##$DBPNAM1= <>
##$DBPNAM2= <>
##$DBPNAM3= <>
##$DBPNAM4= <>
##$DBPNAM5= <>
##$DBPNAM6= <>
##$DBPNAM7= <>
##$DBPOAL= (0..7)
0.5 0.5 0.5 0.5 0.5 0.5 0.5 0.5 
##$DBPOFFS= (0..7)
0 0 0 0 0 0 0 0 
##$DE= 6
##$DECBNUC= <off>
##$DECIM= 32
##$DECNUC= <off>
##$DECSTAT= 4
##$DIGMOD= 1
##$DIGTYP= 9
##$DL= (0..7)
0 120 120 120 120 120 120 120 
##$DP= (0..7)
150 150 150 150 150 150 150 150 
##$DP07= 0
##$DPNAME0= <>
##$DPNAME1= <>
##$DPNAME2= <>
##$DPNAME3= <>
##$DPNAME4= <>
##$DPNAME5= <>
##$DPNAME6= <>
##$DPNAME7= <>
##$DPOAL= (0..7)
0.5 0.5 0.5 0.5 0.5 0.5 0.5 0.5 
##$DPOFFS= (0..7)
0 0 0 0 0 0 0 0 
##$DQDMODE= 0
##$DR= 18
##$DS= 0
##$DSLIST= <SSSSSSSSSSSSSSS>
$$ [...]
##$SUBNAM2= <"">
##$SUBNAM3= <"">
##$SUBNAM4= <"">
##$SUBNAM5= <"">
##$SUBNAM6= <"">
##$SUBNAM7= <"">
##$SUBNAM8= <"">
##$SUBNAM9= <"">
##$SW= 18.05172834244
##$SWIBOX= (0..15)
0 0 2 0 0 0 0 0 0 0 0 0 0 0 0 0 
##$SW_h= 3612.71676300578
##$TD= 16384
##$TD0= 1
##$TE= 0
##$TE2= 300
##$TE3= 300
##$TEG= 300
##$TL= (0..7)
0 120 120 120 120 120 120 120 
##$TP= (0..7)
150 150 150 150 150 150 150 150 
##$TP07= 0
##$TPNAME0= <>
##$TPNAME1= <>
##$TPNAME2= <>
##$TPNAME3= <>
##$TPNAME4= <>
##$TPNAME5= <>
##$TPNAME6= <>
##$TPNAME7= <>
##$TPOAL= (0..7)
0.5 0.5 0.5 0.5 0.5 0.5 0.5 0.5 
##$TPOFFS= (0..7)
0 0 0 0 0 0 0 0 
##$TUNHIN= 0
##$TUNHOUT= 0
##$TUNXOUT= 0
##$USERA1= <user>
##$USERA2= <user>
##$USERA3= <user>
##$USERA4= <user>
##$USERA5= <user>
##$V9= 5
##$VALIST= <valist>
##$VCLIST= <CCCCCCCCCCCCCCC>
##$VD= 0
##$VDLIST= <DDDDDDDDDDDDDDD>
##$VPLIST= <PPPPPPPPPPPPPPP>
##$VTLIST= <TTTTTTTTTTTTTTT>
##$WBST= 1024
##$WBSW= 4
##$XGAIN= (0..3)
0 0 0 0 
##$XL= 0
##$YL= 0
##$YMAX_a= 735284
##$YMIN_a= -625340
##$ZGOPTNS= <>
##$ZL1= 120
##$ZL2= 120
##$ZL3= 120
##$ZL4= 120
##$ABSF1= 10
##$ABSF2= 0
##$ABSG= 5
##$ABSL= 3
##$ALPHA= 0
##$AQORDER= 0
##$ASSFAC= 0
##$ASSFACI= 0
##$ASSFACX= 0
##$ASSWID= 0
##$AUNMP= <proc_1d>
##$AZFE= 0.1
##$AZFW= 0.1
##$BCFW= 1
##$BC_mod= 2
##$BYTORDP= 1
##$COROFFS= 0
##$CY= 11.3945322036743
##$DATMOD= 1
##$DC= 2
##$DFILT= <>
##$DTYPP= 0
##$F1P= 15.7292609196834
##$F2P= 12.9074282941183
##$FCOR= 0.5
##$FTSIZE= 0
##$FT_mod= 4
##$GAMMA= 1
##$GB= 0.15
##$INTBC= 1
##$INTSCL= 1
##$ISEN= 128
##$LB= 0.24
##$LEV0= 0
##$LPBIN= 0
##$MAXI= 10000
##$MC2= 0
##$MEAN= 0
##$ME_mod= 0
##$MI= 1.114404
##$NCOEF= 0
##$NC_proc= 0
##$NLEV= 6
##$NOISF1= 3.799351
##$NOISF2= 2.8
##$NSP= 1
##$NTH_PI= 0
##$NZP= 0
##$OFFSET= 15.70392
##$PC= 1
##$PHC0= -21062.5
##$PHC1= 30.25272
##$PH_mod= 1
##$PKNL= yes
##$PPARMOD= 0
##$PSCAL= 0
##$PSIGN= 0
##$REVERSE= no
##$SF= 200.130013532006
##$SI= 16384
##$SIGF1= 3
##$SIGF2= 2
##$SINO= 400
##$SIOLD= 16384
##$SREGLST= <1H.CDCl3>
##$SSB= 0
##$STSI= 0
##$STSR= 0
##$SW_p= 3612.71676300578
##$SYMM= 0
##$S_DEV= 0
##$TDeff= 0
##$TDoff= 0
##$TI= <>
##$TILT= no
##$TM1= 0
##$TM2= 0
##$TOPLEV= 0
##$USERP1= <user>
##$USERP2= <user>
##$USERP3= <user>
##$USERP4= <user>
##$USERP5= <user>
##$WDW= 1
##$XDIM= 8192
##$YMAX_p= 0
##$YMIN_p= 0
$$ End of Bruker specific parameters
$$ ---------------------------------
##NTUPLES= NMR FID
##VAR_NAME=  TIME,          FID/REAL,        FID/IMAG
##SYMBOL=    X,             R,               I
##VAR_TYPE=  INDEPENDENT,   DEPENDENT,       DEPENDENT
##VAR_FORM=  AFFN,          ASDF,            ASDF
##VAR_DIM=   8192,          8192,            8192
##UNITS=     SECONDS,       ARBITRARY UNITS, ARBITRARY UNITS
##FACTOR=    0.0002768,     1,               1
##FIRST=     0,             0,               0
##LAST=      2.2672688,     0,               0
##MIN=       0,             -625340,         0
##MAX=       2.2672688,     735284,          0
$$ Real data points
##PAGE= N=1
##DATA TABLE= (X++(R..R)), XYDATA
0 0 0 0 0 0 0 0 6 -8 8 -8 8 -16 24 -24 32 -40 48 -64 72 -88 104 -128 152 -176 208 -240 280 -320 370 -424
30 -424 487 -553 630 -711 803 -903 1014 -1135 1269 -1414 1574 -1747 1938 -2145 2370 -2617
46 -2617 2889 -3185 3509 -3864 4256 -4692 5174 -5709 6309 -6986 7761 -8651 9688 -10915
60 -10915 12389 -14207 16507 -19520 23656 -29696 39368 -57264 101093 -421631 -275382 735284
72 735284 -318522 -377221 437873 -23806 -348434 361854 31301 -337163 218081 142509
82 142509 -298503 124732 158270 -207104 51233 164529 -154601 9734 108589 -110443
92 -110443 4781 91370 -104828 10624 88548 -81228 9258 85191 -87085 5507 85664
103 85664 -88363 -255 102377 -96324 -7236 142097 -91771 -56742 165017 -61363 -117473
114 -117473 146222 -11401 -145891 117206 38179 -154424 84269 93352 -152825 17787
124 17787 129530 -106678 -40547 119795 -50465 -56149 97151 -14781 -63328 66326 8587
135 8587 -61005 30028 16228 -45122 9698 18608 -22176 1823 9011 -6676 8637 -5320 -12115
148 -12115 15348 -4985 -12965 20447 -5188 -12762 33642 -103 -27279 29501 11071 -34967
160 -34967 16072 18496 -36187 4982 29471 -32490 -13639 33196 -17676 -26646 25024 -798
172 -798 -24113 16925 12408 -15574 6649 18322 -4839 -6181 11560 6473 -9829 -864 10433
185 10433 -4747 -6533 11391 -138 -15828 8458 10418 -22104 -6490 17379 -12760 -12759 17085
198 17085 -3663 -11405 16873 1425 -13473 12134 6331 -12733 5973 10170 -8587 1123 9920
211 9920 -5356 -3091 4589 -4872 -3388 938 -5089 181 836 -4351 4997 1297 -6463 8065 3558
226 3558 -10640 7616 8765 -15497 1788 17106 -13782 -9765 19957 -6385 -17534 17962 786
239 786 -22562 13276 10139 -22289 4592 16653 -15814 -3130 18166 -8234 -8042 17949 -1636
252 -1636 -11876 15393 4235 -14768 8462 7591 -13783 1306 7482 -10858 -3686 6801 -6413
265 -6413 -6883 5692 -1369 -7056 4028 2865 -4057 3271 4952 -823 1887 4358 2290 75 -560
280 -560 3545 920 -4396 2111 2665 -5590 -349 4234 -6224 -4936 5576 -3552 -9493 6101 3093
295 3093 -10154 4570 8804 -8778 912 10188 -6857 -3249 10474 -2405 -6100 9285 2066
308 2066 -8131 6058 4742 -10536 1075 6249 -9526 -2597 7995 -5023 -3729 8282 -307
321 -307 -6052 4720 3996 -6655 -1068 5861 -2793 -3367 4849 899 -3256 1310 1717 -3196 -3068 635
337 635 -906 -4298 1663 3204 -3136 1727 6004 -2339 -1887 5028 51 -4133 3723 3542 -4229 2372
353 2372 6683 -4618 -2337 5944 -4209 -6985 3347 -1189 -6701 1639 2715 -4371 -534 4834
367 4834 -2673 -3543 4607 -218 -4238 4425 3872 -2648 2614 6072 -1205 -2105 4639 87 -6600 1828
383 1828 3328 -6810 -1086 5668 -3780 -3439 5217 -1798 -6847 3601 2540 -7729 1363 8365 -4793
398 -4793 -2073 9933 -1800 -5619 8062 709 -9163 4501 6124 -8283 -821 9509 -4725
411 -4725 -5362 8987 -2354 -9953 6697 2742 -10474 2622 7274 -5604 -1450 7088 -2552 -4783
425 -4783 4984 -376 -6977 2836 3315 -5426 300 4887 -2647 -2372 3546 -201 -5425 1710 5208 -5237
441 -5237 -2049 9138 -493 -6169 7243 3715 -7732 2357 6138 -7429 -1699 9136 -5316
454 -5316 -6730 9814 -863 -10822 5990 2414 -10529 2905 5159 -8440 1268 8776 -5141
467 -5141 -1870 9573 -2284 -4967 8867 -51 -8209 7395 4303 -8565 2895 6749 -5577
480 -5577 -1692 4455 -3352 -3450 2928 -2254 -4516 3338 488 -5086 1707 3111 -3486 -454 2478 -580
496 -580 -1015 1745 1924 -1514 -234 3886 -303 -3603 2492 1890 -3854 387 2817 -3496 -1678 4851
512 4851 -1701 -4734 5331 1120 -6234 3809 2979 -6798 1786 4379 -6265 -550 5876 -4128
526 -4128 -3182 7064 -1383 -5756 6605 2237 -7819 3836 5782 -7158 -398 6658 -2986 -2704
540 -2704 4680 -31 -2453 3690 628 -4155 2461 2659 -5039 -719 3275 -2907 -1272 2038 -2063
555 -2063 -1287 1644 -1271 -2066 514 549 -236 531 198 789 3111 -76 -1951 2809 906 -2349 1805
572 1805 -601 -2265 4330 1075 -4686 2385 3681 -4054 -671 2626 -4770 -2377 4835 -3306 -4767
587 -4767 5085 -287 -3678 5602 -665 -6371 5751 3729 -7489 984 6234 -3777 -1374 6011
601 6011 -2203 -4098 5212 886 -4804 1416 829 -1812 2633 348 -2770 1354 1797 -1155 -800 -1196
617 -1196 -1402 693 107 -2248 -231 891 -908 2141 1537 -4580 626 5181 -3150 -2364 3929 -1609
633 -1609 -1471 5137 -1275 -5021 5733 3868 -7224 1232 6791 -6024 -1963 7782 -5048 -6081
647 -6081 8075 -950 -8771 4666 3153 -8135 1507 6047 -7017 -1606 8654 -3943 -5230 8312
661 8312 416 -6746 5107 4047 -5837 939 5606 -3067 -2898 4752 352 -4854 2095 2792 -3815
676 -3815 -775 3596 -2088 -3616 3024 1087 -5688 1132 4973 -5354 -1926 7821 -2849 -5344 7539
691 7539 814 -7606 4816 4485 -7934 1074 7775 -6060 -3086 8545 -2780 -5833 7158 55
705 55 -7016 4718 2782 -5990 1891 3758 -4064 -506 3256 -2923 -1597 3096 -2096 -2393 2816 -362
721 -362 -1579 1586 -702 10 1386 -1733 526 2133 -2340 340 3309 -1989 -615 4217 -1329 -2742
737 -2742 4728 186 -5009 3432 2121 -6203 1847 3497 -5938 76 4441 -4619 -2066 4587 -2367
752 -2367 -3440 4205 230 -4056 3432 2519 -4143 1309 4048 -2617 -771 3337 -212 -1220 1551
767 1551 1077 -1251 -544 1621 -841 -1788 1037 63 -1951 209 975 -1748 -959 1257 -410 -1573 1397
784 1397 832 -1962 1319 1906 -1812 567 2164 -1010 -643 1600 223 -926 407 1387 -788 -658
800 -658 1353 -334 -1397 648 732 -1277 -572 1052 -547 -1638 1188 318 -2426 958 1267 -2423 236
817 236 1664 -1889 -384 2142 -815 -1398 2217 879 -2165 1356 1975 -1961 238 2332 -1133 -306
833 -306 1973 -286 -726 686 37 -821 -20 230 -1179 -655 541 -710 -816 244 -671 -367 248 -281
851 -281 -334 -128 658 170 -525 1091 832 -675 997 909 -1017 460 1060 -528 -584 667 313 -931 349
870 349 60 -1325 454 282 -1771 79 676 -1443 -68 688 -928 -328 1097 -9 -1117 845 1227
887 1227 -1254 115 1944 -482 -247 1503 -80 -560 815 509 -855 -344 1054 -678 -937 1181
903 1181 -609 -1537 1153 94 -1923 528 695 -1663 -671 1272 -239 -1362 1397 855 -1345 1145
919 1145 1501 -1380 88 1648 -525 -496 1026 525 -893 432 1101 -1000 -360 1265 -1168 -910 680
936 680 -726 -1010 372 -201 -796 -93 833 -893 -1123 1156 -148 -1472 780 913 -999 -137 1310
953 1310 120 -570 758 1197 -1112 325 1787 -1074 -776 1746 131 -1252 855 709 -1361 143
969 143 1069 -1750 -1028 2019 -1250 -2395 2142 177 -2429 1167 1025 -1904 363 1880 -1511 -851
985 -851 2685 53 -1836 2070 1150 -1802 1477 1530 -1638 122 1554 -519 -1205 675 589 -1198 -258
1002 -258 683 -1569 -835 1176 -953 -1864 893 1070 -1878 -819 2667 -417 -1924 2582 816 -2599
1018 -2599 1982 2166 -2806 315 3002 -1752 -1561 3041 -544 -2492 2766 763 -3921 1480 2007 -3801
1034 -3801 -128 2209 -2470 -855 2525 -1112 -1524 2051 328 -1949 1144 1131 -1791 352 1648 -865
1050 -865 -609 809 660 -179 -769 562 972 -1357 138 1332 -1128 -470 1790 -406 -1437 1217 474
1067 474 -1871 770 994 -2528 280 2330 -2307 -1269 2606 -723 -2039 1557 397 -1695 1005
1082 1005 1551 -1489 -273 2379 -580 -855 1782 -124 -531 1636 -304 -1350 1322 642 -1424 -683
1098 -683 353 -219 -722 -539 -974 -402 782 -680 -930 127 -83 463 232 -994 708 1001 -521 878
1116 878 975 -839 226 2010 -602 -1754 1813 876 -2368 685 1590 -2279 -194 1572 -1897 -942
1132 -942 1490 -1257 -1700 1691 402 -2036 1210 1941 -1867 242 2350 -1823 -826 2443 -925 -1555
1148 -1555 1909 616 -1402 1145 928 -1709 29 1661 -1500 -1037 1290 -351 -303 1073 -58 -279
1164 -279 327 -146 55 -475 -839 379 -28 -721 561 243 -848 537 1158 -1765 -590 1765 -1337
1181 -1337 -1164 2753 -637 -1663 3442 943 -2549 1652 1548 -2163 169 1505 -1909 -466 2154
1196 2154 -1178 -1641 2092 -732 -2608 1274 -356 -2423 1018 774 -1387 220 1600 30 -233 1012
1212 1012 363 -332 777 262 -309 829 644 120 222 -72 313 -173 -1244 92 -139 -1401 80 287
1230 287 -777 84 634 -515 -598 616 -133 -658 1181 -11 -815 1707 854 -990 905 887 -1092 380
1248 380 458 -1249 -131 691 -795 -63 976 -593 -925 1161 -477 -1402 1333 -272 -1462 1475 525
1265 525 -1458 1079 1025 -1511 -144 1061 -1142 -1002 1380 -424 -1141 1410 221 -1372 1423 533
1281 533 -1337 905 949 -1272 275 1506 -475 -482 1319 -141 -1336 769 130 -1662 215 378 -1341
1298 -1341 -215 460 -713 -309 7 -199 -298 140 221 -84 521 341 116 816 477 168 642 11 -10 576
1318 576 -450 -152 407 -627 -574 267 -426 -746 67 34 -1106 -196 665 -933 -508 974 -212 -148 1039
1337 1039 10 -263 700 233 -302 285 804 -163 -167 440 -142 -335 585 -201 -778 306 -45 -404 -55 117
1357 117 -82 -384 192 375 -527 155 492 -488 111 238 -99 -271 144 447 -186 -124 682 19 -373 666
1377 666 40 -325 739 140 -415 172 735 12 -426 560 152 -678 276 76 -987 200 358 -637 -350
1396 -350 368 -262 -673 -98 178 -429 125 521 -344 317 924 36 115 718 18 239 177 103 -87 184 356
1417 356 -211 -206 280 -400 -594 -132 -670 -443 -245 -447 -73 -46 30 399 -292 -46 210 48 -54 -74 250 691
1439 691 -58 499 743 -7 284 320 -603 -227 122 -265 -553 5 369 -220 105 202 -409 -111 257 -863
1459 -863 -423 456 -277 -161 783 336 -93 270 190 -684 -239 605 -643 -404 933 251 -171 716 -145 -193
1479 -193 264 -16 -516 75 320 -119 -531 532 243 -491 214 -333 -668 -147 72 -554 -529 213 474 -179
1499 -179 35 497 -225 66 204 -260 162 878 127 30 658 661 -128 125 71 -726 -192 251 -750 -563 591
1520 591 -535 -542 427 -410 -741 -68 226 -467 -212 746 27 -192 982 237 -250 804 11 -328 835
1539 835 51 -106 511 503 -303 -277 430 -161 -646 264 -413 -591 454 -307 -393 420 -79 -166 303 -265 -100
1560 -100 113 -7 -155 182 163 342 392 44 -452 516 363 -741 114 627 -437 381 453 -554 244 684
1580 684 -768 -584 630 -378 -764 580 -25 -1140 687 633 -1423 -47 764 -976 -427 708 -529
1597 -529 -76 1103 -140 -549 1030 548 -971 410 715 -943 103 894 -585 -72 888 -410 -520
1614 -520 305 -137 -783 83 -30 -777 247 295 -623 -16 455 -378 -20 51 -116 317 90 28 615 510 -117
1635 -117 419 306 -174 -80 245 -280 -77 597 -498 -347 844 -343 -994 782 -188 -1165 315 190 -960
1654 -960 99 782 -362 -539 626 -279 -339 760 -261 -572 1116 364 -622 616 484 -502 281 175
1672 175 -296 -184 424 -158 -31 338 -26 -20 -2 -553 -365 144 -665 -64 269 -751 261 714 -932 -152
1692 -152 912 -463 -805 1051 328 -675 1107 509 -1007 752 956 -1332 113 991 -1044 97
1708 97 863 -991 -392 1172 -450 -1256 645 98 -973 243 302 -869 378 564 -533 369 811 -414
1726 -414 29 490 -76 -52 245 301 -3 28 412 89 -112 37 -74 -93 -156 63 225 -460 219 374 -459 -362
1748 -362 354 -398 -481 312 53 -601 344 493 -404 14 730 -312 -462 725 -80 -201 831 18 -580
1767 -580 780 441 -556 211 578 -666 -247 979 -446 -782 1010 -228 -864 732 -238 -1046 376
1784 376 7 -1040 283 575 -542 20 753 -370 -161 1125 -478 -364 1278 -128 -480 805 88
1801 88 -307 721 31 -748 240 303 -837 -5 496 -675 -78 741 -882 -192 547 -704 -333 637 -612
1820 -612 -174 611 -41 -36 557 -74 -383 608 62 -521 584 288 -704 585 479 -846 441 525 -1150
1839 -1150 242 551 -749 -11 535 -627 -123 727 -568 -559 710 -101 -826 672 94 -676 697 537
1857 537 -676 550 511 -538 125 591 -300 -163 458 -155 -69 587 -200 -211 183 -172 -557 37 -55 -337
1877 -337 164 -364 -203 141 -221 -250 -93 -201 -158 33 414 -90 193 486 -264 -131 682 -86 -169 675 -17
1898 -17 -208 375 152 -457 -143 346 -523 -417 272 -304 -421 355 -191 -558 145 -33 -282 131 125 -20 -151
1919 -151 250 106 -21 492 192 -96 371 127 -157 -93 -40 169 -33 -112 229 25 -115 299 -145 -354 104
1940 104 64 -451 -280 357 38 -378 321 273 -530 328 352 -491 104 481 -212 -50 548 170 -211 199 372
1961 372 -411 103 496 -365 -114 505 -53 -392 282 25 -493 -45 285 -490 -375 531 -14 -481 303 18
1981 18 -427 116 80 -281 -247 408 -53 -85 520 461 -345 278 504 -507 99 560 -144 -153 387 12 -419 22
2003 22 315 -420 -514 217 -366 -301 263 54 -411 200 317 -256 -205 496 63 -319 353 220 -500 349 491
2024 491 -208 44 561 -149 -382 367 299 -579 -69 369 -550 -197 566 -363 -288 366 85 -406 -131 362 -361
2045 -361 -226 402 -142 -291 649 33 -458 354 250 -305 -59 320 76 -257 370 124 -506 270 445 -336
2065 -336 -273 470 -86 -436 309 152 -485 50 465 -776 -425 664 -343 -592 878 149 -724 518 580
2084 580 -635 93 639 -429 -163 1036 -49 -458 817 -71 -785 603 184 -919 211 477 -519
2101 -519 -490 443 -153 -811 301 33 -528 249 9 -539 93 330 -226 186 316 52 97 220 91 -172
2121 -172 381 200 -142 89 112 -48 366 -287 119 330 -178 -155 -67 -187 -102 146 -92 -173 4 129 -291 -90
2143 -90 358 -377 34 468 -75 -40 483 -101 -241 347 -41 -164 265 67 -249 136 388 -383 44 270 -285
2164 -285 -18 226 -270 41 -5 -504 86 259 -572 -60 215 -320 -26 546 -50 -181 351 120 -416 414
2184 414 226 -436 462 432 -463 350 498 -442 139 555 -105 -477 316 -122 -397 410 68 -661 270 74
2204 74 -780 -23 362 -330 32 415 -165 126 288 22 -90 293 107 -125 104 -44 41 223 -166 -45 372
2225 372 -363 0 293 -565 -191 428 -361 -344 456 -81 -579 557 165 -931 324 551 -820 73 826
2244 826 -550 89 966 -499 -209 865 -77 -634 620 158 -551 369 462 -489 -60 772 -446 -295 479
2263 479 -350 -264 340 -53 -104 97 39 -225 -105 153 -167 -36 234 -50 45 239 -37 116 227 41 112 -116
2285 -116 49 258 -125 -102 72 -25 -48 37 97 -354 -360 225 -225 -423 384 -251 -468 350 199 -402 121 262
2307 262 -312 0 488 -136 -356 487 62 -169 502 255 -400 222 344 -443 119 190 -337 -124 283 -186
2327 -186 -298 137 11 -374 107 31 -348 220 88 -117 241 174 -164 283 -149 -71 349 21 -96 370 4
2348 4 -43 111 200 -223 84 418 -403 -136 485 -399 -191 275 -274 -331 268 -102 -436 182 106 -325 -37 274
2370 274 -396 48 448 -196 -18 585 -157 -151 426 -11 -56 392 42 -153 104 37 -52 134 100 -283 5 74
2392 74 -218 17 -206 -250 107 -160 -122 207 175 -165 76 149 -56 45 299 216 13 240 145 -94 323 -25
2414 -25 -257 269 104 -260 182 27 -232 -163 266 -84 -277 31 116 -327 76 111 -332 18 38 -205 3 -57
2436 -57 23 82 56 129 159 -3 85 46 96 66 86 -16 -287 33 244 -260 -144 302 -243 -58 175 -152 -234 80
2460 80 97 -115 -58 50 -94 123 424 -171 -165 365 -14 -192 320 12 -98 -39 113 -82 -145 144 -110 -191 211
2483 211 75 -283 -52 -31 -243 -212 -128 -50 -159 -117 168 -235 -227 115 -65 -188 145 -37 -41 202 60 -81 -22
2506 -22 391 -27 -129 298 52 -222 257 26 -332 142 247 -244 -109 113 -328 -141 165 127 -349 72 -30
2527 -30 -349 -78 110 -180 -219 61 130 -104 133 265 -73 121 309 -142 -37 387 45 -107 8 232 -11
2548 -11 20 190 -61 -130 242 -140 -371 70 88 -99 12 -4 -202 28 75 56 -77 276 167 -42 220 119
2570 119 -37 17 81 117 53 -17 72 102 68 341 45 -209 -53 -39 2 -101 -74 -184 -59 -15 38 -196 241 178 -337
2595 -337 11 108 -66 -209 214 2 -43 167 179 -108 131 331 -18 -129 307 -86 -41 90 -125 -14 -56 -44
2617 -44 131 -130 -84 119 -209 -204 39 -71 -105 36 9 -255 -75 276 -58 -38 585 -185 -355 456 206 -310
2639 -310 178 358 -277 133 594 -299 -392 430 -231 -457 351 -203 -542 357 282 -554 59 437 -170 -274 651
2660 651 -122 -400 341 132 -480 367 249 -367 128 326 94 -110 382 8 -315 208 164 -163 -63 346
2680 346 -277 -291 132 -62 -290 -91 -2 -34 -43 31 -123 -223 245 84 -218 151 185 -97 -271 269 242 -371 343
2703 343 396 -418 112 341 -219 97 351 -8 -191 213 -110 -332 250 98 -392 -138 272 -408 -297 232
2723 232 -151 -158 233 188 -40 73 128 -170 52 134 82 -9 68 130 -56 -97 -19 55 -132 16 150 -58 -136 346
2747 346 -189 -306 361 -54 -456 180 82 -305 -99 414 -292 -150 542 13 -451 457 -6 -425 462 327
2767 327 -301 170 429 -305 37 314 -258 -228 203 -30 -431 62 141 -292 145 244 -259 28 25 -175 7 140
2789 140 110 34 33 6 89 41 125 154 96 26 338 177 -330 219 269 -178 31 440 -176 -7 88 -154 -387 73
2813 73 -20 -338 99 134 -320 25 320 -340 -125 393 -160 -17 240 -4 -296 196 130 -202 127 354 -214
2834 -214 -59 254 49 -43 146 -128 -207 -9 -40 55 -66 79 -180 -154 -84 -104 -173 -78 -46 -83 -51 -174 246 1
2858 1 -65 248 9 -67 124 193 -35 277 91 -49 48 -58 -39 -136 223 -288 -246 221 -19 -165 333 158 -241
2881 -241 74 2 -165 59 -14 -87 -118 177 -37 -103 365 -118 -126 386 76 -93 173 -19 -78 86 44 43 -21 91
2905 91 -53 -90 -23 -129 -259 19 -95 -121 123 -201 -70 129 -285 -72 144 -53 -56 208 -1 -39 27 8 77
2928 77 35 275 81 -128 175 86 118 39 -137 126 16 -124 45 115 27 -20 -80 -13 -69 -59 37 -148 12 224
2952 224 -50 227 135 -20 46 160 113 124 123 -9 -108 157 97 161 171 70 -166 -18 146 -93 53 75 -211 111
2976 111 -109 116 -82 75 -49 -245 -20 121 181 168 140 -90 140 -77 -208 213 42 75 166 32 -94 43
2998 43 20 12 32 -64 -70 -140 140 -206 -141 -83 7 -77 38 -26 -95 28 -35 85 -45 -40 61 -76 148 -24 81 91
3024 91 131 -51 -9 57 -105 48 52 -65 175 -181 -29 18 17 245 -144 56 -103 -9 74 -14 -161 -28 -52 226
3048 226 -31 51 77 -79 -99 -4 9 20 320 -35 48 -72 119 -52 -26 114 -116 5 36 -111 -162 138 50 -88
3072 -88 51 -207 -160 -50 -148 -2 -174 33 12 -226 54 -45 -49 -50 207 41 15 119 126 98 188 133 -2 -5 37 -66
3098 -66 -173 208 0 -211 94 37 -104 -163 -57 -8 -243 89 137 -149 205 44 -98 88 95 -26 71 -134 227
3121 227 -43 107 -68 -241 197 280 -194 -61 111 -93 -32 -146 -38 -13 -131 60 60 15 -60 3 -327 136 -55
3144 -55 -49 -10 33 1 -136 214 93 -217 75 50 -64 153 125 -172 -111 137 -64 -74 79 43 -238 -17 133 -181
3168 -181 87 141 -134 -110 207 -45 -58 134 10 -181 99 116 -107 -56 262 -56 42 196 -120 4 97 50 -86
3191 -86 -67 -13 -109 108 51 -122 -114 -44 -71 -66 -57 120 -40 -44 -219 -26 -178 70 107 -194 -48 -4 -27 -208 219 42
3217 42 -18 175 266 22 -135 252 13 -193 28 20 -85 189 126 -305 1 48 -16 -112 125 34 -140 163 82 -217
3241 -217 91 33 -128 78 163 -36 -138 140 -35 -98 151 168 -130 7 158 -23 -116 -17 -161 -108 -38 60 -33
3264 -33 -82 131 98 -81 54 120 -95 35 47 -110 -50 53 38 55 310 96 -88 53 57 -297 -30 227 -36
3287 -36 -112 182 18 -143 158 -14 -284 -25 122 -200 89 116 -255 -88 88 -228 -297 -57 -42 -42 -9 65 -98
3310 -98 -65 162 -118 51 192 22 71 177 79 -75 110 -100 97 0 -25 37 24 -118 26 -137 -102 -75 -58 12
3334 12 -200 4 -7 -271 106 -112 -175 179 10 -281 124 -161 61 -1 146 -170 -61 5 -103 41 51 39
3356 39 5 -13 -4 72 61 -24 16 -213 -28 -68 -30 6 -217 42 159 -25 -19 44 135 -33 66 11 106 63 -32 228 -37
3383 -37 70 114 26 64 -42 -59 -145 126 -107 155 152 -110 -5 -64 -92 45 -153 39 2 -37 -9 -73 -61 19 -43 112
3409 112 118 173 184 -146 74 -99 -69 29 -89 33 122 -18 -34 64 -11 63 -41 -36 -20 -34 -80 -111 -99 59 157 -129
3435 -129 66 -1 -24 54 133 -104 56 173 141 -135 -50 130 -97 -50 12 -81 5 86 -211 82 49 2 80 177 -52
3460 -52 -101 -28 71 37 61 48 -85 -87 151 -121 77 -19 26 119 -35 241 88 -91 35 114 123 23 -99 230 -24
3485 -24 -42 61 61 -148 158 -140 -165 -27 -231 -325 -92 81 -92 -61 38 -3 71 74 -42 -103 108 199 85 -58 44
3510 44 -89 262 -36 22 -51 -49 41 138 -138 -132 -24 -40 28 -82 -32 -87 -66 -85 -24 -100 17 -193 -91 56 -51 -202
3536 -202 98 -206 24 123 65 125 -7 191 -263 207 23 -88 -86 -85 -90 -48 -100 -47 -15 -91 -175 8 -74 -277 -5
3561 -5 38 -54 23 -59 -12 -38 47 -182 26 91 235 67 116 138 75 -77 0 168 29 60 48 -83 114 75 -75 27
3587 27 -22 -199 -201 168 -34 -71 18 -122 -168 -33 114 22 -33 242 -53 -184 4 -19 88 -105 -1 58 -70 121
3611 121 -113 42 34 -135 -48 85 0 -30 41 -45 -169 -129 -49 -29 -180 -9 57 27 206 159 37 99 -211 157 35
3636 35 35 61 27 140 187 -14 -66 -58 -48 -50 -29 69 5 65 21 20 -75 87 -23 -174 138 54 -133 48 77 95 -92 69
3664 69 189 133 99 37 -65 -100 -109 126 135 30 6 -13 32 70 -69 6 80 66 -129 24 -70 -13 -45 -71 140 -133 -168
3691 -168 6 -112 127 35 -5 17 64 -125 85 -45 95 101 75 -5 15 -99 180 -44 -29 109 26 -164 -34 106
3715 106 -4 25 64 133 -148 126 -18 -100 84 170 -38 14 -96 42 -63 59 8 -126 102 120 -61 -50 26
3738 26 26 5 130 -11 49 -10 136 -16 -51 101 68 -196 123 37 -220 -104 275 -52 -81 -41 -71 -82 -21 39 -150
3763 -150 47 60 -68 -70 483 -148 -102 174 -105 -139 -27 83 -38 -48 25 -298 12 188 -38 68 88 -49 -211
3786 -211 -12 -128 -56 -44 81 -64 -101 160 -32 -64 49 -39 49 101 -39 90 -35 72 116 -50 64 147 -29
3809 -29 -100 -90 -140 -215 -83 47 -69 -93 128 -69 -167 74 -81 -44 57 17 -44 35 98 -50 79 3 2 -35 186
3834 186 -4 -23 191 69 -23 63 34 -129 -53 24 -80 143 68 47 -201 114 -138 -144 107 -203 -54 56 20 -89
3858 -89 178 25 18 -107 -91 -146 175 -42 -1 179 -32 -24 -7 -44 6 -109 123 33 118 154 -150 -89 -89 -115 -58 38 -93
3885 -93 26 108 -16 -5 139 -4 -5 22 184 73 50 127 -202 98 10 -49 -99 103 -52 -22 54 17 87 -45 1
3910 1 -182 106 -101 -20 -35 63 -86 -58 99 -65 121 -162 -60 -13 132 -43 -67 36 53 110 43 94 32 79 -88
3935 -88 -60 -89 -159 -63 154 38 36 40 -32 -41 -201 -13 94 210 -13 -5 -95 42 51 -6 144 39 -17 -15 90 -230 193
3962 193 8 77 -64 120 -53 -82 -75 -180 -34 179 54 -51 31 -102 -38 -7 131 35 -134 -176 -83 13 105 43
3986 43 43 168 -10 -148 134 -26 88 76 -57 -89 138 54 39 21 26 -222 115 60 -120 -24 56 -196 -26 -51 -34
4011 -34 -1 209 -96 -64 173 -85 179 15 25 -162 53 91 -65 66 27 -73 34 153 -48 73 84 27 -14
4034 -14 126 -4 -20 199 -37 -162 0 46 -54 -223 88 12 131 -133 5 -34 83 -213 -77 -6 140 -79
4056 -79 -23 -19 82 -53 73 247 70 -33 -78 81 -186 -35 55 109 -181 -45 109 -30 -165 -1 -107 -123 61
4079 61 -127 -31 42 -35 -66 179 -85 -153 126 208 38 1 111 80 24 106 -7 27 168 56 -70 -80 -19 -100 115
4104 115 -21 86 -101 61 -49 -124 -57 29 100 -79 232 9 -5 138 43 -78 -70 -97 39 94 79 -85 -120 73
4128 73 119 -12 -148 62 -44 97 67 -81 -181 132 65 -279 -78 7 101 -177 77 120 -100 -34 -163 60 184
4151 184 116 69 47 174 -27 92 -11 32 -27 -6 -116 -2 -28 127 116 -124 47 -76 9 -82 8 2 -20 -115 146
4176 146 -147 -18 31 -82 62 68 4 21 30 -68 58 63 33 98 193 121 -80 -20 80 -131 -186 34 39 -219 179 -16
4202 -16 13 -25 33 -119 -84 -71 38 61 -73 176 -119 159 109 -70 22 57 -54 -178 -97 180 -57 -233 195 2
4226 2 -222 158 -148 -123 -118 -183 86 -109 -21 -111 -51 181 -49 13 80 64 -69 24 -42 -26 -77 -93 18 23 -65 57 -5
4253 -5 -72 -103 12 191 16 -42 -86 41 -24 -60 -122 102 -90 96 47 -114 -42 94 166 102 211 -16 -6 -127 62
4278 62 1 -200 -7 5 -216 -9 88 -51 19 59 -66 44 -24 -47 -8 105 -101 -147 -124 -84 -269 -83 -65 -98 -95
4303 -95 -90 162 -49 106 55 233 39 -66 71 -49 20 37 -17 97 12 16 49 -31 -48 -97 147 184 -107 -72 -41 -32
4329 -32 -51 -41 26 -101 66 -158 -13 -46 -48 -224 71 222 28 -58 -30 140 -73 78 34 -155 0 160 -57
4352 -57 -23 10 104 -62 155 -153 79 -22 -132 -5 99 65 7 -66 62 81 -16 3 -48 -153 -97 -29 -91 -13 -186
4377 -186 6 -85 123 -37 106 92 76 34 58 21 -96 -130 -38 131 -137 74 187 -75 35 44 162 -133 -84 -68
4401 -68 21 14 21 -126 106 -88 122 -7 38 15 -103 0 -32 -23 61 18 -136 -36 -81 60 11 -20 64 47 26 -33 -6
4428 -6 11 -162 -51 128 -38 -73 -55 9 -37 -48 29 163 129 6 98 53 8 -140 10 57 87 -12 -100 -94 102 102 2
4455 2 56 36 1 32 -60 86 -7 52 7 -115 18 57 -164 177 85 36 -36 81 25 232 -24 79 202 66 5
4480 5 69 93 124 64 120 15 -77 41 115 -118 -27 -70 33 34 -94 -5 -113 89 -48 116 92 -36 -53 -103 9 -62
4506 -62 40 116 100 162 10 126 118 -53 229 -23 12 47 244 168 -72 -132 -6 -4 -57 -3 24 45 112 15 -148 -5
4532 -5 -128 -36 -6 12 6 -53 -17 139 27 88 -26 31 152 -43 34 112 -99 -6 139 16 -50 43 187 -66 10 -11
4558 -11 -61 -84 -53 -30 65 4 -125 37 182 1 -49 -48 -74 -36 81 -30 -5 46 175 16 39 45 81 24 1 -66 -35
4585 -35 -22 92 -46 193 -81 -15 149 -54 74 13 -103 -12 -67 18 -56 -120 46 -20 -91 53 -70 13 2 -1 -183
4610 -183 -32 78 70 -83 -33 5 -143 -16 -36 118 88 23 -2 -107 -95 6 -41 -47 36 50 -84 29 -60 0 -18 -166
4636 -166 84 135 -44 61 -123 101 -37 39 151 -20 -219 128 -103 25 166 -51 26 14 63 -114 -118 16
4658 16 136 -94 -13 147 29 -51 113 -102 -39 7 73 9 136 86 -17 6 208 44 66 29 -99 -113 33 -58
4682 -58 10 -43 110 121 -147 138 78 -93 -80 92 -107 13 -105 -29 11 50 -66 24 90 41 -132 -77 -9 -99 -27
4707 -27 146 46 -21 99 -59 -109 169 123 -80 98 20 -69 -15 -106 19 -151 147 93 -113 -14 -8 -115 130 63
4731 63 -35 -118 -69 9 86 -118 19 87 -25 61 -21 37 -168 101 -116 166 -100 -6 11 106 59 -58 -14 135 19
4756 19 65 -37 -117 -58 72 -26 -228 -37 46 142 -170 38 -115 -50 140 9 -19 39 179 69 29 7 -23 -131
4780 -131 -33 183 -96 13 83 -120 19 99 34 -140 17 -146 3 -62 16 55 163 40 4 24 23 32 -101 -156 -28
4805 -28 23 -94 -4 -42 99 46 -43 4 28 -14 114 142 -174 58 -77 -136 11 26 66 -142 -105 -152 89 0 123
4830 123 13 -24 32 -41 112 -107 62 -23 84 67 -58 0 76 15 35 -3 -8 -45 -54 -31 45 -137 -106 37 66 -23 -74
4857 -74 102 -193 -59 -81 27 147 113 -27 -11 49 -67 67 -27 127 -99 2 36 32 -91 47 -28 -95 11 -119
4881 -119 -14 1 -89 22 32 110 -79 10 106 159 28 -72 58 48 -154 172 12 38 87 -132 -155 10 7 -189
4905 -189 6 32 -39 -37 90 -1 58 15 125 41 37 53 11 69 -200 12 93 44 -27 10 64 -63 157 -1 51 43 67
4932 67 11 2 26 -26 39 53 19 -11 -91 50 -55 44 35 -29 31 211 28 20 67 -59 -57 33 -74 97 29 69 -16 -35 -63
4961 -63 115 -124 5 -24 30 157 -97 71 60 138 -72 -41 2 -27 13 -67 9 -42 -141 -2 -75 -176 13 -76 -95
4986 -95 28 -63 68 -3 286 52 -36 52 8 26 71 7 -88 173 121 50 -96 -108 27 -106 105 -42 87 38 106
5011 106 61 -97 -131 -230 23 57 -166 220 -42 -18 -62 183 -63 144 47 -8 -44 -82 -29 44 33 134 -86 -69 -81
5036 -81 6 -115 5 23 140 -7 15 79 -118 164 92 -20 -94 -102 0 215 39 -41 -138 -55 -38 214 -63 105
5060 105 95 -35 -95 22 -33 22 98 23 -57 59 -231 16 4 132 -75 80 -62 122 -54 95 -31 -35 19 -65
5084 -65 -3 145 -14 -35 18 118 -119 2 110 163 83 -143 26 -140 28 63 58 17 -14 19 11 -91 -91 -26 102 67
5110 67 116 -12 -50 -146 33 12 -214 10 15 -15 40 -25 -9 171 26 -69 101 68 21 -82 -116 35 51 5 134 0
5136 0 109 -87 25 82 -48 34 -77 142 96 -97 40 -93 -48 8 -59 -22 -37 -136 -8 -52 90 -22 119 -82
5160 -82 -56 36 71 -12 35 -12 134 -3 -28 12 -47 0 -68 160 141 5 -149 -53 30 -60 88 134 -23 132 96 -75
5186 -75 -44 81 -4 -100 37 103 14 90 -150 78 -2 78 126 181 -38 14 24 72 117 -136 -55 89 -17 157 144 3
5212 3 -35 15 24 -20 47 152 -43 -70 80 -38 -51 -103 11 -72 135 -19 5 -15 -40 57 8 43 77 -15 -19 -20 36 59 -179
5241 -179 -56 -104 181 -87 58 -100 -188 -57 114 38 -38 -85 95 21 -124 -33 112 153 77 200 -179 52 182
5264 182 -48 21 40 63 38 -9 -3 20 -38 51 -5 13 -17 -3 158 41 1 -71 3 -25 175 0 47 63 34 -71 -1
5291 -1 26 -78 -1 -39 -10 -19 -65 12 93 43 -8 -61 -169 130 -65 122 75 76 -113 -2 60 30 70 -66 -25 -36 172
5318 172 75 108 -63 97 13 -9 -23 -25 -89 50 -69 -19 6 105 50 -27 71 39 -100 46 119 -28 82 -75 45
5343 45 134 202 80 -142 0 -129 74 -14 71 77 45 -59 69 -60 4 -2 -22 59 26 -41 75 142 -64 -122 -78 116
5369 116 -35 -16 -149 -26 34 56 111 115 54 -8 -56 -82 80 31 59 -74 14 56 51 70 -26 -143 13 14 -67 57 -4
5396 -4 -200 9 -141 51 99 26 0 154 88 -56 -64 -13 69 -39 -155 -2 40 28 19 6 55 -55 -87 -35 58 100 -82
5423 -82 -77 -6 -56 94 149 20 31 303 7 159 22 65 -79 -18 47 -57 23 -27 -59 20 -137 111 -13 66 -124
5448 -124 -58 32 26 62 -38 -5 91 -114 -85 70 118 -19 -200 12 -52 -10 47 54 -25 -128 -43 -38 12 24 -112 -7 -15
5475 -15 96 6 -3 30 68 21 -44 66 137 86 177 -113 20 -24 46 -79 -73 54 -65 -58 30 46 -75 27 -96 -31 -101
5502 -101 -25 3 14 -82 -111 76 -87 -127 -112 47 -113 24 65 -116 18 -24 -85 -55 189 -104 7 57 -177 74
5526 74 126 -11 -157 134 -163 130 48 22 48 103 -14 -39 53 -43 -93 -170 78 -90 -43 -78 129 56 19 128 -83
5551 -83 -187 89 -37 -106 -111 -57 -117 -126 -90 -38 -43 76 -24 -107 -128 81 -10 -93 -46 29 -6 -88 37 64 49 -125 -70 71
5579 71 57 3 217 41 -7 -43 219 -144 131 155 -94 -8 54 -75 106 15 -15 91 62 -128 -103 -33 -225 86
5603 86 -49 -88 60 47 -30 11 63 83 -70 -81 -26 26 -33 28 120 -127 8 -12 48 -14 52 100 7 -7 -89 -100 -35 -106
5631 -106 75 -21 -79 -197 32 74 77 44 -9 -33 7 91 116 -15 -71 75 13 -23 84 55 2 -141 -38 -24 -163 37
5657 37 -52 -39 31 45 -53 145 34 -143 92 41 -17 -66 -52 -106 26 -19 45 24 -29 -79 85 -56 -3 94 -40 170
5683 170 0 62 12 -62 -55 -137 142 -7 -11 12 -99 -104 91 49 37 -7 23 -46 -107 131 -80 115 24 7 -43 -141 -55
5710 -55 -3 -45 31 35 -10 -15 -98 -150 -74 7 -70 115 -105 -150 -53 24 152 -129 -36 -2 101 102 -38 63 -49 -71 -88 68
5738 68 -1 41 78 46 65 -116 115 -42 24 -76 -25 -7 87 62 33 -10 25 90 41 39 -112 -43 4 8 55 29 -57 59
5766 59 -55 119 -67 -156 -2 61 71 117 -80 -62 -8 -51 30 67 114 -59 191 -10 -34 84 12 8 73 27 36 58 -71
5793 -71 -30 114 127 -92 10 -32 36 -53 6 -98 27 129 -56 -86 46 92 8 -51 -42 -41 102 14 -99 9 -11 -94
5819 -94 -39 -82 33 -35 31 -46 48 -14 103 -36 -97 49 41 -6 -4 37 84 112 -110 -21 -42 -213 -19 84 246 42
5845 42 -57 177 52 -213 -138 61 125 -39 80 7 72 64 -25 29 -113 165 95 124 41 -13 -13 30 105 -129 -49 -110 -85
5872 -85 -11 176 43 -45 92 30 75 5 43 -47 -3 -281 42 40 -92 106 -4 -67 46 -102 -128 18 3 127 101
5897 101 116 11 -21 43 -38 -44 38 -17 71 8 -133 85 -14 15 -61 164 -60 -170 -12 117 -136 122 21 -14 -180
5922 -180 -91 77 -20 -168 48 -248 -30 -149 116 45 103 -17 -24 82 -12 112 161 -86 -74 72 120 -77 7 7
5946 7 92 -40 82 47 -84 10 15 -23 86 -176 -37 -50 -16 -121 53 116 -20 22 28 -30 -69 110 -56 -13 26 -115
5972 -115 46 -19 246 8 -62 49 211 -81 -106 112 -24 1 3 75 117 -152 88 143 -40 -26 74 68 -20 169
5996 169 -56 -32 5 8 -54 103 107 228 -28 27 115 124 153 -72 -62 -19 -41 -227 -38 100 -40 -1 15 -31 -10 109
6022 109 7 14 -205 -58 -34 45 -8 40 -86 -6 90 -37 -3 -22 82 -90 25 -58 54 78 22 41 -42 33 56 55
6048 55 33 70 -85 126 107 -82 80 70 -80 65 -104 26 -53 49 31 -182 25 -39 191 1 -30 -28 65 -52
6072 -52 -18 72 -18 79 -12 -155 -18 0 61 -93 23 12 158 -151 14 -70 21 -130 65 -76 -107 -67 57 -85
6096 -85 -111 109 80 -68 91 -70 -58 92 43 38 58 -16 -88 -173 -58 -20 31 71 127 1 -6 63 31 -102 -42 -116 -38
6123 -38 -189 -23 -111 77 -50 6 34 -95 150 117 51 150 177 -25 84 -17 50 11 205 -10 128 4 93 -19
6147 -19 200 -64 74 21 -45 32 29 206 -64 -31 -23 93 -46 -35 -66 38 20 -114 2 -57 -5 -10 -49 -172 -69 77
6173 77 -18 15 -23 95 -22 -206 -14 117 19 -84 -152 -6 -152 27 -13 -111 -1 -221 68 4 -41 131 21
6196 21 -67 -133 -1 64 112 -25 84 32 -51 -58 -106 169 -103 -40 -46 -89 -47 74 -87 -39 64 -25 202 67 -50 27
6222 27 2 17 -123 -10 31 44 26 26 -11 -28 -44 7 178 -40 -11 9 26 -9 -16 61 -215 -73 72 -38 -87 40 -22
6249 -22 33 -30 68 -82 99 41 -124 169 -28 -73 -49 -132 85 -79 165 85 -115 0 117 55 116 -206 1 38
6273 38 38 -83 -97 38 -64 -26 -23 -54 94 -59 5 -240 -99 14 -260 174 -124 -2 -46 123 11 141 -20
6296 -20 -115 -117 34 -125 57 -9 -5 42 19 -5 -144 -3 -21 5 114 -5 -44 -62 41 149 44 -142 -157 57 94
6321 94 12 -38 -26 21 -40 67 69 -98 45 10 -27 4 -185 9 85 138 101 115 -229 -56 -93 -32 92 50 -34 -14 83
6348 83 -55 -72 -29 93 -9 -99 -1 127 14 -53 21 -13 -60 122 12 -11 114 -90 -37 -87 -143 12 -17 20 231
6373 231 61 82 -38 -67 -94 -64 71 -68 0 52 -46 4 103 71 181 52 -184 12 151 -138 56 110 -155 -34
6397 -34 149 49 25 41 20 39 6 109 171 12 44 -63 117 -43 60 -55 -48 -49 -14 31 9 5 -40 37 -29 -9 35
6424 35 22 100 -116 37 -36 13 85 -155 -44 -27 -48 26 145 -122 -6 12 41 -194 12 -73 -110 -132 -10 -80 -4
6449 -4 102 -39 266 49 35 61 -56 25 153 -97 -79 -89 141 -29 -63 -96 -83 25 31 -59 69 42 56 -10 -64 40
6475 40 -21 69 1 108 223 -25 -75 151 114 4 215 35 -113 134 -164 1 30 97 2 64 45 80 -43 118
6499 118 -85 54 -13 106 -65 189 27 39 110 -24 -13 10 -23 -99 -1 63 99 96 12 -15 124 -46 -52 -84 8 114
6525 114 -84 -65 98 -10 7 -52 54 -19 62 29 74 18 -17 -90 -52 -55 72 -64 40 73 55 8 -86 79 153 40
6551 40 21 18 17 61 39 -10 -35 19 -86 -154 2 -31 3 36 -32 13 -40 33 -43 22 103 -114 101 -76 -107 25 42 -12
6579 -12 42 144 202 107 -102 -20 14 11 51 -101 -58 106 4 -3 9 -51 -101 64 41 1 125 102 -128 -102 28 -52 -118
6606 -118 56 -111 49 -20 -125 -98 -88 7 103 94 33 66 -72 37 65 43 -38 -49 -79 75 172 -54 -41 -27 93 -135
6632 -135 -127 61 33 20 97 -28 70 23 -46 3 30 -63 -103 23 -15 30 -83 -55 -67 101 -11 93 -59 -49 -13 -69
6658 -69 -52 -51 50 98 41 -33 35 -72 15 63 172 84 -5 88 -6 -54 -63 10 -23 33 -136 -33 19 111 11 57 70 19
6686 19 -29 0 35 -43 -17 0 92 -56 -127 150 96 90 -37 -86 -51 -93 4 -93 43 -115 -70 -65 73 -100 50 63 41
6713 41 -38 -157 352 -37 135 105 118 5 171 137 112 146 26 78 64 -10 -32 -29 65 68 34 -55 -42 -125 32 75 -4
6740 -4 27 165 47 -23 -146 -131 43 -126 -12 -25 -4 45 -57 -69 67 -96 -156 71 44 24 54 61 110 -145 -48 95
6766 95 -173 -13 122 63 124 -119 17 60 -167 -75 -66 -156 7 171 19 38 26 95 110 60 37 52 49 -78 46 -44
6792 -44 106 -161 109 22 103 38 -74 37 -56 38 -17 31 -40 -92 43 50 3 18 4 79 28 39 -40 -124 -151 -174 17
6819 17 -58 -27 -3 -68 87 -30 19 -54 0 56 -133 -76 16 -49 75 -15 -9 -70 122 -103 -71 27 46 9 55 -8 -88 -79
6847 -79 105 103 58 -24 -50 30 87 110 -37 60 34 -3 -118 9 -77 43 128 76 -65 -10 53 22 -75 8 191 52 -217
6874 -217 58 41 64 -19 -47 -24 -82 -24 -37 -103 -44 119 101 172 -29 121 -142 76 70 -28 13 36 65 13 77 -52 64
6901 64 57 49 75 -9 180 -33 -106 31 18 -148 47 7 32 -56 -95 -28 93 204 -183 -166 184 42 22 107 194 13
6927 13 -39 -1 -30 135 55 -71 -21 -23 57 106 -72 -81 -90 53 67 122 -75 -65 46 54 -14 50 111 -41 -62 172 52 -4
6955 -4 -69 -164 20 14 -8 -66 58 -39 34 -44 -85 -49 -153 -87 175 -35 -44 -33 110 -100 0 10 14 -167 0 91 48
6982 48 -162 101 -62 -36 -59 -3 122 -85 66 36 56 -147 -118 30 -141 -8 52 -9 6 -29 53 33 -18 -111 132
7007 132 179 -135 14 -56 -45 -171 -104 33 91 -1 -57 69 3 102 61 55 -22 -78 9 68 19 10 97 27 -59 105 56 -58
7035 -58 -104 -117 159 -194 169 -34 151 140 99 -72 205 -10 -129 69 66 -60 105 83 -209 162 -51 12 -165
7058 -165 14 27 131 10 -147 -184 72 36 24 19 -75 -179 -96 -80 4 -115 80 49 -35 51 -9 2 -114 -12 126
7083 126 198 -185 -44 24 -54 -19 -30 -74 92 123 55 66 -179 -8 32 73 -17 33 123 24 -42 -34 -77 73 -7 -95 23
7110 23 53 67 -34 109 -50 141 47 24 70 110 -152 55 89 0 90 84 207 189 42 148 29 -54 -125 -132 -56 -28
7136 -28 -25 -36 -66 10 18 -135 46 75 -45 -19 -85 -98 -61 126 65 -126 134 26 -30 58 -171 -134 -111 181 105 -120
7162 -120 47 -6 119 20 -48 -51 -100 -75 94 61 -74 -14 -2 -38 172 -173 -80 32 -8 5 -108 -64 29 -53 -17 -19 129
7189 129 63 -114 115 -56 12 -46 -84 26 3 -85 -164 -16 152 25 62 39 -20 12 -1 -22 -151 -83 -46 80 -154
7214 -154 -65 -55 -84 63 111 8 -3 -132 101 105 -82 208 -90 -23 -44 -49 7 -24 16 -90 -72 -110 -22 -46 -15 69 -78
7241 -78 90 -83 152 -173 -59 14 22 28 -154 64 92 146 -75 163 63 -91 -139 61 -19 219 -93 -62 15 118
7265 118 -31 -29 69 49 91 64 -98 -13 -74 115 257 -47 130 53 -69 -34 -82 -26 -3 -5 -51 -71 -49 -58 77 4 -144
7292 -144 65 128 170 81 -54 135 -142 75 -83 -8 -73 -2 32 -61 118 -100 134 8 -19 11 -67 -29 -38 73 -41
7317 -41 -88 -59 -1 -28 26 -141 -4 -54 -11 201 164 180 -35 -74 85 34 71 -117 144 75 -69 62 7 23 89 13
7343 13 21 36 24 -111 -26 51 140 -124 -41 58 81 122 140 -4 -57 9 -66 176 -32 -136 -11 -91 133 7 -123 129
7369 129 30 -6 49 65 91 -12 -166 -210 63 30 64 -24 -29 -110 96 48 -119 -54 254 37 -70 196 81 -163 0
7394 0 -67 -28 -5 -121 -28 -117 98 -125 -22 -114 -37 -4 -107 -41 25 -11 140 83 125 119 -82 -43 -122 105 64 -79 201
7421 201 10 -35 -32 -79 81 -182 -91 -129 -23 7 -191 58 92 -46 53 2 -47 -14 -80 -96 71 -61 11 55 176
7446 176 -97 29 -51 -6 -112 92 82 4 28 125 97 42 -26 -101 -10 -83 89 -179 -31 -37 7 74 -5 55 -75 53
7472 53 85 -124 34 54 20 0 -53 -20 8 84 -50 31 7 -99 -96 227 98 -55 48 -226 -94 38 27 -54 -105
7497 -105 -73 -54 -99 -28 -50 56 -11 -21 41 39 42 -43 -39 6 -40 -106 216 -42 -114 137 -20 97 42 -13 108 -72 44
7524 44 37 41 -258 -95 -41 -32 -49 -27 71 -239 -72 -5 35 -121 -69 -31 48 -23 -34 -55 -6 57 -15 30 -38 -48 -114 -23 -21 -201
7554 -201 -11 90 74 3 -72 -16 -73 -1 -112 109 118 28 -122 -7 83 -41 9 -181 39 18 -145 103 4 24 40
7579 40 -88 -35 183 5 39 0 65 -45 -126 -39 3 -11 78 -129 24 -42 -12 219 38 63 14 53 -84 28 136
7604 136 -113 99 -173 -129 -182 55 20 -70 -69 20 -44 -90 -94 115 14 -76 26 59 -10 -66 -30 67 -89 -119 -10 -124
7630 -124 160 31 -37 -28 89 -98 71 114 31 112 113 -31 -13 23 87 -110 18 12 15 -50 -97 -18 -10 -8 20 -196 65 -83
7658 -83 -59 -71 -123 -66 -45 42 -31 98 -109 -113 -93 116 -80 84 83 50 109 -48 -35 -163 173 26 60 -85 28 22
7684 22 -92 -63 -130 48 -63 39 -43 -37 96 -81 92 -5 166 -112 4 13 -138 -68 26 -115 -127 76 -52 -12
7708 -12 -34 -15 32 53 -6 -34 168 -69 26 -109 -61 -34 30 159 -21 98 15 105 -35 -57 -36 55 77 109 -26 -8
7734 -8 98 -21 42 117 -61 58 -70 -74 -12 42 -14 177 72 44 -126 5 -121 -147 -13 38 -40 61 167 -147
7758 -147 -96 -252 145 -86 4 70 63 -82 -31 188 -108 -103 -63 16 91 8 12 -60 63 -192 181 -17 42 -84 -73 -107
7784 -107 -41 -101 221 -37 8 109 94 110 -177 -17 -22 -136 35 -11 -71 28 -72 -97 18 -61 -28 77 26 -2 32
7809 32 -8 -123 -6 108 60 -29 182 -52 -51 100 58 -58 -92 22 4 -1 7 -235 -109 55 -90 12 205 -139
7833 -139 -105 -28 108 9 -97 18 -1 39 27 36 -74 149 4 -142 25 46 -135 11 48 -109 1 7 84 -96
7857 -96 18 7 -9 -43 -15 213 -29 -11 -33 5 -47 62 60 50 63 -13 -17 58 37 51 -94 40 111 60 -83 47 -324
7884 -324 79 -109 -42 -27 -73 -91 71 -74 -5 55 -19 5 -45 -31 3 17 161 -94 93 -125 -53 -47 55 155 -242
7909 -242 -11 -2 -33 43 -33 -88 -97 119 170 -32 56 14 73 -218 67 -100 -59 6 -168 -122 57 -40 -15 -54 -94 -26 9
7936 9 72 46 77 68 11 -2 -2 11 110 30 -99 -159 146 -67 40 263 -102 -6 73 46 20 -15 -188 78 -60 33 23
7963 23 69 71 -35 44 125 30 34 121 -76 -56 156 -121 -176 7 14 -80 -25 -5 -57 31 -2 62 0 158 -103 71 201
7990 201 -15 81 50 88 -147 89 146 -71 96 -61 -43 -104 1 124 61 -15 36 -12 115 2 3 5 -39 -69 -2 168
8016 168 -18 225 36 -29 101 43 -47 45 130 72 54 -9 -168 -27 77 10 -46 -16 -127 2 -16 61 -25 -101 41
8041 41 21 158 31 -65 46 -58 128 33 46 -134 -50 -141 29 -13 -168 3 -23 -79 51 89 19 35 21 -28 -2
8066 -2 -76 -16 17 129 -255 80 115 -203 49 -45 -156 114 83 74 27 -54 3 -171 32 4 71 67 -82 -128 -30 -58 -2
8093 -2 75 -141 71 -4 -13 85 118 151 75 -46 40 48 35 80 87 97 -146 -173 -76 66 -66 -10 -40 39 -1 -20 68 -27 107
8122 107 98 -29 13 61 61 101 -21 36 64 -124 13 53 -103 -88 9 -9 -66 -223 140 88 -167 181 -4 68 -132
8147 -132 -27 125 -132 -82 132 -28 -26 -7 73 0 37 97 -49 78 143 6 120 3 -26 -44 -68 75 23 76 -106
8172 -106 4 -30 -17 43 43 -126 126 -68 -4 -67 -124 -24 -87 -146 -113 110 -65 192 115
8191A15
$$ Imaginary data points
##PAGE= N=2
##DATA TABLE= (X++(I..I)), XYDATA
0 0 0 0 0 0 0 0 0 0 0 0 0 0 8 -8 8 -16 16 -20 24 -32 40 -46 54 -65 77 -92 108 -124 142 -165 189 -218 249
33 249 -283 319 -359 407 -458 514 -572 640 -713 793 -881 974 -1078 1190 -1314 1450 -1598
50 -1598 1758 -1937 2133 -2350 2593 -2862 3162 -3503 3894 -4343 4865 -5486 6229 -7144 8285
65 8285 -9752 11659 -14070 16027 -9487 689283 -47855 -625340 406839 147772 -433622
76 -433622 207921 196604 -400609 104018 238640 -299912 -18765 237860 -199163 -48860
86 -48860 208000 -110020 -69864 160415 -68944 -52460 110519 -73070 -56107 100998 -62681
97 -62681 -47918 93990 -53149 -43931 100004 -54844 -54482 101539 -57750 -68523 131763
108 131763 -40105 -102848 150559 10369 -144681 120203 60140 -160642 67117 95732
118 95732 -152365 23866 134499 -126478 -35956 155434 -68146 -90816 120489 -13428
128 -13428 -99461 78565 17932 -85684 51306 43021 -62629 20903 44747 -40144 -1290
139 -1290 31576 -22535 -9998 15422 -7462 624 1960 -13572 8979 1123 -21812 8637 606
152 606 -22020 20467 10248 -28885 21808 27689 -29201 6986 31755 -27234 -7765 34615 -20825
165 -20825 -23199 35704 -2126 -31618 23189 11227 -29916 6036 13727 -23178 -6493 14327
177 14327 -7631 -11301 10334 8961 -7612 -988 12934 659 -6776 10633 6212 -11192 6940
190 6940 16517 -14169 -8853 20104 -5465 -19435 12603 1112 -18727 9295 5157 -17560 5800
203 5800 10649 -13323 757 12762 -7283 -3445 11389 -2141 -5116 7525 144 -3323 4285
216 4285 -1829 -1431 2622 -4179 749 2658 -7339 2740 5400 -10575 1502 10604 -12058 -3669
230 -3669 18139 -6545 -12846 20044 4043 -18891 14179 10662 -22242 5718 16306 -21077 -4640
243 -4640 18965 -13225 -12222 16954 -4321 -15202 13564 3183 -15738 10539 10641 -14308 5141
256 5141 14673 -9926 -1103 12856 -5997 -5503 9464 -2208 -7797 5372 1254 -8748 673 2670
270 2670 -7396 -2579 2180 -4582 -2484 2607 682 -691 270 3633 3036 -2283 2229 5598 -2283
285 -2283 317 7114 -1266 -3624 6478 676 -9186 2966 4407 -11599 -2125 8040 -8735 -4948
299 -4948 10384 -4020 -6808 9657 734 -8622 6496 4749 -8520 3565 8767 -6912 -286
312 -286 10397 -5461 -5365 8049 -3202 -7815 5911 1146 -7442 3523 6042 -5145 -2197 6425
326 6425 -1525 -5443 3417 1949 -3727 1594 3937 -867 -1279 2058 690 -3996 -1154 1525 -4765
341 -4765 -2338 4068 -2288 -3830 4487 1492 -4686 1422 3421 -4459 -488 6918 -1732 -2182 8899
356 8899 1771 -4700 5376 2966 -6650 -253 2923 -4971 -2999 3800 -1555 -4969 3269 896 -6379
371 -6379 533 2060 -5672 -1179 4759 -665 -2021 5717 3954 -3360 2531 5979 -4521 -2776 6211
386 6211 -1948 -4594 5517 1588 -5714 2749 4024 -7683 -3133 6023 -5163 -7096 7374 719
400 719 -7089 7073 5104 -8007 2671 8332 -7045 -4219 9096 -1790 -6950 8611 3114 -8770
414 -8770 5632 6532 -10009 -1295 7658 -5688 -5173 6566 -200 -5116 4989 3467 -5748 1915
428 1915 5128 -5251 -2292 4541 -1915 -3673 3639 1347 -4407 568 4601 -4483 -5288 6215 106
443 106 -8466 4468 6095 -6702 841 8554 -4139 -3361 9152 -1516 -8224 8488 3852 -10475
457 -10475 4109 7303 -9135 -147 7239 -7741 -3647 7663 -4741 -6739 7145 -467 -8073
470 -8073 5854 2967 -8912 4459 7249 -7765 490 9513 -3032 -2925 6727 77 -3563 3526
484 3526 480 -4216 2453 1959 -5279 376 3809 -3516 -2269 2610 -837 -2489 345 1036 -1446 -974
500 -974 3139 700 -3482 1973 3422 -3067 -570 3608 -1893 -2289 4769 637 -4841 3779 3263 -6436
516 -6436 796 4462 -6290 -1201 5888 -4196 -2521 6955 -1743 -4813 5841 743 -7204 3509
530 3509 3803 -8384 389 7203 -5946 -3062 7504 -1431 -4694 4107 1106 -3793 2249 2048 -3407
545 -3407 2126 4778 -3156 -967 4739 -1122 -2496 2227 -946 -2050 1824 -337 -1978 642 867
560 867 -1314 -813 -822 -1134 405 -1032 -3080 1564 2079 -2310 1067 2001 -1589 3319 2604 -4181 1148
577 1148 5001 -3056 -1830 4234 -1773 -2842 4959 -886 -5900 3944 1943 -5506 2882 1423 -6972
592 -6972 3353 5150 -7713 -1830 6746 -2785 -4221 5149 -202 -4852 4565 3224 -4962 934 3343
607 3343 -1649 1248 1406 -2873 955 2830 -1328 -1191 140 -382 806 564 -1740 -461 1714 -343
623 -343 343 1401 -3719 -1197 4616 -2622 -4924 2881 52 -3141 3584 525 -4863 4131 5359 -6222
639 -6222 -1191 7757 -3318 -4202 7895 -988 -6862 7552 3160 -8779 3008 6180 -7349 -1618
653 -1618 6853 -5080 -4766 7801 -1517 -7931 6146 2593 -8717 2245 5253 -6215 -1485 6341
667 6341 -1649 -3515 5238 2801 -4107 1514 4459 -3018 -1877 3815 -491 -3599 2582 2443 -4487
682 -4487 -476 5363 -3647 -4459 6337 -782 -7370 5254 3157 -8176 2048 6313 -6644 -1969
696 -1969 8253 -3776 -5723 7891 384 -7554 5886 3656 -7244 2897 5263 -5830 -272
709 -272 5238 -3201 -2066 4146 -1208 -2355 3528 -269 -3079 2435 781 -2848 874 295 -1419 852
725 852 -1202 -987 1873 -1974 -1286 3015 -1167 -2023 3717 258 -3356 3807 2285 -4691 1983 4436
741 4436 -4748 330 5465 -4011 -1543 5704 -2640 -3612 4714 -853 -4862 2620 1095 -5212 1084
756 1084 2752 -4423 -821 4131 -2342 -2445 3225 125 -2051 1276 1696 -683 -48 1925 447 -1521
772 -1521 1052 1354 -1555 134 1520 -1039 -1160 1310 22 -2013 497 793 -2214 -65 1630 -2357
788 -2357 -867 2100 -1038 -1276 1460 454 -1147 136 1414 -328 -618 1539 657 -1041 710 1316
804 1316 -691 -348 1034 85 -1296 841 1118 -2051 239 1984 -1962 -800 2144 -1578 -1516 1938
820 1938 -650 -2177 1312 1112 -2415 272 2279 -1757 -892 2538 -616 -1177 2015 227 -935 1066
836 1066 784 -468 382 870 -364 -520 953 46 -900 415 -137 -444 -59 -429 -730 -270 11 -264 -1143
855 -1143 -10 618 -1079 186 1090 -891 -9 1485 -269 -552 1124 823 -294 273 1037 -556 271
872 271 1214 -1139 -329 1118 -863 -721 830 -912 -1018 552 -269 -1255 70 867 -1245 -794 1493
889 1493 -405 -1214 1042 438 -868 798 942 -351 -15 1153 77 -691 1147 616 -1389 1061 1013
906 1013 -1681 238 1457 -1337 -891 1120 -86 -1811 442 938 -1727 -399 1382 -1400 -783 1464
922 1464 -469 -1015 987 643 -775 169 1248 -490 -361 1792 -139 -871 1219 207 -824 718
938 718 233 -683 49 751 -565 -1029 862 182 -1996 167 1078 -1190 -675 773 49 -927 279 802
956 802 -940 -553 1669 -625 -1181 1754 716 -1214 719 1272 -732 -53 1542 -712 -1179 2231 -64
973 -64 -2598 1764 1358 -2691 483 1611 -2045 -661 1527 -1493 -2089 1715 396 -2537 1170 1872
989 1872 -1979 442 1938 -1449 -360 2077 83 -974 1024 1261 -612 154 1486 -535 -719 1189
1005 1189 -249 -1848 389 1285 -1598 -1341 2052 -40 -2774 1220 1374 -3131 267 2499 -2616 -876
1021 -876 3590 -634 -1910 2996 871 -2550 1937 2044 -3454 715 3477 -2804 -991 3305 -1491
1036 -1491 -1778 2334 -541 -2209 1506 706 -2491 179 1419 -1830 -642 1857 -774 -961 984 392
1052 392 -380 -642 243 839 -818 -360 1466 -576 -683 1683 73 -1508 955 1381 -1702 11 1663
1069 1663 -1596 -387 2873 -1075 -1966 2739 74 -2747 976 779 -2343 -47 1411 -1607 -1034 2051
1085 2051 -301 -1684 1287 461 -1183 1039 307 -1291 1329 1437 -710 -116 1496 860 -434 34
1101 34 -200 -287 560 -474 -1298 8 -191 -212 -56 -1260 -261 595 -1151 -481 673 -915 -84 2006 -28
1120 -28 -1317 1686 2117 -1802 175 2518 -1622 -734 2401 -791 -1285 1869 -197 -1821 1016 641
1136 641 -2438 -212 1695 -2018 -1144 2355 -976 -1433 2497 -161 -2436 1573 833 -1912 309 1409
1152 1409 -1122 134 2164 -509 -1255 1527 62 -1242 536 9 -736 538 193 144 189 -185 328
1169 328 345 -751 218 193 -1081 65 1059 -1061 -916 1952 -523 -2214 1503 -46 -2854 1773 1402
1186 1402 -2887 957 2808 -1706 -211 2458 -850 -1044 2348 -153 -1818 2293 957 -2259 1294
1201 1294 1211 -2156 246 979 -2159 -985 703 -598 -1071 369 196 -658 186 275 -742 174 642 -206
1219 -206 406 573 914 694 -355 592 893 -789 -122 515 -800 -379 465 -571 -578 506 -121 -901 64
1238 64 80 -1522 430 790 -1426 403 1640 -748 118 1196 -601 -164 890 -524 -570 949 -175
1255 -175 -849 1026 340 -1396 952 317 -1943 753 866 -1674 443 1403 -1184 -383 1675 -353 -1077
1272 -1077 1208 -177 -1807 732 660 -1776 537 1175 -1563 334 1328 -1297 -480 1536 -435 -796
1288 -796 1449 812 -924 1012 1363 -969 329 1259 -908 -455 766 -650 -720 392 -224 -490 -259
1305 -259 -277 -611 -323 -228 -650 145 -14 -298 674 183 78 773 194 13 954 227 -255 973 351 -327
1325 -327 393 413 -571 -344 519 -667 -1012 495 -462 -1140 389 28 -810 364 235 -675 153 527 -188
1344 -188 -113 674 198 -268 777 319 -654 454 515 -554 89 491 -243 -523 26 325 -388 -273 560 -344
1364 -344 -233 435 -76 -476 157 132 -424 -406 304 117 -551 432 202 -514 225 176 -379 -51 465 133 -198
1385 -198 409 490 -297 410 859 -597 167 845 -624 -376 547 46 -537 -91 300 -464 -474 203 -649 -598
1405 -598 419 -527 -436 527 74 -17 377 100 161 421 384 -42 -44 732 392 -258 551 191 -271 80 -545 -202
1427 -202 -154 -451 -277 -411 -305 168 -212 -213 -64 -17 170 -514 -284 558 15 213 623 83 184 494 105
1448 105 -335 181 190 -181 -12 453 -52 -19 600 -402 -462 366 -329 -814 273 122 -341 142 429 -229 -285
1469 -285 652 -453 -848 253 59 -734 170 144 -17 696 241 -397 -20 391 -87 -498 292 617 -116 512
1489 512 726 -217 228 180 -685 -552 15 -36 -659 -441 422 -137 -227 339 -467 -491 235 -467 -564 169 376 239
1511 239 412 784 375 218 511 -228 -289 539 -47 -540 564 383 -467 68 471 -354 -768 166 -573 -1065
1531 -1065 243 156 -666 585 378 -283 407 179 -510 195 650 -148 -113 872 591 -78 663 222 -455 273
1551 273 -56 -449 100 -10 -128 86 -120 -136 362 -66 -553 -268 -37 -68 -28 -107 -269 292 567 -484 -70
1572 -70 904 -445 -207 384 -514 -44 847 -153 -142 1021 129 -641 312 303 -947 107 795 -1069 -369
1591 -369 1210 -554 -760 766 -486 -655 349 -97 -1032 288 758 -1023 6 885 -769 -229 1058
1608 1058 -498 -438 1016 -101 -561 803 395 -370 233 510 -503 -183 300 -501 -408 508 -237 -318 189
1627 189 -349 -43 -222 -557 -5 163 -215 306 316 -38 49 386 -167 -197 548 -172 -422 967 153 -881
1647 -881 815 622 -1089 250 467 -1062 -347 637 -332 -640 731 122 -627 494 -95 -956 417 426
1665 426 -1089 102 743 -359 143 638 -272 -30 562 -28 -74 307 318 -49 334 176 -324 365 -293 -289
1685 -289 273 -564 -232 482 -671 -423 956 -177 -1001 588 206 -1140 173 475 -1085 268 1289
1702 1289 -937 -23 1597 -491 -442 1376 -466 -703 1251 261 -982 663 633 -952 148 556 -775
1719 -775 -176 531 -676 -330 678 -448 -402 490 -47 -444 170 152 -254 -290 249 135 83 275 161 104 -70
1740 -70 320 500 -298 -226 730 -52 -72 506 -142 -361 427 -95 -626 -189 360 -401 -491 696 -263 -591 526
1761 526 -77 -655 587 103 -768 327 588 -561 246 828 -313 -245 925 50 -693 889 310 -842
1779 -842 745 529 -807 401 403 -1018 -325 417 -681 -518 656 -309 -674 695 -72 -758 754 -68
1797 -68 -911 747 490 -682 654 433 -422 445 552 -501 -61 623 -547 -371 891 -391 -579 810
1815 810 -358 -590 461 -395 -642 348 -134 -386 426 160 -470 470 256 -440 327 444 -632 289 673
1834 673 -753 302 1040 -758 -23 964 -434 -205 647 -383 -475 627 -32 -754 740 267 -1024 413
1852 413 310 -1124 232 513 -735 -30 780 -681 -95 700 -240 -280 231 48 -247 249 328 -373 482
1871 482 264 -301 281 342 -180 94 -72 -158 276 -2 -237 60 -92 -271 -203 7 -403 -79 294 -186 -438
1892 -438 487 -125 -378 548 -24 -201 361 358 -92 125 712 160 -250 549 56 -437 270 42 -585 308 179
1913 179 -385 -61 126 -275 -213 -26 -169 -426 164 114 -215 200 231 -184 50 210 143 197 -107 129 223 -294
1935 -294 366 198 -138 121 246 -216 -152 53 11 -363 180 296 -374 70 401 -592 -128 326 -398 -492 124
1956 124 -48 -334 282 235 -178 189 532 -352 -334 550 -67 -337 429 264 -140 106 410 -60 -341 365 38
1977 38 -842 181 277 -647 26 349 -360 -480 103 -295 -461 183 163 -495 174 690 -273 -7 602 171 -332
1998 -332 494 195 -168 1 576 -119 -354 383 91 -511 219 -138 -624 -26 -35 -271 -451 226 321 -477 74
2019 74 274 -551 80 436 -358 -92 588 188 -272 373 478 -446 -88 634 -263 -281 553 -224 -531 459 158
2040 158 -400 2 344 -138 -312 169 -115 -463 299 229 -588 297 371 -313 -211 231 12 -401 185 322 -396
2061 -396 -55 669 -280 -314 580 135 -482 132 325 -162 100 657 -284 -681 664 -81 -923 296 221 -854
2081 -854 158 485 -705 -489 632 -191 -649 857 75 -737 573 535 -791 548 697 -684 98 872
2099 872 -318 -474 612 59 -569 411 238 -695 104 229 -614 33 130 -516 -242 125 -97 -324 209 25
2119 25 -162 279 275 -105 189 253 50 271 -52 -70 269 91 -427 229 -58 -164 255 -189 -530 -28 65 -414
2141 -414 54 268 -151 -194 457 -194 -402 285 -65 -447 288 62 -191 280 293 -232 337 184 -118 89 368
2162 368 -75 -86 353 -200 -54 225 -385 -23 413 -356 -46 405 -261 -203 197 -111 -395 301 87 -554 103
2183 103 251 -527 -23 435 -478 32 583 -300 -161 800 -30 -337 454 107 -412 282 526 -582 42 501
2203 501 -430 -55 385 -428 -157 318 -145 -244 69 -103 -289 -46 107 -57 0 182 -134 238 -154 -34 507
2224 507 -17 -242 587 -293 -84 482 -377 -566 432 -28 -513 277 337 -724 112 599 -636 -188 635 -636
2244 -636 -621 822 -142 -598 835 51 -593 368 505 -672 90 811 -294 -6 670 -237 -349 492 -107
2263 -107 -464 385 -118 -340 73 255 -160 -260 216 40 -324 56 -83 -364 193 -138 -192 4 -40 154 130
2284 130 -35 154 123 -59 305 204 -165 330 336 -98 -102 316 -109 -442 279 -10 -544 7 215 -380 -72 320
2306 320 -273 -393 143 -141 -369 244 74 -498 192 318 -353 233 372 -462 -78 296 -164 -152 233 196 -51
2327 -51 198 139 -161 -101 48 -358 6 129 -352 46 140 -331 36 43 -229 -7 -9 -97 -63 165 -82 -65 300 14
2351 14 -173 385 -97 -264 580 -65 -376 475 58 -338 344 131 -248 22 149 -386 -106 193 -274 -335 268
2372 268 -108 -277 393 -246 -413 379 15 -189 283 68 -195 209 226 41 130 163 -72 -183 227 -186 36
2393 36 74 -268 57 101 -276 -180 174 -212 42 -13 -220 -293 -80 144 -246 142 97 -436 43 165 -260 132
2415 132 282 -187 254 180 -281 107 137 30 -89 271 271 -259 -39 105 -263 -225 -20 -229 -136 -52 -110 24 -210
2438 -210 14 43 -121 -47 -50 57 -43 122 231 23 -57 185 -73 -34 231 -32 -59 317 58 -175 121 184 -65
2461 -65 -8 128 -172 -179 129 -154 -144 89 -95 -616 149 128 -276 10 139 -209 -5 230 -5 -9 268 303 -82
2484 -82 46 317 -135 14 232 -19 63 -8 162 -93 -198 128 -59 -347 60 -71 -55 -112 66 -197 -176 425
2506 425 36 -268 455 303 -387 330 355 -278 49 254 -170 -89 233 -91 -114 319 3 -426 43 171 -299
2527 -299 -34 342 -100 -171 64 -131 -258 -212 20 -134 -202 260 -45 -269 225 96 -36 358 244 -153 46
2548 46 79 115 -92 231 73 -246 342 197 -190 154 173 -9 -145 38 -9 -126 91 44 -264 -137 62 -175
2570 -175 -64 158 -18 54 -18 -25 258 32 -10 0 87 101 152 162 -107 -62 -165 13 149 148 -265 104 125 -78 -168
2595 -168 151 -327 -165 146 28 -43 51 -35 -57 66 93 20 -31 343 66 -20 169 67 -41 23 0 -7 96 -163
2619 -163 56 -32 -81 132 140 -95 46 44 -249 -36 222 -90 -364 178 -18 -372 343 307 -409 123 260 -390
2641 -390 -14 650 -234 -306 533 38 -568 422 240 -461 182 386 -542 -195 286 -245 -435 417 36 -659
2661 -659 269 295 -407 -213 324 -411 -144 495 -139 -223 247 330 -315 17 496 -271 14 334 -6 -127 215
2682 215 73 -121 -1 128 -11 -206 74 117 -427 93 161 -316 -161 349 -136 -295 133 102 -443 4 386
2703 386 -267 -119 546 -54 -190 274 -60 -166 366 218 -309 118 315 -129 -204 371 2 -447 74 6 -253
2724 -253 176 81 -153 -10 123 -59 21 29 46 -90 20 248 -46 28 86 101 -58 75 262 -44 -180 472 50
2747 50 -215 435 158 -334 77 362 -275 -159 234 -173 -304 303 39 -538 341 381 -431 235 336 -497 -87
2768 -87 564 29 -305 461 6 -144 288 58 -319 191 247 -170 198 283 -114 -148 81 -249 -335 -43 56 -88
2790 -88 -103 173 114 -217 12 -34 37 -174 6 196 -110 21 309 -102 -78 368 9 -126 202 29 -252 277
2812 277 182 -337 -22 219 -124 -181 331 -171 -410 263 -93 -308 234 -137 -438 -77 240 -160 -29 139 -157
2833 -157 -113 152 -87 -154 258 31 -119 202 92 -36 55 125 -61 138 106 28 -66 -77 -158 -18 29 -90 -33 -157
2857 -157 -255 -54 -36 -106 -28 -36 29 183 91 -43 -80 56 -146 -55 153 -10 -103 216 106 -408 196 118 -243 -80
2881 -80 206 -179 36 12 -204 -197 -9 -62 -85 92 25 -195 146 147 -209 -15 183 -204 107 112 -14 149 48 17
2905 17 -20 186 -126 13 167 -36 -147 95 -187 -111 67 -9 -201 -31 17 -37 -37 43 -190 -21 -90 78 92 125
2929 125 88 -263 26 -71 73 177 -58 -51 259 188 115 26 -49 25 -41 -34 -7 -99 -17 -29 -198 -2 -129 -103 1 -272
2955 -272 10 5 -29 -108 -154 -133 -136 18 263 147 60 94 22 -27 155 42 208 83 -135 130 -33 -156 -78 24
2979 24 -54 66 -68 -47 -67 -84 -150 -310 -29 149 -43 41 26 -222 280 202 57 41 53 -4 158 -50 155 -111
3003 -111 38 112 -80 38 89 76 -15 -40 -160 120 6 -121 -134 22 -73 3 81 20 -285 23 107 -82 103 22
3027 22 -53 38 48 29 279 34 153 67 -21 59 119 -102 122 -47 32 -5 -140 36 -106 -24 6 -29 3 24 -189
3052 -189 157 -138 -92 103 -48 -165 -22 55 -23 15 80 128 -188 152 135 -106 129 137 -142 75 -22 -64 -157 -69
3076 -69 -22 -58 -47 133 -172 -144 25 -221 -164 57 -8 -73 -24 136 -11 9 9 25 -99 320 31 -200 49 228
3100 228 -64 104 136 217 -15 -70 102 -49 -73 31 -133 -44 122 -273 -10 58 -131 4 -7 -19 -165 -31 2
3123 2 -28 -31 46 47 -159 89 100 254 -63 100 102 1 67 -19 -14 92 7 -192 10 37 -94 -81 -29 -57 -217 79 45
3150 45 -46 107 113 -165 -229 122 -144 59 -9 -75 158 85 97 -204 5 179 -215 -315 118 -125 -291 -46 -160
3173 -160 -206 216 17 -167 -93 -18 -251 -85 173 -53 -73 121 25 -149 152 8 -148 109 -6 -82 80 57
3195 57 109 73 131 22 -188 -42 151 -126 -171 -195 -68 -8 79 108 -61 -166 2 -131 -229 -14 107 -79 54
3218 54 124 94 -16 26 194 -53 196 21 -195 93 264 -117 -42 206 -76 -91 -33 87 -65 20 118 -129 4
3241 4 107 -212 -82 -5 -226 -37 -29 -90 -119 -4 225 -174 -175 137 99 77 213 -67 -108 55 199 113 -109 113
3265 113 110 -33 122 132 -62 -142 187 -148 -10 -99 -177 -324 -100 224 -171 -91 244 24 -1 227 -170 -25 304
3288 304 47 -109 108 -6 -180 -109 223 -175 9 313 -29 -303 176 -97 -148 127 -50 -219 -144 -97 -28 3
3310 3 -213 -171 -71 25 -41 5 104 77 18 113 3 -4 108 9 129 152 -10 106 131 45 16 32 -239 20 -2 -69 -60
3337 -60 106 63 -269 111 88 -180 156 110 -37 51 135 -138 -108 166 29 88 289 170 -238 42 71 -55 119
3360 119 27 15 62 43 -107 120 99 -81 -123 -15 6 -1 86 -48 -86 27 76 -23 47 -82 -7 4 111 -81 285
3385 285 50 -17 -14 55 205 0 212 8 -124 -93 15 -74 22 -22 31 62 -204 -111 38 -55 -116 -127 92 65 -215
3410 -215 16 -56 38 74 -33 82 43 81 -67 102 106 53 107 10 61 99 76 -100 -1 71 -151 -26 78 -193 -211
3435 -211 313 -71 21 104 -111 -49 84 -4 55 58 167 -21 -71 45 4 31 209 7 -104 132 6 151 -59
3458 -59 12 -9 17 -36 -44 -4 104 -46 -201 96 -209 12 -98 -57 -62 -88 -52 -27 84 -46 -28 95 -48 41 123 63
3484 63 129 153 200 -56 194 39 -41 96 141 -54 -53 -24 -26 -86 29 25 7 114 4 -138 -12 -93 -92 85 -81 -152
3510 -152 -128 -57 -67 -9 49 -57 -54 83 62 27 36 39 16 -3 28 -13 43 -80 -178 -82 -56 -107 -153 4 -90 103 -58 -12
3538 -12 -86 34 -135 -117 142 65 -104 93 18 -3 175 22 22 167 14 -22 33 -112 31 17 27 106 6 7 -95
3563 -95 72 62 -158 -153 -15 41 -43 -128 70 34 -59 -47 -153 -137 -124 187 120 -94 -97 104 25 -80 3 144 127 88
3589 88 195 92 43 68 58 -105 -88 24 -34 -68 11 38 -74 -78 -92 66 107 -28 8 -124 -98 -127 -65 186 41 -61
3615 -61 116 36 157 126 45 64 -184 -138 1 38 -126 62 -105 7 29 -100 -136 -279 -12 5 -73 101 -109 -186
3639 -186 -75 -10 -101 -174 103 -136 90 72 30 21 -195 -114 -160 -11 29 -123 77 -49 -172 36 62 -77 -216 -23
3663 -23 74 -12 42 -128 20 102 -11 70 202 117 -99 91 -70 90 107 74 14 75 -2 -5 91 5 253 -109 107
3688 107 22 -13 -11 -75 79 17 -8 77 -65 -54 -271 -3 65 -79 -10 -99 206 -92 168 160 -258 51 145 -241 0
3713 0 100 60 83 -109 -106 -207 -74 -18 -99 104 93 -87 -41 -19 -112 -97 -107 21 -38 -39 32 27 -43 56 -30 -34 5 45 38 33
3743 33 152 90 -110 55 101 -88 81 24 -75 -102 46 -59 -6 45 -11 -51 -5 27 -176 -202 55 -56 -144 272 -60
3768 -60 -62 192 0 74 153 102 -18 54 262 -96 17 54 65 -118 93 18 -196 36 154 -135 42 11 -80 -48
3792 -48 210 -113 -154 -99 90 -21 -8 87 40 44 52 104 108 142 186 51 5 85 -77 -123 39 70 -90 57 143 -48 -168
3819 -168 75 81 -248 -99 -70 -159 32 -60 18 105 139 -15 12 19 -42 -94 46 57 -33 115 -54 63 214 -12 -64
3844 -64 -7 41 52 132 107 50 31 6 39 -79 -13 98 -19 131 -28 -151 -27 -62 27 -133 -77 -47 47 103 13 76
3870 76 71 -13 -67 97 -85 -14 113 70 -169 119 -173 33 -24 -21 -97 -5 99 -102 107 -49 -107 -120 237 30 10
3895 10 139 -49 -42 17 44 91 98 111 50 -130 48 39 164 48 14 6 201 37 -19 81 67 -25 -27 -99 -27 -97 -2 2 -237
3924 -237 -67 31 65 -93 -93 163 119 -177 180 74 81 -36 -6 0 41 162 -8 7 121 -37 -105 105 74 -141 114
3949 114 -40 -42 78 51 -217 -91 64 -67 -206 43 92 238 137 -49 -39 -9 95 -137 275 -91 -18 18 -55
3972 -55 26 -36 99 68 55 -101 23 -170 -24 -67 -56 -128 -98 14 -3 -67 -47 90 81 163 110 -109 -54 142 0 9
3998 9 25 -51 -181 87 38 25 63 36 -82 -3 192 -152 66 -97 -102 2 -58 -16 -146 -69 66 55 118 173 -13 -13
4024 -13 218 67 34 36 -10 -95 140 116 -145 251 41 59 -5 60 -16 -51 -41 -148 -141 -1 -52 140 15 55 -20 9
4050 9 2 53 -120 6 -56 9 4 -30 16 -8 -59 26 -33 6 147 10 29 57 35 -7 63 93 -62 -56 228 -15 -44 69
4078 69 34 -181 -109 80 -55 -40 -2 -147 19 44 26 -78 90 -99 -128 -80 -79 4 30 264 66 25 62 -17 -54 143
4104 143 7 -103 0 36 -187 14 -88 118 -157 46 -137 5 -16 0 -62 -55 60 70 27 50 -14 -154 5
4127 5 -4 -136 -25 43 110 -32 -58 54 -115 -1 130 -8 -105 206 9 -10 122 210 -33 48 84 -149 -30 32
4151 32 -98 -12 47 8 5 177 92 126 165 75 82 45 20 -11 62 -16 62 65 226 -10 -173 14 150 -115 -157 -151 58 -4
4179 -4 81 25 -181 -5 86 9 -23 -42 27 -61 -66 -52 -100 -106 -24 -155 0 18 -56 -47 66 -12 -10 32 20 -26 -171 13 -51
4208 -51 15 -94 -10 -128 33 -87 -135 43 -61 -53 52 -56 131 109 -158 192 -114 20 228 112 3 113
4230 113 30 -88 73 -68 79 40 4 63 -156 143 101 -61 1 -184 46 -58 -53 38 47 6 -118 -210 -62 -33 -16
4255 -16 37 118 33 50 130 133 14 15 36 -63 27 165 -53 -108 -45 32 -94 133 144 -127 -21 112 -44 175 -53 -105
4281 -105 36 17 -1 -51 -117 53 -39 48 -102 93 37 11 55 75 37 76 -31 67 67 -77 22 -47 -58 -124 38 28 10
4308 10 13 -75 26 -51 -54 3 113 -72 -63 66 -5 -38 201 -52 -32 -42 3 15 144 219 -84 -9 20 18 -113 129 -89
4335 -89 -150 -85 75 26 96 -101 -160 129 -21 -73 -53 54 -144 -95 124 121 -94 76 26 51 147 -84 -61 125 130 113
4361 113 48 40 208 32 -147 -172 -70 -3 -39 -213 38 60 -34 -54 -146 97 -65 -39 39 -68 -82 -85 -5 -22 56 -9
4387 -9 88 10 -5 20 -155 116 -118 -37 136 51 -123 116 -36 -111 -1 43 -63 165 234 0 -49 42 43 58 60 -5
4413 -5 88 -123 14 -137 3 34 66 21 -146 -108 1 120 162 49 29 33 20 -59 -28 75 15 81 -140 68 -16 -125
4439 -125 128 -125 16 163 -22 125 147 113 -143 0 2 4 124 92 34 -64 163 39 -6 61 -42 202 -53 6
4463 6 -72 -93 97 15 79 69 -205 15 -44 113 -77 -99 7 -322 -80 111 101 5 54 25 17 71 69 28 142 -55
4489 -55 55 -62 -238 -21 -100 6 94 -35 -41 -51 -87 -170 70 -65 -190 -124 13 -27 -98 24 -24 -6 72 76 136 59
4515 59 6 3 29 -71 -23 9 55 -20 58 -27 12 101 76 147 -88 152 127 -6 81 -51 -117 55 153 -90 48 79 30
4542 30 -108 -72 -6 -58 -234 7 22 2 -30 -98 -44 -19 203 -137 -64 -46 -22 -97 9 61 11 8 -103 -217 25 160
4568 160 -38 46 79 -13 9 -35 -33 16 28 -45 -49 -119 -86 -1 139 3 25 47 -49 249 0 31 128 -132 106 198 0
4595 0 8 -106 -37 16 62 52 67 -69 119 -70 -115 -63 -84 76 -71 -66 183 -137 -96 -214 90 86 3 202 135 -1
4621 -1 158 169 108 -81 -25 191 -147 -136 164 -106 20 -136 72 -12 20 125 -25 65 -10 60 42 -59 130 -45
4645 -45 -68 177 -34 -122 -57 135 55 -14 93 -31 -87 44 23 -63 86 26 -88 222 64 -57 7 99 -7 -6 -120
4670 -120 -92 -79 7 -42 -151 25 91 -10 -39 110 -98 19 48 32 -116 -139 95 -8 -17 11 -4 -131 36 -29 46
4695 46 -65 -46 22 -42 44 160 -201 -8 -50 -17 -47 -61 188 -99 142 74 71 -48 211 -32 -83 53 -32 16 34
4720 34 -80 -135 -159 -151 -66 34 72 -10 -164 -105 34 -240 -110 56 72 -79 -69 10 -168 3 104 -82 13 90 21
4745 21 71 161 -84 9 1 -49 -48 111 -90 -99 81 100 -171 168 31 -194 -174 -31 22 -132 150 31 -69 -161 -38
4770 -38 9 -86 58 -63 -48 -7 78 71 93 147 -8 -163 52 79 -50 17 71 44 -123 -11 -104 -153 183 -92 149
4795 149 9 55 -76 -49 -114 -54 -108 131 20 8 -132 -40 -115 138 77 -131 16 43 -107 37 86 1 -38 -12 114
4820 114 41 -45 -142 -101 11 86 48 104 19 -10 -38 -7 149 124 30 81 186 -143 25 -40 50 51 92 63 -101 -53 -50 -89
4848 -89 -63 33 23 43 4 86 -26 39 -105 -69 57 -60 -90 37 -25 94 60 -15 -22 -91 13 203 20 -46 -20 -100
4874 -100 -38 -22 -47 52 -106 -75 -103 -68 108 47 -142 -53 -219 -161 -110 -3 -155 45 0 0 -233 -85 89 -40 -143
4899 -143 -66 -45 28 66 59 88 144 64 -34 24 109 45 -55 140 182 -28 56 -63 -81 190 16 11 -58 -13 71 65 -177 76
4927 76 147 -25 -33 98 -2 -45 -75 -105 -66 -8 69 -113 -41 -33 198 -118 37 -196 34 65 14 32 79 -3 134 57
4953 57 39 -32 -80 55 -48 -12 -121 -188 132 118 42 66 76 -4 105 129 -106 68 1 -22 -95 -18 -76 86 16 -40
4979 -40 -85 -170 -67 3 165 -74 -26 18 -235 -5 60 -14 -62 -125 24 -91 -109 129 50 -25 -3 26 13 80 -6 -187
5005 -187 -26 57 48 77 54 90 161 -10 15 1 -34 -59 4 42 -154 26 8 -68 65 16 -81 8 156 -29 -10 49 95
5032 95 -41 87 -83 -69 171 -169 -152 77 24 -48 61 -40 -328 142 45 46 -57 -85 66 28 96 104 -125 24
5056 24 -27 -32 -228 40 3 -64 -1 -22 -9 54 150 134 49 71 -125 30 17 -91 -91 112 -73 135 42 -25 -19 -136 57
5083 57 55 12 -111 -50 -20 -51 -137 125 -61 136 106 -140 2 29 91 -146 -68 -19 -7 81 -62 -148 7 146 -84
5108 -84 54 -8 56 -49 128 -28 -87 -84 57 -142 -115 -21 50 -52 140 91 88 148 45 -26 -27 81 26 139 -11 18
5134 18 77 -117 69 14 -28 32 59 100 -123 -2 -71 -31 -52 -63 31 -7 -168 43 24 34 -104 -48 -106 -12 113 165
5160 165 -16 30 -48 97 223 -7 -30 -51 -38 124 24 114 -25 66 109 -9 44 63 114 -105 -55 164 -176 -10
5184 -10 88 -128 7 -39 -3 113 -90 23 20 -6 -66 -11 22 -93 -93 -35 113 81 30 85 -131 -1 142 -62 -71 78
5210 78 -98 61 -133 -64 -9 -62 273 -129 110 -64 -40 56 -95 113 -89 -45 91 84 2 -136 77 16 -34 -93
5234 -93 -91 36 2 -50 37 -6 -316 -7 -2 -28 23 -95 8 -79 -113 -62 -16 107 -92 -16 101 -107 101 -26 -65 194
5260 194 -42 -92 -137 -10 38 50 -125 -149 -20 22 -37 -19 -9 22 73 -25 -62 -85 41 6 -27 178 -125 61 160 -56
5286 -56 56 -41 33 57 124 97 27 3 21 11 12 -89 -154 109 40 33 127 -94 64 129 -74 -5 -40 -136 248 -59 101
5313 101 51 17 91 -102 -114 -25 26 -166 107 17 117 93 3 8 -69 130 -29 -44 65 -35 111 -161 -89 -173 57
5338 57 -65 -96 25 27 103 -34 -74 81 -86 -10 -159 -88 -18 -171 4 -21 -50 -122 75 -70 -21 183 -219 -161 25
5363 25 14 11 40 -36 20 50 69 48 -3 -18 -224 -214 -16 12 24 -79 158 61 -7 53 70 124 17 50 154 15 119
5390 119 -28 62 -19 68 101 59 134 195 46 -130 96 7 -6 -42 -42 -26 -51 80 -55 -69 86 -109 -139 -43 -107 19
5416 19 110 145 -56 110 -20 290 32 -50 -24 26 -46 -55 -37 99 -65 -91 -27 -31 27 5 28 -36 0 60 248 31 -99
5443 -99 58 -122 -80 -78 -23 141 -8 91 -48 -36 136 2 70 -50 -36 13 100 35 -41 -43 -20 65 41 -6 -56 -7 63
5470 63 -81 -52 -102 -44 1 -161 120 -180 -98 42 -30 -206 -144 247 68 35 43 -25 20 0 65 105 148 -42 -40 -50 -13
5497 -13 -120 13 -113 -64 -4 126 12 36 -111 -26 81 -50 28 10 -91 90 0 -10 -11 -189 -5 -34 28 -80
5521 -80 53 60 43 -27 -31 138 116 -93 -14 4 64 -77 -59 -20 7 -86 -103 -41 97 17 -46 -30 21 -82 -4 -55 31 144
5549 144 159 37 65 6 -79 48 -76 26 64 -37 69 -36 7 -110 103 -105 20 -9 -60 -114 -68 139 -6
5572 -6 54 -1 59 -31 113 37 -192 -31 149 -74 -154 -170 -39 138 -2 34 23 -114 36 -1 -27 94 -27 -29 83
5597 83 -56 16 -13 72 56 -12 35 14 -146 67 -153 2 -61 6 -121 69 -23 57 -138 -106 73 -48 -137 63 33
5622 33 63 66 42 112 65 -26 51 -21 -50 155 -68 -89 -38 36 137 -3 -83 -113 118 -14 -42 -39 -169 -78 69 -34 38
5649 38 62 90 226 21 176 -85 40 -104 -26 144 -122 106 12 99 -73 -20 -14 179 -125 -39 20 -121 96 -117
5673 -117 -2 -102 -107 -127 138 6 88 -21 28 224 -29 5 -16 58 -63 61 -115 -103 160 -79 39 -133 85
5696 85 47 23 96 -14 -22 22 -85 4 -130 99 48 4 9 5 54 -75 45 40 -8 -158 31 226 -47 -190 -73 29
5722 29 -89 125 -122 61 45 63 19 57 -27 -19 -121 -61 -189 -126 66 -22 -37 49 73 49 -92 -57 95 70 182 50
5748 50 187 -8 -19 184 221 -2 72 57 -233 -105 44 -91 -46 71 25 -141 -17 98 28 -88 -75 130 -89
5771 -89 -10 -66 47 11 -8 -114 -22 11 -3 60 22 62 22 41 44 69 1 -44 -44 69 47 -99 -3 -156 108 -3 -72 -96
5799 -96 -108 72 -108 -94 142 -178 74 -26 -1 -51 -19 45 -7 -35 59 71 -74 -19 14 -80 14 39 -43 77 -66 -151
5825 -151 72 7 -77 -204 57 -3 -112 -8 8 -116 -68 180 -39 10 87 -10 -8 -46 -73 -38 -57 -84 -112 208 105
5850 105 236 18 23 111 25 -11 0 -29 -254 -121 -170 28 -161 8 80 -56 -111 -85 -91 54 72 11 -105 136 21
5875 21 36 107 136 -94 -18 -98 21 -27 -57 101 54 -1 75 -45 60 -3 69 111 -128 21 83 101 -39 -45 -41 -11 -93
5902 -93 113 -75 -5 64 -25 -59 100 129 24 -195 -82 14 -43 -102 -216 -5 -5 -3 -8 -187 -70 -15 3 -118 51 79
5928 79 68 -18 -264 85 -61 -177 12 15 30 -112 -164 -1 120 19 -84 38 22 105 139 70 49 162 7 89
5952 89 -149 -40 -5 -45 -1 -64 -63 21 110 -122 4 -53 122 110 39 122 18 70 67 -161 -36 194 -89 102 -94
5977 -94 -109 58 -9 158 100 -66 53 -30 -169 67 -99 25 25 -91 33 -39 -69 15 74 -27 -16 47 48 -10 69 3
6003 3 -150 95 -115 7 -9 -206 7 -78 22 104 22 -130 -238 21 60 48 -95 60 39 24 -29 0 0 91 83 77
6029 77 -40 -23 -86 -37 -42 -60 -39 -52 -44 -113 -16 32 57 -58 26 63 -131 15 14 -175 64 153 159 -47 -141 -44 48 142 45
6058 45 121 39 -91 -157 96 43 -43 -42 27 40 -29 128 -98 91 -49 25 72 -85 76 111 -4 95 75 -118 77
6083 77 -63 50 0 -56 -50 5 102 -154 -16 -66 65 -97 3 -38 9 6 22 -15 64 -52 -101 -39 -194 -20 71 -93
6109 -93 -5 35 69 -45 103 -149 -70 -47 -23 -31 -32 -11 161 137 -16 152 -22 -113 -100 -135 53 -77 21 31 -119 31
6135 31 -5 187 -36 39 -20 -49 -98 -46 2 -86 54 -94 -28 -171 -69 -22 55 -15 105 -107 -20 -40 17 119 61 -29
6161 -29 32 -9 19 39 -121 -68 91 -81 -4 149 195 -51 -107 -32 10 -17 58 3 -26 190 40 -144 -104 -16 -98 -26
6187 -26 111 66 -24 187 -3 -11 7 60 34 -12 43 -78 -78 38 37 189 -15 36 103 6 67 49 -30 176 116 162 -19
6214 -19 -49 62 -22 -1 13 0 -141 86 -75 -65 194 -58 -256 130 -155 12 -72 1 -20 -48 209 -138 45 2
6238 2 -58 99 15 52 5 -41 14 80 -54 148 -154 36 114 66 -99 -115 -116 40 127 86 -1 -7 38 35 -34 -14 29 -129
6266 -129 132 -131 -6 -12 16 152 67 250 35 6 -14 -85 41 130 -36 -71 -147 -148 10 -60 -79 -165 24 88 47 65
6292 65 57 -17 81 34 11 -4 0 -59 120 -28 -18 42 0 147 78 -22 42 -63 93 -57 -84 47 99 20 253 -95
6318 -95 -76 -104 -8 113 -59 17 35 -37 67 76 109 43 -39 -6 -34 -64 21 85 -7 -101 135 38 -59 60 -119 -99 -84 116
6346 116 -69 150 49 -22 8 -2 49 47 54 41 -144 19 -95 -90 -121 -139 -56 -89 -34 -107 -125 35 -66 -69 95 0 -9 -196
6374 -196 -6 -88 116 -70 37 -18 10 -75 22 -223 -179 -76 118 -83 -16 -4 69 118 23 152 21 -131 0 -2
6398 -2 24 127 11 25 75 -71 76 67 -50 69 -7 -24 -146 -137 84 92 -136 2 -68 82 -2 94 128 6 227 83
6424 83 7 -53 -131 25 -13 73 -65 -63 75 92 -103 -12 -34 -182 32 -33 -116 32 6 62 -128 24 54 67 29 57
6450 57 -34 58 -46 73 -101 88 -89 -77 40 -149 42 -34 -144 -131 66 -43 -10 12 101 -181 -52 167 64
6473 64 -73 -213 104 69 -141 -40 77 -25 29 33 38 -80 -34 -89 -140 28 -150 -75 80 35 152 51 -7 -115
6497 -115 -81 136 -61 -73 -29 93 -6 2 41 -82 78 -37 -123 29 -160 -60 -110 -54 11 199 18 192 95 -67
6521 -67 -70 157 -129 247 -103 76 50 -90 -67 -2 104 196 74 124 82 -40 95 -53 54 9 42 -95 38 -30
6545 -30 44 -55 110 -51 107 121 27 51 -137 115 -27 36 18 -58 -4 -20 -3 17 -19 -18 114 -57 93 87 -130 16
6571 16 -57 -72 -134 -29 -51 120 62 -42 112 -69 30 139 21 259 46 79 -60 -143 70 30 49 45 56 47 35 59
6597 59 114 -77 27 71 190 -156 1 -78 115 91 78 -3 70 304 65 -14 117 128 -168 65 -76 22 -23 85
6621 85 -160 60 -48 49 26 15 -20 -86 63 72 153 -7 -38 107 1 -84 128 4 -102 70 -25 -93 -45 -31 117
6646 117 -36 144 0 -61 99 47 26 -9 -142 154 33 -24 -53 -20 -127 117 209 -68 -71 -17 33 -49 -184 -90 65
6671 65 -85 27 102 33 31 107 -36 22 74 166 3 56 -42 8 29 -5 -27 7 160 101 4 31 68 75 -11 -1 69 -119
6699 -119 12 -36 0 -20 -112 -44 -56 -39 -57 -38 -52 -25 -6 88 -82 89 -76 75 0 -59 -22 131 85 -23 -100 56
6725 56 139 -115 120 -62 44 178 163 83 -44 -52 -63 -5 154 -128 -1 61 73 -37 72 125 55 -135 -166 51
6749 51 -77 128 6 -137 -72 -35 -12 177 -40 -9 74 31 -17 -89 -69 52 84 -39 -18 -97 82 -46 40 73 -8
6774 -8 -292 -57 143 -4 -40 -45 14 -117 -24 -35 133 200 -64 -48 -102 -82 10 35 -104 106 -63 107 -41 -80 -37
6799 -37 -2 -50 -6 -76 23 98 -126 -51 32 19 -140 33 -18 -42 -56 156 34 -56 81 27 90 -134 31 -2 -60 -25
6825 -25 -9 61 105 182 10 0 43 -38 -84 63 -82 0 -40 84 22 32 -39 8 118 -150 -132 28 -38 152 29 -220
6851 -220 12 -75 68 69 142 -22 -23 -26 158 -75 -20 62 131 7 70 56 96 -47 40 -70 -53 -48 53 -26 -42 124 -56
6878 -56 27 6 86 -90 16 -86 80 -43 -97 27 129 -107 -34 -162 -100 102 62 -138 130 -186 96 -124 81
6901 81 -4 -108 -4 -59 12 49 -7 168 99 -98 32 14 -31 -73 84 37 -4 151 -150 -74 -110 31 -57 -108 44
6926 44 -60 46 -239 -11 30 -179 5 184 97 38 26 -77 -137 159 57 154 123 -75 137 -105 -68 -11 43 -1
6950 -1 26 -45 110 -7 16 6 56 -82 83 65 64 8 112 141 -58 81 -98 -42 -156 -15 -42 -131 -123 -24 -26 -150 -133
6977 -133 105 228 -55 32 -102 7 -125 89 -54 24 -104 -126 -100 28 -145 -20 -155 -31 -129 -325 -111 -33
6999 -33 -50 132 -90 29 -61 65 -118 39 98 182 120 -164 60 -96 -75 -115 47 30 -26 23 50 14 141 -47
7023 -47 -11 36 -18 26 -44 -190 -7 34 -165 -32 19 -50 13 0 54 19 200 16 -119 -123 22 -63 27 -176 -40 82
7049 82 -49 56 -36 -27 273 -56 -62 -4 126 100 61 -37 175 -139 -19 21 -42 56 -49 59 -49 11 103 72 88 -42
7075 -42 23 63 -22 -40 -141 58 31 30 131 88 -39 -100 -49 -126 -48 99 -139 -75 45 -268 -27 147 150 -42 127
7100 127 -36 166 33 -75 -25 35 21 -24 59 68 -91 29 3 -79 -43 -141 8 18 89 -101 -12 59 5 67 88 41
7126 41 -215 40 -98 -116 16 84 -167 60 13 -55 158 130 -87 -162 111 -164 -38 -40 9 -24 -50 -146 -27 98
7150 98 13 145 -92 64 52 -74 -98 18 122 -50 22 -71 8 -141 -35 48 -272 -31 -126 -3 -39 38 -64 50
7174 50 -23 -2 37 -124 137 -119 -243 105 2 -105 1 -61 -13 238 125 45 126 -93 -65 -42 -32 -80 94 170
7198 170 -62 18 -28 215 -103 -37 276 -25 -62 -42 87 101 80 12 -13 46 22 34 -54 -108 -108 -152 -33 -149 -12 -174
7224 -174 21 -59 107 -35 -2 0 70 89 -81 -121 -9 44 39 58 -65 26 7 40 15 21 -70 15 21 -25 -103 64 -66 355
7252 355 -244 -51 -30 -16 -68 -18 -31 11 30 74 80 -5 171 92 39 -150 51 -40 -23 147 90 -82 149 -30 -45 -62
7278 -62 19 -12 16 148 -10 -82 -25 108 -163 -106 40 -153 19 27 49 -53 39 -55 101 45 -21 15 80 65 18 47
7304 47 18 -125 41 -45 95 24 70 45 -212 45 45 8 -56 76 -92 53 69 -36 -18 -84 70 63 28 43 -4 40
7330 40 51 49 -68 -81 121 95 -70 -37 -76 -18 150 68 114 -114 -24 4 -185 -1 92 -76 -18 38 37 -4 -25 -79 60
7357 60 92 -31 143 161 -28 23 40 118 -109 47 29 114 158 -128 -45 76 161 -56 -3 81 -80 -133 -43 -13 -157
7382 -157 6 -69 144 -121 -34 99 37 72 -39 26 -68 31 74 -38 13 -25 -53 22 -79 -93 130 -103 74 -101
7406 -101 -146 6 -15 64 79 56 42 5 -140 -88 -27 -66 67 114 -63 -43 -159 60 85 8 -183 121 -72 -125 -53
7431 -53 26 38 -29 13 -64 99 5 96 -96 -45 92 -118 -80 47 7 -89 -144 43 84 202 -17 105 86 78 94 12
7457 12 -49 -95 -95 -12 -52 100 -209 74 -187 -40 112 -47 18 -200 118 130 60 127 -40 -19 -6 -126 -106 96 -144
7482 -144 -68 -38 36 -174 32 115 78 22 7 -51 32 35 -72 35 -91 -127 39 -200 -54 -5 48 100 85 -30 2 -65
7508 -65 44 -83 166 -19 -52 19 122 163 44 184 -37 -60 46 158 54 24 -33 185 32 35 -56 22 -6 51
7532 51 -70 44 177 16 37 22 -8 -52 -66 -65 13 -45 116 -11 -35 -59 -84 87 38 32 50 -6 4 -105 -32 106 -46
7559 -46 37 55 -79 103 90 43 166 11 -6 15 -172 72 74 -111 99 8 87 54 76 -72 18 -59 -60 -72 -119 152
7585 152 -91 48 -115 -76 -29 78 27 71 -96 -43 115 27 65 -4 8 -57 0 -36 44 -50 52 85 129 -21 -116 59
7611 59 -19 -98 54 56 -50 45 -145 2 51 123 -80 -88 11 -35 135 39 -54 -29 90 63 186 -24 -134 226 96
7636 96 68 -170 180 -76 -18 -23 -40 130 -20 -3 55 -141 -101 -71 143 81 -58 -8 -61 133 -31 -92 -52 115 -191
7661 -191 127 35 -60 -30 -62 -47 49 -12 -60 119 -83 -38 -49 63 90 10 -5 92 -105 49 -75 -39 -53 83 65 -11
7687 -11 -104 110 -29 62 72 -53 -23 -73 47 32 35 -153 -43 49 -89 40 -125 -22 52 23 72 -91 -132 89 60
7712 60 5 15 19 -38 12 57 -25 36 -12 -16 -27 -30 -16 -39 166 -58 126 -98 -103 -134 119 -28 28 -6 28 -66 -155 137 73
7741 73 124 85 -53 -79 -134 -16 108 133 41 -44 -35 -14 56 51 -87 36 -24 -18 6 -118 40 109 -8 -46 -125 45 -27
7768 -27 36 65 -93 61 -49 -38 26 113 -105 66 56 27 -90 -106 43 75 -10 127 -99 -40 -119 -81 -54 36 -41 85
7794 85 62 156 -18 79 -21 -44 137 70 -9 35 -11 73 -12 -149 -93 -151 -41 -7 -138 -123 150 -48 59 -81 60
7819 60 207 90 -136 69 102 36 17 -48 -85 -113 288 187 -112 20 112 101 -13 35 21 -115 -105 -62 -60 -31 16 17
7845 17 -10 -2 -152 -18 48 39 54 -39 12 -120 -147 167 155 69 13 -65 28 28 21 -47 63 109 166 -52 -22 26 8 -189 138
7874 138 -143 -199 -83 73 170 49 98 -32 1 -42 -30 87 -77 -81 71 -152 -5 -155 -217 -66 91 -50 -32
7897 -32 -41 -71 -116 -113 154 84 57 89 29 37 59 28 78 -67 -109 -85 -52 10 -121 35 -265 -24 -208 3 25 35 -59 49
7925 49 -171 96 158 -73 82 132 -55 -76 89 70 -100 -89 -42 -77 -44 23 -130 93 173 107 189 7 -114 -6
7949 -6 -210 89 -26 32 -71 -36 140 95 184 -48 97 25 -100 8 -41 49 74 -102 -161 81 124 149 187 -35 28
7974 28 -103 -37 12 153 -140 116 95 119 -33 55 -114 103 20 -113 72 23 -39 -77 -66 -62 -36 -5 84 -36 -22 163
8000 163 -146 -68 -101 -126 10 5 146 -258 -23 46 109 84 -1 -54 29 -131 -18 11 -11 -88 15 17 152 52 -24 -68
8026 -68 -49 35 -35 -89 97 -1 25 -84 18 -40 54 42 -6 144 76 -18 -55 73 23 14 -42 3 -73 44 -63 17 -27
8053 -27 106 35 68 99 23 175 -61 -60 25 -132 -101 25 144 -73 -161 -9 71 12 -42 165 -39 41 11 26 64 28
8079 28 -52 -225 100 -59 89 103 68 -75 76 88 -54 -16 32 57 -98 -27 148 99 5 -96 -55 50 24 93 110
8104 110 -58 -12 12 -153 -23 54 -14 27 2 66 61 1 -54 27 29 -44 110 123 71 -15 29 16 19 16 16 -144 -62 136 153
8133 153 28 -57 38 -187 -77 8 -152 64 91 -152 -37 97 121 -147 -120 75 -102 -49 72 -21 -55 -87 6 71
8157 71 23 52 -114 -168 -118 124 -43 179 4 91 -246 33 -31 34 116 -78 -14 78 58 -53 -108 -102 -144 -135 -47 -44 -69
8184 -69 32 25 -28 -22 -1 24 -28
8191b8
##END NTUPLES=NMR FID
##END=
