##TITLE=1H_B3dm-4
 CDCl3
 8 sc, 
 13.7.2023
##JCAMPDX= 6.0         $$ Bruker NMR JCAMP-DX V2.0
##DATA TYPE= NMR FID
##DATA CLASS= NTUPLES
##ORIGIN= UXNMR, Bruker Analytische Messtechnik GmbH
##OWNER= root
$$ XWIN-NMR		Version 3.5
$$ Thu Jul 13 14:27:14 2023 Russian Standard Time (UT+4h)  she@DPX200
##.OBSERVE FREQUENCY= 200.13135
##.OBSERVE NUCLEUS= ^1H
##.DELAY= (6, 6)
##.ACQUISITION MODE= SIMULTANEOUS
##.ACQUISITION SCHEME= undefined
##.AVERAGES= 8
##.DIGITISER RES= 18
##SPECTROMETER/DATA SYSTEM= spect
##.PULSE SEQUENCE= zg30
##.SOLVENT NAME= CDCl3
##.SHIFT REFERENCE= (INTERNAL, CDCl3, 0, 15.7039)
##AUDIT TRAIL= $$ (NUMBER, WHEN, WHO, WHERE, WHAT)
$$ ##TITLE= Audit trail, XWIN-NMR		Version 3.5
$$ ##JCAMPDX= 5.01
$$ ##ORIGIN= Bruker BioSpin GmbH
$$ ##OWNER= she
$$ F:/spectra/data/she/nmr/H-F/1/audita.txt
$$ ##AUDIT TRAIL=  $$ (NUMBER, WHEN, WHO, WHERE, WHAT)
(   1,<2023-07-13 14:26:00.85 +0400>,<she>,<DPX200>,
      <created by zg, POWCHK disabled, PULCHK disabled
       configuration hash MD5:
       00 E9 B6 7A A2 85 ED C7 34 08 36 98 17 FE 4E 26
       data hash MD5: 16K
       BA D6 D4 71 1F 7A AC FA 91 C9 8B B0 8E 4F B0 78>)
$$ ##END=
$$ 
$$ hash MD5
$$ 59 97 E5 12 01 CA 1F 06 3F D9 A9 45 27 BF 5E EA
##$RELAX= 
##$RELAX= 
##$RELAX= 
##$RELAX= 
##$RELAX= 
##$RELAX= 
$$ Bruker specific parameters
$$ --------------------------
##$DU= <F:/spectra>
##$EXPNO= 1
##$NAME= <H-F>
##$PROCNO= 1
##$TYPE= <nmr>
##$USER= <she>
##$AMP= (0..31)
100 100 100 100 100 100 100 100 100 100 100 100 100 100 100 100 100 100 
100 100 100 100 100 100 100 100 100 100 100 100 100 100 
##$AQSEQ= 0
##$AQ_mod= 1
##$AUNM= <au_zg>
##$AUTOPOS= <>
##$BF1= 200.13
##$BF2= 200.13
##$BF3= 200.13
##$BF4= 200.13
##$BF5= 200.13
##$BF6= 200.13
##$BF7= 200.13
##$BF8= 200.13
##$BYTORDA= 1
##$CFDGTYP= 0
##$CFRGTYP= 5
##$CHEMSTR= <none>
##$CNST= (0..31)
1 1 145 1 1 1 1 1 1 1 1 1 1 1 1 1 1 1 1 1 1 1 1 1 1 1 1 1 1 1 1 1 
##$CPDPRG= <>
##$CPDPRG1= <>
##$CPDPRG2= <>
##$CPDPRG3= <>
##$CPDPRG4= <mlev>
##$CPDPRG5= <mlev>
##$CPDPRG6= <mlev>
##$CPDPRG7= <mlev>
##$CPDPRG8= <mlev>
##$CPDPRGB= <>
##$CPDPRGT= <>
##$D= (0..31)
0 1.2 0 0 0 0 0 0 0 0.06 0 0.03 0 0 0 0 0.0002 0 0 0 0 0 0 0 0 0 0 0 0 
0 0 0 
##$DATE= 1689243960
##$DBL= (0..7)
120 120 120 120 120 120 120 120 
##$DBP= (0..7)
150 150 150 150 150 150 150 150 
##$DBP07= 0
##$DBPNAM0= <>
##$DBPNAM1= <>
##$DBPNAM2= <>
##$DBPNAM3= <>
##$DBPNAM4= <>
##$DBPNAM5= <>
##$DBPNAM6= <>
##$DBPNAM7= <>
##$DBPOAL= (0..7)
0.5 0.5 0.5 0.5 0.5 0.5 0.5 0.5 
##$DBPOFFS= (0..7)
0 0 0 0 0 0 0 0 
##$DE= 6
##$DECBNUC= <off>
##$DECIM= 32
##$DECNUC= <off>
##$DECSTAT= 4
##$DIGMOD= 1
##$DIGTYP= 9
##$DL= (0..7)
0 120 120 120 120 120 120 120 
##$DP= (0..7)
150 150 150 150 150 150 150 150 
##$DP07= 0
##$DPNAME0= <>
##$DPNAME1= <>
##$DPNAME2= <>
##$DPNAME3= <>
##$DPNAME4= <>
##$DPNAME5= <>
##$DPNAME6= <>
##$DPNAME7= <>
##$DPOAL= (0..7)
0.5 0.5 0.5 0.5 0.5 0.5 0.5 0.5 
##$DPOFFS= (0..7)
0 0 0 0 0 0 0 0 
##$DQDMODE= 0
##$DR= 18
##$DS= 0
##$DSLIST= <SSSSSSSSSSSSSSS>
$$ [...]
##$SUBNAM2= <"">
##$SUBNAM3= <"">
##$SUBNAM4= <"">
##$SUBNAM5= <"">
##$SUBNAM6= <"">
##$SUBNAM7= <"">
##$SUBNAM8= <"">
##$SUBNAM9= <"">
##$SW= 18.05172834244
##$SWIBOX= (0..15)
0 0 2 0 0 0 0 0 0 0 0 0 0 0 0 0 
##$SW_h= 3612.71676300578
##$TD= 16384
##$TD0= 1
##$TE= 0
##$TE2= 300
##$TE3= 300
##$TEG= 300
##$TL= (0..7)
0 120 120 120 120 120 120 120 
##$TP= (0..7)
150 150 150 150 150 150 150 150 
##$TP07= 0
##$TPNAME0= <>
##$TPNAME1= <>
##$TPNAME2= <>
##$TPNAME3= <>
##$TPNAME4= <>
##$TPNAME5= <>
##$TPNAME6= <>
##$TPNAME7= <>
##$TPOAL= (0..7)
0.5 0.5 0.5 0.5 0.5 0.5 0.5 0.5 
##$TPOFFS= (0..7)
0 0 0 0 0 0 0 0 
##$TUNHIN= 0
##$TUNHOUT= 0
##$TUNXOUT= 0
##$USERA1= <user>
##$USERA2= <user>
##$USERA3= <user>
##$USERA4= <user>
##$USERA5= <user>
##$V9= 5
##$VALIST= <valist>
##$VCLIST= <CCCCCCCCCCCCCCC>
##$VD= 0
##$VDLIST= <DDDDDDDDDDDDDDD>
##$VPLIST= <PPPPPPPPPPPPPPP>
##$VTLIST= <TTTTTTTTTTTTTTT>
##$WBST= 1024
##$WBSW= 4
##$XGAIN= (0..3)
0 0 0 0 
##$XL= 0
##$YL= 0
##$YMAX_a= 511314
##$YMIN_a= -651777
##$ZGOPTNS= <>
##$ZL1= 120
##$ZL2= 120
##$ZL3= 120
##$ZL4= 120
##$ABSF1= 10
##$ABSF2= 0
##$ABSG= 5
##$ABSL= 3
##$ALPHA= 0
##$AQORDER= 0
##$ASSFAC= 0
##$ASSFACI= 0
##$ASSFACX= 0
##$ASSWID= 0
##$AUNMP= <proc_1d>
##$AZFE= 0.1
##$AZFW= 0.1
##$BCFW= 1
##$BC_mod= 2
##$BYTORDP= 1
##$COROFFS= 0
##$CY= 11.3945322036743
##$DATMOD= 1
##$DC= 2
##$DFILT= <>
##$DTYPP= 0
##$F1P= 15.7292609196834
##$F2P= 12.9074282941183
##$FCOR= 0.5
##$FTSIZE= 0
##$FT_mod= 4
##$GAMMA= 1
##$GB= 0.15
##$INTBC= 1
##$INTSCL= 1
##$ISEN= 128
##$LB= 0.24
##$LEV0= 0
##$LPBIN= 0
##$MAXI= 10000
##$MC2= 0
##$MEAN= 0
##$ME_mod= 0
##$MI= 1.114404
##$NCOEF= 0
##$NC_proc= 0
##$NLEV= 6
##$NOISF1= 3.799351
##$NOISF2= 2.8
##$NSP= 1
##$NTH_PI= 0
##$NZP= 0
##$OFFSET= 15.70392
##$PC= 1
##$PHC0= -20993.5
##$PHC1= 13.85272
##$PH_mod= 1
##$PKNL= yes
##$PPARMOD= 0
##$PSCAL= 0
##$PSIGN= 0
##$REVERSE= no
##$SF= 200.130013532006
##$SI= 16384
##$SIGF1= 3
##$SIGF2= 2
##$SINO= 400
##$SIOLD= 16384
##$SREGLST= <1H.CDCl3>
##$SSB= 0
##$STSI= 0
##$STSR= 0
##$SW_p= 3612.71676300578
##$SYMM= 0
##$S_DEV= 0
##$TDeff= 0
##$TDoff= 0
##$TI= <>
##$TILT= no
##$TM1= 0
##$TM2= 0
##$TOPLEV= 0
##$USERP1= <user>
##$USERP2= <user>
##$USERP3= <user>
##$USERP4= <user>
##$USERP5= <user>
##$WDW= 1
##$XDIM= 8192
##$YMAX_p= 0
##$YMIN_p= 0
$$ End of Bruker specific parameters
$$ ---------------------------------
##NTUPLES= NMR FID
##VAR_NAME=  TIME,          FID/REAL,        FID/IMAG
##SYMBOL=    X,             R,               I
##VAR_TYPE=  INDEPENDENT,   DEPENDENT,       DEPENDENT
##VAR_FORM=  AFFN,          ASDF,            ASDF
##VAR_DIM=   8192,          8192,            8192
##UNITS=     SECONDS,       ARBITRARY UNITS, ARBITRARY UNITS
##FACTOR=    0.0002768,     1,               1
##FIRST=     0,             0,               0
##LAST=      2.2672688,     0,               0
##MIN=       0,             -651777,         0
##MAX=       2.2672688,     511314,          0
$$ Real data points
##PAGE= N=1
##DATA TABLE= (X++(R..R)), XYDATA
$$ [...]
1828A085J250m090J214K762l175P42K137m320Q51M200l602j486M109j407k468
1843b198K340J087j636q1m26n6K648p67k733K360O47k513K170J570l394R8J976
1860A092r65N49J98j958L64J699o27m44L88j895N27L083k855k399M031M75l039
1877a776R81J147l40K67o86k24J860k68j999J098J547j879K92J859j953j026K456
1894A356k70j315o0l41O14Q49j038o80M52l38N00J358j209k696K088L062k496
1911a64j757J502J322j00j073k47J630J45k014N81J438l64j388L85P77o29L95
1928D39J94j055m56P76L43j87r53j26Q68r9K09M12j054n24P85J662j88k536j87
1947a677K818J008j983j449J766J367j925n85J621m30p54M8K1M25J66n07l76l52
$$ plain form
1828 1085 2335 -1755 -541 2221 -954 -212 1925 -2395 -1544 2656 -946 -2432 1677 270 -2198
1843 -2198 142 1229 -407 -488 -914 -970 1678 911 -1822 538 1185 -1328 842 2412 -982 -884 1092
1860 1092 127 676 874 -1084 -720 979 352 -92 296 -1599 -1072 2011 -844 -3243 788 1263 -1776
1877 -1776 -795 352 12 279 -407 -631 1229 961 -1038 60 1607 -272 20 1879 -74 -1100 1356
1894 1356 1086 -229 -289 -630 -16 833 -205 -885 -433 -771 -271 1087 -122 -2818 -730 2332 -164
1911 -164 -1921 -419 903 803 -270 -517 1113 1258 -756 -175 1263 899 -489 -104 673 44 439
1928 439 633 -422 -878 -102 241 54 -899 -1025 -157 -256 -47 365 -689 -1213 -428 1234 1046 -1490 -1677
1947 -1677 1141 2149 166 -1283 483 1850 -75 -660 961 531 -223 -175 -154 271 437 -70 -446 -798
1965g98P97L97l38r57n33J296J119j198n78N43J40K68M41j16r10l84J483R91j533
1984A30j241Q43J726p6k071M11R98k05o66l72M72L65q93m4P86j58l43r2k2j52
2004f04N60M54j025n18J081N76j93n7p37L7J138K3k12o62n87R29J332k14j816
2023d95q17K151N00j720p69P75O54m06o40O86J94n09j16j19O84M84j256k50R28
2042d1K91K8O5m76l06R01P96j280k76J203j085m95J943r8k069J28J156M11m05
2061C91r23j122J633J117j640q67J723r5j104R91J04p80K99O14j40l55P50N7q69
2080b16L21P45m02n98L75o2Q4J72m23n79Q14L34j141Q03O84k428k11L213p75k580
2100a870J174O82m59Q37M3j574N41J573j289J95J424j773n10K404n81j451J298
$$ plain form
1965 -798 -1 396 58 -899 -1432 -136 983 -215 -793 -250 -110 158 599 483 -427 -811 672 1663 130
1984 130 -1111 -268 1458 1382 -689 -278 720 515 -151 -523 -51 314 -579 -623 163 5 -338 -430 -452 -604
2004 -604 -44 410 -615 -1133 -52 524 331 274 -463 -426 712 735 523 -139 -726 203 1535 1321 -495
2023 -495 -1312 839 1339 -381 -1150 -375 279 -127 -767 -81 113 -396 -512 -631 53 537 -719 -969 -41
2042 -41 250 278 343 -133 -439 462 1258 -22 -298 905 -180 -675 1268 1170 -899 -771 385 796 391
2061 391 -532 -1654 -21 1096 -544 -1411 312 217 -887 104 208 -572 -273 341 201 -154 596 653 -216
2080 -216 105 850 448 -150 225 163 247 419 -4 -583 231 565 -576 227 911 -1517 -1728 1485 710 -1870
2100 -1870 -696 -14 -473 364 407 -1167 -626 947 -342 -147 1277 -496 -1006 1398 817 -634 664
2117F64j74j441J384J175j800j040J441J60r05M65Rk1m08m77Q32P99q19o02k15
2136i73J305R25j924k25J543k64p07J166j05k157J724J858k547m82K475j625r49
2153i62K705j327k333K202N60j762R40K8j957K345J236l698M10M098k476k424
2169b415L385K03k309J238K06j208J695M46k228L80J899p98l13N72j405L1K166
2186A545q82j904J146P37j154k3R27j0j848L36K411q51j670O96Q29m78JO66r12
2205d38L61P58j233L54K308k037j395K581o80j565K296j54l447J922K826k661
2221b04j500K255n21q31J936j349j335J909k69j187J852o80j948K365J345k805
2237i67l90K672l03j667P89J89L1K26r09Q8J184o77k16J93r75J001P50j393p23
$$ plain form
2117 664 490 -951 433 1608 -192 -1232 209 369 -536 -71 -62 -83 -491 -968 -136 663 -156 -758 -973
2136 -973 332 1257 -667 -892 651 387 -320 846 741 -1416 308 2166 -381 -863 1612 -13 -962
2153 -962 1743 416 -1917 285 845 -917 23 51 -1906 439 1675 -2023 -1613 2485 9 -2415
2169 -2415 970 1173 -1136 102 308 -900 795 1241 -987 -607 1292 494 181 753 -652 -621 1545
2186 1545 663 -1241 -95 642 -512 -535 392 382 -1466 -1130 1281 430 -1240 -544 285 -193 -192 474 -438
2205 -438 -77 681 -552 -198 2110 73 -1322 1259 579 -986 1310 1156 -2291 -369 2457 -204
2221 -204 -1704 551 30 -801 1135 -214 -1549 360 91 -1096 756 76 -1872 493 1838 -967
2237 -967 -1357 1315 1012 -655 134 323 354 580 -329 -241 943 266 50 243 -732 269 1019 -374 -1097
2256a097Q76M72R0m11j409P68K050j727j221K757r11k296K926J020l239P64J799
2273A211j479L55J156j970L19K157k023p67K755j623j878L114n76k774K286R11
2289A174l109J083K269j834p17J125k75R6J226j604o19K163r43o73J859q17j841
2306a437J883J040j348m75K70L85M06n59o29M43J77q27R69K35j516O71J198j686
2324h00m0J134j8p19j09L8J134K45j963L25J827n19j298J133M30j333Q27O75j090
2343a21l10N26J3N64n16o85M25N58m63l41N02p29j64J327j64j209Q2Q29J18m98
2363b56j39Q31k23r24O13J004p01m26J87N49j79l19M19Pn09n37J016P36j358r08
2383a117J042P31o89j18j76o10P43M90k58o60M2N78L44k59q18O34R28q91m65R29
$$ plain form
2256 -1097 -221 251 341 -70 -1479 -711 1339 -388 -1609 1148 237 -2059 867 1887 -1352 -588 1211
2273 1211 -268 87 1243 -727 -408 1749 -274 -1041 1714 91 -1787 1327 751 -2023 263 1174
2289 1174 -1935 -852 1417 -417 -1134 -9 -284 -188 1038 -566 -1185 978 35 -638 1221 404 -1437
2306 -1437 446 1486 138 -337 -67 318 724 165 -464 -21 156 -671 298 533 -983 -312 886 -800
2324 -800 -840 294 276 -443 -552 -514 620 865 -1098 -773 1054 535 -763 370 800 -533 294 969 -121
2343 -121 -431 95 108 672 156 -529 -104 454 -9 -350 152 -577 -741 586 422 -787 -705 124 242 -256
2363 -256 -395 436 213 -711 -98 906 205 -221 -34 515 336 17 436 443 -66 -603 413 1149 -209 -1117
2383 -1117 -75 656 -33 -151 -327 -937 -194 296 38 -622 -580 -2 342 83 -735 -101 827 -64 -529 400
2403D00L41q47J58M13ql31k24m7M63k30j12L97k34o70K10J036p37q89P02K12J03
2424A06p8l80k69L21O93J48o05n77M29J029l13r82K22R76l88o32O33Q2l81m3j9
2445b8K72k9m32R3K01k14K3K58k30o70L66O17k04j74o5r9L32M32l11Mm58Q8J059
2468H31Rj374l63J402L34q74l0J98l34K16J16j46M1l16q7K58L2n3j48L8J02j04
2490b52L56L12n08l29L05M93J03n64L9J97o8M99m6q09P9O95k5m58j73R0J24K80
2512C40n41j28M45j84m45O10J21r22L10Q39m39l22M1J57j48N77K8o10K91K65m27
2533a42K86M13m07r9l4j20J57M38k66q82Q1J101j28r83J73J32N4L77J07o43m2
2554d27M74j72k08M81j98o24J123j11o59M57K94n49K10N78p36k33P07j39o21M57
$$ plain form
2403 400 741 -106 52 465 457 126 -98 -145 318 88 -24 373 139 -531 -321 715 -22 -911 -209 3 106
2424 106 28 -352 -621 -300 393 541 -64 -641 -212 817 504 -478 -256 720 332 -300 333 415 34 -9 -28
2445 -28 244 215 -217 -124 77 -137 -114 144 -86 -756 -390 227 23 -151 -216 -315 17 449 138 142 -316 -228 831
2468 831 840 -534 -897 505 839 -35 -65 133 -201 15 131 -15 26 -290 -377 -119 -87 -140 -288 -250 -148 -252
2490 -252 104 416 -92 -421 -116 377 480 -84 -45 152 84 583 537 -272 -193 502 477 19 -154 -64 60 340
2512 340 -201 -329 116 -68 -513 97 218 -704 -394 445 6 -316 -275 -118 -266 311 339 -271 20 285 -142
2533 -142 144 557 150 51 17 -103 54 492 226 -656 -575 526 398 -585 -412 -280 -226 151 258 -385 -427
2554 -427 47 -125 -333 148 -50 -674 449 338 -321 136 430 -119 91 669 -67 -300 407 268 -353 104
2574A04M61p57MK06k0J32j03n16L0Q51j46p82P8N12k87K49N57q17m42J091J97
2595F02n82l44O30k00J92M63o64n71J085m66m27O03k36m97N95J41r68L57J003
2614G16j072p21J551J06j420L75P31m90K92K37l95k88O29J96m15K62l66m52J030
2633E06M01j238p2P27k39l78N80j51j004N16J040r94o24J105p2n84L99j16m2O48
2653D08o09o08R33P25j113l65J312n40n92J223l78j243R30Q09r83l43P74k63k47
2672a70Q76p00q78Q19K57m19L98r1j044O30J100j047o73J341J41j337O03R62o34
2691A34j77L41m41M14M95p07k41M66l02J8L07j87n71M83N63p93m27N65J29j97
2711a28j34R4J7l31O18L24r22j69R01J54k82k07j40J90N19k13n50O32l3j137P62
$$ plain form
2574 104 565 -192 -188 18 -2 130 27 -489 -459 392 246 -536 -458 54 -233 16 573 -244 -686 405 602
2595 602 20 -324 306 106 298 761 97 -474 611 145 -282 321 85 -412 183 324 -644 -287 716
2614 716 -356 -1077 474 580 -840 -465 266 -224 68 305 -90 -378 251 447 32 294 -72 -524 506
2633 506 907 -331 -403 324 85 -293 287 136 -868 -352 688 -306 -930 175 103 -481 -82 -198 -240 408
2653 408 -201 -809 124 849 -264 -629 683 143 -449 774 396 -847 83 892 -91 -434 340 77 -170
2672 -170 706 6 -872 -53 204 -215 183 92 -952 -322 778 -269 -942 399 540 -797 -194 768 134
2691 134 -43 298 -143 271 766 59 -182 284 -18 0 307 120 -451 32 595 -198 -625 -60 69 -128
2711 -128 -262 -168 -151 -482 136 460 -462 -631 270 424 142 -65 -205 -15 504 291 -259 373 340 -797 -35
2732c5J126j499l2J108r45j94J286l48j113M26L26n34Q50k10j096O33Q81j046
2750d16l5J050j136J0J420m08j102O85N00p66K20K80l35K68l6n86L71M79o73L15
2770A05m0k09j8R9j28Q4n3j83L72l22n9O69Q4q32K97O09o75o3J146q77m30O07
2792A83o9K0L90q60j09J020j28q32L00K63q52M05Q98q77j23N16m01o2K62J32n51
2813d75K66q0K39L80l92j68M63J0l25M17Q3n69J70L63m1p8n68l3P32j02p16K91
2835a33K51l69J90K15m50n3O18l39L3l6j74r9N40k04l23P11l12j27K34K27n07
2856a07O6L80k19r1L78k78k77l0j77N98R0o33q9O42k64j75J26j51lJ79J67n03
2878c71J00J60J62K13j51m20M06Q3k47K35J55m25j45N81Ll83pK61%k48j51J38
$$ plain form
2732 -35 1091 -408 -440 668 -277 -471 815 467 -646 -220 106 -428 422 212 -884 -251 630 -416
2750 -416 -451 599 -537 -527 893 485 -617 68 568 -198 22 302 -33 235 199 -387 -16 463 -210 105
2770 105 65 -144 -162 -63 -191 -107 -160 -343 29 -293 -352 317 401 -431 -134 475 -200 -263 883 6 -424 183
2792 183 114 134 524 -336 -445 575 447 -385 -85 178 -674 -269 629 -248 -371 145 -256 -318 -56 76 -475
2813 -475 -209 -289 -50 330 -62 -230 233 243 -82 335 418 -151 19 382 341 263 -305 -338 394 292 -424 -133
2835 -133 118 -251 -61 154 -296 -349 269 -70 -37 -73 -247 -346 194 -10 -333 378 66 -61 173 400 -107
2856 -107 -41 339 120 29 407 129 -148 -178 -355 243 333 -300 -389 253 -11 -186 -60 -211 -214 -35 132 -371
2878 -371 -271 -111 51 264 113 -307 99 182 -65 170 325 -100 -245 336 339 -44 -51 210 210 -38 -189 -51
2900e1J52l36k59O19P9l74j43RK79K60Jk76l04M73L25j56m94j12L93K65k22j14
2922A4K02j74j89L54J02k60k63J37K41M7l49m6N37k80l80K17K96m01j95M33p3
2943c0J17p0l44l2M59O0R9l79j28M10L80j24n17k9N68l19k6j47MO4r6J68O3m62
2967c11J14M85k38l72l5M25m5k81J42J42o1P0j26J00L52l25k53L24R8j62K31k53
2989B1l86K69O52k82o25J89J40k12M18q8l07R9p9Q9L47k44k72K23L07j76m89O47
3011B41j24r5j63M02r4Qj91J28p0O1J59j21m62N61o2j94p8j62L10J01r1m90K09
3034b17L79k69l86P66j43o79M14N84m70k54K10K05J39J15l39l96P50j61l77L78
3054B49j34m48M71J05o62M33K99m88m91P04K79m73m22N14j00J59J39j55o6J24
$$ plain form
2900 -51 101 -235 -494 125 204 -170 -313 -304 -25 235 236 -40 -344 129 454 298 -196 -308 85 350 128 14
2922 14 216 42 -147 207 309 49 -214 -77 164 211 -138 -184 353 73 -307 -90 206 -195 -390 43 -30
2943 -30 87 17 -327 -359 100 160 259 -120 -248 162 542 418 -99 -128 440 121 95 -52 -48 16 -80 88 151 -311
2967 -311 -197 288 50 -322 -357 68 23 -258 -116 26 -35 35 -91 9 361 36 -217 107 205 43 274 21
2989 21 -365 -96 556 274 -351 -162 -22 -234 184 96 -211 -112 -191 -102 245 1 -271 -48 259 83 -406 241
3011 241 117 22 -141 261 167 175 -16 112 42 103 262 141 -321 240 178 -16 -94 -256 54 155 64 -426 -217
3034 -217 162 -107 -493 273 130 -549 -135 449 -21 -275 -65 140 279 394 55 -341 409 248 -129 249
3054 249 115 -333 138 243 -419 14 313 -175 -666 38 317 -156 -578 -64 -164 -5 134 -21 -87 37
3074C7M1j02K09j93k25M36K88l77k07K86O9j58k7J73k17k17L81q1m05K98L8m15
3096c68L06J94l04J97o6l52L74L64n94k87P63R2n09L07K15n73J27M57j26k15M3
3117D5J20m1J76k12n28L67L91m47m9J63l57K24M40m25l35N57K8p16L91Q15o83
3138g6p0K16r6m4L26l12j04L21j7l00L12J56n05M6L92R2q92N94J69l87J99j16
3160i6j85J2K42J1q8l67M60P7m7o7j60K98J46l54l4L63J7m49K33M78n62l52M21
3183cJ07l60N43k5n06n5M51k94N9K36m58j46N95r9k99K72l30j14Q51J4j101M72
3205a90O34k69j61J68K9l09K15J0j43K93k35j34L41k74j8K37j65j73J5J63l0j68
3227a64P4k6P7N1j86K71k90M2M17k4n71K70N01k87n5j21q1L96J16o14J43L52k23
$$ plain form
3074 37 78 -24 185 -8 -233 203 491 114 -93 193 262 104 77 250 33 -184 197 116 -289 9 47 -368
3096 -368 -62 132 -172 25 -41 -393 -19 345 -249 -536 227 319 -190 117 332 -241 -114 343 217 2 45
3117 45 165 124 300 88 -440 -73 318 -129 -178 -15 -372 -148 292 -133 -468 89 117 -599 -208 607 -76
3138 -76 -146 70 -26 -70 256 -56 -160 161 144 -156 156 312 -193 -147 245 337 -555 39 208 -179 20 -96
3160 -96 -281 -269 -27 -16 -104 -471 -11 66 19 -48 -208 90 236 -118 -152 211 228 -221 12 490 -72 -424 -3
3183 -3 104 -256 287 262 -244 -299 152 -142 -83 153 -305 -451 144 45 -254 18 -312 -426 425 439 -662 -190
3205 -190 444 175 14 182 211 -98 117 127 -16 277 42 -92 249 -25 -43 194 29 -144 -129 34 4 -164
3227 -164 -90 -116 -39 12 -174 97 -193 -151 266 242 -329 -59 442 155 100 -21 -102 294 410 -204 -61 291 68
3250F8l74N01j33k49K43K16j84m3j01j64J71J22j76K0K4l9J06K0J19j85L5nj66
3273a74M39l0k11Q9l20N83O2m15j07M3R4j13K48Ql07j6K17j22j16Ln4J06J39k67
3297b21L26p0j34K30N0o2k48L42j3l59K34J32j47l38K93J61rj47j82M43j55l20
3319a94J02J8J32O1l03J9K79k53q4K65j23r6L18q5j95L36K14m50M9K67k84MM0
3342C7N3O6R5l65L5L39m02j35K26M34n19j57K54j28J42nr2P6O9k17M30k97k29
3365b90L03K27k11m2J76k90J37L51k50l7k6k50K75J18l66j21M76k72l37M25R4
3386I0m67J29J67j49K83j12j88J59L85l79j70M21j86o1L64K3o16K38L16k26J3
3407C4Q7j23j52L24r7q7k0o2M3K72l58j90L05Q3k50j68M76j21j91P8J30J24M1
$$ plain form
3250 68 -306 195 62 -187 56 272 88 45 -56 -220 -49 73 -103 -83 -59 -98 8 28 147 -38 -3 -8 -174
3273 -174 265 235 24 113 -207 376 438 23 -84 -41 53 -60 188 196 -111 -127 90 -32 -148 -145 -199 -93 46 -221
3297 -221 105 35 -99 131 181 119 -129 213 200 -159 75 207 60 -278 15 176 167 20 -162 281 126 -194
3319 -194 -92 -74 58 119 -184 -165 114 -139 -223 42 -81 -177 141 56 -139 197 411 -39 10 277 -7 -3 37
3342 37 90 156 251 -114 -79 260 -142 -277 -51 383 -136 -293 -39 -167 -25 -30 -122 -46 23 -194 236 -61 -290
3365 -290 13 240 29 -13 163 -127 10 361 111 74 48 -202 73 191 -175 -296 180 -92 -429 -4 90
3386 90 -377 -248 -81 -230 53 -59 -247 -88 297 -82 -252 169 -17 -78 286 309 -307 -69 247 21 34
3407 34 121 -2 -154 170 73 -14 -34 -96 -53 219 -139 -329 -24 59 -191 -359 117 -4 -195 -117 13 137 178
3430A78m70L31o4p2J69k7k02J43L64k96R6k43j9K55j0jp3j86PJ75R2j76m49M56
3454b2L25l27O4j88J33oj33J94J15j40l9Q5J60j29J4k82Q5jK74k35%p4J14Q1j17
3479d9j63oK33j24MJ09o8l28M10L09k71k34P9jK54p4j73K47m7p2j00M51l10q4
3503hJ97r7p1n8J44l81Q4J73J38j19j23pK06j29j10j05R3J70LO3L0k46KK15L18
3528C82j72m11J44K51k49K29kj51p1J78M3k06M7n6K6o0K80k06j16k5j72L96K31
3551C10n52J98K92n1k29L4J55l58O7K85l8j93k8o6M13q1k18j35J16K31k08L7j15
3574a34l9P1J98N5k84L3K05k68O1Q6M7j67m6K46q8l9j22L7M52j12j82Q1k7p1j67
3599a74L62j75k06J45J82r0J0j07o7J94k5k0r6l26K70j0J77M1j01o4o6J50OLj52
$$ plain form
3430 178 -292 39 -25 -97 72 45 -157 -14 350 54 150 -93 -112 143 133 132 59 -127 -120 55 147 -29 -478 -22
3454 -22 303 -24 40 -148 -15 -21 -154 40 155 15 -24 61 221 92 106 -176 -91 -92 182 -53 -53 -127 -13 68 -49
3479 -49 -212 -218 15 -109 -105 4 -64 -392 18 327 56 -178 -99 -100 154 80 -93 154 107 35 -65 386 76 -8
3503 -8 189 92 21 -37 107 -274 -190 -17 121 2 -121 -128 78 -51 -161 -266 -173 -3 0 63 93 -153 -151 64 382
3528 382 210 -201 -57 194 -55 174 172 21 -50 128 171 -35 12 -44 -18 -78 202 -4 -120 -145 -317 79 310
3551 310 -242 -44 248 197 -32 2 157 -201 -134 151 113 -80 -108 -174 239 158 -60 -195 -79 152 -56 -19 -134
3574 -134 -173 -102 96 151 -133 -100 105 -163 -102 -16 31 -136 -182 64 -24 -63 -185 -148 304 192 10 91 64 -7 -174
3599 -174 188 13 -193 -48 134 44 54 -53 -120 74 49 29 -67 -393 -123 -133 44 85 -16 -80 -146 4 10 13 -139
3624a39p5K61K70j73l10K47J52l69R8L28k45o8j2M5J4Q1k79m9K67q1j88R1J76
3647D2l87M02Q0l49m4L33k0j47M0J88J01k13J55OM0j48p5K53L2l95p5K51Q8j18
3671D0r7M1j01N0M4k7j4J3j84K16J01nO6l75J64L4K81j81j32k8J50J73k77L20
3695B72m03L8O1J32J38k72K0P4oj13J65m4j81J90J0k76P5J13j00O2l4J65k32R9
3719d7j64K39K18k25j10J40J29Lk51L8N1Q9L0j10r8L5k7k7K21k47J1l6q7K50m2
3744a7r9K38k57j67M62j08j65k3R2k6M7J24N9l15L16J67l71o9Q0Q5J55m5k49j16
3768b02J04K15k46P3j78K2J53K25k06k40K16k5J37k3q6J21n7P9k6q8K65M0m02
3791a29J88J04p2j9r4o6O3L84l81l42K89K26j72%m3k96K67L26l17nO5j88J39K44
$$ plain form
3624 -139 -214 47 317 144 -166 81 233 -136 -38 290 45 -23 -35 10 24 105 -174 -223 44 -37 -225 -134 42
3647 42 -345 57 137 -212 -256 77 57 -90 -50 138 239 26 181 187 227 79 4 257 289 -106 -181 70 158 40
3671 40 -57 -16 -117 -67 -23 -50 -64 -51 -235 -19 82 77 143 -232 -68 -34 247 66 -66 -94 56 229 -48 272
3695 272 -131 -93 -32 100 238 -34 -14 60 54 -59 106 62 -119 71 81 -195 -120 -7 -107 -45 -79 86 -146 -47
3719 -47 -211 28 246 21 -89 51 180 183 -68 -30 21 110 140 30 -68 -33 -60 -87 134 -113 -102 -138 -225 25 -17
3744 -17 -116 122 -135 -302 160 52 -113 -136 -44 -70 -23 101 160 -155 161 328 -43 -112 -32 53 208 163 -86 -202
3768 -202 -98 117 -129 -56 -234 -212 -59 166 -40 -280 -64 -89 48 25 -61 60 3 82 56 -32 233 273 -129
3791 -129 59 163 91 72 -22 -88 -25 359 -22 -364 -75 151 -21 -21 -64 -360 -93 233 -84 -89 -24 -212 -73 171
3815A71j04k85N03j36k19J55J02k41J54R2j90J80k82J98j13p7J35J33j1l74q9
3836b98M19k35p5K3O4K27j53p9L0J24k19L68K4m60o2N68j35l24J78N2oL6Q9k38
3860h2J79r2j00J79nl36R4L46k37j67N08l87k09K43N4rm9R6k33K24ko2J47m6j6
3885C8Q9J36j82l60K43K05m9m0k9o0j74J00K88j96m29K50L86k59j13rJ09J80j08
3908A6j39K65M2l88K6N16m01j87K06k1KK25Qj80l8K17J32l80n2J57l6J40p7p3
3932b0J2k61J53K59R0m35l5J44J77j13r4J53J8j19K2MJ34j25O9J68J2k46J58k44
3956a19J73J68j11j08p3O6PR6k64l8K11k6q3j19K93l32J58O0J39j14R7j46Q8J18
3980A41m4j37J97k9k19M35n0k97k2J16r5K4N9k24J11K5J14J14l73j19K15P6J4
$$ plain form
3815 171 67 -218 285 149 -70 85 187 -54 100 192 2 182 -100 98 -15 -92 43 176 165 -209 -298
3836 -298 121 -114 -189 -166 -102 125 -28 -107 -77 47 -172 196 220 -240 -302 266 131 -193 -15 37 31 67 156 -82
3860 -82 97 5 -95 84 79 -257 -163 183 -54 -221 287 -100 -309 -66 -12 -21 -70 26 -207 17 15 -47 100 54 38
3885 38 127 263 81 -279 -36 169 120 80 51 -9 -183 -83 205 9 -420 -170 216 -43 -156 -165 -56 124 16
3908 16 -123 142 184 -204 -178 338 -63 -250 -44 -65 -63 162 170 -10 -48 169 301 -79 -131 26 -10 130 53 -20
3932 -20 -8 -269 -116 143 233 -202 -237 -93 84 -29 -123 30 48 -71 -49 -45 89 -36 33 201 213 -33 125 -119
3956 -119 54 222 111 3 -70 -4 3 99 -165 -203 8 -18 -101 -220 73 -259 -101 -41 98 -16 81 -65 23 141
3980 141 97 -40 157 128 -91 344 294 -3 -25 91 -4 20 79 -145 -34 -9 105 219 -154 -273 -58 18 32
4003C2j75J44p4j68K85J69j71j16N0J87r4K5j13J02J0L2N2r8j59L6j2Ro8K69m3
4028A11l19J15j7J02j61L3N5m3MN8QK11j72J8Q7K9l28L09lO7o7k87N77k74Oj1
4054A08j69J0L59l9k76m0J74K5k47%R9q6J29j37q5J39n0k39L02J72r4KMJ5q6L6
4080B6r1P5J60l2K2nk39j57M35o2n0p3k73K38J79j68J72l47j05M03n9p3l8n8j1
4105a31N5p5J03m9J33M6N2L0k46r1L95l3l28R9J85k59l7J93J99k69l5N4j28J08
4129b9J93k44j66K12J24%r6n7QJ75j41r2J75j33J04jJ56J09l33j53L15J82l89
4152h1J5P9j3k2NN4L3j56P8l4J04n1l27L21J87j48o1L9k47N27L9j76j20j75mJ82
4178D8K26j68n8kn1R3J0j05l4j87K50o1m6j99L68k37n8J85pp9J11Lj5L8o7P4k32
$$ plain form
4003 32 -143 1 -73 -241 44 213 42 -74 -24 163 69 94 -19 83 93 125 177 79 -80 -44 -56 -47 -115 154 111
4028 111 -208 -93 -110 -8 -169 -136 -81 -124 -120 -62 -54 157 -15 3 90 119 -209 100 97 164 97 -190 387 113 119 108
4054 108 -61 -51 308 269 -7 -47 127 152 -95 -95 4 -82 47 -90 -175 -36 -86 -325 -23 149 55 57 61 76 -10 26
4080 26 -65 10 170 138 160 155 -84 -241 194 132 82 9 -264 -26 153 -15 157 -190 -295 108 49 -24 -62 -120 -131
4105 -131 -76 -151 -48 -97 36 82 134 164 -82 -173 222 189 -139 -40 145 -114 -151 42 241 -28 -63 -9 -137 -29
4129 -29 164 -80 -246 -34 90 90 -6 -63 -55 120 -21 -113 62 -71 33 32 188 297 -36 -189 126 308 -81
4152 -81 -66 13 0 -22 -17 37 70 -86 -8 -42 62 11 -316 5 192 44 -17 22 -225 302 341 165 45 -130 -134 48
4178 48 274 106 48 46 -5 88 98 -7 -41 -228 22 -39 -85 -284 84 -153 -211 -26 -33 -112 -1 2 -13 25 -42 32 -200
4205b00M12J6p8l13J68lN1j16m1J97K14l26j5M6j1k10K99L83n73j37K20K28j17
4228I4j81l2rP6L6J18K1j14q5K2K85k76J84k00P2K8R2J34m10k33M03K14m52J57
4252e6J26m27K51K42n0j03j07o0K48lj60j13L81J06n42K23J95k35QJ81m7j46N0
4275c8m2J40K3K8j36J3n1P9Q9q7j19m4L63ml19J7K21j40p8K26j99j28P1K45Mj25
4301IR0j11k8J36K24m30K53j60L4J88n6l89K18K69m13J3M13l03l56L60K10k77
4323a06P8M2k17K18n8r0K4J36J47j53J96l27n1QK16P4r5Ok58J69J09k6r8k43M06
4348A07J34k79j37J63m3K0N1j71J34k2rj1J49j60l32L70M22n33J85K94l92L7K28
4371B05k17N1O3j59J50R0l0l85K79k14l0K99j02l72J02M72l36l0O0N3J8RJ4o8
$$ plain form
4205 -200 212 228 150 -163 5 2 53 -63 -104 93 307 -19 -34 12 1 -209 90 473 -100 -237 -17 211 94
4228 94 -87 -119 -128 -52 -16 102 123 9 -76 -54 231 -45 139 -61 11 39 131 265 -145 -378 25 239 -213 -56
4252 -56 70 -357 -106 136 86 -17 -124 -184 64 61 -99 -212 169 275 -267 -44 151 -84 -76 105 58 -88 -38
4275 -38 -80 60 83 111 -25 -12 -63 16 105 18 -101 -145 218 214 -105 -88 133 -7 -85 141 -58 -186 -115 130 134 9
4301 9 99 -12 -40 96 320 -110 143 -17 17 205 149 -240 -22 247 -166 -153 260 -43 -399 -39 171 -106
4323 -106 -28 14 -203 15 -43 -133 -109 27 174 21 217 -110 -161 -153 63 137 42 48 -210 -41 68 42 -56 -299 107
4348 107 241 -38 -175 -12 -55 -35 16 -155 -21 -43 -52 -63 86 -74 -406 -36 386 -147 38 332 -60 -23 205
4371 205 -12 39 102 -57 93 183 153 -232 47 -167 -197 102 0 -372 -270 202 -134 -164 -104 -51 -33 -24 -10 -78
4395g8R2j13J43P9m9m1j86K77j44R7J21q8k42n3J77K65m13J08J35j05M9r1J98
4418A38m29L60K20k40jj17j10L54k18k19K61R2k39O6K64l0l39Q2K38mj09K58k46
4441C2nJ16j34J04j38j11J53M5j24L2l5j22J40m6J72k14r9K54J69j33l06J79K72
4464B01o4l05J99N1j2o7K54p6k68O1M4L7r7J11r6j0p7K15L3l08P5l2m4R0K05j97
4490g7R4j21J23P2k23J15m1J66J36l53KK28j55j4J07j67PL1J84o9j31j09K21k01
4514a75J05J06q3L5o8J25n3J44j53j17P5J44j08K50k44r1L35j32kl8l22M82Qj13
4538A10k25J81P6o3j02J51k00k1J85j95J45j06o2J57k13J20J98n9k91K87J88l74
4560a13J71n7M3j3k1Q8j13O8l09M44L6k66NJ21j50Q5J16r9j68J12Q7m0k14RK3
$$ plain form
4395 -78 14 -99 44 123 74 33 -153 124 -20 77 198 110 -132 -185 -8 257 -156 -48 87 -18 31 -60 138
4418 138 -291 69 289 49 48 -69 -179 175 -43 -262 -1 91 -148 -82 182 152 -187 -105 133 129 20 278 32
4441 32 27 143 9 113 -25 -136 17 62 -62 -30 -65 -187 -47 -93 79 -135 -234 20 189 56 -250 -71 201
4464 201 137 -168 31 82 70 3 257 181 -87 -26 18 55 -42 69 -27 -37 -114 101 134 -174 -99 -131 -175 -85 120 -77
4490 -77 17 -104 19 91 -132 -17 -58 108 244 -109 -107 121 -34 -48 59 -108 -101 -70 114 45 -86 -195 26 -175
4514 -175 -70 36 -47 -12 -80 45 -8 136 -17 -134 -59 85 -23 227 -17 -108 227 95 93 55 -267 215 223 110
4538 110 -115 66 142 79 -23 128 -72 -93 92 -103 42 -64 -126 31 -182 -62 136 77 -214 73 261 -113
4560 -113 58 1 44 31 10 98 -15 53 -256 188 224 -42 -37 84 -66 19 135 36 -132 -20 67 27 -187 -178 -155
4585a55M3K34k83J28J17j56j68K35o1j3O1K56j02p4o2J48j09R4J29j94j77q0L10
4608A21K1m5k81j09K27K62j76J2m1r3O8K53q2l47rL12%p9N6qj10K95j73n2L8k71
4634b11L73N0k44p0O4M8q6J43M3j43r0Q2o1J54j91N3N9j75K80m2r0L1j56L09k2
4659A08L5k29R4J83k88J01n1j03j04K63O9k10k9J75M9M3k07M7j22K66j24M2M7
4682E5J7k06lL08j22j05J68j67M0J20J97m51kL29%k83L11k24k12J64J24j50O0
4705c2N2o3J12K52l85l42M71M2j99o2J50mj14M11j89k19J86J9o5J4J87j32oo0
4729B4j7M1J19l67J31K87o2k11N6J9p2pJ47q0k70K61J92n3k26L7j60K26N0j55
4753i0m9O6J4j14M58k74r5R7J56j52j07M57l73o6P7J94j72p5n3jK21n6j41n3J14
$$ plain form
4585 -155 -112 122 -161 -33 84 -72 -240 -5 -66 -79 -18 238 136 62 0 148 39 133 262 68 -109 -189 121
4608 121 142 97 -184 -293 -66 196 20 32 -9 -102 -34 219 137 -210 -219 93 93 14 70 62 -48 247 74 22 60 -211
4634 -211 162 212 -32 -102 -38 10 -76 67 110 -33 -123 -41 -102 52 -139 -86 -27 -202 78 36 -54 -23 -179 130 108
4659 108 143 -86 8 191 -97 4 -47 -150 -254 9 78 -132 -161 14 63 106 -101 -54 -176 90 -34 8 55
4682 55 72 -134 -137 171 49 -56 112 -55 -15 105 302 -149 -151 178 178 -105 206 -18 -230 -66 58 -92 -32
4705 -32 20 -43 69 321 -64 -406 65 107 -92 -154 -4 -8 -122 289 100 -119 67 86 21 35 222 90 84 24
4729 24 7 48 167 -200 -69 218 156 -55 1 20 -52 -59 88 8 -262 -1 191 138 -88 -51 -211 15 65 -90
4753 -90 -139 -73 -59 -173 285 11 -84 13 169 17 -90 367 -6 -72 5 199 27 -48 -101 -102 119 63 -78 -131 -17
4778a7j22J33R1j90k38M48K36k76p2M0k4onN6j75R5J11j23K50k76J98j53J43j33
4802io9J78j65j46K61R3l20J23J18n8oL8Q9k42rL55j78m7j41M4J76Q4k79n7P1
4827i6J24j34L26l74j6p2M57j77l41L36m1O1O5j58Lo8p4R7L66k50k9j44L12p3
4851A00k37L16k41j20L8M30j52k39J15M9n1n0%Lj36K28k3R6m85K52L9N2K16m95
4875b95K20L82m09lJ97l8l95K86K76j73j43Q3K8j06K68j96J11n9q7J36J92k91
4897a6j12nO3l8J38J29p1j57K88q7l37J67j44J41K29k28L6q3J03jP0j14j54N8
4921a25J86mj57J69J1j01Q2O4r7l6k59K03J41j6j37Q5k8PJ88o2k22o9K01J34n6
4946A02kL1J12k17J42Kj90p1K1L01p8j45j23n1K20J84l50R7jr2KL44m48k1L53
$$ plain form
4778 -17 -139 -6 85 -105 -343 105 341 65 -7 33 9 3 -2 54 -121 -26 85 -38 212 -64 134 -19 124 -9
4802 -9 -78 100 -65 -211 50 143 -177 -54 64 6 0 38 127 -115 -124 231 53 6 -135 -91 85 169 -110 -167 -96
4827 -96 28 -106 220 -154 -170 -242 215 38 -303 33 -8 53 118 -40 -37 -105 -179 -82 284 34 5 -139 173 100
4851 100 -137 179 -62 -182 -144 286 134 -105 10 59 8 -42 -42 -39 -175 53 30 126 -359 -107 -68 -16 200 -295
4875 -295 -75 307 -102 -105 92 54 -341 -55 221 48 -95 -12 16 -90 178 -18 93 34 -53 83 275 -16
4897 -16 -128 -133 -70 -108 30 159 88 -69 219 132 -205 -38 -182 -41 188 -40 -4 -87 16 15 85 -29 -183 -125
4921 -125 61 57 -100 69 80 -21 61 125 28 -8 -267 -64 77 61 -76 9 -19 -12 176 114 -108 -177 24 158 102
4946 102 100 131 243 26 168 170 -20 -91 -70 231 153 8 -115 -166 54 238 -112 -15 -16 -108 -106 238 -210 -231 122
4971A22j01k30J88O2k89J88J32lr6l1L7J37J21l89J28K90k18j87K27J4j01j16
4993a15Q7K56j54p7N3kL4j03m5J4L2r2J86j54j45J88j2Q9k1j9m3J69j13P2J97
5018B82k50k52L66L2q4j74l1n5K41K1j05kk25J50J56O1lk87J29p5J19L6k21N9
5042a12N0J85k5k88K49j06J0M7Q2Q1k96j01K90K25k75NJ10jJj14j53R4Jn0J67
5067G6j09m0o4J35N7j16J79q6r2K6J50J7l06ML47P3j96k96K43K11k41J13LJ46
5091B34k70n1J65k2j66K5J37M0j77J12j40Q5k48M56j8l43R9j26O4J13J33Joj16
5115a9P0J01k23QR7J94q2j34q5k4L6k8R4k8j03j00K97J00r8k58O2R4j25K73q4
5140C5lj42M9P5J68j47j00j2J71P3k3j68j41J50K41j09m60K74P7J51r0l02K25
$$ plain form
4971 122 21 -209 -21 41 -248 -60 72 69 -27 -58 -21 116 237 -152 -24 266 48 -139 88 102 1 -115
4993 -115 -28 228 74 -3 50 48 82 -21 -66 -52 -20 -112 74 -80 -225 -37 -49 40 19 0 -43 126 13 85 282
5018 282 32 -220 146 178 94 -80 -111 -166 75 96 -9 -11 -236 -86 70 131 128 -159 -30 -105 14 50 -171 -112
5042 -112 -62 123 98 -190 59 -47 -37 10 92 173 -123 -224 66 291 16 21 131 130 131 17 -136 -42 -41 -91 76
5067 76 -33 -73 -137 -2 55 -61 118 32 -60 -34 116 133 -173 -169 178 251 55 -241 2 213 -28 85 88 234
5091 234 -36 -87 78 56 -110 -85 52 92 -85 27 -113 -28 -276 180 162 -181 -82 -208 -144 -31 102 103 97 -19
5115 -19 51 152 -71 -63 34 228 146 12 -73 -97 -61 -89 5 -23 -126 -226 71 171 73 -185 -123 -29 -154 119 35
5140 35 32 -110 -61 14 182 35 -65 -77 94 167 144 -24 -165 -15 226 117 -343 -69 8 159 69 -233 -8
5163hq3oK09j56m9K0nJ17J11j83p5J44J34k9J10j04k64j7L67j76j22Q0j00%J58
5188G3N1j1j32K3K03r7k73j0j9M22J3m71L30M7j05r5J21R6k01Rl0K55j03j23J01
5213G4j03J3K12j63j29J05M9K1k09J02j07J76k5qO5k07j86K88J78l23j2J39K36
5236A86r3j10J11k07K01L2l9oj88j33K82J24k5j7Mj81j15M94k78o5k19J79N5J3
5260ER3k20P0o6L09j04k16L3j29N11j68n9o0J69k43J11m0L9k10J19L32m02K2N5
5284d9P4j20J44J51j83j9kq8K68k99NM2K73j04k16J22J0k12K73Q8k81k65K01L46
5308A59k6k85K08k44N3L16r4J4rm2k44L83k65%j13K05j03Q8J41k53n7K86P3j70
5332B1mL7M3L0o8r8o9j5O0K89M2l17J4J12jj91K00L4m06J81L79j54k02j20N6K86
$$ plain form
5163 -8 -91 -97 112 -44 -93 -73 -78 39 150 -33 -108 36 170 141 251 147 -117 -134 233 57 -65 15 -85 -85 73
5188 73 124 113 -19 4 207 110 -163 -173 -192 230 243 -228 102 149 44 -51 70 166 -35 -26 -56 199 96 -27 74
5213 74 -29 -16 196 33 -96 9 58 79 -130 -28 -135 41 16 8 73 -134 -320 -32 146 -177 -189 -50 186
5236 186 93 -17 94 -113 88 120 81 75 -113 -246 36 160 135 118 122 -59 -174 320 42 -23 -242 -63 -8 5
5260 5 98 -122 -52 -118 191 87 -129 -96 -225 286 118 59 -1 168 -75 36 -4 35 -175 -56 276 -126 -104 -49
5284 -49 25 -95 49 200 17 -2 -4 -92 176 -123 -118 -76 197 93 -123 -1 9 -203 70 158 -123 -388 -187 159
5308 159 133 -152 56 -188 -135 181 87 101 92 50 -194 189 -76 -76 -189 16 -87 1 142 -111 -168 118 191 21
5332 21 17 54 97 127 59 -39 -108 -123 -63 226 268 -49 -35 77 76 -115 85 119 -287 -106 273 119 -83 -203 -147 139
5358A39rj23j04N7j34K59J00k15k41J71J78J06k03j8J09q8J79k32K17j81r4K23
5380I6L7k03m6J55l1J10j1j61M4l4R6kJ1k06j51N02p9j65r3J86k79K00K72p4l05
5405a31L3L02r0J84k07k51K85j44M3J85j03l02J98k7qJ15k80N2r1J89K24j98o9
5428i1R0N7J33k08p8K42j34op5l0j03L0K38L7n4j30Q5J27k3l7k25J45j27m2L74
5453A95k46k91J24K35P5J71k49j11k1J60Q0r2j55m2J40J75k58J52j28L3Q4p7J24
5476G8j76K4Q7J24j36l11J93K11o3N4J19l82k2K89j05n3M0j93p3L51J06j01m8
5499A3j96J31J95m3k78p1K28K08l22K34l6QN5KK6K1l98R0J75J81k38m6Qm2J87
5524I2Jj21j95N6K46J20k80P6pm2J50rl8n3p8K44R4l60J61J6p7J62l52J63jj50
$$ plain form
5358 139 130 7 -97 -40 -174 85 185 -30 -271 -100 78 184 -19 -37 72 -16 163 -69 148 -33 -127 96
5380 96 133 -70 -116 39 8 118 107 -54 -10 -44 52 50 61 -145 -296 206 127 -38 -131 55 -224 -24 248 174 -131
5405 -131 -98 204 114 298 91 -160 125 -19 24 209 106 -196 2 -25 -33 82 -198 -146 -237 -48 176 -22 -91
5428 -91 -1 56 189 -19 -97 145 11 5 -70 -100 -203 -173 65 102 48 -82 3 130 107 70 -155 -10 -137 -179 195
5453 195 -51 -342 -218 17 92 263 14 -97 -118 42 122 30 -125 -167 -27 148 -110 42 -86 -53 31 -46 78
5476 78 -98 -74 13 137 1 -310 -117 94 31 85 204 -178 -200 89 -16 -69 -29 -222 -295 56 162 61 13
5499 13 -183 -52 143 100 -178 -249 -21 187 -135 99 63 71 126 128 154 175 -223 -133 42 223 -15 -61 -53 -95 92
5524 92 93 -28 -223 -167 79 199 -81 -5 -12 -54 96 87 49 -4 -82 162 256 -104 57 73 -4 158 -194 -31 -32 -182
5550a82J9J90j30n6J29oJ19j18Pn1O1J58P1k00L6j68J81P1j15Ok7j6J13L3Nk1
5576A09l34J86J70n2j60rJ35p9j18L96k35o3Q6J5J70j74j81N5J80n6M4j48O0K4
5600B1J4J40q1j42J13Q6j91P8M2q4p4O7K03j57l51K05K38J5j01k42O4M9m5K31
5624I8J3j43j05J03J36N4k77J49o8J34j00K36j94j72J80J02j76r4o9K10rK9k34
5647a97J22m8k9K37J4k37M2N6K82j26r2J9k53L41N8J5p8q8j51K85j0p5r7K9N1
5672G0j77L07r9l17J2L98J26k69l02J40J41J6p5n0Q1j08J38j4o0mK8Q8k5m4o2
5697f1N4K12l07L15lk98k4K47m3q7R3k14O7N9J85k36k68K47N1J38O4l66k17L63
5721b9p4M9J33Nr6q1K71j26j44k6P9L3J84j43j58J07j08J9J08K8j84kK92j27m6
$$ plain form
5550 -182 -163 27 -103 -159 -30 -36 83 -35 -28 -79 -18 140 211 11 47 -121 60 131 16 22 -5 -21 92 125 130 109
5576 109 -225 -39 131 79 -81 -90 45 -34 -152 244 9 -54 32 47 217 43 -138 -83 97 41 85 -63 -3 21
5600 21 35 175 94 -48 65 151 -40 38 80 -4 -78 -11 192 35 -316 -111 127 142 41 -201 -137 -88 -133 98
5624 98 111 -32 -137 -34 102 156 -121 28 -40 94 -6 230 36 -136 44 146 -30 -124 -193 17 8 37 -197
5647 -197 -75 -123 -152 85 99 -138 -96 -40 242 116 24 43 -210 131 189 204 126 38 -113 172 162 87 -10 19 70
5672 70 -107 200 101 -216 -204 194 320 51 -251 -111 30 46 -29 -79 2 -106 32 18 -42 -46 -18 70 45 1 -61
5697 -61 -7 205 -102 213 210 -88 -112 135 92 5 98 -116 -49 10 195 -41 -309 -62 -11 127 191 -175 -392 -29
5721 -29 -103 -54 79 84 -12 -93 178 52 -92 -118 -39 -6 178 35 -123 -16 -124 -105 3 31 -153 -155 137 10 -36
5746c6k7J91l15K47nl11J13J54jJ05Rq0M8m8J80k99J38K5k24K00K17l49O6m1J60
5771A17k1J9M0k83L8R5K67l86R9n5KJ2K39j26j26j2M4J80k13K2m3M2J48l5M3j11
5797dj26J01J46K0k79J01K5J55K2j33l1j6J36j60K04k34k60J02L93q8q9j4r3J86
5821F4j01QO6K2r3K15M7l23n4J90J59k47M2R4j26k38K72mJ11k23j19K95K8k46
5845a61o0O7qJ61K07k40l8j7K11j05j15J39k4j21J04MK59j92k69J13K19m8j04
5868a8L2k13J47j29L71j80l03L54J22L8l63Q1q5R3j59K96j07j13M1K03J03j90
5890B1k90L32J27j89j35m5J75KJ12O6j59j03J49L6r9j21N6m1J6J10K7j02j56Q
5914b03K88J21k55o5J00J87q1Q2J2k60j00L24J38m3k89m4J12P4p4p9lj08J98K6
$$ plain form
5746 -36 -63 128 -187 60 55 -256 -143 11 10 115 124 44 92 44 224 -75 63 88 -136 64 281 -68 -2 -43 117
5771 117 96 115 155 -128 -90 5 272 -114 -15 -70 -68 -56 183 57 -69 -81 -37 143 -70 -48 -91 -49 99 64 107 -4
5797 -4 -130 -29 117 137 -142 -41 -16 139 161 28 -3 -19 117 -43 161 -73 -333 -231 162 74 -15 -29 -122 64
5821 64 -37 -29 37 59 -34 181 228 -95 -149 41 200 -47 -5 89 -37 -275 -3 -7 104 -119 -238 57 85 -161
5845 -161 -221 -154 -162 -1 206 -34 -72 -89 122 17 -98 41 17 -104 0 4 263 71 -198 -85 134 86 -18
5868 -18 14 -199 -52 -181 190 10 -293 61 183 221 -142 -61 -146 -53 -212 84 -23 -136 -95 108 211 21
5890 21 -269 63 190 1 -134 -179 -4 -2 110 176 17 -86 63 99 0 -121 -65 -106 -90 20 47 -55 -211 -203
5914 -203 85 206 -49 -114 -14 173 92 174 186 -74 -174 150 288 245 -44 -88 24 98 24 -55 -58 -166 32 58
5938E8l6k4j56K24j04K9J27r4j34n5L22P8k47q9J15L57l26r2K4r3J45J98k82N5
5962@No8K82j12j85j13K01m5n2J87J8l06K15O4k05K0P3n6J84J17r6lj82Q2l8R1
5988G8k9j92M0J13R2o4Rj7l8j08J77Pk50O0J62L0m6o3r4K26K2l7Lo2m2l9j63Q7
6016a38J40j25J20j30K79Qo7l87P9L95j67j2k20K99j73J59n5O4k30K74O3j45l0
6039AL9p2RJ20J4j06q4j32J54J60j25j88J05K29j44J14q5k5o6K92j80R5l45J36
6063h4J42J58l51L0J37o4K6l0j37k8J22R9Om3r6k8J76L5j8J8j43p7J52J01l1j22
6089e0J08q2L09j97q7J4K5n7j20J04k37N2L13Q8l01Q9J89j93LJ05n5j02Jq4K44
6114G9J16j83r4J09r6J40J26k26l6L2J70j50L6q2J54n4k11K53Q4k88J01J24J51
$$ plain form
5938 58 22 -2 -158 66 -38 -9 118 24 -110 -165 157 235 -12 -101 14 371 45 -47 -23 -116 29 227 -55 0
5962 0 5 -63 219 107 -78 -191 10 -35 -87 100 118 -188 27 91 -114 -94 -21 -77 107 224 128 125 -57 25 -13 78
5988 78 49 -143 -103 10 102 38 47 30 -8 -116 61 68 -182 -122 40 70 24 -39 -133 93 115 78 81 19 -23 -62 -225 -138
6016 -138 2 -123 -3 -133 146 154 87 -300 -221 174 7 -5 -225 74 -99 60 5 69 -161 113 176 31 1
6039 1 40 -32 -23 97 111 5 -79 -211 -57 103 -22 -210 -105 124 -20 94 9 -16 -82 210 30 125 -220 -84
6063 -84 58 216 -135 -105 32 -32 -6 -36 -173 -201 -79 20 26 -17 -113 -141 35 70 52 70 -73 -150 2 103 72 -50
6089 -50 58 -24 285 88 1 15 40 -17 -137 -33 -270 -218 95 183 -118 -29 160 -33 -30 75 20 -82 -81 -165 79
6114 79 195 12 -82 27 -69 71 197 -29 -65 -33 137 -13 23 -59 95 41 -170 83 167 -121 -20 104 255
6137B55n8l23j0K48l6j33Q6j58p0Q5K52J02j84j3M0k17J44rj5r2k6J89J83k91
6161e1n6JJ44J0j11j20K39k06J61or5P8j41J00Rj41lK89l9o2O6r6m9J28j7J49
6187A81k71j84J94J42J44j62j88k0nK85K5q7l17J28K43l55K88r1j66K52R2j18
6209A0J66k36j40L21Rj63m1KJ09K5k43L56k93l1K46J85k05k42J79J4L6j18l5J40
6233E1k0o8O8m1J38k77J30K01l75J59O4k29P5J14J77j46m7J18l6O6j15N2m6J15
6257A28m7k44J76J7j03Q6r5N6q0%J36OJ52l41J42j28k4L06k58p8K67K7K3k01M8
6282b9J33k17J75O8n5j30k1K37kk03L0R7j55j3J79n3l52J58J95O8j78j4N6m8Q9
6307A5J5LK42m14J60O5k4k05K32o7J0m1J88l43n7K27J68r2J32j24l47L12j00p6
$$ plain form
6137 255 197 -126 -136 112 76 -57 29 -129 -199 -114 138 240 56 43 83 -134 10 1 -14 -106 -132 57 240 -51
6161 -51 -107 -106 38 48 -63 -183 56 -150 11 5 -90 -12 -153 -53 -44 -185 -188 101 62 0 66 -30 -79 49 32 181
6187 181 -90 -274 -80 62 206 44 -144 -164 -169 116 141 54 -263 -135 108 -247 41 -50 -216 36 128 10
6209 10 176 -60 -200 121 130 -33 -74 -72 37 62 -181 175 -118 -149 97 282 77 -165 14 28 64 -54 -89 51
6233 51 31 -37 31 -10 128 -149 -19 182 -193 -34 30 -199 -124 -10 167 21 -26 92 56 122 7 59 13 128
6257 128 81 -163 13 30 -73 13 -82 -26 -106 -106 30 36 188 -153 -11 -139 -163 143 -115 -193 74 101 124 -77 -29
6282 -29 104 -113 62 130 75 -55 -76 161 159 -44 -14 83 -72 -85 94 41 -311 -153 42 110 -68 -82 -26 -74 15
6307 15 30 33 275 -139 21 86 62 -143 89 22 32 -9 179 -164 -221 6 174 82 214 90 -257 55 -45 -121
6331a21J8j6L10np5j34k05L33M5j81o1K65r5j4O8K06l48n1R2L2%L1l18J52l4J48
6357D2j7p3k7L2o9J30m1q0J82l6k35K31Q7l08P2K73k7k88N8K00p2P9k5M6j04m2
6383a2j66K71Jj29J5M1j27R3n5R7j48O5J41J8j53j06J92R7k12Q7kpR9j14j4l4
6409f2o6J70J13J26l17p6J95j93PJ09J08l49J52J73K5q4Rj23Q6m6K7j04rQ4M8
6434CJ17p3j48K5j8K40j22l5j6qO7J20m1k13n5K00R1j15k14K84K7j07j14K72j27
6459D0k79J59R1J19m31K35J16j65P1K43j86q7N1K25j52j76J01o1P2N0o9M7n7j9
6483f2J41J18l47j2K74J8j36j50J55k5o2K5J66j33j07j17M32k47M2l1P6J71n5
6506A34j22K04k92J36J0J31l55P4K8nJ10L2j34k0L3J82K8j20o7k66K70j05K16
$$ plain form
6331 -121 -103 -119 191 186 111 -23 -228 105 150 -31 -92 173 78 64 132 338 -10 -61 31 63 63 94 -224 -72 -106 42
6357 42 25 -48 -75 -43 -112 18 -23 -103 79 43 -192 39 126 -182 -110 163 136 -152 -94 106 34 113 88 134 30 -12
6383 -12 -178 93 94 -35 -20 21 -106 -13 -68 29 -119 -54 87 105 -48 -154 38 135 -77 10 8 1 100 -14 -28 -62
6409 -62 -128 42 155 281 -36 -112 83 -110 -103 6 114 -235 -83 90 115 31 40 -83 3 -43 -16 -120 -129 -45 3
6434 3 120 47 -101 -76 -94 146 24 -11 -27 -35 32 152 111 -102 -157 43 134 19 -195 89 116 9 -105 167 40
6459 40 -239 -80 11 130 -301 -66 50 -115 -44 199 13 -74 -23 202 50 -126 -25 -86 -14 36 -33 14 -43 -62
6483 -62 79 197 -150 -162 112 130 -6 -156 -1 -26 -88 -63 103 -30 -137 -254 178 -69 -27 -58 18 189 134
6506 134 12 216 -76 60 70 201 -154 -80 -52 -57 53 85 -49 -69 -36 146 174 54 -13 -279 -9 -114 102
6529A02j44j50j7J28K40N1l34L6K56m5k17P1j5L0J25l0j32J8j43K47M8k69O5J44
6553F5j58N9k0K2N8j80N5R0j01r7kJ73Q7p1K30j96l8q1Q5K78j09j91J14P8j13
6578C7j66N9N0j70L12J9k29l6J24L13m35N3L1m7K59j55j27J97n9j97L68j22j51
6601g2n6oO9K16J12j83k45J7L52Nq0k19j41L94j19j36J77j70l33M03J06j50q5
6624a44J0K74k33J29O5r4j48J30N8Q9j76m3L9J16L6J55k40q9J65n4R9k73M4n1
6648a36J29J24j83J3j0J77m1p8j97J0O1K09o2P1j90O0J81j00J15Nj06k16J18K42
6672A96j75O9l6k00L12q8k1r9J48r9J03n9m9j26K05j24L7q9Q2q4K5J70j29o7j69
6697b67L73r1J1r0JJ71j24J34l4j12Q6j96K92q3l9k32L33Kk20R1r2j19J36K89
$$ plain form
6529 102 -42 -192 -209 -81 159 210 -124 -88 168 123 -94 -23 -38 -8 117 87 -45 -27 -170 77 125 -144 -79 65
6553 65 -93 -34 -54 -32 26 -154 -99 -9 -110 -207 -209 -36 51 -20 210 14 -24 -105 -20 258 149 -42 72 150 37
6578 37 -129 -70 -20 -190 122 141 -88 -124 0 313 -122 -69 -38 -85 174 19 -108 89 30 -167 201 79 -72
6601 -72 -128 -134 -65 151 263 80 -165 -148 204 209 129 -90 -231 163 44 -92 85 -85 -418 -15 91 -59 -144
6624 -144 -134 140 -93 36 101 7 -141 -11 47 136 -40 -83 -44 72 108 263 23 -66 99 45 144 -129 -85 -136
6648 -136 -7 117 -66 -53 -63 114 73 -5 -202 -192 -131 78 16 87 -103 -43 138 38 153 158 52 -164 -46 196
6672 196 21 90 54 -146 166 78 57 -42 106 7 110 51 2 -124 81 -43 -6 -95 -13 -97 -72 98 -31 -98 -267
6697 -267 106 15 26 -64 -63 108 -16 118 84 -28 58 -138 154 71 32 -200 133 135 -85 6 -86 -205 -69 220
6721B20j44l41J47J25j17J28l0qJ8k9M0R2J66l79Q8l4J55J8J7q4j16P8pR9k71
6746a69O1K80j23j01J26j32q5K06Nq8j32O8K2L01j33k55K39j28J45r0N0o7k28
6769b28J47K36j72Q1m4j63K92l3j96L3P9k63L4J68J41k45k0J97j43N7j43Q2N3
6792e0K40j4r8j93J35L2N7q6n1K33o3k5K8k28R9OJ00j4o0k94K10o2j07K09j7j83
6818a96J91J34J16j79k81K08N7O6Pk48J27j8J0l1J08k06J64R6k5k2q5K51k48p0
6842g4R8O1Mk06n8K67Q4k17nn3O3J26l6k27QJ53J51j6o4j05K46j46p3J1P6J65
6868B33l40J70O3j5q2q3P2l5J5M2q2P2q2oR0l1k06M98l14L4j05N3K9J06O3j47
6894A2J8j27J26K3J44k98J01N1l8j8Q6j46j63M30J7k81j60J66J42k83J77J81k16
$$ plain form
6721 220 76 -265 -118 7 -110 18 -12 -20 -2 -31 9 101 267 -112 -24 -58 97 115 132 48 -68 10 3 102 -169
6746 -169 -108 172 49 -52 74 -58 -143 63 68 -20 -152 -84 -62 239 106 -149 90 -38 107 17 67 0 -228
6769 -228 -81 155 -17 64 20 -143 149 116 -80 -47 32 -231 -197 -29 112 -133 -153 44 -99 -42 -185 -103 -50
6792 -50 190 176 78 -115 20 52 109 23 -28 205 142 117 145 -83 16 22 122 108 48 -246 -36 -98 -205 4 -13 -196
6818 -196 -5 129 245 66 -215 -7 50 116 123 -125 2 -16 -6 -37 71 -135 29 125 100 78 -7 244 -4 -74
6842 -74 24 85 89 -117 -175 92 176 -41 -46 -99 -36 90 54 -173 -165 -12 139 123 59 -46 200 54 -19 -8 68 233
6868 233 -107 63 126 111 29 -54 18 -17 -2 40 -42 30 -52 -58 32 1 -205 293 -21 13 -92 -39 -10 96 159 12
6894 12 30 -97 29 52 196 -102 -1 50 12 -6 80 -66 -229 201 218 -63 -223 -57 85 -198 -21 160 -56
6917e6P9p3N8P6j52j80L10J80j02k02R2R2j54J25J51j98j63P5K30j1k13j07L5
6940a08J51j89K6O1P0k73O9J66J66j53n0k4J23R5j04J1q4K36o7k48O6j00K57J6
6964A13j16L8l3k5J43J03j47k6l05L63J54j61k16k4k3K3L19k09o6R6k2J04L4j52
6988c5qN0M5q3J27n6k11K44Kk17J32O6M4l8lR8j77k13J53M9q8M9j44K53q0pJ02
7015E4j05J01k3K7M3j18L7J46j03j14J26r4L0O3rJ06k1l10J83P0j3q0j64K61k1
7040G2L0j47o4J26j72L54j02k41J29K8L0J7lp4M6q7J26J39j97P7j63J3J97L8j83
7065a1Q1j22J27J79k53M1k45P9J13o5J00RJ1n6n3L04j41k67K16N2j12K5l3l6P9
7090B2N3rP8j90k2J48O8k1j68l1J7J34j30j3J18P7j1l35J96r3m9K70j77O2J76
$$ plain form
6917 -56 23 -50 8 84 -68 -248 62 242 140 -62 30 122 -32 93 244 46 -117 -42 188 177 -36 -143 -108
6940 -108 43 -146 -120 -59 11 -262 -193 -27 139 -14 -64 -88 35 130 26 37 -47 189 122 -126 -60 -160 97 113
6964 113 -3 35 2 -23 120 223 76 50 -255 108 262 101 -115 -139 -162 -139 180 -29 -95 1 -21 83 117 -35
6988 -35 -43 7 52 -31 96 40 -171 73 75 -142 -10 56 100 62 59 157 -20 -233 -80 -31 -119 -70 -214 39 -41 -48 54
7015 54 -51 50 27 54 97 -21 16 162 59 -55 71 -23 7 70 61 167 146 -164 19 89 76 -4 -168 93 72
7040 72 102 -45 -109 17 -155 199 97 -144 -15 13 43 60 57 -17 29 -58 68 207 10 87 -76 -63 134 172 -11
7065 -11 70 -52 75 254 1 42 -203 -124 -11 -76 24 33 44 -12 -65 239 98 -169 47 99 -13 12 -21 -57 22
7090 22 75 66 144 -46 -68 80 148 127 -41 -72 -55 79 -51 -64 54 131 120 -215 -19 -112 -161 109 -68 -6 170
7115A70O1m70J55K40q8J3m7j29L3J15j0Pj81K29P7k75J1o9M7J94j20j02J09K2
7139hm0J52k78MNK50j36OK7L8j43%l5K08P1j80L1J41j62J04k03J36K08l5k37J95
7165A19j54K1J76p4k28Q4j5N5n7n2J34k27J57l7K09j18k50K10J17Q3k25J38J2
7188G8r5R0j20J3k9q6L05l0l51J42J25m1J02j78M3P6j10n1J52l0j37K57n3k06
7212a34K71j61J54k37N9P5l3j17J25L4J69j68n0q3Q8O9L4l5K2j21J5N8L6r5r2
7237a17R0o8J38oj47P6Q4J84k66K3Q4J18j14J1o1Kr6j22J31K38k69Q3L6j11kJ34
7263E3j75M3q5L14p4j98K36j63o5K07rl00J61K34k96J29Qj38J75J04J5k67J15
7286B4l4j17O9L55j21k73mK7J38J19k16j41L37J2k23J4l3j40L21j48p1J67k53
$$ plain form
7115 170 231 -239 -84 156 68 81 34 -95 -62 53 43 50 -131 98 175 -100 -89 -158 -111 83 -37 -139 -30 -8
7139 -8 -48 104 -174 -170 -165 85 -51 -45 -18 20 -123 -123 -158 50 121 -59 -28 113 -49 55 -148 -12 196 161 -76 119
7165 119 -35 -14 162 88 -140 -56 -71 -16 -73 -125 9 -218 -61 -98 111 -7 -257 -47 70 153 -72 66 78
7188 78 -17 73 -47 -34 -63 -149 156 126 -225 -83 42 1 103 -75 -32 44 -66 -117 35 5 -132 125 72 -134
7212 -134 137 -24 130 -107 -48 27 -6 -123 2 36 205 37 -13 -96 -8 61 95 60 82 -39 -24 34 70 -25 -117
7237 -117 -27 -95 43 37 -110 -34 50 234 -32 -9 75 193 79 90 29 31 -65 -187 -56 182 -87 -4 32 -79 -81 53
7263 53 -122 -79 -164 150 76 -122 114 -49 -114 93 84 -216 -55 179 -117 12 20 -118 57 161 176 -91 24
7286 24 -10 -127 -58 297 176 -97 -101 -74 64 183 -33 -174 163 175 -48 -34 -67 -207 114 -34 -105 62 -191
7309a91J46K1M7P4j49K3p0Q5J47j88O8Q2k22K72j48m2J64j62J54j01q1O1o6l8
7333a14K78k24O9L9k20K17K3j5j02M7r0j3J03j06Q0l8J0J77l1q0r0J83J4j53N9
7358B3m1%p2oJ72k79J25J54j5k6N4k24P0J30Lj24J0L2p3J71M1j83O4n0K40k97
7384a01J72N5j2r8j27K67k39P7q1K1J80l02L9Q6J37j79J11j21J20j36J32J79j33
7407D7m1k0P7L9no6P7l0O6r8J81k58O3j07K18j99R0o1J32j34N8J72k01n4M9J16
7433A11k58R3J46k43K16j23l1J05Lr7L07k07Nk30L58j5k10L91k43j82J68p6J04
7456I2j73Q8N9J46k62R7j59R4J07j24j4P7O2k80L75r5P1j20Q1k42K10k1o1j81
7480a73L17r3K53l27j95J91L1R2n0k3j33P2J38k7N3k13K15k30J43j3j8P5j63J55
$$ plain form
7309 -191 -45 -24 23 97 -52 -29 -99 -14 133 -55 13 95 -127 145 -3 -45 119 -43 111 10 -71 -10 -76 -114
7333 -114 164 -60 9 48 -172 45 68 53 -49 -2 -92 -105 -2 -108 -28 -66 -56 121 90 10 -80 103 117 -36 23
7358 23 -18 -18 -90 -96 76 -203 -78 76 61 35 89 -135 -65 65 68 -56 -46 -14 -87 84 125 -58 6 -44 196 -101
7384 -101 71 126 114 16 -111 156 -83 -6 -87 -66 114 -188 -149 -63 74 -105 6 -115 5 -131 1 180 47
7407 47 6 -14 63 102 97 31 108 78 144 46 227 -31 32 -75 143 -56 34 -27 105 -29 29 201 0 -54 -5 111
7433 111 -147 -54 92 -151 65 -58 -89 16 19 -78 229 22 27 -203 155 140 -70 321 78 -104 64 -12 92
7456 92 -81 7 66 212 -50 47 -112 -18 89 -35 -49 28 90 -190 185 90 161 41 122 -120 90 69 8 -173
7480 -173 144 51 304 -23 -218 -27 4 96 46 23 -110 -38 100 73 126 -87 128 -102 41 28 10 85 -78 77
7504G7k9J62k02K6p2N9J7r2M0K93k65j4J67l45J14J57j90K14m0j24N4k03O6M05
7528B75k63j31l7L59l37J93q0r2K05Q3j44L2j04R7j04Q9j37J5J09o9J70J1k35
7551i5k0R7mM6p0q9K3R9J2l5J9L7j17J22n3l5R0l1L2j17J70%J32j26j22m4J19
7578D0n5j19P0L2J0Pn9J11n2J47k15j07N0K08L4j27r4k3K31j32m8K33m6j26J83
7603A53r0L6O6k43N8n2K15m2j40J58k91J62J08q0l58L01QJ12p3r8k3m8J18LJ50
7628A10j24o2P7J9O0j96J09j26P6J12p0L5p7J28N5k2k6j65K48n5j84R9M3j20P5
7653A9j77L08j30j29J35o8J96j72l3N3o1N6P0j45j1O9J04j15J81j37J37j73n0
7676g3Q4j33J63j2J7J20k28J4k5Q9j03O6n2k0kn0K47k5j99R1P1Lj56K57%q2k7
$$ plain form
7504 77 48 210 8 34 -38 21 38 -54 -14 279 14 0 167 -178 -64 93 -97 117 77 -47 7 -196 -130 275
7528 275 12 -119 -156 203 -134 59 -21 -113 92 175 31 63 -41 56 -48 41 -96 -81 28 -41 129 140 -95
7551 -95 -115 -18 -22 24 -46 -135 -112 -13 -1 -36 -17 20 -97 25 -28 -63 27 -4 28 -89 81 81 213 87 -35 -79 40
7578 40 -15 -134 -64 -32 -22 -15 -74 37 -15 132 -83 -190 -140 68 102 -25 -119 -142 89 -43 -91 142 96 -30 153
7603 153 63 99 165 -78 -20 -72 143 101 -39 119 -172 -10 98 18 -340 -39 -31 81 8 -90 -113 -161 -43 -40 110
7628 110 -14 -76 1 20 80 -116 -7 -133 -57 55 -15 20 -57 71 126 104 78 -87 161 106 -78 21 64 -56 19
7653 19 -158 150 20 -109 26 -42 154 -18 -51 2 -59 -3 67 -78 -89 -20 84 -31 150 13 150 -23 -73
7676 -73 11 -122 41 29 46 166 -62 -48 -73 16 -87 -21 -73 -93 -95 -145 102 77 -122 -31 40 43 -113 144 144 62 35
7703C5N5k36L2J32j88K55p7k6J57l15J03K45O5l37p0J68K2j1j31O0J3J97j86J26
7727H8p2K4Q5p4k05K67r0J46j66%P8j8j5o0R1N7j60k6k6K6m0J21o2j75J03P1J07
7754G5k40j75L40l8m8K28q1j7j03R0J42k86qJ86j0o2J20N2j88J5nN1k8q0J73o8
7780C5J30k64N4K62k68J05P2k67j6K27l8O5j65K3j93K30J55j93K7P0l19K44lJ7
7804a0R7j81J74j59n7K99l54K18K9N5k14R6j07K42j08j30K5M6j11K29qm4p8j40
7828a91J02J44O8k30n5J91o4M5j29J16m4J38o8J43k52l9J39q4m6J43o5l8k9R0
7852a5L4k27O9J04O5j36K17j09M2r8r5R7J74r8k04K35q9J56k53J62j9l4J30R3
7876B01l73Q3QJ74k09P9j3j6k0r0L42k21M7n0K74j75j6n1O0J44p5j9N6j31n5J65
$$ plain form
7703 35 90 -146 -114 18 -170 85 8 -18 139 -176 -73 172 237 -100 -170 -2 20 9 -122 -62 -49 148 -38 88
7727 88 16 40 125 51 -154 113 23 169 3 3 81 63 48 -12 79 136 -24 -50 -76 -50 -90 31 -31 -206 -103 -32 75
7754 75 -165 -340 0 -38 -86 142 61 44 -59 31 173 -113 -121 65 55 -7 113 165 -23 -8 -13 38 10 -70 103 35
7780 35 165 -99 -45 217 -51 54 126 -141 -157 70 32 97 -68 -45 -238 -8 147 -46 -19 51 -268 -24 -27 -10
7804 -10 87 -94 80 -79 -136 163 -191 27 56 111 -103 -7 -114 128 20 -110 -85 -39 -150 79 71 27 -51 -191
7828 -191 -89 55 123 -107 -162 29 -35 10 -119 -3 -47 91 23 166 -86 -125 14 -70 -116 27 -38 -76 -105 -15
7852 -15 19 -208 -139 -35 30 -106 111 2 44 -54 -149 -52 122 24 -180 55 -34 122 -131 31 12 -22 108 201
7876 201 -172 -89 -81 93 -116 -37 -50 -66 -86 -176 166 -55 -8 -58 216 41 25 -26 34 178 103 84 140 9 -46 119
7902A19p1j69N2M0Q4Q4j51j8J73k80J13N8J87l83R8Q4l6j1r8J71J01j54OJ48k02
7927e5J9J33m0J06k08J6J36Q0k48J39j36p2N5J80K0j49N7Oo9p9K92k30l4J34Q3
7952A36k07K4J4L2M1N4k00K56Q4j20q7m1L6L6j0J49l13J95N5j49J89j4j83Q4J0
7977G1R9k19J50j39M8q1j0P1k6N1Pj49J54J64j30j4j35M0J40j31P0pn4J86r8o
8003E2j7j58J82k1n7l0M1J26r9J46r6j79O5K14k43j9J61j40J84k82K61q8Oj74
8027a65L08r6K35m18K21r5Q8j65J32p7j70J82J17j04m1M4lj1k43K92M6nk56R3
8051i1K40r4j81J30O0n4p2J17j47N2O4J24o8l66L78o4J26k23j03m9L41j93K60
8074A87k02p4N7J30j77rJ23j55k1J23j04j7J68q6J08p0j54J64j46J95LM7k7j9
$$ plain form
7902 119 48 -121 -69 -29 55 139 -12 -30 143 -137 -24 34 221 -162 -64 20 -16 -27 -125 46 147 -7 -1 147 -55
7927 -55 -36 97 57 163 -45 -29 107 187 -61 78 -58 -130 -75 105 125 -24 33 39 -30 -109 183 -47 -81 53 136
7952 136 -71 -47 -33 -1 40 94 -106 150 234 114 27 -14 22 58 48 197 -116 79 134 -15 174 160 -23 61 71
7977 71 170 -49 101 -38 10 -71 -81 -10 -36 15 22 -127 27 191 61 47 -88 -48 92 -39 31 24 -30 156 58 52
8003 52 35 -123 59 38 -19 -49 -8 118 19 165 69 -110 -45 169 -74 -93 68 -72 112 -170 91 3 9 -165
8027 -165 143 47 282 -136 85 -10 78 -87 45 -32 -202 -20 97 -7 -48 -4 -7 -18 -261 31 77 72 -184 -91
8051 -91 149 55 -126 4 64 10 -62 55 -92 -40 24 148 80 -286 92 28 154 -69 -172 -221 120 -73 187
8074 187 -15 -89 -32 98 -79 -88 35 -120 -141 -18 -122 -139 29 -57 51 -19 -173 -9 -155 40 43 90 63 44
8098D4P5j95K31j77M2K4M0m7j10N4O9j54l8J34R6j87K6j2J78n7j34J73o7P3N6
8123A37J45k05j03q7J13J84j63r5J21n3p9K33l04M1J40j22J22r9P8m3J42j25k6
8146d8j25Q7J01qMm1J56p3j0P9NJ2j52l7j39K91j33MJ14j79J83mj40L0K2N2q3
8173c2O7mj45J73k15L5R6K6r6K72q2k03K56j70J8j1K10j17
$$ plain form
8098 44 119 -76 155 -22 20 44 84 37 -73 -19 50 -104 -142 -8 88 -99 -73 -85 93 36 -98 75 8 81 137
8123 137 282 77 -26 -113 0 184 21 -74 47 -6 -85 148 -156 -115 25 -97 25 -74 4 -39 103 -22 -48
8146 -48 -173 -86 15 7 11 -30 126 53 43 122 127 139 -13 -50 -189 102 -31 -27 87 -92 91 87 -53 -23 -1 51 -32
8173 -32 35 31 -114 59 -156 -121 -25 1 -95 177 95 -108 148 -22 -4 -15 195 78
8191G8
$$ Imaginary data points
##PAGE= N=2
##DATA TABLE= (X++(I..I)), XYDATA
0@%%%%%%%qJ6j6J6k4L2m0N4o2P3r7J20j44J76k09K49k97L46m02M72n50O33p26
30c88Q33r52J083j226J387j567J762j977K213k471K754l064L402l770M172m612
46b421N092n617O194o825P514q277R124j0062J1107j2280J3609j5126J6879j8929
60a0018K1361k4306K7956l2619L8814m7489O0589q2857J30424m02467M14292M17634
72E11314r74082L50076L93825m65849J06496L69659m78248P1479L46514l26964
82i5780k8978L45354l14567j7273L55512k89384j55867M11526j56396k22246K66214
93I8115p7816j62732K70205r4172k04196K68402j1609k49101K22883M8184k54371
104a46208J55255J03340k18490J04916R1201j69547J19663N0301k30085J62552
$$ plain form
0 0 0 0 0 0 0 0 0 -8 8 -8 8 -16 16 -24 30 -32 41 -56 64 -80 96 -113 136 -161 185 -217 255 -295 338 -388
30 -388 445 -507 576 -650 737 -830 932 -1045 1168 -1303 1451 -1613 1789 -1981 2191 -2421
46 -2421 2671 -2946 3248 -3577 3937 -4340 4784 -5278 5829 -6451 7158 -7968 8911 -10018
60 -10018 11343 -12963 14993 -17626 21188 -26301 34288 -48569 81855 -320612 93680 511314
72 511314 -462768 -112692 281133 -184716 -78220 291439 -186809 -115330 231184 -95780
82 -95780 -124758 220596 -93971 -111244 244268 -45116 -200983 210543 54147 -168099 98115
93 98115 20299 -142433 127772 33600 -170596 97806 86197 -162904 59979 108163 -146208
104 -146208 9047 112387 -106103 -1187 90014 -79533 40130 90431 -139654 22898
114B2898J40524k93492P4606K35285k64601k8850K90480j85237j38449K65131
124A18295q7795j66121K22279l9570j83013J91197O091j90496J65144O0856k03873
135a07006J00318J09624j78688L4212J40385j26512l5523J09274n1956m593O5092
146E4627r6708l370J19438o8577n7081Q1751k6567l0354O3005l6682l5970O6976
158C0488j8645m2043N1539j4742l3559N4766l0712m7149Q8531j3007r1475Q1724
170A5716L3490r9656M6489N5030r2957J3602P7354o0646j6218O3453m4932j9595
182b8870P5438l6677n3195O7518l012n0817M7908j683n2351M6678J9721n9136
194b8478J8856M3525l8441j8116K8855m039l499M587k8995J1500M6684k8310l6246
$$ plain form
114 22898 163422 -130070 -55464 179821 -84780 -113630 176850 -8387 -146836 118295
124 118295 30500 -135621 86658 47088 -135925 55272 61363 -129133 36011 96867 -107006
135 -107006 -6688 102936 -75752 -41540 98845 -27667 -63190 46084 -5872 -10465 54627
146 54627 -42081 -45451 73987 5410 -51671 30080 3513 -26841 36164 -518 -36488 30488
158 30488 11843 -30200 21339 6597 -26962 27804 -2908 -50057 38474 25467 -66008 15716
170 15716 49206 -50450 -3961 51069 -41888 -28286 49068 -11578 -27796 35657 -9275 -28870
182 -28870 46568 9891 -43304 24214 21202 -29615 18293 16610 -35741 10937 30658 -28478
194 -28478 -9622 33903 -4538 -22654 6201 2162 -1337 3250 -25745 -14245 32439 4129 -32117
207c2117L1843J7275j5375n608l321O234J0665q238m318P779m857J280J5910j6691
221D61j8443L5914O805n2046P341M5817j6536k6964R420Q954L582N51j1882l675
235a0701P937k807J643J5471j3677k2542K9438K0992l0238o918J9694k298l958
248B036L134l152P52K231o791Q40J2236n775j3958R674K039j4894J1127R533k2380
263a3348o200K3116J0116j8209j2775J7172J0658j8497l794K1449K02k5822O381
276i551L3768p861k8553P233J6554J329n990j4437q70J6619R38j3414l935O373
290a797O607N81q764j0246R272J2765j2258j0516R389Q124L278p911j0901J6571
304D194J2774k0522r152J6868N155r448K774L732j1655R53J8394k45j8157j0801
$$ plain form
207 -32117 -274 17001 1626 -3982 -7303 -1069 9596 1358 -2960 4819 -38 1242 17152 461
221 461 -17982 17932 24737 -27309 -19968 25849 9313 -17651 -8231 723 4305 4856 -7026 -10701
235 -10701 -2764 -5571 -3928 11543 -2134 -24676 4762 25754 -4484 -11402 8292 5994 2036
248 2036 5170 2018 2770 5001 -1790 -950 11286 5511 -8447 1227 3266 -11628 -501 9032 -13348
263 -13348 -19548 3568 13684 -4525 -17300 -128 10530 -7967 -11761 9688 9890 -15932 -9551
276 -9551 24217 16356 -12197 -4964 11590 12919 6929 -7508 -8378 8241 9179 -4235 -8170 -1797
290 -1797 4810 5391 -3373 -13619 -4347 8418 -3840 -14356 -4967 3157 6435 -1476 -12377 4194
304 4194 16968 -3554 -12706 4162 9317 -131 2643 6375 -5280 -4327 14067 13822 -4335 -15136
318a5136J0431J9042p283k1092J538J3081O740k754j0923p65J0757l8j0808q59
332h069J2025J291r448k06M200N874O348j0007j3557P080J5468j04j7390m420
346a0915J6856K117j1159L534O289p777o550R508P660j2800j0266J0226J0797
359G520k264j1180k884J1952N367q880p687J674R271M20p271K850K871j324L600
374D035j999n714N171O354p201r656P664J2468m547j2248j996J2857Q355j5963
388b420o055J4425p934j1164J9646M537k5099n75K5280j48j9616J120R731j520
402B08n93j217j545N381n00k175M628p45l973K274L013l207l713O757R66j2979
418g420L330J4581o419j1702N300M483m862Q62K354p853J570P487o868N895J0739
$$ plain form
318 -15136 -4705 14337 7054 -14038 -12500 581 7321 4567 -6356 -7121 3636 3598 -7210 -8069
332 -8069 3956 5247 -4201 -4407 -207 5667 12015 2008 -11549 -4469 10999 10895 -6495 -10915
346 -10915 5941 8058 -3101 433 6722 -1055 -7605 1903 9563 -3237 -13503 -3277 7520
359 7520 5256 -5924 -8808 3144 8511 -369 -8056 -6382 2889 3309 -3962 -1112 1759 435 4035
374 4035 2036 -3678 1493 7847 646 -9010 -1346 11122 6575 -5673 -7669 5188 13543 -2420
388 -2420 -8475 5950 -1984 -13148 6498 11035 -14064 -14639 10641 10493 -9123 -8003 1728 208
402 208 -385 -1602 -3147 2234 1734 -441 4187 3442 -531 1743 4756 1549 -2164 4593 5559 -7420
418 -7420 -4090 10491 4072 -7630 -2330 2153 -2709 -1847 507 -7346 -5776 1711 -5157 738 11477
433A1477k1750n505L1219k329k6481Q904J4855j1967J514J3715j4732p341J9902
446A1481m910j4299J4102O63j7041O525R132p989n82L346q088L489J4269j3007
460b909j3379K0166K741j9623J0639J2800j5046NJ4105q439n284J5925o048j8523
474a2870J7238J3290k0972l388J0612m466N954M309k1327m48K5961o879k4507
487a7493J3701J2209k0074M085K1499j6036j4578J9199P833j3677l065Q538Q15
500B956m135K507N20p50M989m538o493Q791M233j0057j33N625r171J20K1436j1615
516D285k9890K4543K5621l1347r991K3205p883o233J6360r991j0799K0047k865
529E062j6094K1830j230l1143K5681K1254m3144K014M2938k4077k6685L2277O567
$$ plain form
433 11477 -10273 -15778 15441 13112 -13369 -4465 10390 -1577 -63 13652 -1080 -8421 11481
446 11481 6571 -7728 6374 7037 -10004 -3479 5653 -2336 -2918 428 -7660 -4171 10098 -2909
460 -2909 -16288 3878 6619 -13004 -2365 10435 -4611 -4606 9499 1060 -4224 11701 5653 -12870
474 -12870 4368 17658 -3314 -6702 3910 -556 5398 9707 -11620 -12068 13893 7014 -17493
487 -17493 -3792 8417 -11657 -7572 13927 -2109 -16687 2512 10345 -3332 -6397 2141 2956
500 2956 -1179 1328 1848 1098 6087 1549 -4944 3847 8080 -1977 -2110 3515 -5656 -5536 15900 4285
516 4285 -25605 -1062 24559 -6788 -16779 6426 -1457 -7690 8670 -1321 -12120 7927 5062
529 5062 -11032 10798 9568 -21575 4106 25360 -17784 -15770 27168 3091 -23594 8683 15250
542A5250k5305R113Q745j7038O673J3196j3823l092N711n219J2524N838k7293
555a4720j625L0671k757k6193L582J9091l927j0517O051N764p211l182Q635L453
569G115j0742k502J0901k67m442k12j752P523J791j5737N274J5386j5564p549
583a0777J8866q202j6036K5558O619l7000O548L4233j4595j8627R225o20P121
596B313J1406k0410q544K5618K51j8297J0293N264j6023R032J2579j8995j541
609g054J8885q772j2700J0630O710o450o898o53N917L874m768m573K092L422L66
624B8J418m23n212o61O303N615n544j0184R031J1097j3433l752J5809m700j3470
639h078Q581Q224q724l297M609l107L79N762n650l498N136k517N43M273q347q90
$$ plain form
542 15250 -10055 -942 7803 -9235 -2562 10634 -3189 -6281 -570 -5789 6735 12573 -14720
555 -14720 -16345 14326 11569 -14624 -11042 8049 4122 -6395 -344 5420 -1791 -4973 3662 7115
569 7115 -3627 -6129 4772 4505 63 -149 -1901 5622 7413 -8324 -3050 12336 -3228 -10777
583 -10777 8089 -113 -16149 9409 16028 -20972 -14424 19809 5214 -13413 -4188 -4808 2313
596 2313 13719 -6691 -15235 10383 10634 -7663 2630 7894 -8129 903 13482 -5513 -7054
609 -7054 11831 3059 -9641 989 7699 1249 -5649 -6302 -385 3489 -1279 -5852 -3760 -338 28
624 28 1446 1023 -4189 -4850 1453 7068 1524 -8660 371 11468 -1965 -5717 10092 5392 -8078
639 -8078 503 8727 3 -3294 1315 -1792 -1413 4349 -1301 -4799 337 -2180 -1637 2636 -5711 -6601
655f601J2290m146j0764R654R203j2806m685J4290J9r991J808M418J348m72n018
670a453O48L979j429L58L15n442j985P198L349q753m272P695L107n600k711O690
686A694L059j3114k539K0304j52j9646L409J3455l286l514L204k230k854L932
700A722K080l83j614n968L822Q022j0215l091J4281n776j3752Q479Q907n898m580
715c964k83J656M238n94k782L245m014o400J4728P129k3155j416K2288j704j2417
730c445j53L186O642P44j1621Q13J0809o741n599J1744n317j2707J6514N390k0896
745a0637M713J5339r891o256M654N41N685r60j2600M370J3570o933o080Q460n515
760a540n957J5954K132j7018r8R546M471j578j1482l34J4067l832j1141P719L968
$$ plain form
655 -6601 5689 1543 -9221 433 9636 -3170 -7855 6435 6454 -3537 -1729 2689 4037 3565 -1453
670 -1453 -805 3174 1745 2103 2418 -3024 -5009 2189 5538 -3215 -7487 208 3315 -2285 -4996 1694
686 1694 4753 -8361 -10900 9404 9252 -10394 -6985 6470 3184 -330 2874 644 -2210 1722
700 1722 3802 3419 1805 -4163 -341 7681 -2534 -5625 8656 2880 -10872 -2393 6514 616 -3964
715 -3964 -4247 -2591 1647 1053 -1729 1516 -2498 -8898 5830 12959 -10196 -11612 10676 8972 -3445
730 -3445 -3598 -412 6230 6974 -4647 -3834 6975 234 -5365 6379 1062 -11645 4869 10259 -10637
745 -10637 -5924 9415 -476 -6732 -2078 -1537 4148 3188 -9412 -5042 8528 1595 -4485 3975 -1540
760 -1540 -7497 8457 10589 -6429 -6527 3019 7490 5912 -5570 -5904 8163 4331 -6810 909 4877
775D877j0354K390Q355o476l373N705j859j072Q65l584O164K546j2833M887J3356
790I594r210p019J0069j048o189Q321J508j0873K450O731k437L280m079j1820
804a0722J2037J2475j5284q423R977K748k651j18l568j305O905K48o833J837L106
819D29n34J937m384k419J0381P07j0624J013O817J550j866m519j695N150L656
834E599l943l864K87O67M256J600r191k134Q796K54l240j462k859M372N617o024
850a269m327O630K141n302m5M549q06n16q73k598M952L181o197r68K462o47K416
867B783M85n002j159L595Q24j637k5j199j838K386J214n43J067m888k018R186
883C231J709p698j052L227J763J770j707l620J659M371k128k216L565j780k649
$$ plain form
775 4877 -5477 -3087 5268 -1208 -4581 1124 -735 -1807 -942 -4526 1638 4184 -8649 -3762 9594
790 9594 384 -6635 3434 2386 -3803 4518 6026 -4847 -2397 4334 1897 5177 1098 -10722
804 -10722 1315 13790 -1494 -9917 60 2808 157 39 -3529 -4834 2071 2319 -4514 -2677 429
819 429 -105 1832 -2552 -4971 5410 6117 -4507 -3494 3323 4873 3007 -1512 -3207 1943 5599
834 5599 1656 -2208 -1921 -1254 3002 4602 -4589 -6723 2073 2327 -913 -2375 -5234 -862 4755 -1269
850 -1269 -5596 1034 3175 -2127 -2172 2377 1571 1055 182 -2416 2536 5717 -480 -1448 1014 367 2783
867 2783 3268 -1734 -2893 702 1526 -111 -136 -1335 -3173 -787 427 -116 951 -3937 -5955 3231
883 3231 4940 -2758 -3810 -583 1180 2950 1243 -2377 -718 3653 1525 -691 2874 1094 -1555
898a555M329j225l916M797Q93o756r6O288k01n116k85Q98L02M299j913p136M082
915b311O137l287k738J384L30P93L159j935n582M232N974n335k842M128l21q27
931I59l24j233J985J416n239k503P552L249r453l451P784J437k556p07k168J098
947b154L770p58k648J695K753l122k897N788K578n052o49M71j175M793M200q892
963a299p047J0701O293j0942j785O532m841M5O373n578l167O154k014k998O237
978B664k184p178Q854L997j3210L767J2091r998m391J1053l151m981O100k008
992A425l902O024j039o445O206R41q442P318N487j4712N94J4127n653p978N506
1007e43M83k918K927K265k060l116m86N399L826o993m882Q007K331n022J141M34
$$ plain form
898 -1555 2774 1549 -2367 2430 3323 -3433 -3529 2759 2558 -2558 -2843 -1945 -1643 2656 743 -6393 -2311
915 -2311 3826 539 -2199 -815 -485 308 3467 1532 -4050 182 6156 821 -2021 2107 1786 959
931 959 635 -598 1387 2803 -2436 -4939 2613 5862 -3591 -7042 742 2179 -377 -1084 -3252 -2154
947 -2154 1616 858 -1790 -95 2658 -464 -3361 2427 5005 -47 -696 -225 -1400 3393 7593 -1299
963 -1299 -8346 2355 8648 -2294 -4079 2453 -2388 -2343 4030 -1548 -4715 1439 -575 -3573 2664
978 2664 480 -6698 2156 6153 -7057 -3290 8801 -1197 -5588 5465 2314 -2667 3433 1425
992 1425 -2477 3547 2508 -3937 2269 3210 -5232 2086 7573 -7139 -6545 7582 1929 -6049 -543
1007 -543 -60 -2978 -51 2214 154 -2962 -3448 1951 5777 -1216 -6098 1909 4240 -782 359 793
1023G93L33K373n581J66R083o846p250J1081m23j1033Q943O312j5520J148J5058
1038H637p684p570P962l984q3R903j0129n624J4633m013r222J4038r16j8430J1115
1053a367J6178j5878q014J2988o14l184L216o360J869P668q944l133J0451k696
1067B180o383M373o06l320O149J793q486j482N430M117k94r158j628J3778j652
1082D811j0388O739K319o967M998L072o506J749J946l428N081J073j0837N768
1096e70R940j2795l160J3937p299q287J1854r08r144O821J626n737L468J310l334
1111b278L227q15n213P487L625j0248K087P164n545J070M159o519N03L841k524
1126B1K579J7q272M292Q638q412m302Q261l558m307Q400l265o485Q726j698o365
$$ plain form
1023 793 1126 3499 -2082 -1916 7167 321 -6929 4152 3729 -7304 1639 7951 -7569 -6421 8637
1038 8637 953 -6617 1345 -2639 -2722 7181 -2948 -8572 6061 2048 -7174 6864 5948 -12482 -1367
1053 -1367 14811 -1067 -9081 3907 3293 109 3325 -3035 -1166 6502 -2442 -5575 4876 2180
1067 2180 -4203 170 -436 -3756 2393 4186 -4300 -5782 -352 3765 3471 -5687 -7315 6463 4811
1082 4811 -5577 1162 3481 -3486 1512 4584 -1922 -173 1773 -1655 3426 4499 -6338 -570
1096 -570 9370 -3425 -6585 7352 53 -8234 3620 2712 -6432 389 2015 -3722 -254 1056 -2278
1111 -2278 949 134 -5079 2408 6033 -4215 -2128 5036 -509 561 4720 -1799 -1296 2545 21
1126 21 2600 2617 -5655 -1363 7275 -1137 -5439 2822 -736 -5043 3357 92 -6393 2333 635 -5730
1142e730R117o82q057P278N40p550R127K615j3749M662J2243r629l882Q469m795
1157b3k143O716n536j304O666p851j347J0969n699o509P910k277m585R307k222
1172B072j0461Q003N433p871L088J949o760P984K490j2357O959Q272j3714O72
1186d241J3076q188o851J0087o43o561N078r85m157O141l056o066J0419q89j1444
1201h280P731O485r353J053N829o151j365Q427j207o890O65L627L815m80q054
1216d148J293Q128l521l858L812j701j836L197n01k79J45l405K157M638o494l524
1232e897J0541j429j1936O705Q529p827j178L520m029K778M703n623j967L337
1246B27p48L281K719r624j807J3870j088j3702M019Q727n448k909L076N21j085
$$ plain form
1142 -5730 3387 2705 -5352 1926 2466 -5084 4043 6658 -7091 -2429 9814 185 -3697 4772 -23
1157 -23 -2166 4550 -986 -2290 4376 -3475 -4822 6147 448 -6061 1849 -428 -5013 4294 2072
1172 2072 -8389 -386 5047 -2824 264 2213 -4547 3437 5927 -6430 529 8801 -4913 -4241
1186 -4241 8835 647 -6204 3883 3240 -3321 1757 772 -3385 2756 -300 -6366 4053 3164 -8280
1201 -8280 -549 5936 -3417 -2364 3465 -2686 -4051 4376 3169 -3721 -3056 571 4386 3906 -4148
1216 -4148 -2855 5273 1752 -2106 1706 5 -1831 1366 865 586 731 -2674 -517 4121 -2373 -5897
1232 -5897 4644 3215 -8721 -2016 6513 -1314 -2492 1028 -3001 -223 4480 -1143 -3110 227
1246 227 -521 2760 5479 -4145 -5952 7918 6830 -6872 -2853 5874 426 -2483 593 1114 29
1261B9j010K41K355k116k242K445J170l269k22L662K99k869r17K486L784k717
1277A109n413M959K952n749L044L637p990N53R705k791q382K735M241j214n57
1292H39k767j860O325p54o943N584L574q944J346Q004m628m389M903P83l478L094
1308F89K069l992P54K703k617J462J624l371q9J874o59R73J585l425l443M046
1324A83M837m449n660K863L953j006k589K02J595p28j14J763j170q81P43L09L46
1341A97R0m1J254q74r79J508J327j666j848J383J262j917K45J149k183N6K242
1358A205l29k286q88J601J458j236j380o5J647J546j707l97J421o05j92O24N21
1375I38Q9j312j02R52J156Q46j904l007K173L199j327l828p59M210N16l431J59
$$ plain form
1261 29 -981 -740 1615 -501 -2743 -298 872 -2397 -2619 1043 1342 -1527 -2444 42 3826 1109
1277 1109 -4304 655 3607 -2142 902 4539 -3451 -2898 6807 4016 -4366 -1631 2610 1396 839
1292 839 -1928 -3788 2537 1783 -5160 424 3998 -4946 -3600 4404 -224 -4613 290 1073 -2405 689
1308 689 2758 -1234 -480 2223 -394 1068 2692 -679 -768 1106 447 1420 3005 -420 -3863 183
1324 183 5020 571 -5089 -2226 1727 721 -1868 -1666 -71 -799 -913 850 -320 -1201 -458 -149 197
1341 197 287 246 1500 626 -353 1155 2482 816 -1032 351 1613 -304 -59 1090 -1093 -1037 1205
1358 1205 876 -1410 -2298 -697 761 -475 -1855 -1920 -273 1273 -434 -831 590 -15 -207 417 938
1375 938 1027 -285 -387 565 1721 2567 663 -2344 -171 3028 1701 -2127 -2886 1324 1840 -1591 -1432
1392a432J877n01j327r4J902J68j960j72R72J126N99j414l20K63N57K247r32l466
1410a907Q15K859L11k183j31P61j078Q52K453k620k815K062J561l25j469j012
1426a866J372J546j159j892J892K577l903k226N271Q35m009K19J894j24L87N96
1442A410j531p67J972L53j620Q79l27j194J698k69j042J682j241k382K548K673
1458B842l336m005L444L909k136l005k16K150K869j487l789J442K760m15j816
1473g89O94J485j326j57J780j384j91K600k219l292K472L848k084m041J342J164
1489i8L94J960k687l773K950K763j625l86p86j372K898L196l816k950M594K011
1505C273m522K37K472j30m0j539n63L041O98l621r63K892l19k187R34K91j374
$$ plain form
1392 -1432 445 -56 -1383 -1477 425 593 -1367 -1539 -567 559 1158 -256 -576 -313 244 2491 1559 -1907
1410 -1907 -1092 1767 2078 -105 -236 525 -553 299 2752 132 -2683 -621 940 615 -854 -1866
1426 -1866 -494 1052 -107 -1999 -107 2470 -1433 -3659 1612 2447 -1562 -1343 551 427 814 1410
1442 1410 -121 -888 1084 1437 -183 696 369 -825 873 604 -438 1244 3 -2379 169 2842
1458 2842 -494 -4499 -1055 2854 718 -2287 -2503 -353 2516 1029 -2760 -1318 1442 1027 -789
1473 -789 -95 1390 64 -93 1687 303 112 2712 493 -2799 -327 3521 1437 -2604 -1262 -98
1489 -98 296 2256 -431 -4204 -1254 1509 -116 -502 -1288 -2660 238 3434 -382 -3332 1262 3273
1505 3273 -1249 -1012 1460 1330 1290 -249 -812 2229 2927 -694 -1657 1235 916 -1271 -337 -46 -1420
1522a420P96J341j232p27O35J51k37p4J362j048j980L047K290k632j934J608K362
1539B308K86k470k344K184L763k696l696L219J792l389R60J015k298P69Q82j996
1555a711L89J753n14p45L5o46J574K433k963l031L612K020j804mj44j077J352
1572E29J926j63k595k388K899L411k981l609K564K012k105k60J340j411Q31q3
1588h3k758K311K925l545j274K709m82Q46J760l471k187N141J259m952O44K891
1604A734j740j73J534j054L47k76j211K017J56l074M97K607o88j968J045K27m40
1621d60O38k97k7l51j699J892L015l925r06L737j873p41L855k682l395M431J646
1638B858m034R65K172k921J287J909m205K311L813p103j512Q486j591o328K684
$$ plain form
1522 -1420 -624 717 -515 -1242 -607 -456 -693 -767 595 -453 -2433 614 2904 272 -1662 -54 2308
1539 2308 2594 124 -2220 -36 3727 1031 -2665 554 2346 -1043 -83 932 -1366 -597 285 -1711
1555 -1711 -1322 431 -83 -828 -793 -1439 135 2568 -395 -3426 186 2206 402 398 254 -823 529
1572 529 2455 2292 -303 -2691 208 3619 638 -2971 -407 1605 -500 -760 580 -831 0 -83
1588 -83 -2841 -530 2395 -1150 -2424 285 -197 649 2409 -1062 -3249 1892 3151 -1801 -1157 1734
1604 1734 -6 -179 1355 301 648 372 -839 1178 1334 -1740 -1243 1364 676 -1292 -247 -20 -460
1621 -460 178 -119 -146 -497 -2196 -304 2711 -1214 -2120 1617 -256 -997 2858 176 -3219 1212 2858
1638 2858 -1176 -211 1961 -960 327 2236 -1969 342 4155 -2948 -4460 4026 2435 -3893 -1209
1653a209K195k595K369J488n342N07M981k200k036J989p91L36J756j791m03L215
1669B469j082l654K129M153l340m031L912K713l568j637K904K48k561O72J734
1684A061j869n42J173j263Q36K086k773q24L121j156q63L286k253m180N568L826
1700E234p231r46O704k511l190M409r31l657K336J314j799L81m79j700L151J065
1716B150n425J093N930m327m504N642K088m495L8K266m25J71J512j658j958K343
1732D41K363j770k056r0J975J568j135k599L56K720m27l846K085K945m365j510
1748c345N650o74n073K714K770l425n61L671j960j645K585j074k59L513k887k390
1764b390M760m40l806L534M64n452K678N521n216l458N605J0l067J722o90j483
$$ plain form
1653 -1209 986 -1609 760 2248 -3094 -2587 2394 194 -1842 147 -644 -308 1448 -343 -746 2469
1669 2469 1387 -2267 -138 4015 675 -3356 556 3269 -299 -1936 968 1216 -1345 -673 1061
1684 1061 -808 -1350 -177 -1440 -604 1482 -1291 -2115 1006 -150 -1013 2273 20 -4160 1408 5234
1700 5234 -1997 -2943 3761 1250 -1940 2469 1538 -2119 217 1531 -268 113 -366 -2066 1085 2150
1716 2150 -3275 -2182 3748 -579 -5083 559 2647 -1848 -1810 456 31 202 1714 56 -1902 441
1732 441 2804 1034 -1022 -1112 863 2431 1296 -1303 -947 1773 1346 -2500 -415 2530 -1835 -3345
1748 -3345 2305 1631 -3442 -728 2042 -1383 -1944 1727 -233 -1878 707 -367 -626 2887 0 -2390
1764 -2390 2370 1930 -1876 1658 2122 -3330 -652 4869 -347 -3805 1800 1810 -1257 465 -225 -1708
1780a708K145p97r38K137r25k624K938K264l020j294K309P1n51L36k17K50l56
1797B0l92J714j77j809J909m80l146K912K412l689j550K583O93k76m69k781J580
1814i46L947l990k335N343j474m161N008R40n120K147K631l258J389K102l795
1829a572K17L803k171j126K811k379q14M391k427l366L809pl465K349J749k348
1845e46m46K44J31J533j81l166J629J992k526R35K424l300l69K914m67p24P05
1862G82j452l2K385q75j177Q53o34k1K628k087l065L483J326l744M05J982r05
1879a48l41j94m13J400K06j975M32K209j405r17K241j059j228K598O6k001M85
1896d4M47Q4P34p63j034P33N2n7R54r42k248J319L170k283k761J978J383p73j077
$$ plain form
1780 -1708 437 -360 -1298 839 -86 -2710 228 2492 -528 -1822 487 558 7 343 126 376 20
1797 20 -372 1342 1165 -644 1265 785 -2361 551 2963 -726 -2276 307 1000 724 255 -2526 -946
1814 -946 3001 -989 -3324 2019 545 -3616 1392 2332 -2788 -641 1990 -1268 121 2223 -1572
1829 -1572 -1355 2448 277 -849 1962 -417 -1231 3160 733 -2633 1176 1169 -2296 53 1802 -546
1845 -546 -992 -748 -617 916 735 -2431 -802 1190 -1336 -401 2023 -1277 -1646 1268 801 77 782
1862 782 -670 -702 1683 808 -369 484 -150 -171 2457 370 -2695 788 2114 -1630 -1225 757 -148
1879 -148 -489 -683 -1096 304 510 -1465 -1033 1176 -229 -1146 1095 36 -1192 1406 1472 -529 -44
1896 -44 403 487 1221 458 -576 157 209 152 1106 164 -2084 -765 2405 122 -2639 -661 722 -51 -1128
1915a128KJ524J61j582K87J842n04j295M96R29l15o1M51q61k11J187J44o32p81
1934c47j95R04L5n41L78r93m09J100J303q44k248m1K710O36k352j082J905J716
1952A635j947n63J641jj052J81N36K25j32m72M4l85R22N20r39p65k53R64J006
1971A165j452j054J025K79n3K42k41p94PJ168N88j462q16J311J211n05j572L31
1989f22J748j44q80k10O28L24q32l06Q91j83m73J02j87r9L78L59j020q57J285
2008i8N18p27j85k30J16J056J58q84m78j5R05Q57k27j464k39K205O96k023p80
2027h39J000O91m91o71O18J75p54K19L3J86L62r79o14R92M06o62j93j88O9O46
2047FP83j123m63J239l28j041J935K14k258N30J352L14o77n51o07J034J307j856
$$ plain form
1915 -1128 -1126 398 559 -1023 -736 1106 602 -693 -197 732 417 356 807 -54 -265 922 1066 434 -347
1934 -347 -542 362 397 -144 234 -759 -1168 -68 1235 391 -1857 -1898 812 1448 -904 -1986 -81 1635
1952 1635 -312 -875 766 765 -287 -106 430 655 523 51 95 -290 632 1152 213 -552 -805 159 1165
1971 1165 -287 -1341 -316 -37 -90 152 -89 -883 -876 292 880 -582 -1398 -87 1124 619 -953 -622
1989 -622 1126 982 102 -108 520 844 12 -294 597 414 -59 43 -144 -243 135 494 -526 -1383 -98
2008 -98 420 -307 -492 -722 -606 450 608 -276 -754 -769 136 993 766 -698 -937 1268 1964 -59 -839
2027 -839 161 852 361 -310 308 483 -271 -52 -19 167 529 -450 -1064 -72 334 -328 -521 -709 -640 6
2047 6 789 -334 -797 442 114 -927 1008 1222 -1036 -506 846 1160 483 -68 -675 359 1666 -190
2065a90r59J812M5j588N04Q18q93j39O87m23k43M16L16q61J59R86k82n57L72L97
2085C77j01rl12p7K69Q35j051M0J272j589p09K941m84l306R91J703o44l32K80
2104I4j244k5K127j123o97J544j217q64K293j52j861J148M43j160Q49J599j578
2121A76j167J524P25j482J97N98k76l23k30N22M06p71p41M22O36N27j564p22J652
2140A09L15j217O90N32j532P01K394k384j173K871m99k152K648k28k659K022J317
2157A755k174L16Q95j837J114J876l203p95M279j551l530L142J442l300Q01J195
2173D25j239Q46R30k265K41K229q40r44P81l34l31J997n73k009Q45J424q25o42
2191b84Q73J70j478K4K119q74j964P43J100o44j45N39m36k30P89o57l59J912j319
$$ plain form
2065 -190 -1149 663 708 -880 -376 442 -451 -590 97 -326 -569 -153 163 -698 -539 447 165 -392 -20 377
2085 377 276 267 -45 -122 147 982 -69 -29 1243 -346 -1055 1886 1402 -1904 -913 790 146 -186 94
2104 94 -1150 -1175 952 -171 -868 676 -541 -1405 888 736 -1125 23 466 -694 155 1754 176
2121 176 -991 533 1258 -224 -27 571 295 -28 -258 264 670 -101 -842 -420 216 743 -821 -1543 109
2140 109 424 -793 -103 429 -1103 -402 1992 -392 -1565 1306 807 -1345 1303 1075 -1584 438 1755
2157 1755 -419 -103 792 -1045 69 1945 -1258 -2053 2226 675 -2855 287 1729 -1571 -770 425
2173 425 -814 32 962 -1303 -1062 1167 327 -617 164 -170 -501 1496 923 -1086 -241 1183 358 -284
2191 -284 589 759 -719 -695 1424 550 -1414 -671 429 -215 -360 179 -257 -487 302 -355 -714 1198 -121
2210a21j762K399N53k252J882P92l285J182L462k472k404K742L71j585J166k10
2226D58j991J911M85j805J405j18k078J675J726k766p56K795p8k131P59R17n69
2243a61J88l41k53J406n11n55M69m62L62J178j311q67J035P71l77n11q35N79J701
2262A505j238k024K239L50l067K306J612l121j40K790j165p15J267j128m85K443
2278A429j294j437K403k17k473K599Q31l242J521J740l044L94K835j718j677J509
2294A59J78o33P75q83j040J956j41j694J908k70k161J737J595j805o38P95M96
2311C34K17k76p45O73L62p19K96P82j315K10J241j128o45J374j88r41l0L27O55
2330D84k91j303Q2J825k03j853J013P29j203L51J198j066n65J058N5P8l5q06N97
$$ plain form
2210 -121 -1883 516 1069 -1183 699 1491 -1794 -612 2850 378 -2026 716 1087 -498 668 458
2226 458 -1533 378 863 -942 463 345 -1733 -58 1668 -1098 -1854 941 863 -1268 -509 408 -161
2243 -161 27 -314 -567 839 328 -227 242 -220 142 1320 9 -858 177 948 571 60 -775 -196 1505
2262 1505 267 -1757 482 832 -2235 71 1683 -1438 -1578 1212 47 -668 599 -529 -1014 1429
2278 1429 135 -1302 1101 884 -1589 1010 1841 -1401 120 1860 -1184 -790 2045 327 -1350 159
2294 159 337 -296 479 -404 -1444 512 371 -1323 585 315 -1846 -109 1486 -319 -957 -162 334
2311 334 551 275 -470 203 565 -154 142 924 -391 -181 1060 -68 -713 661 473 -468 -498 -171 484
2330 484 193 -1110 -1028 797 594 -1259 -246 483 -720 -369 829 -237 -802 256 311 389 354 -452 145
2349A45P06l16o77M90l77k56Q95mj262J03Q87j46m84l45N83J86p75K93R40o03
2369a7p86N13O85l17n08M67J92m27kO68M03o56j058R31J178j129l71K88k82M95
2389B67L56q37l47K75N79p3n80l49L18R30o07q62J162M90j243L24M95q5k28K4
2409Ir9N13k79o4K77J01p07L95Q09p48j134J025M65n69J13k97l38M61J84N7p29
2430e55k37M68P97k05p50j20J093k48p08O55rj26mlL47j0m89K27K50q2k98J30
2452A23j02k64J01L00j73m72J89qL88J89m31k69j14K26Q29k79q88k47J267M83
2472H48j096k27Q41l72K17L27k19j66k21L7K43L6k40j93K00J6m5M0K73n91k94
2493e86K92M80j11m41O6L12J3J09J40q13L40O19n5n49K56J60J7J03j57k71J14
$$ plain form
2349 145 851 535 -142 348 -29 -285 610 606 -656 -553 334 188 -296 -641 -58 128 -647 -354 586 -17
2369 -17 -803 -290 395 78 -430 37 229 -198 -200 468 871 215 -843 88 1266 137 -234 54 -228 267
2389 267 623 -214 -561 -286 293 220 -360 -709 -391 539 -68 -930 232 722 -521 -197 298 213 -15 9
2409 9 -90 423 144 80 357 458 -249 146 955 207 -927 98 563 -6 107 -190 -528 -67 117 174 -555
2430 -555 -792 -324 473 268 -482 -602 491 243 -465 190 181 55 51 48 395 385 -104 123 373 291 -7 123
2452 123 21 -243 -142 158 -15 -487 -298 -306 82 271 -160 -429 -543 -317 512 233 -655 -902 365 848
2472 848 -248 -475 366 -6 211 538 319 153 -68 -31 212 248 8 -185 15 31 -14 26 299 -292 -586
2493 -586 -294 186 75 -366 -300 12 25 134 274 -539 -199 420 365 -184 72 232 249 352 195 -76 38
2514C8M19o10K87L74j040J92Q39l77n99K93J32l83L23M37p45Q2O23n42J67M48
2534C58l58j16Q1P1kN47n8p67Q4J116k69j259L53M95k32L39j13n29J1M59O6o20
2556c43O1q0j82N82K17r42N53M28n80J75M77m55l58R14j50n92K29N26m75j30O17
2577D92k39j66N4l46m8P80j54q07O0N49l58N8K08o25l11R30N77j092k52O43P2
2598B5q5L51k08p07R29J62n62L00K06n73L48N19j007J93R33n89j084J282L53j402
2618f16J7Q71m73j35O01p89j39Q43J71o69K88j24k76O95N87j239j03J005j06n16
2638a07M06R2r99O52R19q07q80R53L09r48M05L23n25K53J00p68L79R65j078m47
2658h03J418j02j351J031J11j215Q57J008q44p67J033O7l25L98j76r88P56O76
$$ plain form
2514 38 457 -153 134 508 -532 -340 499 122 -477 -184 -52 -435 -112 325 -420 -338 285 -257 -90 358
2534 358 0 -116 -35 36 34 581 523 -244 -160 956 687 -572 -219 276 44 383 270 -259 -248 211 277 -343
2556 -343 -282 -362 -544 38 255 -687 -134 294 -286 -111 366 -89 -447 467 317 -275 -46 480 5 -125 492
2577 492 253 87 141 -205 -253 527 373 -434 -374 175 -183 -125 83 -542 -853 77 654 -438 -690 -47 25
2598 25 -60 291 83 -624 305 467 -95 205 411 -162 186 705 -302 -109 824 235 -849 433 786 -616
2618 -616 -599 272 -201 -336 265 -524 -663 180 351 -318 -30 -154 -430 265 852 -387 -490 515 409 -107
2638 -107 299 391 -608 44 963 156 -724 229 538 -410 -5 318 -207 46 146 -622 -243 722 -356 -803
2658 -803 615 513 -838 193 304 -911 -54 954 110 -657 376 443 118 516 340 -648 108 784
2676G84q52J39K92j113O55J001j040q72J109L73j037M2J004n83m73M61k16L41
2694A5K63n13j38N31P4l32L51J27q26N34P18r02n55R54K34n05j26J99j04k58L31
2715G2L22r01j81P97J30n19K7OJ62M08l09m80M15N34j082L92J537j472o52J366
2735E72l49p36J103P9j180J90J036p23R9J68j100N58J212j113m45J152r46l44
2753g67J291j66j301O92P96o32k93O22k91J22J7l91M04N64q68Q5M41l20KJ76k39
2774e6J1J55n7j01j10j51L92L88p57j87P42l10m85R11m25p82Q03L09l47J97k06
2795f6k43R52J7q49M8P87q02K2R04n58p47Q20j39l21M34k18j23j2j5j31L09j29
2817f0l89K61L01l93O5K52l25M5M81j07j00o5p0O20K2q01J05O94l15j34K01l64
$$ plain form
2676 784 -68 71 363 -750 -95 906 -134 -1006 103 476 -561 -519 485 -98 -571 -110 -326 15
2694 15 278 -235 -373 158 232 -100 251 378 -448 86 804 -98 -653 301 535 30 -96 103 -1 -259 72
2715 72 394 -507 -688 109 239 -280 -253 -247 -85 323 14 -466 -51 483 -599 -207 1330 -142 -794 572
2735 572 223 -513 590 669 -511 -321 715 -8 91 259 -841 -283 929 -184 -629 523 -423 -767
2753 -767 524 358 -943 -251 545 -87 -380 242 -49 73 90 -301 103 667 -201 -116 325 5 7 183 -56
2774 -56 -45 110 53 -48 -158 -309 83 471 -286 -473 269 -41 -526 385 -40 -822 -19 290 -57 140 -66
2795 -66 -309 643 660 -189 -141 646 -156 -134 770 212 -535 285 146 -175 259 41 -82 -94 -109 -240 69 -60
2817 -60 -449 -188 113 -280 -215 37 -288 -243 238 131 31 -34 -104 516 538 -263 -158 536 221 87 288 -76
2839g6p4L67J36o39J19K0k0L03j53l13L28k10l46P37J96p76L9N38k71q9K97p8
2861C5j35J50O1J92K24p45q9R35k90n53L03q4j27K23K10m21j19J42P5jj82j63
2883c59L77L41n85N5K01k45k5M47n2Ml45M86k9k31J6K7K77k47k72L07K17n89j34
2906c58K62O7l0n8ll7J23K26l38k97M4M67Rj05k48K55J46j68K62n6j27l2P0K81
2930C55j17j98p1K71j40k10L5K43l29l89O37L8j36j44K4j13M33l3j63j76j06M04
2952A15K10l83k83J37O30l76j02J10j19Q6K17o7j55q3j3L23O6m95N3K16O8l70
2974b15p6L06j89N5m0MJ03J70n65L94O9J64J17k86m12K30Q70m97m31J65K91m9
2996A78P2j56l07J75r7J57K55k88l83K44K39o3l88J63L80l10K8J48j46JP2l8J4
$$ plain form
2839 -76 -150 217 353 -286 -167 -147 -167 136 -17 -330 -2 -212 -558 179 375 -401 -362 176 -95 -184 113 35
2861 35 -100 50 111 303 527 -218 -307 628 338 -215 88 4 -123 100 310 -111 -230 -88 -13 -14 -196 -359
2883 -359 18 359 -226 -171 30 -215 -240 207 155 159 -186 300 271 40 56 83 360 113 -159 148 365 -224 -358
2906 -358 -96 -29 -59 -117 -120 -157 -34 192 -146 -443 -399 68 77 -28 -276 -21 125 -43 219 163 36 4 74 355
2930 355 238 40 -31 240 100 -110 -75 168 -161 -550 87 125 -11 -155 -131 -244 189 156 -7 -183 -289 115
2952 115 325 -58 -341 -204 426 50 -52 58 -61 25 242 175 20 -63 -76 247 313 -182 -129 87 155 -215
2974 -215 -291 15 -174 -119 -159 -155 -52 118 -447 -53 16 180 297 11 -401 -171 699 202 -229 -64 227 178
2996 178 250 94 -213 -38 -135 22 277 -11 -394 -150 89 26 -362 -199 181 -129 -101 47 -99 -98 -26 -64 -50
3019e0J7K80j84k67L61K09q0l24m1Q2L64k99m03L34M48k81l62L13J8o99M07O61
3041E04o43l11M56M6j72K50m08Q5L60P6n11L83K22o21M06K01l27k9L37l15k65
3062b76N42K35o54k26L06K08j58j40j93K81O1J1k15L08m20N6K83J10k25j54M06
3083A46P4m92L95J60k46n5M90k93l93L57J48l91K04J27m09J96R6l01J10J93m57
3104c41L6M61J03q06L93J74j65j23M68k9l98L18R7n0N8j68l41L19M31l27j12K08
3126B06j48j39N50m66m01O21J02o02L9P20n06m26L68J41j62o8O6j93N46j15k70
3147a37m4K31j27r2N51k41l88L58K43k73K5Pk49N4K47O4k27j23L17pj44k27J16
3170f6q0K46J0k32J61r3k40J60N05l11l46L56J13l80L16K61n03J56M45k14k51
$$ plain form
3019 -50 -33 247 63 -204 157 366 286 -38 -79 3 367 68 -335 -1 447 166 -196 117 135 -564 -157 504
3041 504 -139 -450 6 52 -120 130 -278 -193 167 243 -268 115 337 -284 122 323 -4 -33 304 -11 -276
3062 -276 266 501 -153 -379 -73 135 -23 -163 -356 -75 -14 -3 -218 90 -330 -274 9 119 -106 -260 146
3083 146 220 -272 123 283 37 -18 472 179 -214 143 291 -100 104 231 -178 18 114 -187 -77 116 -341
3104 -341 -305 156 259 -547 -154 20 -145 -268 200 171 -227 91 188 138 196 28 -313 6 437 110 -2 206
3126 206 58 -81 469 3 -398 223 325 -277 -238 482 -24 -450 -82 59 -103 -171 -105 -298 248 133 -137
3147 -137 -181 50 -77 -169 382 141 -247 111 354 81 106 113 -136 -82 165 229 2 -121 196 189 45 -182 -66
3170 -66 -146 100 110 -122 39 -54 -294 -134 371 60 -286 70 183 -197 119 380 -123 33 478 264 13
3191A3J05k31l15O26K7l66J19P7m31O68J11r88J79P95l94k35J10K52k23k1J08
3212a4o8L07p7l17M66Q4m10R5K1j19J31J09j39j10j52K34k9J8k13K23j88M3K94
3235A89j71m37J64N53k89k74M0K31J76N4n06J97L80j27l70O00j29m20K03K77k09
3256A32q5M0m07L17N7k77J98n2j7J42N4j83j52L26p3j47L11Lk89K8l3K02K07n58
3280b56kM63J30l12NO1m8k6K64l07p6n1K0J84P9l00J8J63k25K01O4k8j83K27K5
3305I0o0m0J30j09j08lM28j27l43L9L83J17l97o6J0L37k0m00J51J42k30k0J11
3328A5on9l4L72l84mJ78k37o8M80q6l42J89%O4K74k36j36J53L1l90M95J46o08
3352a93L1L13k7k2k56j05M7J76QJ30j09m82L13L67l42J7j33J24J46K63n3k09K01
$$ plain form
3191 13 118 -113 -428 198 225 -141 -22 55 -376 292 403 -585 -406 389 -5 -240 -130 122 -101 -122 -14
3212 -14 -82 225 148 -169 297 381 -29 66 87 -32 99 208 69 -41 -193 41 12 30 -183 40 -148 -105 189
3235 189 18 -419 -255 298 9 -265 -225 6 182 236 -270 -73 307 180 -190 410 281 -139 64 341 132
3256 132 47 87 -320 -3 54 -223 -25 -77 -94 48 102 -81 -233 93 20 -127 184 187 -102 -74 -107 95 302 -256
3280 -256 -258 205 335 23 28 89 41 15 279 -28 -104 -155 -135 49 128 -172 -154 9 -216 -15 49 21 -162 65 90
3305 90 30 -10 120 11 -97 -100 328 201 -142 -103 280 397 0 -66 -56 281 261 -139 12 154 -76 -96 15
3328 15 9 -50 -84 288 -96 -100 78 -159 -227 253 167 -175 14 14 78 352 116 -20 133 164 -226 269 415 -193
3352 -193 -162 151 124 102 -154 -259 -212 -36 -28 102 -7 -489 -176 191 -151 -134 -267 -143 3 266 213 4 205
3375B05k98K03K41l41j87L81j09l23N67j5k90k33K42N6j14P0p2n0J83j46j68K47
3397D9m4l37K95Nm57M16L87n28J85L0j0o5L49j53l9N0p2J72J10m23n8K74l8j49
3421e1J0J08r4r3k2L44j62j8l55K04K34j54P3K8m89N27NJ4r6j70J95J07K03m43
3445i5P0k4K3K5K53k74m70O44n4j48R0o0J48l87J25K8N4p2k7j69M68r2j00Jq5
3470a28K10J26l7k79OR2L50k71k19K02Q0j05O7N7k58j69K08L51j98m03J72K46
3492A00m8M3l15K86j05J18j43l0N5j20J28K98l00J38J18k94M7L42k26k46K4J59
3514B9K75j38j99N2KJ21j28k0m3k25K39P8J65n9m57K32L54k60j9P5q7Kk6J94j03
3539E4j23J54j58k5L04j13k32J35j73L62O6k01k52M79j49l42N0J31j62N2J99%
$$ plain form
3375 205 -93 110 351 10 -177 204 95 -228 339 324 34 -199 43 99 -15 55 -17 -67 116 -30 -198 49
3397 49 5 -332 -37 -32 -489 -73 314 -214 -29 1 -9 -74 275 122 83 133 61 233 343 -80 -138 136 98 -51
3421 -51 -41 67 -27 -120 -142 202 40 22 -333 -129 105 -49 24 52 -437 90 95 109 13 -157 38 145 348 -95
3445 -95 -25 -49 -26 -1 252 -22 -492 152 98 -50 40 -20 128 -259 -134 -106 -52 -124 -151 -320 148 56 -44 -43 -128
3470 -128 82 208 171 -108 -102 -10 340 69 -150 52 132 27 94 151 -107 -276 -68 283 85 -318 -146 100
3492 100 52 95 -220 66 -39 79 -64 -94 -39 -159 -31 267 -33 105 223 -71 -24 318 92 -154 -130 29
3514 29 304 166 -33 19 21 142 14 -6 -49 -274 -35 43 208 149 -308 -76 278 18 -1 74 -13 -11 -37 157 54
3539 54 -69 85 -73 -98 206 93 -139 -4 -177 185 251 50 -202 277 128 -214 -164 -33 -195 -143 56 56
3561E6l13J44J84R5J17m47O2K18L4j10K2Q0j59j23M87k92l11K05K27j29k20L23
3583A50L9l11J07J98l04P7j94J58K31j33j85J91P3l22J3M45o5m69J06M89k50j84
3605a40L07j30O1J07q2k46R7O5L07k43q4k23K8L53j63q1K01p6k67J2L19Q6n12
3628c04J38J90K1j06K59k27j42J21K04kn3j11k21L56P3j60j89L10j95J78N9l34
3650a35r3M42j87j42L7l3P0N8j12r3K22J10k17Q0L07m84j4L73j32nJ62Mj90q8
3674f0J70J11j58j56J5J62O7k36Q5k22r7M50l1j99k46J76K78Kk64N4J14l4pK8
3698BK33l80k3L28k9k12MJ87r7K8l9j6Q3j15l8J56j45P7r2jo6Q7J42J00m17L46
3724A03J6n5j55j62N07q7m6j81L2L0P4M5j27k7J8Q4n4Jj1k9J12n5k14K05K9k33
$$ plain form
3561 56 -257 -113 71 166 283 -164 -102 116 150 40 62 142 -17 -140 347 55 -256 -51 176 47 -173 150
3583 150 189 -122 -15 183 -121 -44 -238 -80 151 18 -167 24 97 -225 -212 233 168 -301 -195 294 44 -140
3605 -140 167 37 98 205 123 -123 -26 39 346 103 19 -204 -176 177 14 -67 134 58 -209 -197 122 208 -304
3628 -304 -166 24 45 -61 198 -29 -171 -50 154 152 99 -12 -233 123 196 36 -153 157 -38 140 199 -135
3650 -135 -228 214 27 -115 -78 -111 -41 17 -95 -188 34 144 -73 7 314 -170 -184 189 57 52 214 218 28 -60
3674 -60 110 221 63 -93 -78 84 151 -85 0 -222 -319 131 100 -99 -345 -169 109 111 -153 -99 15 -19 -26 2
3698 2 235 -145 -168 160 131 -81 -77 110 13 41 2 -14 69 -46 -84 72 -73 4 -88 -89 -155 -68 74 174 -243 103
3724 103 119 64 -91 -253 254 167 121 -60 -28 2 76 121 -6 -33 -15 69 15 16 5 -24 88 33 -181 24 53 -180
3750a80LK17J10j78J87q4k35P5L69k53j34J74m2J28p1k68Q6L18q0qJ5m1k89M04
3774B23j96q7q4L8K20p7r8J18j4j80K05j5j80M7l1R7N7m1j9K05r3j70K14J32j20
3799A51l96L33K38l85mK27rj67K18j18j47j72J19K63m7k26j22L65J10l93K48n8
3821B8k39J05J64J60k47j16K12l1P1m8J66k00r1J57K08l41j29L2J81J17j29k07
3843a77J37J15j87J19rj76p9M83k53j78K27r8m8R2K18l56J06J02j90K21N4k48
3865a25J05L06k82j69K38Ol01J94K60m29Q1J0J6K41J8k89l1J01j22J78N0l7j78
3888a59K31J7o7M1j12l3nJ18K81j66l50K94K39l73j2K98j36p7n1l4R1p2M2p6K14
3913A43j44j46q9L73k44rK18k89K77J20k4j60Q4p6J0N8q7j11N1Rj0K52p6l26J39
$$ plain form
3750 -180 -177 40 150 -28 159 75 -160 -85 284 31 -103 71 29 157 86 -182 -96 222 142 134 149 108 -181 223
3774 223 27 -60 -144 -106 114 37 -61 57 43 -137 68 53 -127 -80 -111 -14 43 2 -17 188 95 -75 139 271 151
3799 151 -245 88 326 -59 -63 164 155 -12 206 88 -59 -231 -112 151 104 -122 -244 121 231 -162 86 28
3821 28 -211 -106 58 218 -29 -145 67 36 107 59 225 25 -66 91 299 -42 -171 -139 42 159 30 -177
3843 -177 -40 75 -112 7 -2 -178 -257 226 -27 -205 22 -76 -124 -32 186 -170 -64 38 -152 69 123 -125
3865 -125 -20 286 4 -165 73 79 -222 -28 232 -197 -116 -106 -90 151 169 -120 -151 -50 -172 6 56 19 -159
3888 -159 72 89 22 63 -49 -82 -87 31 312 146 -204 90 329 -44 -56 242 106 29 -22 -56 35 -37 5 -71 143
3913 143 -1 -147 -236 137 -107 -116 102 -187 90 210 186 26 110 34 44 102 15 -96 -45 -36 -46 206 130 -196 -57
3938e7K04j43j79L4J43k5m7k5K73k41PnJ3P7r1P0N3j70K20K18l37K32m02J42K38
3963B02k93J30J4M8j41k7K28j95j35M29j02n21K56j22L43j7p8k01J85N3l8Rl1
3986dk47J65J25PP0j35N6r4J36R5N8k61JK0J48j10n2j93K35j23M9L04l73j55K57
4011b1J23k66O8j0J76J32j13OJ18q0j23J56j20j6j71M75l79J09j1M3k18L8L19
4034B35j30p7j34j10J73M0k34M6J03L1n8J96o4n3j83L80j2k03j36K57J63k3Q7
4057B94k60M2k0J05j34Lj93K72R7j42m6q7J26j83m1K85j80o1O8NM7k79J77J51
4081D6j22J71J25l7j26j36J08K63j87j33KM9L9RJ31r1k23J66o2j86J66k6Q7jj12
4106h0J43k77J74j45K63q8j89J13K36o8L3j7k2Q7l96M23J30l30K0m8R6rR6j97
$$ plain form
3938 -57 147 4 -175 -141 2 -23 -70 -95 178 -63 -56 -61 -48 29 -62 8 61 -109 111 329 -8 224 -178 -36 202
3963 202 -91 39 53 101 -40 -67 161 -34 -169 260 158 -363 -107 -229 114 97 19 -182 3 56 18 27 -4
3986 -4 -251 -86 39 46 116 -19 37 -57 79 174 232 -29 -28 -8 140 30 -22 -215 20 -103 -54 250 -123 -278 -21
4011 -21 102 -164 -96 -106 70 202 89 95 213 133 10 166 46 30 -141 334 -45 64 53 96 -122 -84 235
4034 235 105 28 -106 -216 -43 -3 -237 -191 -88 -57 -115 81 17 -36 -219 161 149 -54 -190 67 230 207 294
4057 294 34 76 56 161 27 30 -163 109 206 64 18 -69 57 -126 -167 118 -62 -123 -55 -50 -3 -282 -105 46
4081 46 -76 95 220 183 57 -79 29 292 105 -28 -26 23 62 71 202 111 -112 54 -8 -194 -28 -54 33 32 -80
4106 -80 63 -214 -40 -185 78 -10 -199 -86 150 82 115 98 76 163 -233 190 320 -10 10 -38 58 49 145 -52
4130e2j29J08N5O8p1k2l1K49j67p7J43Q4j29L1l8P9p2R9K8J24k87J01l6j5o1J16
4156I8r4j48J55K0J35j13j75O8mJ96j29L5j11j64R8K64j10j99K2L04o0k64J49
4179b7Pj3J32Q8lk92J19k6J91r4K7j99L30r9l14K54j29R1j42M8K14k37j04O3o8
4204a83J51J26j50k4n0Q0J95j06k00J05L08r9m03K81J51l31Q7L92l05j69L82n4
4226A84j45k6p9q4J55J73jk92N0n7q2K93m7l0L8j01j14L44J59l12l08L49J61l11
4250h3j09K03O0N1J40l77J20l6l4Q5L7L7l85J86J54j16j91N01k55j20K48j49j57
4273a90J66QJ6j03J88j90P9J12k28J59P8j91P8J81L6k98j10L66j10k47L03k0l46
4296b63J86P5J00k49J39M2j0J26r5j70N5M8R5k8M0k20J70K86k28p9K30j85k75
$$ plain form
4130 -52 -181 -73 -18 50 -21 -43 -74 175 8 -69 74 158 29 60 22 101 29 128 156 280 -7 94 58 43 -18 98
4156 98 4 -144 11 31 166 53 -122 -54 -58 138 9 44 -67 -231 -133 131 21 -178 -156 148 88 -176 -27
4179 -27 -20 -33 99 187 184 -108 11 -15 176 82 109 -90 240 141 -173 81 -48 43 -99 -51 163 -74 -178 -115 -183
4204 -183 -32 94 -56 -80 -130 -50 145 39 -161 -56 252 153 -250 31 182 -149 -62 330 25 -144 238 184
4226 184 39 13 -66 -150 5 178 177 -115 -65 -122 -204 89 42 12 50 -51 -165 179 338 26 -282 67 228 -83
4250 -83 -192 11 71 122 262 -115 5 -31 -65 20 57 94 -291 -105 49 -67 -258 243 -12 -132 116 -33 -190
4273 -190 -24 -16 0 -103 85 -105 -26 86 -142 17 95 -96 -18 163 199 -99 -209 157 47 -200 103 83 -263
4296 -263 -77 -2 98 -151 -12 30 20 146 51 -119 -64 -16 79 51 91 -129 41 327 99 20 250 65 -210
4319b10K09M15l85j93K26o6PJ03p9k40J25q1M2K00j43j86J01K62o0j25Q7j04J31
4342C6J19Q5l06J03L1L8j34L9J45k9l6P4j65N8j35OJ18R6j38k02L4L68l79k8K89
4367H7l09O8K28M2k63J62j33K9L07J64n47R4J83j22J99R8n49J20M56k56M3Nl9
4390F7j33K6l9K87l53N0J76o5p9K9m5R8k12K46Nj70l4J38L11k16j17j05L70j90
4414D5j11J64j15r2J25K17j61k31J11P0Q7o5k06P7J37p3J11R2k80j64L15K52k42
4437F3j77K36Rk25M2M0P7r5L8L3j42Q2j17l5K90J5L1p5l05K21J13n4j28p5J27
4462a1J15j38j45R2J55k75J57K42j95j82L4L75j95Q9j35N2m0n6K50N4j29k24M6
4485f4K48j63k3n6j42K13%O4k77L1K57m4P3k75l7QL50j50j26J46j82M6K11j63
$$ plain form
4319 -210 -1 414 29 -164 62 -4 3 106 27 -213 -88 -169 -127 73 -70 -256 -155 107 47 -78 9 -95 36
4342 36 155 240 -66 37 68 106 -28 11 156 127 91 165 0 58 -77 -71 47 143 5 -197 -163 205 -174 -202 87
4367 87 -222 -154 74 116 -147 15 -118 -89 218 382 -165 -71 112 -10 189 287 -262 -142 314 58 101 106 67
4390 67 -66 -40 -79 208 -145 -95 81 16 -63 -34 -79 19 -193 53 58 -112 -146 -8 303 87 -30 -135 235 45
4414 45 -66 98 -17 -109 16 233 72 -159 -48 22 109 44 -162 -85 52 -21 90 182 -98 -262 53 305 63
4437 63 -114 122 131 -94 -52 -12 65 -30 8 41 -101 -19 -136 -171 119 134 165 90 -215 6 119 65 -63 -138 -11
4462 -11 104 -34 -179 -87 68 -207 -50 192 -3 -185 -151 224 29 118 -17 35 -5 -61 189 243 114 -110 -64
4485 -64 184 21 -2 -58 -200 13 13 77 -200 -169 88 44 117 -158 -195 -187 163 13 -113 33 -149 -103 108 -55
4509e5pM8JN0J95j98J9o3L3k06L06k81M4R4K18k03j09J56r0j37J72K91j38j09
4533C1k47K75K49l19k47J09J43Q5R2l50J47l9Q5J36k66m7J14lJ05j49J97k06j83
4556b88K11K13j23j36PJ1P5J52r6J63k44K2J57L08m99j76N54k01j4M0J2k90L73
4579B31p0j46r4k38N31j45MJj18J80k49l6J04J0j24J25M2l3j25n1N39k56j94K63
4603A51j27KO7O6k6j55J2q2J29J24j85m9l1J14m1J88j36k44J35K24k25l4J56k50
4627b17k6L05R2k30l5p3K56P4j60j78K42J20p9j44K75j1l37J38J63o9k25n8Q2
4650i5J5P0O9j8k53J69J10Pk48J7J25O8j79P5J08j3l6K8K16l34l4J28R6r4l5n7
4676i5n9J11J37j66J16K0j77L6K39j30k17J14J02k30K39K5j65j71K56J82l58K00
$$ plain form
4509 -55 -62 -14 -13 37 232 34 53 -10 23 -183 123 -158 -114 -20 198 -5 -114 42 -48 -185 -13 278 140 31
4533 31 -216 59 308 -11 -258 -149 -6 79 171 -179 -32 -71 14 150 -116 -163 -49 -52 53 -96 101 -105 -288
4556 -288 -77 136 13 -123 -116 -105 -30 122 26 189 -55 -33 124 432 -67 -243 311 110 96 136 148 -142 231
4579 231 161 15 -79 -317 214 69 73 74 -44 136 -113 -149 -45 -35 -159 -34 8 -25 -150 -201 338 82 -112 151
4603 151 24 26 93 159 133 -22 -10 -92 37 161 -24 -73 -104 10 -31 157 21 -223 -88 136 -89 -123 33 -217
4627 -217 -243 62 154 -76 -111 -184 72 146 -14 -192 50 170 91 -53 222 211 -126 12 175 106 -119 -177 -95
4650 -95 -80 -10 59 41 -212 -43 67 74 -174 -157 -32 36 -143 -68 40 27 -9 19 235 -99 -133 -5 91 -3 -38 -95
4676 -95 -154 -43 94 -72 44 64 -113 -77 162 32 -185 -71 31 -199 40 65 -100 -271 -15 167 -191 9
4698Ij2Q9m9M0n2k14J97p9J88mj14k34K55k7j04n0J77j54q0K99L9m32L19N4q1
4723b0N2r1j1M1R1J16r8Op9j67M64n1l10n7K50j95M7J56j8m07J08K00K50m56M6
4748a33L4K15l1j34m4P8oP4L2k15k95M73J6j62K7K56p8m40N01k3j2k15J45J21
4772A84n3l1j97K8K97r2q8K69l55l18L85Q6j30k7k1RR7R0j62o1oJ93k30J33J60
4797A60j10k23K01N1m3k1n1o0K95Q8l27j16J30J24j27J2K00k29j94L65j04j72
4819a51N8k52L72K16k95k02J88K14j15Q3P3k28N9K95j73j79L2K16k51j17L45j39
4841D9j39l7K78j29r0K4P6R5p9j38J3M00m35K8J20J61m68K80O7k4r5K17k16n2
4865i4K78Qr5l91L31m8J34j61j6J30q3p6N6K02k57k94J89K89j08k72K38J09k3
$$ plain form
4698 9 -3 86 37 77 25 -189 8 -71 117 113 -1 -235 20 -7 -111 -161 16 -138 -218 81 120 -312 7 61 -20
4723 -20 32 -59 -70 -29 62 178 80 86 7 -160 304 253 -57 -114 136 -59 -12 144 126 -281 -173 27 277 -179 -133
4748 -133 -99 116 85 -49 -93 -15 -21 53 85 -130 -425 48 64 -98 -71 185 107 -333 168 145 133 -82 63 184
4772 184 131 100 -97 -69 228 136 48 317 -38 -356 29 115 -15 -42 -63 -54 43 133 -29 -90 -96 97 -133 0 160
4797 160 50 -173 28 79 36 15 -36 -96 199 287 -40 -156 -26 98 -29 -17 183 -46 -240 125 21 -151
4819 -151 -93 -345 27 243 -52 -254 -66 148 33 116 189 -39 20 315 142 -37 -5 211 -40 -157 188 49
4841 49 -90 -127 151 22 -68 -44 32 127 48 -90 -77 323 -112 -84 36 197 -271 9 76 52 -43 174 -42 -94
4865 -94 184 192 97 -294 37 -11 123 -38 -54 76 -7 -83 -27 175 -82 -376 -187 102 -6 -278 -40 69 46
4888D6J21p1o2K1q1O8J28P8l31L3Q7k5L3N7j21j06L83j57j26m4q2P6o3M2o3K51
4914I2j15MJ33j03j71J91J31L0j84j65K48q1J46j29K2m0o2J20P1O0l12M2P2%J47
4939A47ql52J31Q1P1Lk55m6L53M2m16K94M8m49K62K61l2k82J33K8l0J59q1j7L1
4964G6p0N1J29j91k07L02j13m8m7N0lj88L54J42j70k07k6J13K97m71pM29j85P7
4988H7L0op1M7M1J03l48K2K5J69R1k99J22R9k49J16K20j00j94M5J96j93k65J03
5012b09K64j36N1J60L7k81k9L58Q2l43L9N1r8L02j17o3j72l7Q3K71Lk39j95L10
5036I2r7j22J12j58L5J17J04o7P9l54J59Q7J89j34M3l33L78l7n5k8j01R3L3P6
5060A11K1j72J95O1l55L25j98K8r8J30o4m9k9k9PQ5Q7j58K4q6K11J88k64j17K68
$$ plain form
4888 46 167 96 34 55 -26 42 170 248 -83 -50 37 12 45 102 -19 -125 258 101 -25 -69 -151 -75 -138 -96 -159 92
4914 92 -23 -19 114 11 -160 31 162 192 8 -157 91 10 156 27 49 9 -53 67 138 198 -114 -72 0 0 147
4939 147 139 -213 -82 -1 70 73 -182 -228 125 167 -249 45 93 -356 -94 167 135 -147 -14 14 -16 143 62 45 76
4964 76 6 57 186 -5 -212 90 -23 -71 -118 -68 -71 -259 95 237 67 -140 -166 -53 244 -227 -234 195 10 87
4988 87 117 111 40 87 128 231 -117 -95 -70 99 190 -109 13 112 -137 -21 199 99 -95 -50 146 -47 -312 -209
5012 -209 55 -81 -30 130 167 -114 -143 215 297 -46 -7 44 -54 248 131 68 -104 -141 -58 213 216 -23 -218 92
5036 92 -5 -127 -15 -173 -138 -21 83 16 95 -259 -100 -13 176 42 85 -248 130 93 38 10 -91 2 35 111
5060 111 132 -40 155 216 -139 186 -12 16 -82 48 -16 -65 -94 -123 -116 -31 56 -102 -78 -164 47 235 -29 -146 122
5085A22ll4j9p4Q9j04J08rl9l1l6P4J02m8j29m4M6M2lL7j79o4L32j15N4o5o0M7
5113cP5R2k42J34j48K72l7j93K10l6k16K17J1q9K3m8oJ12J20l65R9J03p8L5q1
5138c9J24m14K12K74n4k65k3J02j8K01m4j61M7L2J04J99k28j31J92J28J3k09j13
5161g1k0k0K6K87r4k69kK36o7j53n3jK44l3N7r4J02k03P1M31l19k00M3K42L8j35
5187D3m4k42K36J81K41l60k1K1r5K11j8j08j26R0K6P3p4o2k89K48R5j72O1J53
5211F8k64R5K06L1o2k21J90O5j9k74J73l1N4o3K09j40j92P0J59K19k65l8j3J05
5235F2k11J13M5k81K1K61n0J73k13o5J86J87j23l42J32LJ99K4N2l53M1K50j06
5258Eo2k1K19k70J44Q2m2l85K50P4J24K01m99O0O6K0L9N6J78l09PK34k5n24M87
$$ plain form
5085 122 119 85 66 -8 81 -23 85 76 37 6 -30 44 146 98 -31 -75 -29 13 10 47 -132 -196 136 21 75 10 -50 -3
5113 -3 72 164 -78 56 -92 180 143 -50 160 124 -92 125 136 47 70 22 16 128 248 -117 -18 85 7 42 -39
5138 -39 85 -329 -117 157 103 -162 -185 -83 -101 100 56 -105 -58 -26 78 277 49 -82 110 238 251 42 -71
5161 -71 -91 -111 -85 202 108 -161 -163 73 6 -147 -200 -201 43 10 67 -27 75 -128 -57 374 55 -145 -102 140 178 43
5187 43 -1 -243 -7 174 415 55 34 55 -40 171 153 45 -81 9 35 108 34 -28 -317 -69 26 -146 -85 68
5211 68 -196 -101 105 136 74 -147 43 108 89 -185 -12 -43 11 -52 157 17 -175 -105 54 273 8 -30 -43 62
5235 62 -149 -36 9 -272 -251 10 -40 133 -80 -145 41 228 105 -237 -105 -102 97 121 173 -180 -139 111 5
5258 5 -57 -78 141 -129 15 97 55 -330 -80 -6 118 319 -180 -120 -54 -34 5 61 239 -70 -63 171 146 -378 109
5283A09K3k66K97r7j9j65J00k2J29l0l67K44J42J5j47l6J39k61K20J05j06k70
5305b63J15K17k8P6j85J26p0O5J6p8m1QR4J24l5l32J17K95k23J7K27k69k55J82
5329a00L15m09n2K71R8k17J07P7j49j23o8J50J40j96rQ7J00o1N6J52k15k2L18
5352B50j33k22%N0J98q2p9q5R2j19J78j4q3j98K01K12j25q3r0J77n1M8j6j01J85
5377A10j11L3K77m28J61P2j88K10m8n3j22K16l2l0K6j51p7K49J11j69j83Q9j94
5400b32J68J29j9l46J77P2J07N8np5k3O2oR0j73j87J34K93k43j6j04J80o6K17
5424A92j53k33o2J86J52L4r5k89L37m2q8K02l00n1K56K87j86j19j64J9K99L5m44
5447b27J66J21J2j28K25k3k39K3K1J94o1k38P4P3mK6J72l58j83M27R5k47k38K26
$$ plain form
5283 109 132 -134 163 66 47 -118 -18 -40 89 59 -308 -64 78 93 -54 -90 49 -212 8 113 7 -263
5305 -263 -148 69 41 117 -68 58 -12 53 69 -9 -50 -42 52 176 141 -191 -74 221 -2 15 242 -27 -282 -100
5329 -100 215 -194 -246 25 123 -94 13 90 -59 -182 -250 -100 40 -156 -165 -78 22 -39 17 169 -46 -68 250
5352 250 117 -105 -105 -55 143 61 -18 -103 -11 -130 48 34 -49 -247 -46 166 41 -42 -132 45 -6 42 26 -75 110
5377 110 -1 32 309 -119 42 114 -74 136 88 35 -87 129 97 67 93 -58 -135 114 225 56 -127 -38 -232
5400 -232 -64 65 46 -300 -123 -51 56 114 109 34 11 73 67 157 -16 -203 -69 224 -19 -35 -139 41 -25 192
5424 192 39 -194 -256 -70 82 116 21 -268 69 27 -61 141 -159 -210 46 333 147 28 -136 -117 182 217 -227
5447 -227 -61 60 72 -56 169 146 -93 -70 -49 145 84 -154 -80 -7 -11 15 187 -171 -354 73 168 -79 -317 -91
5471i1J22o8R5J84l86J90MJ37j21r8n7NR2P1Oj69K9L09q6j88N5j52J47J5r7r6
5497a48J05r1J16K31k40ok15K57K02j51n6l6J56l9k0R3j10j17j18J28J99j49l47
$$ plain form
5471 -91 31 -37 58 242 -144 46 50 187 66 -32 -89 -84 8 79 85 -84 -55 254 168 -20 35 -117 30 45 -52 -148
5497 -148 -43 -134 -18 213 -27 -33 -248 9 211 60 4 -32 124 85 65 158 48 -69 -187 -59 140 -9 -356
$$ [...]
8191B5
##END NTUPLES=NMR FID
##END=
