##TITLE=1H_B3dm-3
 CDCl3
 8 sc, 
 13.7.2023
##JCAMPDX= 6.0         $$ Bruker NMR JCAMP-DX V2.0
##DATA TYPE= NMR FID
##DATA CLASS= NTUPLES
##ORIGIN= UXNMR, Bruker Analytische Messtechnik GmbH
##OWNER= root
$$ XWIN-NMR		Version 3.5
$$ Thu Jul 13 14:19:05 2023 Russian Standard Time (UT+4h)  she@DPX200
##.OBSERVE FREQUENCY= 200.13135
##.OBSERVE NUCLEUS= ^1H
##.DELAY= (6, 6)
##.ACQUISITION MODE= SIMULTANEOUS
##.ACQUISITION SCHEME= undefined
##.AVERAGES= 8
##.DIGITISER RES= 18
##SPECTROMETER/DATA SYSTEM= spect
##.PULSE SEQUENCE= zg30
##.SOLVENT NAME= CDCl3
##.SHIFT REFERENCE= (INTERNAL, CDCl3, 0, 15.7039)
##AUDIT TRAIL= $$ (NUMBER, WHEN, WHO, WHERE, WHAT)
$$ ##TITLE= Audit trail, XWIN-NMR		Version 3.5
$$ ##JCAMPDX= 5.01
$$ ##ORIGIN= Bruker BioSpin GmbH
$$ ##OWNER= she
$$ F:/spectra/data/she/nmr/H-F/1/audita.txt
$$ ##AUDIT TRAIL=  $$ (NUMBER, WHEN, WHO, WHERE, WHAT)
(   1,<2023-07-13 14:18:03.04 +0400>,<she>,<DPX200>,
      <created by zg, POWCHK disabled, PULCHK disabled
       configuration hash MD5:
       00 E9 B6 7A A2 85 ED C7 34 08 36 98 17 FE 4E 26
       data hash MD5: 16K
       B7 55 C5 1F 23 30 A1 81 0B 3F FE C5 A4 46 10 21>)
$$ ##END=
$$ 
$$ hash MD5
$$ 26 F8 05 6C F7 E4 72 69 65 42 89 A6 27 88 44 0A
##$RELAX= 
##$RELAX= 
##$RELAX= 
##$RELAX= 
##$RELAX= 
##$RELAX= 
$$ Bruker specific parameters
$$ --------------------------
##$DU= <F:/spectra>
##$EXPNO= 1
##$NAME= <H-F>
##$PROCNO= 1
##$TYPE= <nmr>
##$USER= <she>
##$AMP= (0..31)
100 100 100 100 100 100 100 100 100 100 100 100 100 100 100 100 100 100 
100 100 100 100 100 100 100 100 100 100 100 100 100 100 
##$AQSEQ= 0
##$AQ_mod= 1
##$AUNM= <au_zg>
##$AUTOPOS= <>
##$BF1= 200.13
##$BF2= 200.13
##$BF3= 200.13
##$BF4= 200.13
##$BF5= 200.13
##$BF6= 200.13
##$BF7= 200.13
##$BF8= 200.13
##$BYTORDA= 1
##$CFDGTYP= 0
##$CFRGTYP= 5
##$CHEMSTR= <none>
##$CNST= (0..31)
1 1 145 1 1 1 1 1 1 1 1 1 1 1 1 1 1 1 1 1 1 1 1 1 1 1 1 1 1 1 1 1 
##$CPDPRG= <>
##$CPDPRG1= <>
##$CPDPRG2= <>
##$CPDPRG3= <>
##$CPDPRG4= <mlev>
##$CPDPRG5= <mlev>
##$CPDPRG6= <mlev>
##$CPDPRG7= <mlev>
##$CPDPRG8= <mlev>
##$CPDPRGB= <>
##$CPDPRGT= <>
##$D= (0..31)
0 1.2 0 0 0 0 0 0 0 0.06 0 0.03 0 0 0 0 0.0002 0 0 0 0 0 0 0 0 0 0 0 0 
0 0 0 
##$DATE= 1689243482
##$DBL= (0..7)
120 120 120 120 120 120 120 120 
##$DBP= (0..7)
150 150 150 150 150 150 150 150 
##$DBP07= 0
##$DBPNAM0= <>
##$DBPNAM1= <>
##$DBPNAM2= <>
##$DBPNAM3= <>
##$DBPNAM4= <>
##$DBPNAM5= <>
##$DBPNAM6= <>
##$DBPNAM7= <>
##$DBPOAL= (0..7)
0.5 0.5 0.5 0.5 0.5 0.5 0.5 0.5 
##$DBPOFFS= (0..7)
0 0 0 0 0 0 0 0 
##$DE= 6
##$DECBNUC= <off>
##$DECIM= 32
##$DECNUC= <off>
##$DECSTAT= 4
##$DIGMOD= 1
##$DIGTYP= 9
##$DL= (0..7)
0 120 120 120 120 120 120 120 
##$DP= (0..7)
150 150 150 150 150 150 150 150 
##$DP07= 0
##$DPNAME0= <>
##$DPNAME1= <>
##$DPNAME2= <>
##$DPNAME3= <>
##$DPNAME4= <>
##$DPNAME5= <>
##$DPNAME6= <>
##$DPNAME7= <>
##$DPOAL= (0..7)
0.5 0.5 0.5 0.5 0.5 0.5 0.5 0.5 
##$DPOFFS= (0..7)
0 0 0 0 0 0 0 0 
##$DQDMODE= 0
##$DR= 18
##$DS= 0
##$DSLIST= <SSSSSSSSSSSSSSS>
$$ [...]
##$SUBNAM2= <"">
##$SUBNAM3= <"">
##$SUBNAM4= <"">
##$SUBNAM5= <"">
##$SUBNAM6= <"">
##$SUBNAM7= <"">
##$SUBNAM8= <"">
##$SUBNAM9= <"">
##$SW= 18.05172834244
##$SWIBOX= (0..15)
0 0 2 0 0 0 0 0 0 0 0 0 0 0 0 0 
##$SW_h= 3612.71676300578
##$TD= 16384
##$TD0= 1
##$TE= 0
##$TE2= 300
##$TE3= 300
##$TEG= 300
##$TL= (0..7)
0 120 120 120 120 120 120 120 
##$TP= (0..7)
150 150 150 150 150 150 150 150 
##$TP07= 0
##$TPNAME0= <>
##$TPNAME1= <>
##$TPNAME2= <>
##$TPNAME3= <>
##$TPNAME4= <>
##$TPNAME5= <>
##$TPNAME6= <>
##$TPNAME7= <>
##$TPOAL= (0..7)
0.5 0.5 0.5 0.5 0.5 0.5 0.5 0.5 
##$TPOFFS= (0..7)
0 0 0 0 0 0 0 0 
##$TUNHIN= 0
##$TUNHOUT= 0
##$TUNXOUT= 0
##$USERA1= <user>
##$USERA2= <user>
##$USERA3= <user>
##$USERA4= <user>
##$USERA5= <user>
##$V9= 5
##$VALIST= <valist>
##$VCLIST= <CCCCCCCCCCCCCCC>
##$VD= 0
##$VDLIST= <DDDDDDDDDDDDDDD>
##$VPLIST= <PPPPPPPPPPPPPPP>
##$VTLIST= <TTTTTTTTTTTTTTT>
##$WBST= 1024
##$WBSW= 4
##$XGAIN= (0..3)
0 0 0 0 
##$XL= 0
##$YL= 0
##$YMAX_a= 384868
##$YMIN_a= -478621
##$ZGOPTNS= <>
##$ZL1= 120
##$ZL2= 120
##$ZL3= 120
##$ZL4= 120
##$ABSF1= 10
##$ABSF2= 0
##$ABSG= 5
##$ABSL= 3
##$ALPHA= 0
##$AQORDER= 0
##$ASSFAC= 0
##$ASSFACI= 0
##$ASSFACX= 0
##$ASSWID= 0
##$AUNMP= <proc_1d>
##$AZFE= 0.1
##$AZFW= 0.1
##$BCFW= 1
##$BC_mod= 2
##$BYTORDP= 1
##$COROFFS= 0
##$CY= 11.3945322036743
##$DATMOD= 1
##$DC= 2
##$DFILT= <>
##$DTYPP= 0
##$F1P= 15.7292609196834
##$F2P= 12.9074282941183
##$FCOR= 0.5
##$FTSIZE= 0
##$FT_mod= 4
##$GAMMA= 1
##$GB= 0.15
##$INTBC= 1
##$INTSCL= 1
##$ISEN= 128
##$LB= 0.24
##$LEV0= 0
##$LPBIN= 0
##$MAXI= 10000
##$MC2= 0
##$MEAN= 0
##$ME_mod= 0
##$MI= 1.114404
##$NCOEF= 0
##$NC_proc= 0
##$NLEV= 6
##$NOISF1= 3.799351
##$NOISF2= 2.8
##$NSP= 1
##$NTH_PI= 0
##$NZP= 0
##$OFFSET= 15.70392
##$PC= 1
##$PHC0= -20994.47
##$PHC1= 18.25272
##$PH_mod= 1
##$PKNL= yes
##$PPARMOD= 0
##$PSCAL= 0
##$PSIGN= 0
##$REVERSE= no
##$SF= 200.130013532006
##$SI= 16384
##$SIGF1= 3
##$SIGF2= 2
##$SINO= 400
##$SIOLD= 16384
##$SREGLST= <1H.CDCl3>
##$SSB= 0
##$STSI= 0
##$STSR= 0
##$SW_p= 3612.71676300578
##$SYMM= 0
##$S_DEV= 0
##$TDeff= 0
##$TDoff= 0
##$TI= <>
##$TILT= no
##$TM1= 0
##$TM2= 0
##$TOPLEV= 0
##$USERP1= <user>
##$USERP2= <user>
##$USERP3= <user>
##$USERP4= <user>
##$USERP5= <user>
##$WDW= 1
##$XDIM= 8192
##$YMAX_p= 0
##$YMIN_p= 0
$$ End of Bruker specific parameters
$$ ---------------------------------
##NTUPLES= NMR FID
##VAR_NAME=  TIME,          FID/REAL,        FID/IMAG
##SYMBOL=    X,             R,               I
##VAR_TYPE=  INDEPENDENT,   DEPENDENT,       DEPENDENT
##VAR_FORM=  AFFN,          ASDF,            ASDF
##VAR_DIM=   8192,          8192,            8192
##UNITS=     SECONDS,       ARBITRARY UNITS, ARBITRARY UNITS
##FACTOR=    0.0002768,     1,               1
##FIRST=     0,             0,               0
##LAST=      2.2672688,     0,               0
##MIN=       0,             -478621,         0
##MAX=       2.2672688,     384868,          0
$$ Real data points
##PAGE= N=1
##DATA TABLE= (X++(R..R)), XYDATA
0@%%%%%%%%%%%%%%Qj6J6j6J6k4L2l2L9m7N3o1P1q3R2j04J20j36J55j76J96k20
36a17K47k74L04l38L77m17M59n09N63o19O82p52Q26r09J002j104J218j347J493
55G85j657J848k071K333k649L037l529M169n033O265q148J1328j7610L4171j50746
70a27507l51114N07992J81905k50285R0512j6905k06075J50984J09757r5298P8804
81G2770m3212j78531J65034P8301j91908J39292J23980k99138j8530K61339l8681
92G0716o4052K1088j24548N0492J57699j26741m1489J56280j16412j09170J88593
103F2456k691j33763J22892K8995j54460J7900O5778L6381P2887j32991j47064
114a63680J73061R0179j24459O0919L6979j89934K9388J99257m7100q6823J8737
$$ y = [0, 0, 0, 0, 0, 0, 0, 0, 0, 0, 0, 0, 0, 0, 0, 8, -8, 8, -8, 8, -16, 16, -16, 23, -24, 29, -32, 39, -44, 48, -56, 64, -72, 83, -93, 103, -117, 130, -144, 160, -178, 199, -218, 241, -268, 295, -324, 358, -394, 432, -477, 525, -579, 639, -708, 785, -872, 976, -1095, 1238, -1411, 1626, -1903, 2266, -2767, 3498, -4650, 6678, -10932, 23239, -127507, -478621, 29371, 211276, -39009, 51503, 34598, -171477, -20493, 89264, -6034, 72770, 29558, -148973, 16061, 94362, -97546, 41746, 165726, -133412, -151942, 109397, 70716, 6664, 27752, -96796, -46304, 111395, -15346, -56835, 99445, -16967, -126137, 62456, 59765, -73998, 48894, 77889, -76571, -58671, 7107, 43488, 116375, -16616, -163680, 9381, 99560, -24899, 36020, 72999, -116935, -87547, 111710, 64610, -22213, -3476]
125c476n3785K2533R2441n5373q23O5350j22491m8135J68070J7862j00597J2253
137f171k0191l6000R8395L7164p9776q291p286j4669R4007m766j21897N5147Q1646
150F7312r1384k3674P7709m339k0538j300l9864J1257N0931j7649l898K0777o1516
163c6176j2925R1051o560n6164K4780j4498l3694N1558K9880j6454l860m9458
175c2520k7200R0068M0627q2974k7270L4043r538K1204L9085l8510l2343Q393
187a6935k853L5259K3673n7853j5334M4450j2491r554M4294k0113o2108L0992
199a8573N3787k1380k8531k700J2549L3369j1585m5168J4991K6237j3102N956
211E850O205l0843j511M3008M709l7555j2731J4525J4315L67j8537R760K6172
$$ y = [-3476, -57261, -34728, 57713, 2340, 1517, 66867, -55624, -103759, 64311, 82173, -18424, -6171, -26362, -62362, 36033, 73197, -6579, -14870, -22156, -36825, 57182, 52416, -69481, -14334, 67312, -24072, -47746, 29963, 25624, 5086, 3786, -36078, -24821, 26110, 8461, 4563, 25340, -36176, -49101, 41950, 35390, -20774, 4006, -10492, -44186, 7372, 37252, 20798, 16938, -32520, -59720, 30348, 70975, -11999, -39269, -5226, -14764, 6440, 45525, 7015, -25328, -16935, -19788, 15471, 39144, -18709, -34043, 10407, -2084, -11638, 32656, 12543, -49565, -18573, 35214, 13834, -14697, -17397, -4848, 28521, 16936, -28232, -13241, 12996, -106, 5850, 12055, -18788, -20299, 22709, 27418, -10137, -22868, -8343, 5972, 6339, -12198, -2438, 23734]
224B3734l2239k7109M8834K3585m5157k4771K1090K0023N787l99j5740j7153J0683
237h832K7829J0566l4253m3433L2535O1919k0192m9382M701K0812P608Q621p865
250A0634l4129j2079L7163L1269j5314l3852q803K8609J4226k3527N01J8343k1339
263h298k2112K7587L5249p142l4242j6003J1491K2597J3983j0132k5038j6876
275b8936J9514M8162l515n9797r434M5702J3276k9066j8461J6618K4495j228k3402
288f072j7134J0622K6183J1440k1304m0461N368N8621J3976m4583j8590J5722
300f212Q640l486L25J3542L820k5758k0610K4865L9925l427l6007k7479n479L6097
314a244M9266j2610n8450k6519L1928N5245O340n3096l2583K2773K8615L218k139
$$ y = [23734, -8505, -35614, 13220, 36805, -8352, -33123, -12033, 7990, 13777, 13378, -2362, -19515, -8832, 18997, 29563, -4690, -48123, -15588, 46331, 26139, -23243, -18542, 2270, 9878, 18499, 10634, -23495, -35574, 1589, 32858, 17544, -16308, -25111, 3498, 17724, -5803, -5302, 13041, -8298, -30410, -2823, 32426, 25284, -8958, -24961, -13470, 9127, 23110, 12978, -12060, -28936, -9422, 38740, 35225, -24572, -34006, 11696, 24972, -4094, -22555, -5937, 18558, 17330, -6072, -23206, -12584, 13599, 25039, 3735, -36726, -31358, 27263, 41239, -3344, -21934, -6212, 2428, -1058, -733, 12809, 16629, -9129, -29739, -4874, 35051, 31624, -4383, -31862, -37341, -1244, 48022, 35412, -23038, -49557, -17629, 37616, 43956, -9140, -41723, -18950, 9665, 12883, 10744]
327A0744l981j5901l099J3557K410P92M481p071j1412n778J3701K8810m811l8007
341a5565r087K7818J1698j8125m240J7062p7j5738p704J0046J6439p54j1454j1420
355a1101j7723J0839N1191J4302n4452m4819K7853N2783M877l0833k2006l879
367b2968J1346K2633K3243r540m6009j5122L6778K1478j1149p166k432j7135q839
380b4882L3394L1250k8283m3387N388L4541P986j7076K386O938k0936n947K9092
393A0464R187k6396q492K4703k87l0537J1508M2323o298m4341r768K9628J2465
406A4159j1884O715K832l2334j3413M3551L7278l2061n0370Q682L2003L194K191
419A0543O674k2562l2111J6811N2975M416m9361j7556K6690J3617p994N502J0490
$$ y = [10744, 6763, -9138, -12237, 1320, 3730, 4522, 9003, 1932, -9480, -15258, -1557, 27253, 22442, -15565, -24652, 3166, 14864, -3261, -7501, 9561, 9484, -6254, -13958, -3912, 12527, 11773, 319, -11101, -28824, -17985, 33206, 47508, -6944, -51763, -23910, 28873, 33750, 2917, -19089, -22968, -11622, 11011, 34254, 24714, -21295, -36417, 361, 21839, 10690, 3524, 1092, -16043, -24882, 8512, 39762, 11479, -31908, -26520, 8021, 16007, -1069, 1317, 8255, -12681, -18628, 10464, 19651, -6745, -15237, 9466, 9179, -21358, -9850, 32473, 26175, -18166, -27934, 1694, 14159, 2275, 8990, 11822, -20512, -33925, 9626, 46904, 14843, -35527, -26845, 5158, 8352, 10543, 17217, -5345, -37456, -20645, 32330, 36746, -12615, -30171, -3481, 10136, 2142, 7644, 18134]
432A8134k4096k6901K6663L6224j2912l0524M69J6861k428k398J6565q107l0757
445b3207P683L4226m412l4400K537L7751R09l7422r586L0194J9214j8158j8680
458a3351M666J57N292K6149j848l8427j0191L2226K0241j6830j8304M307P013
471A100m274j307J5635Q212k6631j7989K1435J7733j376o748j8059j2478J9587
484e160K9536k236l4850j9377K5571L5320q863l8996k354K8299O296p919o507
497a240q487Q098J4068o384r887j438K202Q380L390j4189l962J8668k47k1219
511a2247N635J6577n190q826r834K693K8933L516l5889q631K5873J3870m299j3598
525a417k1055O353L7551N301l3087j4743J1687K3148J2306k9118k5529K4260K2041
$$ y = [18134, -5962, -32863, -6200, 30024, 17112, -13412, -12943, 3918, 1490, -908, 15657, 7550, -23207, -15524, 18702, 14290, -20110, -17573, 20178, 21087, -16335, -25921, 4273, 23487, 5329, -13351, -8685, -8528, -3236, 22913, 21065, -17362, -27553, 4673, 24914, 8084, -10220, -5913, 1100, -3174, -4481, 11154, 19366, -7265, -25254, -3819, 13914, 12538, 5790, -12269, -24747, -5160, 24376, 22140, -12710, -32087, -6516, 28804, 19941, -19055, -21409, 6890, 13186, 5267, -1240, -9727, -1629, 12439, 6055, -3832, -5270, -3068, 5312, 8702, -5487, -9449, 9219, 8972, -12247, -6612, 9965, 4775, -4051, -13885, -11192, 17741, 21257, -14632, -23263, 2610, 16480, 12181, -1417, -22472, -16119, 21432, 26733, -6354, -21097, -9410, 13738, 26044, -3074, -28603, -4343, 17698]
538A7698j0962q878k009l814O184J0526m237q848k413P93Q554L361r087P291L619
553G778k6837N82L8488M260l1754j6335J2749K7496R939k4945k4002R773J7537
566D729P707K985k0682k1942K7934K7306k4274k0729R297J0298K872p277p631
579i407R714P449r660j932P815q869n074J5908j634j2989J0060M242j0926L839
593a464R807Q96j0455j7906O007L0826M717k7470j2144J0879R452J0348J447k4674
607i734j5102J6572J8188O889r236k1721j099J6115N572J065k927j5075n973J7261
621G95J4836n293j0380q589o74J4385L570j1098J971J972n421O672M283p432M8
636c55K770o189k270N810J474L35M568n157p305M707J16K84R523n433j5212J998
$$ y = [17698, 6736, -2142, -4151, -7965, -1781, 8745, 4508, -4340, -6753, -5960, 2594, 5955, -3132, 4159, 7778, -19059, -18477, 20011, 24271, -7483, -23818, -11069, 16427, 26366, 1421, -22581, -12808, 4729, 12436, 15421, -5261, -27203, 731, 28037, 3763, -16966, -7669, 2629, 5501, -1776, -9407, 307, 7756, -1904, -3836, 3979, -4890, -9964, 5944, 4310, -8679, 1381, 5623, -5303, -1464, 8343, 9239, -1216, -19122, -13115, 17711, 22428, -5042, -17186, -6307, 3145, 13493, 14940, -9734, -24836, -8264, 9924, 16813, 7577, -14144, -15243, 872, 6444, 7509, 4582, -10493, -16466, 795, 15631, 10338, -42, -8631, -9305, 5080, 8650, -2448, -477, 1495, -3926, 2746, 7029, -403, -355, 2415, -3774, -6044, -234, 1240, 1575, 6143, 986, -6319, -1612, -1496, -1212, 8311, 2878, -12334, -10336]
652a0336J4015J1336o57j7626j5136Q567K0211N184j0152j2260q178J0436K3487
665A8891M03k2340j4788O175J8481N656j1142n536J509m01L290O303j925j0565
679e989j399O530n2J950O630l243r649j510R762P523j0606j1998Q844J4927j364
694A0356j4604n480J0816J0147j301j4957j5462J0726K8297M202k7270k1367J5806
707a0091K8736j515k4430j1760J1171J4699M67m252j897l921m43J698j71M828
721C119M371p437j2872L457K3413Q922k3673k1350J0104K4994L793k0618j2251
734a6028P568J5487R480j1938k0612J726K0362R674j6335j8453J0064K0461L05
747A1761j3762o686M939L588K429L103o205o551N374O734J32l792j496J944n818
$$ y = [-10336, 3679, 15015, 14358, -3268, -18404, -9837, 10374, 15558, 5406, -6854, -15032, -4596, 18891, 19294, -3046, -17834, -11659, 6822, 12478, 1336, -4200, -2691, -3092, 198, 6501, 4576, -5989, -7388, -858, -910, 1040, 7670, 4427, -5222, -6732, 3030, 10553, -53, -12051, -3207, 11720, 10356, -4248, -9728, 1088, 11235, 9934, -5023, -20485, -9759, 18538, 22740, -4530, -25897, -10091, 18645, 17130, -7300, -19060, -7889, 6810, 7277, 3025, 1128, -2793, -3236, -1538, -1709, 3119, 7490, 53, -12819, -9362, 14051, 22973, -700, -22050, -11946, 13048, 16841, -3777, -16028, -8460, 7027, 16507, 4569, -16043, -14317, 6045, 15719, -616, -19069, -9005, 11456, 11761, -2001, -8687, -3748, -160, 2269, 5372, -833, -7384, -2010, 4724, 4856, 1064, -432, 1512, -4306]
762d306m521J2059R538j0703j4597L438J4683N298p257j1841o476J0697J6374
775A2386q0j6857j4731J2060K6317n617k6831l273J8537J0274n720r171m462M592
789b576R826n5r805k978L758N099j63o353M772P827j2219j0540J1971J3326n480
804F410j5651n217J2483J5242j435j8049p783J0529J0515L238j0287j3502P788
817e719J6229j773r713l895L073N954M98m875k889J416J676K535L476n217q138
832g362M579O046J59Q25p305q476Q339J2497l44j0548q178K688R255P456k672
847F959r978o437K320J2405Q919r752j1806l4L554R222Q814q548j7210j864J6716
862C280J1615r202j3920p81R489M828l540j904j496l778M907N426n210m296M137
$$ y = [-4306, -8827, 3232, 12770, 2067, -12530, -9092, 5591, 10889, 3632, -8209, -14685, -3988, 12386, 12306, -4551, -19282, -7222, 19095, 13478, -13353, -16626, 1911, 12185, 6465, -2706, -7168, -2576, 7250, 7195, -2610, -5588, -1830, 3269, 3106, -3247, 1525, 9352, -2867, -13407, -1436, 11890, 6410, -9241, -14458, -1975, 13267, 11832, -6217, -14000, -3471, 7044, 10282, -5, -13507, -5719, 10510, 8737, -976, -4871, -1798, 4156, 4654, -221, -3110, -1694, -18, 2517, 5993, 776, -7362, -2783, 3263, 3422, 4247, -3058, -11534, -3195, 9302, 8958, -1590, -9768, -7080, 2175, 9631, 6959, -3019, -9456, -7136, 5269, 14188, 4436, -7370, -7404, -3850, 5372, 14186, 5638, -11572, -13436, 3280, 14895, 5693, -8227, -9008, 481, 5309, 1769, -135, -1631, -5409, -502, 4924, -286, -4582, -445]
877d45N531k239q679J218Q834O25n085j41J736m794r60J2078L195j4247p163P310
893c226Q044Q27k796j632p108o500J1884J6080o098k0566o325J5605J3264j606
907I847p974j0718m886J1479J6430j587k0629r238J8549J3238j0431j0258L875
920b303O370l123n533L779M871j779k592j118l91P0M337K897r393n446J1416M847
936F909j0505m217J1520P970j3399j4257R061J9095K411j7189j3040Q324J5558
949H241O899p302j8344o973J6045J7570m150j8433n546J2379O548m630l510R60
963b46l46o080N81J1224L758q506o680J108M859K973J614k849j0187O96J5566
978G485N530j3349j1298Q888J4116n767j4306J06J1741P193n678q446k145J824
$$ y = [-445, 5086, 2847, -5832, -4614, 4220, 4845, -240, -381, 1355, -3439, -4399, 7679, 10874, -3373, -10536, -3226, 4818, 5645, 2849, 1217, -5891, -12391, -507, 15573, 9475, -11091, -17416, -1811, 11453, 9847, 1873, -8845, -13731, -2252, 14178, 12591, -8038, -17276, 1273, 14511, 4080, -6178, -2303, 4067, 944, -4589, -810, 4061, 2282, -310, -1428, -1819, -1749, 2588, 5485, -3908, -9354, 2062, 6909, -3596, -7813, 3707, 11677, -1722, -15979, -6918, 12177, 14588, -2601, -15641, -7317, 8241, 15140, 7838, -10506, -17479, -1434, 16136, 11986, -6447, -11993, 386, 6934, 2304, -1206, -246, -592, -6672, -6091, 5133, 8891, 385, -6295, -5187, -328, 2645, 4259, 1410, -8777, -8081, 7485, 13015, -334, -11632, -2744, 11372, 5605, -8701, -8595, 3146, 10339, 4661, -3785, -5930, -4106]
992d106Q490P510j1494j6936N334K1612M159j6889o871P965K360k867K588L711
1006D566l990j0042L055J3868K416p647m876k212j829P307J3981o293k3745O46
1020a4795K5491Q075j8611j5246Q896J3625k769o860M14l95q28O186M858j0441
1034b400j1115J2046J3098r818j1014O757R212m572n846O413K237j1469k784J3676
1048D421P052j0239q489O239M296k978L057J362j0901o434J2727J4825q434j7706
1062a1202L913J2736r00p063K92J521m299J311J1608Q7j3244k740J1078N536r315
1077f81p248O473N068k282J807J494o930n388R308R670j0938j2281P435R687n97
1092D597l099j288j807l489J637Q264J098r421n706P206Q050k253j997j65q495
$$ y = [-4106, 4384, 11894, 400, -16536, -11202, 10410, 14569, -2320, -9191, -1226, 1134, -1733, 855, 4566, 576, -9466, -6411, 7457, 9873, 2226, -2650, -4862, -6691, 616, 14597, 8304, -15441, -14795, 10696, 18771, 160, -15086, -6190, 7435, 4666, -2194, -1780, -2175, -3003, 3183, 8041, -2400, -13515, -1469, 11629, 1811, -9203, -2446, 6766, 2194, -3652, 2761, 4998, -6471, -9255, 4421, 11473, 1234, -7255, -1016, 3280, 302, 3359, 4721, -6180, -12614, 113, 14938, 6504, -11202, -7289, 5447, 4547, -2516, -2224, -703, -5002, -3691, 7917, 8004, -5240, -7980, 3098, 8634, -681, -7929, -1456, 3612, 1330, 3137, 4631, -2299, -7687, 1621, 11291, 353, -11928, -4493, 5194, 4597, 1498, 210, -1597, -5086, -3449, 4815, 5913, -3508, -9214, -2008, 6042, 3789, 1792, 1627, -6868]
1107f868j182J2919N463r279q973K493J1220L457q725p290L573N801j064m32j508
1122c95m458M690Q270o205r560J077P699N450m721q517J664P692J553k857o33
1137G49k301m503L930N838k17M0l169o525K880P729L788l349j2103o602J2654
1152a161J6038m214j7231n314Q622R984J930j0943p797O288O297J544j203o843
1166d003L18Q425j588r653J206J0302J158p612l466M085N885n68p351J561M403
1181C102m707j527M524L38J607R07q353o547Q548J3784k079j6429r798J0843K0105
1196A4318L84j8986q721N720Q596R466k234j4650m993J0261R419k579p560o34
1210b193L094k055l295O272Q469p948j1841N674Q595j096k597k414k133N21L827
$$ y = [-6868, -8050, 4869, 10332, 1053, -7920, -5427, 5793, 9250, 525, -6765, -3192, 2609, 1545, 1113, -395, -4853, -163, 8107, 1902, -7658, -6581, 1118, 6568, 1847, -6670, -5006, 2686, 4239, 1382, 749, -1552, -6055, -2125, 3713, 3496, 3536, 367, -6158, -3278, 4451, 8239, 4890, -7213, -13815, -1161, 14877, 10663, -6568, -11882, -3260, 6724, 8654, -2289, -10086, -3798, 2499, 4043, 2840, -4003, -3685, 4740, 3152, -6501, -5295, 5007, 6165, -1447, -4913, -828, 5057, 4489, -2862, -1301, 3102, -1605, -3132, 1392, 1730, 3337, 4244, -4109, -10656, -2108, 11676, 9597, -6832, -16630, -5787, 14318, 14702, -4284, -13005, -7285, 1311, 10777, 8543, -6107, -11100, -839, 8580, 6001, -1559, -2193, 901, -1154, -4449, 1823, 10292, 2344, -9497, -3823, 4772, 3676, 1079, -1335, -3468, -2947, 880]
1225H80L575m165n354M792O935o334j1000O663J5769l587j4313k797O333Q353
1239E750M024n658j0073n404P966J5761M63j6849q434R564Q939k825q02J245q205
1254d538n867Q264J1614n04j2996o291O928N168J585L369m592j1655J8J5471O484
1269A2458j2710q750O608O078j625k973K159J154l912Q2L424k316k218M630K851
1284D940o261p477N535J0007j581p278k204J666R71J626O366l38j2791m711J1007
1299e23R791l664q383j237J223k23O837O804p691j3502N34J4422N982q654n466
1314c750J079p80J913O827J616j0103p844Q377R861l711p436K92N681p02n253
1329c933K948L793l194o66L648k514n329M409J0173l992j3973n50J2191N157o794
$$ y = [880, 4455, 290, -5064, -272, 6663, 329, -10671, -4008, 11761, 8174, -6139, -8936, -2603, 5750, 9774, 4116, -5957, -11361, -3395, 12366, 12829, -4020, -12454, -2890, 6049, 3224, 2422, 3667, -4538, -10405, -2141, 9473, 8969, -4027, -10318, -3390, 1778, 3363, 6732, 2140, -9515, -9497, 5974, 12458, -252, -9002, -2394, 3684, 2059, -914, 1245, 2399, -1513, -1431, 1993, -323, -2541, 2089, 4940, -1321, -8798, -3263, 6744, 5163, -2115, -4319, -2653, -1682, -56, 6310, 5972, -6819, -11530, -523, 9268, 5604, -2779, -4016, -2793, -3016, 3821, 10625, 2934, -10568, -10034, 4388, 10370, 1716, -3750, -2671, -3451, -1538, 5289, 6905, -3198, -11042, -2665, 7196, 3485, -3951, -3659, 2022, 1320, -3933, -985, 2808, -386, -1052, 2596, 82, -5247, -838, 9335, 5343, -8630, -9180, 3011, 8168, 1374]
1344A374m242M323k180n223P850P768q442j0757K805Q650J675o79J268n754r291
1359a0855M808J6767L007j9815j0993J5692J3191n803q625m45J464M92L564L577
1373F026n851o860O247Q227n985r093O435R049q459q581Q471O770n860m814N161
1388H83L941p134m275Q082K950o570J4N435l886n488R872Q588j2898j3657Q198
1403e945J6493K27j4477m645Q450L231l87K261m875r778L115J4139R36j3608k668
1418g531J0665K582p680l349O778K017q076P33Q484j048n934J641K683k542j170
1433a747M459j395p185L444J1032m05j4318m902J5013Q300j2232r778M356P260
1447A902L293q41m224n815k87Q500N044p988p606M384Q449k233m898L898J566
$$ y = [1374, -2868, 1455, -725, -5948, 1902, 9670, 1228, -9529, -6724, 1926, 3601, 2922, 4190, -1564, -10855, -6047, 10720, 13727, -6088, -17081, -1389, 11802, 5999, -2626, -3071, -1607, -1115, 2449, 6026, 175, -6685, -438, 7789, 1804, -7289, -854, 8195, -264, -8845, -374, 6396, 536, -4278, 883, 4824, -2310, -6585, 1497, 4447, -2123, -2109, 3326, -560, -6048, 3824, 12412, -486, -14143, -5945, 10548, 10775, -3702, -8347, 103, 3334, 2947, 5208, 333, -9445, -6330, 7809, 8745, -4863, -7531, 3134, 5716, -1964, -5313, 1465, 3482, -4594, -3861, 4623, 3575, -2359, -718, 1965, -577, -1747, 2712, 1317, -5868, -2424, 8608, 8203, -6115, -11017, 3996, 12296, 64, -9714, -5358, 1902, 5195, 4354, 130, -5685, -5972, 2528, 7572, -416, -8022, -3638, 4811, 2578, -2320, 1578, 3144]
1462C144o152j658N529L758k993n012J682M074L92j487j394k013p59L863L747
1477D721n798m873N823O447l187o764k288M336M468Q1l037l909q85N627O411j906
1493E267r768m546P603P256r55n417l197J936K894J659R41k894m686k53L880M308
1509D028l71l961k182k25K276L204n00m438l035L074O399p63n584j163L682K684
1525C125k673l860R79L245K584J37m470l003K104N617K270o233o376K543O162
1540B151K910j034l857m593j808O539P143m049q599j732N770N876m26l605j608
1555i22k920r61N544N721k993p785l29N097K504J501j508o105k105M284N623p64
1571C882o394o16N874L3n811o27N777K166m889l820N17L579N469N33p065o821
$$ y = [3144, -3008, -4666, 863, 4621, 1628, -3384, -1702, 2372, 2764, 1277, -117, -2130, -2889, 974, 4721, -1077, -5950, -127, 6320, 3133, -3631, -5919, -1583, 2885, 2966, -71, -3980, -4865, 762, 7173, 5267, -4501, -9047, -1444, 5812, 4857, -560, -3757, -1821, 1073, 2732, 3673, 779, -3907, -4160, -280, 4028, 3657, -304, -2486, -2711, -435, 2769, 2269, -2169, -5204, -2130, 4269, 3506, -2078, -3241, 441, 3125, 452, -3408, -2429, 816, 3400, 3537, -933, -3936, -1832, 3785, 6055, -178, -6554, -4011, 2151, 5061, 4027, 170, -4423, -6231, 308, 7451, 3402, -5197, -6929, -1159, 4717, 4291, 686, -922, -3842, -4803, 741, 6462, 3469, -4316, -4645, 452, 2956, 4457, 2949, -3156, -5261, -977, 4646, 3882, -2512, -3128, 2746, 2779, -3032, -3659, 2118, 4284, -605, -4425, -3908, -329, 5140, 5673, -1392, -8213]
1587h213K029J1060M506r575o374M206L531l36J869K254m458p565J427Q805N372
1602H538m063q324k614K915N770O634l856j2938k725J1244Q441m061q610j914
1616e563L608K870Q68k45j667k451J541L667k468k208M965J491o471l799L933
1631a929O861J69o272j985K714O77m04L199K29n916k008L910J041J506K588l202
1647A178o633k233P352J0809k317j5573n367J1534J0466j925p478o103p33P963
1661I40P294l482p101k775L114N329j473k284K636j231o156J279Q074J516p047
1676a367l362K759K712J197j156j189j66j562J616K673l220j532N444J519p113
1691b747l904P325P299l610q159k521M755M992J179j301m948o250M804J0673l75
$$ y = [-8213, -6184, 4876, 9382, -193, -6567, -2361, 1170, 834, 2703, 4957, 499, -7066, -5639, 3166, 8538, 4475, -3849, -6463, -3548, 2222, 8856, 5000, -7938, -10663, 581, 9022, 4961, -3649, -5563, -1955, 915, 1783, 1538, -129, -2580, -1039, 2628, 160, -2048, 2917, 4408, -2063, -5862, -1929, 4932, 5101, -1171, -3156, -442, 235, -169, 3030, 3259, -2657, -4665, -755, 286, 1792, 4380, 1178, -5455, -7688, -336, 10473, 8156, -7417, -12784, -1250, 9216, 7291, -187, -6290, -7023, 940, 8234, 4752, -2349, -5124, -2010, 3319, 1846, -438, 2198, 967, -5189, -3910, 4164, 5680, -1367, -4729, -1970, 742, 1939, 783, -406, -572, -2134, -518, 2155, -1065, -2597, 2847, 4366, -2747, -6651, 674, 7973, 4363, -3796, -6317, -1562, 3430, 4609, 3308, -1640, -7890, -3086, 7587, 7212]
1706G212r435m661L800M366R77K96j034m816k540M781O846j470p392p63L279N74
1722B0J961K682l531o265P60Q086K136o980l006M521K854k959k321K939L41l105
1738a867J406J761k982j428M951L651n692o534M306O445j145m126r10P33j05K495
1754I59M248k385p324k0O280K686l238k187R06j522j67N051J685n459n501K960
1770c028O554J69m352o56j59q86L336L731l538p677J751Q861J428o246l584L137
1786a159M131q18k400n39j384N37M641J194n064k800M095L334l310k419J373O38
1802E0q41K46K241L53l168j336J899J091O6m57j456j120K054M266k59o715j816
1819d902O144L384l792n045J453N106K164k285m517j465L833L523j149m409l359
$$ y = [7212, -2223, -6884, -3084, 1282, 2259, 2555, 1521, -3295, -5835, -1054, 5792, 4322, -3070, -3833, -554, 20, 1981, 4663, 1132, -5133, -4373, 3713, 5849, -1131, -4137, 384, 3238, 279, -2042, 897, 1238, -1867, -461, 1300, -1682, -3110, 1841, 5492, -200, -6734, -2428, 4017, 2872, -1254, -2164, -1431, -1536, 959, 5207, 2822, -4502, -4522, 1758, 4444, 1206, -981, -75, -1597, -1764, 3287, 4972, -487, -5988, -3028, 3526, 3695, -657, -1313, -1472, -2358, 978, 4709, 1171, -6506, -4755, 4106, 5534, -712, -4296, -1159, 2972, 2154, -246, -785, -2169, -1632, 3009, 4203, -861, -3661, 434, 3768, 458, -1961, -588, 50, -791, -545, 1696, 2049, -1119, -2455, -556, 535, 601, 144, -1312, -2432, -378, 3888, 3629, -3086, -4902, 1242, 4626, 834, -4211, -2758, 2348, 4512, 2227, -2290, -3755, 78, 3601, 2452, -1957, -5316]
1834e316M150N558j261m246j369R05J026J244N53j371j366L35j42K268K377j734
1850A611l855k047K445O305P61o892l346L947M782l3l758l486L02M680K344l771
1866a1k447J015L052J384m371l595M113L633j080k643j877J034L590K091l242
1881F46m165P77K328K082J068j861j304m71j588K407N175k076o468k282M131N800
1897D199J939m278p121q36O379N438j675p100m572N697P077j213m106j935m90
1912b597K261J607l50j091N9K90n46N92R60P41k51l238j337L432J416j576n5O81
1930I98j257o59k27J229J429n11k073j822R54L459L259j719p242k349N902N376
1946D747j34m246n335R97N881L657j784n734l618K906N331J932k770l255j249
$$ y = [-5316, -1166, 4392, 3131, -1115, -2484, -1579, -553, 691, 1244, -127, -1493, -1158, -1300, 968, 3345, 1611, -2244, -4291, -1846, 4459, 5220, -1672, -5018, -1071, 3711, 3678, -80, -3566, -3264, 1416, 3760, -11, -2458, -1443, 1609, 2993, -1378, -4973, -860, 2773, 1693, -950, -2827, -1793, 1797, 3888, 646, -3519, -2742, -414, 1668, 2736, 875, -429, -900, -2488, -81, 5094, 3018, -3450, -5732, -1601, 4199, 6138, 1860, -5261, -6097, 282, 5720, 4045, -3055, -7627, -1930, 5147, 3934, -172, -2107, -2597, -336, 1271, 921, -170, -111, 179, -367, 225, 1185, 1926, 1675, -1563, -2900, 532, 1948, 372, 317, 998, -259, -918, -1145, 84, 1513, 1002, -1071, -2893, -1939, 1520, 4779, 3060, -4182, -6531, -629, 4747, 4613, 367, -4968, -3971, 1910, 5567, 3783, -1951, -5569, -2663, 2668, 4600, 1830, -1425, -2674]
1961b674P77L657J971l097k864o58J472K987P51j111j672k185N04L672R48k780
1977c02k101J982J941r36m88j03N99M38j229j723P00J895K565p52m802j943L739
1994e20M497m75m992k752J170M023L225j377m830k486K120N194P81l763k193k1
2010b399J450K429J394p61l530k312K496M129M55l192k753R09J797K001P90l451
2026e48l052K240L757J2l339k167K911K585j585k785m97K380J945n39k188k208
2042c078J981M218j58l867k351J714L590j9k065l58j28p3N89J728M13k553k267
2059b684J390K252J102m95k801k094J188M412K234m759m837K202N528J991m547
2074H2l937J565L411J812j196l222j007K169L319o50l847m42K625P68j334o75
$$ y = [-2674, -1897, 1760, 3731, 634, -2230, -2888, -1416, 1571, 2322, 1211, -461, -2646, -2142, 1530, 2478, -302, -2403, -421, 1520, 584, 96, -7, 592, 1030, -199, -1922, -1222, 673, 3238, 2486, -2316, -4259, -520, 3977, 3502, -1490, -4242, -3072, 951, 4176, 2799, -2031, -4517, -2397, 2797, 3578, -185, -2378, -2399, -949, 1480, 2874, 2113, -1417, -3729, -1233, 2896, 3351, 159, -2594, -1685, 112, 2113, 2903, -548, -3600, -1360, 2397, 2409, -930, -3097, -186, 2399, 814, -1971, -2468, -88, 1857, 1318, -870, -3078, -1097, 3121, 2963, -904, -3255, -1541, 2049, 2030, -35, -393, -521, -594, -5, 1723, 2136, -417, -2684, -1294, 958, 2060, 1565, -1236, -3330, -2142, 2270, 4504, -255, -5092, -2890, 2638, 4629, 82, -3855, -2290, 1121, 2933, 1737, -1485, -2492, -323, 2996, 2346, -1501, -1943, 682, 1450, 116, -559]
2090e59Q08N46j763l77K437J02j630r37O18J001L23K01j239k049J878L184j001
2107A543l814q57M824K251l731l329J392L114J347j616k749o87J529L898M58m454
2123h81l450K423M780J02l645r66K2M04K468J253k014k705j013K553K978O9j759
2140F19k115j281J402M283J955n354n173L652N254P57k825l070n41K251K327K92
2156B433l148k301J730L242j88l335l27L727p35k758K43J088N45N51M2j488r61
2173a640J233K093k7j644j809J69J771O52J545M14m249k507L391M518o69m300
2189a059k447Q98K885L223J39m383m329J305O354K549m714l997Q01K499K819K64
2205B807k430k849l32L317K253j722k072P54J287j081o46J986J08k499k02R87
$$ y = [-559, 249, 795, -968, -1345, 1092, 1194, -436, -1373, -755, 246, 569, 770, -469, -2518, -640, 2544, 1543, -2271, -3128, 1696, 3947, 216, -3113, -1721, 1393, 2740, 1124, -1625, -2312, -783, 3115, 3573, -881, -4331, -1908, 2872, 2974, -671, -1637, -1615, -1211, 1257, 2510, 496, -2209, -3222, -669, 2309, 2378, 619, -1496, -2777, -1375, 2908, 4863, -491, -5664, -2012, 3242, 3999, 1174, -1896, -2437, -186, 2141, 2433, -715, -3016, -1286, 1956, 1768, -1567, -1894, 1833, 1098, -1660, -1417, -329, 216, 767, 809, -679, -1640, -407, 1686, 1659, 15, -1794, -1625, 146, 798, 2343, 2757, -1492, -3999, -608, 3910, 3241, -1059, -3506, -2608, 277, 3500, 3639, -744, -5073, -3768, 2586, 5135, 421, -3576, -2775, -276, 2543, 2807, 377, -2472, -2804, 513, 2766, 1044, -1028, -274, 1013, -68, -714, 1272, 1380, -1119, -1321, -334]
2221c34Q53J69j66n5n39j274L84R70k3l4R86l93k551j95M566J756m190m249R39
2240c380M735K613j887k992k350J451M669J446l803m273P43L753J987j266j559
2255a13j070k7N16J699P77k279j908J472J228O38N43j053j599n81J592J753r34
2272F54j814K4K075J472k310j643J494J365j02j415k104J085L089J573k237m240
2288c034k46M376K495k238m618j68L820K062q91j714j670L30J267Q48Q35j123
2304C31j308j84J078J639Q16j554k934j188L582L580j709l985j570L312L901j815
2320A992m005q83J809K522P04k050k112K80L063J052k897j707J367J633K18j041
2336e5l56R79m48j95P91R5j552k85J732M64j123P9K66r16J81O43O25j239k141
$$ y = [-334, 519, 688, 522, 467, -72, -1346, -962, 8, -15, -49, 937, 544, -2007, -2202, 2364, 4120, -70, -4319, -3380, 1355, 3968, 2081, -911, -3261, -1810, 2859, 4305, 502, -3771, -3028, 725, 2712, 1446, -113, -1183, -1210, -694, 1005, 1782, -497, -2405, -933, 295, 933, 1476, 423, -1176, -1757, -165, 1588, 654, -1160, -1136, 939, 2411, 101, -1542, -48, 1317, 1215, -200, -2304, -1219, 1870, 3443, 1206, -3034, -3280, 1096, 3591, 1353, -3265, -3433, 387, 2449, 1558, -156, -1826, -1496, -229, 619, 1454, 331, -977, -1161, -83, 1556, 2372, 818, -2116, -3304, 278, 3858, 2149, -1836, -3406, -94, 3807, 1992, -2013, -2896, -1087, 1435, 2139, 89, -2023, -1743, 1320, 2372, -525, -2232, -865, 768, 986, -55, -411, 568, 120, -75, 716, 811, -741, -1026, 706, 1170, 47, 126, 392, -524, -343, 300, 925, -314, -2455]
2355b455J662L276m90l147j501K182K255k02j564k397n29M040L007k085m640j244
2371c832M153L443k023k991p60J044J696J356J61k571k418J414K182N70p49j409
2387g34o60P0J440K529o69l774j661K934K848p46k605k27R33P94N61m80j117j31
2405f95R61J194j685j520J959K033q35k629j024J723J793L30r13k512j066K316
2421e70L490k15l897k633K129K702J048l33j909k107m18K776L525q11l990k610
2437c823J894L866J603j544l376k476K014M655Q80l408l618P80L736Q49j408j215
2453e91m65P5N09P23J56o99N70L88j590p75J918K018o61l087o87K251J234K38
2471A525l22j103j790l30K648K468j402k427j796L27K665K495J71l623m287J479
$$ y = [-2455, -793, 2483, 1993, -1154, -2655, -473, 1782, 1580, 16, -2381, -2910, 1130, 4137, 2052, -2588, -3832, 321, 3764, 1741, -1250, -2010, -966, 730, 2086, 2247, -324, -2742, -1328, 854, 1424, 675, -734, -1394, -1324, 116, 2645, 1976, -1798, -3459, -525, 2323, 1577, -1028, -1255, -322, 472, 1033, 553, -564, -695, 266, 1460, -225, -1745, 214, 2247, 1412, -1217, -2241, -518, 1275, 1605, 692, -1820, -2886, -570, 2920, 2705, -1192, -3825, -1696, 1006, 2054, 1721, -188, -2295, -2713, 63, 3588, 2777, -1213, -3823, -1929, 1937, 3540, 1996, -1380, -3856, -1842, 2813, 3693, 285, -3333, -2553, 1183, 2032, 624, -591, -1056, -981, -472, 251, 407, -292, 278, 666, -924, -1699, 219, 2237, 1576, -1511, -2198, 53, 1287, 1525, 1203, 100, -1690, -2020, 628, 3096, 1694, -733, -2529, -2202, 463, 2958, 3129, -494, -4781, -3302]
2487c302N809K462l795m844l3L284K781J115k811l661J48L552K456j706k766K06
2503a105R53j97J34J708N79k547j724J585J745l90r8o20j291j92J379J828p43
2520A004j603L56q6j201L41K967J588l457l831J718M255J588j806l449j734J356
2536a994M344K764l622n550K91M704K776k090k841m45K8J079K389O55k580k671
2552b763Q88K622M80m69k56j748j067K226K621p20l506o10K673J522j652j214
2568i73J102R36o01o25j53q37J141K263j234l208o07L709K743k633l514K98K045
2585a48J135k4j87j535j698J690K872k33k209j236N10Q44Q50J171m76k765r87
2602b426K741K437j559l172qJ883J066O52j047k033l20J980K119j693l240M40
$$ y = [-3302, 2507, 4969, 1174, -3670, -3703, -419, 2362, 3477, 666, -2995, -2847, 705, 3161, 1455, -1311, -1105, -152, -349, -215, 1493, 2072, -475, -2199, -614, 1131, 741, 643, 23, -1268, -1460, -81, 1747, 1004, -599, -243, -329, -1530, -1189, 1778, 3366, -91, -3922, -2204, 2051, 3639, 1833, -1616, -3350, -1994, 2350, 5114, 1492, -4058, -3767, 937, 3713, 1623, -1218, -1663, -1635, -556, 1833, 2488, -92, -2763, -1875, 747, 1227, 758, 502, -1246, -2313, -87, 2534, 1814, -1692, -2302, 371, 1893, 241, -973, 129, 1065, 464, -161, -314, -1151, -10, 2253, 1019, -2189, -2796, 913, 3656, 1023, -2491, -2193, -148, 987, 963, 776, -759, -2457, -767, 2105, 1872, -337, -1573, -1063, -219, 631, 1802, 1326, -1439, -2426, 315, 2752, 1193, -1979, -1987, -104, 962, 1614, 567, -1466, -1786, 194, 2313, 620, -2620, -2180]
2618b180L351J193k341k022J412J171R4K15r29j785N82K241J009j652j544O22
2634e63J149m34K1M06n78j484L13K907M73k807j200J347R99q1p81k00n16M98K079
2653A548P3k610j429K257K869j710l269O48K185J341k86j785j556j94K128K634
2669B844j169l747o35K809K529j199j600p37j036L90K961J063k002k772J83K402
2685B84J741p00j309j759o82K033L220J87m453j421L152J636j323j142Q4P77j75
2702A50k18L56J0J55K23p76j512o20K685K518k215k745J91J968J216Q9j025j706
2720a256j629J344L726J072k658k485qJ166J931K009j315m569j534L525N232k82
2736D269n296k865J820K807J517j51k699k421J231L567N88k044j320k9K14L13
$$ y = [-2180, 1171, 2364, 23, -1999, -587, 584, 678, 893, -36, -1821, -1239, 1002, 2011, 359, -1185, -563, 586, 152, 173, 579, 1, -1483, -1170, 1737, 2210, -597, -1797, -450, 549, 468, -313, -513, -1029, -531, 1548, 1621, -989, -2418, -161, 2708, 998, -2271, -1623, 562, 1903, 1617, -168, -1724, -1918, 210, 2844, 1675, -2072, -2707, 102, 2631, 1432, -168, -905, -1941, -1551, 1410, 2473, 471, -2301, -2118, 284, 2025, 1325, 16, -1743, -2425, -392, 2828, 3015, -1438, -2859, 293, 1929, 606, -536, -452, 325, 150, -68, 288, 298, 453, 676, -100, -1612, -2232, 453, 2971, 756, -1989, -1798, 170, 1386, 1475, 450, -1256, -2885, -1541, 2185, 3257, 599, -1886, -1894, -728, 1203, 3212, 1897, -2672, -4206, -681, 4551, 4269, -1027, -3892, -2072, 735, 2252, 2101, -598, -3019, -1788, 1779, 2367, 323, -997, -1026, -812, -499]
2752d99K57J812Rk694n75J363Q47O51J58j216k036K97K394J407q40j540j026M6
2770a185J03J356K683j152m467j091L379L491J56l275l529q3L218L805J76m217
2786f32l731J782M864J131k404k170j210P84K698J336o85k130j813R65J946P17
2802A448p26q97r14p68J860K186j139k081mL59L41o2M24R64j85j512q32R16J762
2821A140O47n88k481k119K159M371M82l321l501K42L715K442r31k775k347O01
2837b264K846K628j045l755j495J618K068J491n12k342j459K33K650K383j667
2852A378k835p66J530J869M81j054j262m56J091R96l01r30j51Q58P6j604r7J887
2870G10J017j193j935o11J492J789O55j376k778n0K419K369p72k908p31R39J231
$$ y = [-499, -242, 1570, 1579, -1115, -1690, -327, 520, 1171, 1329, 113, -1923, -1626, 768, 2175, 1335, -205, -1231, -1185, -1082, 274, 2957, 1805, -2662, -3753, -374, 3117, 3273, -2, -3531, -3614, -396, 3409, 3585, -632, -4363, -2581, 2283, 3414, 1010, -1160, -2370, -1586, 1112, 2448, 1763, -367, -2180, -1215, 731, 1448, 722, -175, -1089, -1857, 3, 2189, 1050, -1031, -1035, -676, -335, -397, 27, 991, 806, -706, -1538, -622, 1140, 1787, 1199, -1282, -3401, -1242, 3129, 3611, 290, -3211, -2969, 746, 3188, 2257, -518, -2865, -2264, 582, 3210, 2165, -1590, -3085, -1467, 601, 2092, 1580, -762, -2221, -1988, 662, 3045, 1378, -1457, -2223, -693, 1176, 1657, 603, -659, -1115, -24, 972, 671, -259, -410, 448, 524, -1080, -1177, 710, 1727, 534, -1401, -2012, -520, 1269, 1924, 548, -2230, -2280, 139, 2508, 1736, -1172, -1903, -964, 267]
2887B67J074M70j599k045k14K800J971j222k600j130J210K035J092q73k512j492
2903b768K616K306p14k328j020J562J527o87p87j93k7P60P59q52j516M71K315
2920A424j74j870o02Q96J172o4o14J62o04r05J171J526n33j918o17J139Q52O04
2938A045k66j353j196N37K468J047k671k174J801K373k24j185j244J13J187J161
2954A419l11k118m63J836J656j229k448L17K007M4o68P9l43o75M42J670L00k177
2972f62j268J029J434Q65q02o84j191m99K446K159k004l287K30K584J910j000
2988A260j542q57kJ587J068o30k078n34K527Q66j885r25J498L44j079m81L52N84
3006G3k32O08J69j243q29J478J579q45j733J48P88j15Q63J168r31k768p70K851
$$ y = [267, 1341, 1811, 212, -1833, -2047, 753, 2724, 1502, -1098, -2228, -1018, 1017, 2109, 1236, -1276, -2768, -152, 2154, 1440, -888, -1908, -346, 1181, 494, -293, -486, -513, 247, 1006, 154, -1362, -891, 1424, 1250, -620, -1222, -326, 846, 782, 168, 330, -274, -1179, -8, 1518, 985, -933, -1550, -411, 441, 1045, 779, -574, -1770, -1233, 1235, 2282, -389, -2563, -762, 1611, 1387, 202, -1042, -929, 258, 1419, 1108, -1010, -1473, 363, 2019, 790, -1658, -1341, 666, 710, 42, 121, -222, -897, -455, 1215, 1515, -662, -1930, -901, 533, 1398, 596, -88, -1279, -1778, 668, 2827, 823, -2464, -2234, 350, 2260, 1260, -282, -1139, -1141, 446, 1514, 884, -1194, -1728, 799, 1665, -220, -1145, 353, 697, -382, -863, -511, 73, -159, 449, 618, -625, -1454, 24, 1603, 758, -975, -827, -39, -154, 709, 1877, 946, -1822, -2592, 259]
3024B59K839j739k672r94J269K129J533r89l549j401K658L333p78k848j051J523
3040d78J038l6M85q09j425q9J619R41j007l75P02n17o18M90Q97m19j084L24J067
3059G06n77j004J457J140j328k072L9J888O61K72m32j868j191J948L049J04m070
3076a278k421K419L207R20j798k216r33R48K769J135k598k499O69K217Q16k43
3092A114m18j128j609Q20K690L91k054j640R76J436O2q1l82r02l70J008P15n57
3110G1r82J427J005j945j509J545J915o9k018r77O59J055J806J26k413k202N39
3127a967L180J438k212j984n1R34J504R61p33k434j443K294K011M9j310j161l25
3144a249Q12J421J002j561k423r0L017J405j699j799P57P45j3n0n78l78O24O71
$$ y = [259, 3098, 1359, -1313, -2307, -1038, 1091, 2624, 1635, -1914, -3315, -657, 2676, 1898, -950, -2001, -478, 560, 524, 1009, 200, -1225, -1314, 305, 1246, 239, -136, 566, 49, -569, -79, 818, 399, -685, -361, 706, 129, -875, 582, 1722, 394, -1678, -1639, 249, 910, 1182, 750, -1118, -2309, -361, 2688, 2792, -1278, -3699, -1280, 1927, 2847, 1049, -1167, -2100, -1152, 1617, 2752, 154, -2345, -1676, 541, 1357, 1114, 696, -432, -2041, -1221, 1469, 1860, -194, -1834, -858, 578, 640, 559, 177, -725, -1095, -87, 628, 71, -911, 516, 1521, -424, -1933, -388, 1527, 1458, -560, -1537, -878, 177, 1983, 2109, -304, -2506, -1967, 1213, 2651, 439, -1545, -1596, -662, 842, 1803, 1070, -1364, -2807, -513, 1498, 1547, 237, -924, -1249, -437, 984, 1986, 425, -1998, -2088, 929, 2334, 635, -1164, -407, 338, 325, 275, -303, -681, -57, 614]
3162F14j70j272k60J731Q61j408j930N07J735Q93n68q15j073J21J340J214l01
3179A219j695j004P18J171R96K3j647j672N45K239J345j603k368k16K000J640
3195A691l92j671j221L31J623J294j336j494l7J576Q46r57q36J93M27N94o98n77
3213f44L87L90N56M0r55n42K76R09K29l64o24m09J25R31R62o85j596p25J122J959
3233A342J75j629j666M38K258R83j222j714q02J602J852k82j694r13Q34J402n5
3250I09p46p58K8R04J77k75j08p30K26R22m6p26m95N27L42J67L92p96r47J52J219
3271C38J160o56k243o2J999Q77l36j335j091M56J611J248j346k358K80J931J009
3288A482o88j661r5R41N47J37o53q03L8J157N85r13j018N08R23k73j24j17j06
$$ y = [614, 444, -828, -1088, 643, 1504, 96, -1834, -1327, 408, 1301, 733, -82, -1155, -1034, 306, 1520, 1219, -476, -1480, -762, 409, 1405, 1428, -219, -1891, -1346, 893, 2238, 635, -1733, -1949, 51, 1691, 1299, -372, -1593, -1262, 361, 1655, 319, -1175, -1212, 364, 1210, 253, -583, -390, 37, 631, -67, -644, -257, 133, 689, 729, -226, -768, -492, 417, 646, 282, -342, -751, -626, 305, 1267, 582, -1014, -1739, -617, 1342, 1517, -112, -1778, -1340, 918, 1901, 679, -1035, -1837, -235, 1617, 1335, -359, -1272, -438, 964, 909, 163, -595, -567, 337, 514, 239, 131, -599, -373, 549, 503, -223, -718, -191, 151, 318, 710, -86, -1033, -881, 338, 1498, 842, -1401, -1463, 536, 1413, 1077, -258, -1349, -893, 718, 1966, 620, -1738, -1458, 473, 1482, 794, -867, -962, -21, 526, 663, 10, -793, -755, 402, 987, 74, -944, -436, 487, 214, 90, -27, -133]
3307a33m33K54J635l91j933m67J469J234j59j508j015M31J265J458l50k368j443
3324b454K082K325k73k435j034Q15J220J291q10j252j036R47J810K1j741j98M49
3341b73M67j84K51O43j177q18J408P13o64j094J11J097m7n26j48j35m5R71M85
3360A035j274j747J121K324K03j796j745Q84J890N66n30j422j356R46K527M40
3376B066j988j767Q94J307L16j82l15q18o76P49J855O1k508m12J273K35K17K66
3394E73m31j177K48J533N65j586q97Q91J289n65j608R20R05j22o4n53j081M95
3412f65J484R74j623j900O75K213M98j459j089R7K2M45J993o09k269m05J538J382
3430A302m59j131l97l76L21J669J325j871k342O77K563M89j789r30pQ56P43M72
$$ y = [-133, -566, -312, 1323, 932, -1001, -1468, 1, 1235, 1076, -432, -1447, -1016, 249, 1707, 1357, -1011, -2454, -372, 1953, 1680, -755, -1789, -974, 246, 1537, 727, -525, -1561, -614, 1196, 1217, -524, -722, -273, 194, 10, 261, 904, -273, -1091, 317, 1030, 366, -728, -617, 480, 433, -93, -241, -376, -421, 550, 1035, -239, -1986, -865, 1459, 1662, -134, -1879, -995, 895, 1461, 931, -491, -1847, -901, 1626, 2066, 78, -1689, -795, 512, 828, 646, 331, -487, -1163, -414, 1441, 1502, -1006, -1418, -145, 90, 307, 573, 142, -1035, -787, 746, 1311, -275, -1172, -281, 1008, 443, -1165, -245, 660, 538, 474, -79, -1160, -665, 819, 1793, 170, -1730, -1055, 1158, 1656, 197, -892, -795, -773, -328, 1665, 1056, -1213, -1618, -80, 1302, 843, -288, -685, -1061, -740, 929, 2254, 383, -1959, -1282, 1281, 1770, -19, -949, -956, -100, 643, 1115]
3448A115p23j376n3J921J05j649r11J560J144j005n08O2K06J59M42K5j241m82
3466a209J275J598q10j534q5P28OM82P22p59j856N1K530P25j378j821j77J593
3484H1O73L03q15j650k23K005J974j526k784K53K246M27n30j076K44J41L36R07
3502I86k63j764K2J565L74r36n94N41J38R8L23K48j211o07P30J764m41j726k07
3521i60P60N52L69l91j061o82J031J977j8k264j036J397J656k87j639k93L34N77
3539B2J323n25j408l02Q36R76m42j127k31O59N82J43k00m81n89K75Q70L61j003
3558b61o96K45J055P16m47p35j073J44J829O27j321j374L4K213O27r72j220n34
3576a143Q29J064J58q92j231M54J453M01p87j301K25J028K04l03l51k87M20M12
$$ y = [1115, 392, -984, -1037, 884, 989, -660, -1571, -11, 1133, 128, -380, -318, -112, 47, 489, 514, -727, -1209, 66, 1664, 854, -680, -765, -37, -31, 451, 1173, 414, -1442, -1391, 1139, 1864, 486, -1335, -1512, 81, 754, 1057, 242, -1408, -1631, 374, 2348, 822, -1962, -1709, 537, 964, 434, -642, -398, -257, 79, 986, 723, -1041, -1019, 546, 920, -16, -610, -69, 69, 167, 490, 738, -473, -1080, -350, 1414, 973, -753, -960, -200, 352, 721, 330, -731, -1413, -382, 1595, 1577, -687, -1723, -326, 1330, 1043, -596, -889, -555, 22, 1345, 820, -588, -890, -54, 922, 480, -647, -878, -219, 363, 506, 306, -175, -764, -489, 381, 742, -261, -957, -712, 343, 1059, 612, -123, -1196, -1052, 777, 1404, 83, -1291, -1257, 956, 1583, 611, -609, -1143, -314, 750, 908, 16, -1215, -761, 692, 1093, 306, -995, -770, 258, 462, 159, -192, -479, -59, 353]
3594C53K23l99p41j74R37L84N9n80j077N01J266M39p43j518n55J416J671R0k096
3613e44j127Q96J578Q19j262j712j31J241J509P2j611q50O01J088J34n58n45q9
3631d91L85J87O76j22p23n04M86N63j16m63j11J93M49j58m35j92O1O71L76r35
3651b03j016M38J508O85j219j460K2J078J625j62j740j270O48J980J031j425j711
3668a191P0J001J108ln25j136m72R79J347k15r46q79J12O65M78P12r12j489M59
3687h37J257M90r77q30M54O27P0l14m02L56L30J02r9j065J6J712P24j682j400
3706a468N38J423Q08o89j006q65M30J562M41m17j761p06J550J231j56n57q30p19
3724a191M93J505J053j814j696M30J789R30o19j179p24K1J498J179j225j742J96
$$ y = [353, 576, 177, -564, -738, 199, 583, 642, 62, -1015, -514, 752, 1191, 448, -1070, -1625, -209, 1462, 1552, -544, -1671, -775, 803, 1622, 360, -1352, -1483, -242, 1267, 1339, -272, -1122, -521, 567, 701, 143, -402, -491, -106, 81, 757, 635, -88, -592, -106, 457, 341, -122, -233, -40, 409, 251, -184, -376, -315, 356, 732, -203, -1219, -781, 727, 1412, 193, -1267, -1245, -167, 1458, 1296, -444, -1714, -1066, 914, 1945, 520, -1191, -1121, -120, 988, 985, 460, -676, -1148, -169, 1178, 963, 17, -862, -750, -85, 393, 1105, 193, -1296, -837, 420, 910, -67, -897, -443, 184, 254, -60, -462, -106, 224, 326, 227, -838, -822, 890, 1614, -68, -1468, -930, 493, 1301, 612, -394, -1259, -829, 733, 1174, 757, -1004, -1710, -160, 1071, 915, 358, -472, -1191, -698, 807, 1860, 46, -1650, -1220, 569, 1499, 880, -299, -1023, -1002, 496, 1675, 450, -1292, -1096]
3741a096J669O29j224q01M74L09K10k15k50k77L63P10J69j243n20J220O86m02
3759D11q93K05M1r1O80Q07r15j497k54K248Q05j320r15m6J53J027R79q30k081
3778a486m96K123J642q64j994j88J026Q66Rm13o71p60J139J472p41j124k04J096
3796D32M32j071l8N85p64M3O93O79j084q61J213O28o49m94k78J06L07L92P39q52
3816A58j662Q32J911J7j863r38J272R72L0m60p21n03O69J024K38j558r00J579
3834I7J072p71p76o0N25k41J80P63p87j013L84J527J35j219r11O21N68P6N09k67
3854D12j375m29J889J383j293j793q6J204J097k26q04m70n69J182J321n72j987
3871a116q9J434O35p51m05J76q9J20J08K27k29n57K21Q62o45j54M91R5j48o45
$$ y = [-1096, 573, 1202, -22, -823, -349, -40, 170, -45, -295, -572, -209, 501, 670, -573, -1093, 127, 813, 411, -482, -277, -236, -327, 353, 1160, 245, -1252, -1506, 742, 1547, 227, -688, -734, -581, 446, 1425, 595, -1486, -1982, 141, 1783, 919, -1075, -1263, -237, 629, 638, 225, -446, -1206, -67, 1405, 664, -460, -664, 432, 864, -207, -245, 340, -424, -381, 312, 991, -93, -954, 259, 887, 238, -256, -534, -428, -121, 271, 1010, 158, -1504, -672, 1239, 1256, -607, -1545, -273, 699, 729, 269, -452, -955, -286, 738, 976, -582, -1482, 97, 1169, 398, -378, -438, 87, -154, 26, 789, 2, -1011, -627, 900, 1035, -184, -1095, -474, 94, 170, 679, 412, -963, -1392, 497, 1880, 587, -1206, -1292, -88, 1009, 783, -21, -491, -1060, 122, 1443, 871, -1116, -1205, 229, 864, 113, -292, -116, -205, -85, 23, 250, 21, -536, -315, 547, -98, -252, 239, 334, 186, -459]
3891d59N51k44l20M99J034l67j428m33J255J359o77j416p05K99J612J103m40k231
3909a008j054J660J871k66j560r08J71J349O79L62j114j368K48J354P34o19j009
3926d78j14K62M06P37O9j030p34M16Q79K75o41j31J97k09L2j96K05J05J58m0q09
3947f41k39J000J172k11j810j019J174J687L81r97j645j45R97J730K39j694j775
3964a796N27J489J125p7j110j075m45J261J622m51j376j102J29J790R50o05j107
3981b51r92N34J292N01q41j096M56P03J88m90r3L91N5n50k53J82L50O49m9j062
4001c76p08N24J466L78j163j290KJ056J069L50q97j152p47J066J550J98j074j562
4019a310j14J490J380L00j808j770L93J884J453p23k041m29R58R53N01p03j256
$$ y = [-459, 92, -152, -472, 27, 1061, 694, -734, -1167, 88, 1447, 770, -646, -1351, -1052, 560, 1663, 1223, -1008, -2062, -402, 1469, 1203, -357, -1265, -1094, 255, 934, 1296, 182, -1186, -938, 416, 1150, 531, -478, -592, -330, 76, 813, 882, -148, -882, -466, 413, 688, 47, -84, 113, -96, -64, -260, -55, 50, 208, 168, -641, -880, 120, 1292, 1081, -729, -1748, -574, 1113, 1494, 497, -1148, -1293, -296, 1434, 1673, -21, -1796, -1269, 220, 1345, 1268, 158, -917, -1362, -101, 1521, 1070, -306, -1408, -1279, 511, 1461, 856, -251, -1243, -709, 583, 1084, 243, -853, -397, 306, 494, 4, -89, 302, 357, -193, -446, -264, 86, 735, 686, -376, -1084, -560, 906, 1284, 121, -1169, -1167, -111, 958, 1308, 411, -741, -1488, -422, 1128, 1326, 252, -1310, -1424, 66, 1446, 1746, -62, -1832, -1439, 445, 1898, 1175, -866, -1295, -337, 616, 1117, 414, -842]
4036h42l23J056O91M1q18J45Q1j43j29J48M96l37n45L60J07NK29L32k58n79k46
4057e29M19R08j95l38o06o05L25J175P83r39j888J08J467J282k68j579q02L12
4075i70J337J147n72k096l06J118J490p2j062m33k09L77O21L54m49r46j12J121
4093C38J56m18j41q3k21J47L15K54p21j3O12Q7m89n66N21J082k61j059j98M03
4113b55M74O19k01j168p76R17J850j98j668r35P66J143K16l87p17n10J24J202
4131D96M92o93j141M6J277L4j00k63n19l88O60R33J92j723l62R93O84nq13k08
4151d08J66M05M88j13j178m64J329Q83p02j328J67J104J09j78l48l97k32P11N33
4170E47q5j357K08P36M07l52k15OR8m54N12P11q65m19K18R38k46p61j66M73K75
$$ y = [-842, -1165, -109, 582, 623, -195, -50, 31, -112, -241, -93, 403, 66, -479, -119, -12, -7, 222, 554, 296, -283, -529, -110, 798, 603, 265, -341, -946, -621, 554, 1337, 398, -1490, -1382, 85, 1367, 1099, -480, -1282, -970, 367, 1514, 942, -1154, -1460, -342, 1148, 1076, 14, -419, -628, -251, 370, 724, 275, -671, -783, 338, 494, 76, -65, -148, -369, -222, 93, 347, -374, -387, 225, 312, -177, -743, -222, 860, 599, -460, -658, -255, 219, 838, 637, -531, -1307, -390, 1460, 1262, -406, -1341, -575, 568, 784, 397, -320, -830, -706, 496, 988, 295, -846, -800, 477, 511, 411, 148, -371, -759, -99, 834, 1026, -697, -1059, -66, 618, 613, -200, -408, -242, 163, 651, 538, -640, -1104, 225, 1108, 406, -922, -755, 349, 458, 280, -68, -465, -697, 14, 547, 462, -895, -687, 49, 456, 104, -111, -105, -7, -461, 51, 762, -103, -522, -304, 634, 388, -373, -539, -66, 209]
4191B09L69j42p38m05K70J512k22j447o34R90J172Q5j201o72O5N20J056P0j052
4210a95j086N26J613K12j008m43j77M8O73Q22r7j174p23Q97J059m50q83l61L43
4229d04J18O12J82n08p69O52O14k98r92L41J046r3q78k17O05L52K45j81r35n69
4249a077O03J472M16j442j283K85J605L53m06n47j062N3J211J344l71j711r54
4266a511P08J234N87k79j373o14K83J800J035j323j829K78J067P71k06o43n73
4283e88j52Q93O09n37k65l48M41j7o72N46Q76n03o67k63N47K42J18K85o13q06
4303h74O5J045P72j70j285m05K35O24J013L17j740j089O82J722P84j188j436p10
4321a638R50J706N07j019j622k85J396J257o32p24n07k26O71N18K34l28p52K4
$$ y = [209, 578, 436, -302, -707, -437, 1075, 853, -594, -1228, -238, 934, 1019, -182, -854, -789, -269, 787, 857, -195, -1281, -755, 858, 1070, 62, -381, -558, -510, 163, 985, 888, -286, -1009, -112, 947, 497, -386, -747, -404, -286, 326, 508, 0, -769, -117, 497, 199, -793, -452, 594, 501, -377, -594, 11, 363, 608, 427, -508, -1077, -474, 998, 1414, -28, -1311, -1026, 579, 932, 526, -21, -1083, -1030, 181, 1525, 1154, -557, -1511, -803, 431, 1018, 739, -634, -1248, -965, 835, 1870, 547, -1282, -1004, 63, 834, 628, -15, -588, -740, 153, 762, 225, -40, -388, 53, 36, -636, -90, 786, 283, -384, -647, -100, 142, 260, 545, -68, -874, -809, 236, 1008, 838, -447, -852, -617, 7, 1020, 1337, -403, -1492, -810, 912, 1696, 508, -928, -1638, -688, 1018, 1525, 506, -1116, -1401, -5, 1252, 620, -104, -611, -837, -166, 352, 586, 258, -494, -470]
4339d70M21J15K08j7j16n19j45Q18M81n47l78k2J05m67J42J384m4j114p01J69
4359f97J029N18l7j102j132K48J800J270j062k067n26J516J332ro42j275m16R33
4377c19J545J73j430j170L04R57N22O6l28p27n48O95J629n79j140k97L80M21J49
4396C03P2k3p38L0N62m6m00j0P34j2j122k34J305O84n58j189l78P64O85N52k60
4417G21j472o87J027J410Oj218n07Q0K44O93N19m99j266j73J183J032k53j143
4435c03n85K56P70O48J26j104j112Q27J331j52j135k49P49K79k67j16n6M0j2J43
4455G8om53j43J000K13j086j78L24N49m1m04L2k10n1O57K85j45q59l11R95K51
4476D97j66M7q48l73O31R66L39j355r24O49J260l4p07o61J60M71L07M12p95p80
$$ y = [-470, -49, 66, 274, 257, 141, -378, -523, 295, 776, 229, -149, -171, -66, -533, -391, 993, 949, -165, -866, -697, 332, 850, 813, -289, -1421, -1173, 627, 1897, 835, -1232, -1758, -242, 1090, 1081, 439, -836, -1252, -319, 1226, 1399, -31, -1201, -897, 60, 582, 648, 320, -407, -955, -260, 1369, 790, -350, -647, -267, 154, 303, 375, 352, -386, -356, 206, 160, -240, -250, 484, 472, -650, -884, 421, 1105, 547, -642, -1020, -256, 429, 981, 721, -751, -1438, -411, 999, 1005, -213, -720, -640, -396, 297, 816, 317, -949, -1122, 61, 1093, 840, -303, -888, -632, 138, 786, 912, -192, -1304, -477, 854, 702, -433, -682, 67, 346, 79, -37, -93, -53, -65, 78, 72, -381, -524, 476, 689, -397, -575, -251, 298, 257, -147, -115, -325, -376, 281, 566, 421, -438, -749, 246, 497, 331, 378, -470, -843, -212, 754, 1093, -262, -1186, -537, 723, 689, -18, -679, -519, -48, 259, 671, -124, -904]
4496i04M38J032J02o10o20K10N39O0j6k76j86j90M79O13n13n69j2L44N28k30k73
4517e4j40j51K97N36o9r13m27Q45O59l24o44m8K32L80J74l67k49j50M78O47m44
4538B68q58L64N71L66o75m94K03L14K36J61k71n67k21M99R21k44r40l31K56N25
4558H3M85K0p27p36L36J215K50p85j165J62J029N41L9p16q15M8Q95M65j55j120
4578f51K02N56J04j52k18M54l52k36k2L96k23K66J8j52o24J43N26N41n22k77k
4599b25K07K49K01K99p71j108N28J036O44m81j346j26O44R16M80p85j518J3J241
4618I8J278m32j324k95J32N53O71o2r61n88J25J113M66p76J5m25P5K09L36K45
4638D53n06m45M73M07j04l04R6J47l93k03L59K46Q6J40m09n27k69J156O69q12
$$ y = [-904, -466, 566, 668, 58, -562, -352, 187, 247, 231, -45, -231, -421, 58, 671, 158, -411, -423, -79, 449, 219, -54, -194, -345, -48, 488, 419, -494, -921, -76, 583, 259, -385, -433, -201, 179, 353, -14, -263, -413, 65, 712, 268, -590, -226, 345, 711, 36, -458, -255, 59, 295, 456, 185, -382, -603, -104, 817, 573, -367, -698, -442, 83, 568, 588, -139, -875, -539, 676, 926, 141, -1024, -862, 167, 708, 747, 31, -784, -736, 159, 624, 469, -651, -449, 107, 211, 59, -159, 295, -57, -293, -315, 81, -142, 124, 142, -10, -634, -491, 35, 576, 54, -223, -225, -18, 231, 432, 731, -40, -1148, -620, 416, 1060, 579, -767, -893, -249, 667, 1147, 362, -1156, -1143, 98, 1376, 944, -380, -675, -543, 10, 681, 619, -342, -930, -805, 308, 774, -2, 13, -412, -337, -128, 208, 453, -53, -498, -25, 382, 278, -26, 70, 217, -176, -379, -20, 226, 312, 452, 43, -484, -753, 403, 1072, 260]
4658B60j078l11J095R78j19p42q21m40J046J385l18j289m77M43P62K37j05m12
4676I4q46l35J212R13l97j232m29R93K49M93k38p69m12J79J178J05p67k50K56
4695cK62k94k74M52K90l93k2P9l79K19Q85m53q24p38J076J003m63o16j17j84L94
4716a00N77J30m50j211K87J044O42m16n80k87l12M42J096J70j468p52Q18J290
4734I20K70j309k60J66k7N29L14o91p24M04J160k43r51kO32pm13K8M08l22j30
4755b48N93J41p67l32O77M57o77k90L06L80n6M8J67l34q80M80J296k13j130n08
4775h90O73N81j41J15l13p78N4J195N97q90j139N33R98j72n18j1j52n5K75N66
4795E28J3j210K84P85R0n63j53P2M3o2M53M33j085m13N86Q64l93r03K26L42J02
$$ y = [260, -818, -1129, -34, 944, 825, 83, -738, -1178, -132, 1253, 935, -354, -831, -388, 374, 611, 506, 94, -752, -1087, 125, 1038, 641, -591, -1020, -27, 222, 715, 477, -292, -704, -525, 653, 758, -9, -259, -3, 259, -35, -309, 143, 433, 40, 18, 97, -282, -63, 822, 369, -455, -1193, -117, 886, 423, -193, -310, -494, -100, 477, 607, 157, -1054, -767, 277, 919, 503, -77, -364, -676, -234, 862, 1032, -436, -1188, -370, 920, 1190, -119, -379, -213, -240, 289, 603, -88, -812, -408, 752, 509, -442, -444, 188, 181, -232, -204, 204, -118, -248, 345, 486, -281, -613, 64, 521, -156, -446, -140, 240, 184, 232, 399, 65, -815, -335, 961, 748, -382, -890, -217, 364, 223, 338, 25, -753, -699, 496, 1093, 203, -936, -403, 595, 423, -95, -106, -258, -313, -38, 528, 541, -669, -385, 400, 490, -73, -226, -154, -111, -173, 280, 713, -372, -785, -199, 665, 272, -631, -405, -63, 39]
4816C9K05R7n94m24N02P20j63p66l13P47M17k70o05J43M43j20J10J7n82k3N62
4837A42L10j73n69lO34k11q2j10k6k24J81N50R8q75l45P60M21Q7l25n30k92M68
4859a14O95K95p53j085L55J255K59p55o66L4M49M99j67m32o9j86N71J62j60l96
4879b09m0K64l5j26P6J28j42L9J5P7o5k24N63L5k28k49k76M36N89k55m53n32J97
4902d15P68L86m18r07k65P79J064n36o12m52M9O47N53o6r04n03N59P28M9m53l21
4923b70M8o1K32M35q9o14k63N23M49J05o50L4Q7J96M3j67j55k10M30R3l06n44
4945f54P10N19k17n25m34M19L56J79k18m89k57M48N39K26p70m89K19N54M55j01
4965D70n35m17j55P78N78l61p75l21L83O21K02k06m18m24K23P40J59q33l23K39
$$ y = [39, 244, 341, -253, -677, -175, 545, 382, -384, -697, 50, 467, 197, -408, -265, 178, 58, 168, 185, -397, -420, 142, 452, 279, -290, -293, 341, 130, 48, -62, -88, -312, -131, 419, 517, -358, -703, 57, 478, 565, 240, -290, -582, -114, 581, 876, 123, -962, -607, 648, 907, 152, -514, -480, -31, 468, 301, -131, -200, -386, 185, 347, 187, -209, -249, 15, -20, -146, -70, 58, -84, -45, -30, 47, -18, -242, 321, 356, 128, -121, -397, 39, 628, 373, -80, -612, -415, 353, 739, 321, -586, -851, -72, 992, 456, -156, -608, -559, 88, 641, 575, -329, -832, -273, 455, 504, 51, -270, -222, -283, -51, 384, 295, -319, -582, -59, 390, 495, -155, -121, -34, 162, 205, 38, -117, -327, 103, 196, -110, -654, 56, 575, 358, -167, -601, -182, 174, 353, 135, -354, -611, -163, 376, 602, -168, -657, -438, 116, 571, 470, -65, -482, -637, 141, 719, 358, -417, -738, -355, 266, 468, 262, -156, -580, -357, 383, 542, -291, -614, -375]
4985c75O04J80k52m22R5J48K16p5l16p2N51J86l91n74L44L39L8l08K9l1j17M29
5007B26K26m12n23J13O12R8j75p4l79k0P8O83K59p99p71O61O32N1l22m99q8K25
5029a98Q33J37r28o33L34Q23Jm47K5M5k0J65L2k35l21L5O21J17o09k77O71J42
5051C13l82j28J83j01l03M75O39n20o40J67O09L58o20k7j00l17M14M30q4q89j
5072e24O89N27p01o48N47K99O9k21j19o3k75P62K16o45o00M69Q91p2q06k3J81
5093d7k32J37P30k03q32k64O13R67o82l63N8k54m7P65L03p37q05N63J153j75r08
5114b60j42L62J63j59L12L0n27J58L33L01q58NN71P2n74j63N93J9k84j48M09l77
5136a64m26M49P82m76o28j9N73O6P7J2l66p09K55J178P18j374r86N57R09J28j59
$$ y = [-375, 229, 409, 157, -265, -170, -22, 194, 119, -197, -269, 282, 468, 77, -497, -153, 186, 224, -84, -55, -86, -203, 226, 452, 40, -483, -370, 242, 340, 165, 91, -288, -308, -230, 453, 712, -87, -858, -197, 435, 486, 164, -335, -423, -198, 635, 772, -156, -789, -455, 368, 369, -78, -53, -8, -28, 137, 169, -66, -387, -352, 269, 386, -223, -500, 171, 313, -69, -197, -14, -115, -418, 57, 696, 176, -464, -297, 312, 670, 50, 23, -77, -394, 20, 450, 366, -523, -524, 165, 692, -9, -657, -110, 189, 258, 37, -82, -145, -420, 342, 558, -87, -687, -218, 673, 601, -205, -228, -47, -279, -142, 588, 385, -447, -711, -98, 869, 187, -176, -118, -372, -419, 346, 649, -88, -893, -330, 823, 648, -260, -402, -40, 123, -36, 276, 306, -221, -63, 270, 571, -287, -282, 289, 361, -213, -376, 217, 236, -48, -196, 213, -164, -590, -141, 641, 165, -463, -482, 91, 157, 234, 246, -120, -829, -574, 604, 1322, -52, -1038, -481, 428, 556, 397]
5157C97m42n58R0O46P68n90p79P8L75K28o4q6p8j33j36M44K70l13m36M7L14k48
5179b06J03L15K6l11J37L9l9k43M48K59n69n39K12P69M72n93p22l2J74P87J05
5200E92m53o85l52R43R22l85q09m88M54L16L97m1l86n79J26N37N68l78n73k79
5220e53K84K75M85N0n86l61J31N69j05j86j83K23l6n3N2M1N1K8k75m3j18M94K59
5243D43k74m52l27O31M45K7n16n23J61O64J41J58m28o10k3N13N64j29n60m46J49
5264c92N92J82p2l37n30J31P14J76j70n72j2J28N10K47o50n8J33Q3J29l21j68
5285b57L13K52k02l02k9M39j3o9k83k20J44N64K02l09n24j71J97O91k0m17l50
5306c64K2J27N74J43m12m73k10M48O27J09o67m71O4Q54K07m38n08N5L47K13ol15
$$ y = [397, -45, -603, -513, 133, 901, 311, -468, -390, -15, 213, 149, 63, -15, -148, -284, 160, 430, 117, -319, -272, 42, -206, -103, 212, 238, -73, 64, 103, 64, -179, 269, 528, -41, -580, -368, 401, 873, 280, -442, -474, -300, 487, 592, 139, -546, -898, 45, 967, 582, -227, -715, -261, 55, 452, 411, 25, -554, -428, 109, 677, 299, -274, -553, -269, 6, 491, 541, -45, -406, -275, 294, 189, 3, -180, 43, 7, -46, 6, 47, 98, 126, -149, -192, -310, 184, 443, 169, -283, -610, 21, 466, 493, -23, -546, -385, 279, 420, 578, 150, -460, -483, 30, 594, 465, -95, -541, -392, 200, 382, 310, -27, -557, -426, 288, 464, 294, -278, -290, -162, 348, 595, -55, -113, 20, 103, 232, -89, -257, 56, 308, 106, -196, -225, 214, 201, 132, -151, -371, -227, 337, 539, 230, -294, -465, -268, 423, 403, -14, -364, -342, -215, 359, 502, 90, -383, -593, -145, 482, 591, -76, -547, -483, 371, 578, 140, -368, -313, 34, 247, 241, -74]
5328g4j88J65K67j94j14o3K86Q1p1l74J11J41K23M6j78Kl56K22K34K08k25k79
5350a30j39L80K18J05l79m30M5M90J96j61o94j24O33L18q0o8m77j0L18K15M3n60
5372b91J83K72J63l63l51M88L46m94o8K14n6k58K94L49k55n74K8L70J38J16k52
5393ak88q5L29O84j81p69l04K69P85Q3n84k59O6M6N37K98p17l21J03P22Q0n56
5415f3R6qj73j19L74L21m67j60J90Q6n9k20M72J88n60m08L59J53j5L70j10n35
5437b88l96O00P62j12j023k0J75L62L85kl33p69K1R33P77q20q35o9O33L38n8J09
5459C70n07n82K50P92L79p91k20OQ7J16M07R4l43p58L12P46l23k4J16o9l23j64
5481d29N51L59k69m79J6N2J39L01L69n71j057L25R61M34l98o01k80Q2L98J066
$$ y = [-74, -262, -97, 170, -24, -138, -201, 85, 166, 95, -279, -168, -27, 196, 242, 64, 66, -290, -68, 166, 374, 149, -130, -269, 111, 329, 434, 55, -375, -330, 160, 356, 195, -499, -623, 10, 328, 248, 180, -297, -307, 11, 226, 269, -291, -108, 164, 327, -36, -387, 101, 447, -47, -115, 99, 43, -215, 79, 428, 173, -401, -373, -3, 135, 251, -1, -289, -374, -45, 639, 458, -311, -615, -346, 439, 522, -62, -321, -255, -209, 328, 626, -91, -412, -309, 413, 493, -63, 33, 25, -148, -267, 107, 428, -39, -199, -9, 77, 18, -202, 270, 458, -102, -510, -151, 2, -13, 357, 247, -288, -684, -84, 678, 566, -457, -477, -302, 60, 445, 443, 110, -659, -638, 295, 1072, 252, -583, -652, -19, 319, 261, 370, -137, -719, -469, 323, 702, -89, -309, -303, -216, -100, 307, 401, 58, -700, -388, 358, 35, 11, 127, 58, -265, -429, 122, 481, 212, -267, -251, -199, -60, 241, 610, 39, -1018, -693, 268, 702, 304, -297, -577, -495, -97, 969]
5501I69r3j240o53O09R92J24n76l99m1r0L09P90j59q32n19Q19M52q5j82k25m69
5522d99jM82N88k52o72M3L53q9J11J80o2k17n98L85N67J31j9m70l79J03N16O42
5544H43k23j117j64L32O39L44k73m51m57n0N86P52l73p59n48M57P11K81Q1q00
5564a89m89L52P36K54k88q69R5K95L10J54k98j53J5o0L01J2p5J09k68k77L5M78
5586A80K18q2n18j08M5M83J02r8k25m37j79O80L36J47o80l54j57O79M91P3q68
5607b72l81K50P50L59k98q28o6J74N48K30k73m06j44J85L94J05k66K5k77O5J85
5628E9J57q8k93%K14k71K40J63J10l72k37J16K24K19k6j92o7l63K49N10J73m99
5650B6j93k70M22L86o5k83m65j0N78L36l14l15l16L76K84J59j31k86l26L89K73
$$ y = [969, 876, -364, -1017, -408, 584, 708, 132, -267, -308, -398, -89, 701, 542, -290, -809, 10, 462, 377, 195, -30, -499, -500, -18, 570, 318, -354, -311, 42, -47, 64, 244, 182, -35, -633, -248, 319, 450, 431, -39, -418, -315, 201, 843, 620, -497, -661, -329, 310, 654, 381, -70, -527, -577, 9, 761, 388, -371, -919, -462, 249, 530, 611, -189, -678, -326, 410, 664, 376, -493, -398, -103, 207, 361, 63, -90, -75, -135, 166, 178, 103, 212, -56, -333, -298, 180, 398, 316, -202, -310, -265, 218, 320, 222, -3, -440, -619, 61, 397, 544, -136, -490, -647, 32, 523, 596, -272, -653, -403, 347, 706, 408, -420, -486, -312, 236, 466, 193, -213, -357, -172, 222, 327, 61, 86, -191, -126, 59, 216, 128, -165, -165, 49, -222, 18, 181, 291, -81, -318, -202, 22, 241, 215, 23, -44, -407, -158, 352, 525, 26, -167, -437, -15, 371, 306, 23, -442, -452, 126, 462, 148, -167, -483, -107, 177, 336, 205, -81, -407, -18, 255]
5671B55J1l61l8J57J32j81Q2J00r3k38J17J50j96j5K40l5j03k95L2K36J04P4N8
5694A93m69p4J17N89k6l43m25L45L59J1m5k82k67R6K91K98k37n24K45L65j66j05
5716e4j09K86j98j27K49P2j53J18k8O7k82OK84J16L7k82j97J3Q6L23K99o03n86
5739f63L53O92L6k39l78j87O2N49K72k96m21l49N19M76l75j69K4n1o8J07L79j11
5761A62m98L5K44L26j89n6Nj63j02L41K02j86k10R4J40k81LL19J67n49j55K7N52
5784B28K98m66j75m41J61P38K99l14p48k95O02P06j77o5n68k67J09N68O14n86
5804B21o90m6L42K01M43m26k43n76N81O41J86p00m44L62K41j51m2L33j15l66o
5825b54K17K91m0j15k00k16n4O60L71m26n35j75M57J66K10j49l10l87K51N19M94
$$ y = [255, 266, -95, -133, 24, 156, -25, 57, 157, 64, -174, -57, 93, -103, -118, 122, 87, -16, -311, -279, -43, 61, 135, 193, -276, -350, -233, 356, 330, -13, -438, -93, 266, 277, 232, -50, -317, -221, 70, 368, 131, -393, -148, 217, 51, -54, -163, 123, -75, -202, 47, 119, -34, 84, 56, 123, -159, -153, 131, 247, 284, 2, -195, -182, -96, 227, 526, -77, -663, -310, 382, 418, 179, -199, -386, -324, 225, 497, 201, -220, -569, -50, 426, 51, -118, -94, -145, -213, -106, 273, 162, -336, -301, -57, 269, 80, 24, 29, -134, -236, 105, 307, 121, -89, 5, 145, -136, -133, 186, 353, -196, -351, -324, 228, 526, 60, -115, -556, -395, 343, 642, 328, -420, -715, -113, 593, 416, 351, -217, -484, -375, 193, 807, 221, -469, -515, -173, 28, 471, 45, -198, -774, -193, 448, 634, -66, -510, -148, 93, -58, -100, 233, 118, -248, -254, -37, 254, 214, 99, -101, -317, -371, 289, 660, 234, -301, -476, -19, 147, 357, 208, -102, -489, -238, 281, 775]
5846G75p11n21j04M34J77K97k6o89l10K14J101K15q56n24p6O64K31J01k28n11
5866c47k22M13N94o7l27k49K07k30K67L52l6m23k87K75J40M5K1r1Nm38J56O15
5888C73j39j91k02l41K06M55L30j61m74m85M96N30Q8n66j84r0L46N09j6j17q74
5909e07k9M91M24Ql04l13m6J41L20J73n13oR0K09j11k7J16P0l07m9L82p4l9k04
5933a05J04j04n3K80K53k62j82j15O3J70J33K04l14m94o1N10M80l01o39Q0K58
5954i5L95J03k81m86j28M38M82j82m53NK34J22N4j6Ql67l5J77M90l13k74P5p0
5977a17J72j75pQ9k34J79J28O6m09J17M03q8k10L8R5O9k1j61J0j11J15M72k66
6000A54l64j95L28M30l42k17J82N5j01N8J02j31l6k3Q4l5l7Q7R5j08k2K65j5m09
$$ y = [775, 64, -457, -561, -127, 50, 347, 321, -368, -678, -464, 637, 852, -4, -528, -604, 60, 291, 392, 164, -347, -569, -156, 438, 371, 44, -205, 2, -228, 39, 391, 355, -68, -355, -80, 60, 105, 126, 35, 40, -398, -242, 373, 234, 43, -159, -500, -294, 161, 491, 330, -144, -629, -133, 397, 485, -81, -265, -355, -9, 500, 484, 367, -507, -536, -45, 379, 387, 83, -230, -276, -135, 185, 358, -155, -161, -71, 138, 27, 0, 116, 186, -121, -170, 212, 138, 99, -105, -1, -105, -158, 122, 375, 113, -69, -184, -121, 49, 182, 386, 72, -422, -483, 27, 507, 206, -433, -353, -95, 300, 403, 122, -364, -492, -54, 428, 246, -207, -202, 32, 154, 208, 192, 200, -167, -202, -25, 465, 152, -122, -47, -117, 55, -120, -127, -38, -272, -93, 35, 101, -308, -191, 212, 124, -86, -48, 47, 116, 95, -66, -56, -167, -52, 420, 154, -210, -405, -77, 353, 11, -206, -24, 31, -70, -12, 90, -41, -77, -100, -16, -51, -88, -1, 94, -14, -36, 229, 214, -195]
6024a95P1L65M4j80m14J34L16Q9j5k28j77J22K23K31j68o08J83N26k39q4m1J75
6046A30k87r0K91K18k62k50J15K90j00l7J32o5l55L31J46j31k95P9L15j54k28
6067b07L9M54j50k56k12K92J32n7L09k10m65k01O90K57l31m70L64j30L36k6j46
6088A2j2n76K69P55ml24l71J07J76P6K22pn01j90L68L68k11l35q7J82P2K3J71
6111A83J1m55j04M45J3k4j44J13L7l06Q9K69K8k17j58J48K8JL10L3m03k56K01
6134a58N19J05m33q8k21K53K52R9k41n47j51P60J08j17j27j37r9n1N63R7l23l68
6156c05r2M57K80k64N0m03J38K92O6Q5m56N3L0K62m28J66K57Q5m38k52M36L26
6178C45k37l4k33k28J60M02P6k00k47n8L55J68J16l53r1k43J07M28R9m74p0k7
$$ y = [-195, -124, 241, 285, 105, -309, -175, 141, 230, 215, -13, -190, -68, 155, 386, 218, -390, -207, 319, 80, -4, -45, 130, -157, -247, 44, 262, 0, -250, -135, 155, 55, 18, 150, 85, -270, 61, 207, 76, -219, -140, 175, 21, -207, -168, 286, 136, -120, -332, -40, 92, 35, 344, 134, -331, -532, 158, 415, 84, -386, -22, -152, 184, 158, 12, 0, -576, -307, 448, 444, 120, -251, -144, 32, 108, 330, 323, -178, -368, 0, 368, 157, -178, -265, -83, -11, 12, 183, 194, -261, -365, 80, 93, 69, -75, 38, 75, -231, -142, 127, 155, -62, -220, -72, -44, -43, 267, 300, -103, -359, -158, 361, 466, 33, -55, -276, -23, 229, 328, 87, -460, -611, 149, 257, 140, 13, -124, -223, -274, 289, 386, 63, -305, -397, 60, 340, 76, 126, -277, -139, 153, 219, 304, -152, -99, -69, 193, -235, -69, 188, 273, -165, -417, 19, 345, 108, 74, -159, -387, -227, 175, 251, 51, -196, -254, 101, 269, 385, 32, -59, -302, -195, 233, 332, -142, -212, -239]
6200b39M19J41kn34l72L53K93K86l08j55k85L58K33k23J57j91L7n6l9L81j67O5
6222A52r4J3j17J21j21N9p3m7M8J34j47m5J50J54k70k97N59Q5k73rk03K15K49
6245B43j95o7m13L27R3L65k54k77j27N54k2l61K07j35NP7K06O0k14j83o0K04P0
6268A03j51J4l9j48J63K94k71j95J86K61m5k97r2K47j4K3L1j13j08q3M17l5N0
6291A98k68J93j47J13j64J29J23l23m3L49l11r5L96j46J89k44J25j89J32l4o5
6312h2m5p1j06N86M8m45O5l24M97J92j12l58l5r6M11J63j89k19k45L15J42j09
6334a7O0k35j65L9M07J90m51p5K21n7NJ46j3j55j25K5M70k10j67Q3K15p1l06K72
6358H6R3k0m19K90P0k54J03J53k4m08J5M66J04l07l99L18j2J32L43q0o50K6L89
$$ y = [-239, 180, 321, 319, -215, -587, -234, 59, 345, 37, -118, -403, -45, 188, -35, 122, -69, -32, -88, -127, 254, 87, 152, 58, 71, -46, 75, -46, 13, -60, -107, -59, 75, -72, -117, 33, 187, -83, -380, 179, 264, -9, -18, -221, -6, 243, 48, -19, -432, -105, -12, 353, 99, -178, -305, 249, 227, -134, 73, -62, -57, 20, 226, 286, 72, -111, -171, 33, 103, -48, -34, -73, -221, -58, 236, -35, -230, -44, 217, 172, -125, -217, 30, 16, 39, 70, -43, -151, -234, 183, 148, 198, -70, 123, -24, 89, -75, 54, 177, -146, -189, 160, -151, -246, 150, 4, 193, -51, 74, -115, 17, -17, -82, -127, -198, -304, 282, 330, -115, -50, -374, 123, 315, 203, -155, -190, -286, 125, 288, 99, -120, -365, -50, 92, -17, 43, -192, -357, -318, 89, 279, -172, -247, -26, -83, -78, 68, 55, -100, -225, -200, 270, 60, -107, -24, 191, 120, -186, 86, 179, 159, -260, 30, 100, -154, -51, 102, 78, -330, -315, 151, 255, -52, -451, -133, -145, -13, 330, 250, -400, -374, 15]
6381A5L34o6m80p7J35O2J50K73k28n76M2M80K48j83j72o8N4r5K69R4r4k78n5L24
6405A08mk34J28J08j76k91L00L15k69N3M2j07k12L81J56L4o40k48O60K27j52k80
6427a01n1n2J00L48J96l19m79K62J69L9n2j12Q6l48K21L77N2n26l54M61K62r2
6449H7p2o4o3R9L0J98j74k65K36K21k78j99J34M04j31l85J83N0m2p4Q8J52l28
6472a93k8K92P8m4k47J18Q1n7J14K20l47l71K36O07k43k48j65pP7K36n0j54j61
6495b56K4K06L70k19l53K56J1M1k9j57M8n1J24M3J30o6j47O6j40K11J09j79J07
6518A49n9K0K3l35QK07J15l9k71J02Q9K36N3m18K3L8J97j20q7j48J23J25J26k49
6542i2k4j32K38K07m1R7l82K66PP6m9j13l20K67J23k4p2k39nL26O7j71j37k00
$$ y = [15, 349, 283, -197, -274, -139, -77, 73, 346, 118, -458, -416, 64, 312, 129, -43, -111, -57, -152, 117, 211, 117, -161, -216, 108, 104, -130, -2, 106, -70, -361, -61, 254, -15, 38, 80, -27, -239, 142, 298, 332, -308, -556, 104, 331, 179, -101, -152, -204, -104, 244, 440, 121, -358, -96, 73, 112, 60, -52, 34, -314, -93, 284, 336, -190, -544, -83, 179, 87, 15, -49, -112, -13, 17, 215, 41, -224, 12, 233, -45, -244, -110, 294, 163, -222, -39, 11, -31, -105, -17, 135, -193, -221, 71, 149, 105, -142, -24, 57, 0, 114, 334, -13, -384, -148, 459, 216, -32, -197, -204, -127, 109, 59, -95, -256, -232, -26, 344, 125, -228, 28, 39, 80, 51, -106, -58, -109, 15, 58, 188, 122, -25, 41, -99, 112, 221, 42, 149, 90, 110, 133, -202, -194, 13, 128, 89, -182, -80, 9, 245, 298, -120, -97, -59, 138, 18, -69, -217, -94, 31, 157, -92, -116, -248, -10, 197, 156, 253, -129, 137, 144, 220, 171, 58, -262, 5, 128, 104, 32, -207, -212, 114, 181, 10, -127, -327]
6566c27J52L47M8j8m10L01k81L77Q0l16j02J80R7N3r7k26k6J09J38j94J49j54
6588a20k0J82J87m3k51r7J52m1l3J8K94n4l0j80k10J61J70O7J7j55j81J55K6J03
6612A17q3r1j17K02J65L1Km65L2J91L25j00k25m56J08K20N64P1o67j36J72K29
6634H9K16j58k71o1J13M7L0K10k42J1j39K05J65J6j64j31l7o0L08n2j54N7n2k55
6658c09N8L03J80j11l59p7K42L01J34n50q4k60O34L15k75k72k7r2L04L35q4k74
6680C2l50M6M16K18k04q4k52J7K67K50m4k61l47J08M06j70j05p2P0r3J88K39j84
6703I1N8j95J10k28J48R5K79m40o3J86O9J31j60j38N8j91J24K73J64m18k46kK43
6726e2L15k02N8k45k58M15K51j92j75o6Q1K05Kl5k74j84J54O30j45k73k34J29
$$ y = [-327, -175, 172, 220, 202, -208, 93, -188, 189, 269, -47, -149, 31, 128, 181, 84, -142, -168, -59, 79, -115, 34, -120, -140, 42, 229, 186, -65, -162, -10, -51, -84, -66, 228, 174, 144, -36, -246, -85, 85, 152, 169, 14, -167, -12, 14, 117, 34, -57, -174, 28, 193, 224, 226, -239, -207, -16, 309, 209, -16, -472, -364, -144, 420, 491, -176, -312, -140, 89, 305, 147, -124, -185, -72, -25, 5, 215, -27, -16, -155, 50, 215, 231, 67, -64, -101, -161, 147, 95, -59, -2, -54, -309, -251, 52, 232, 121, -238, -315, -73, 228, 362, -188, -272, -532, 102, 417, 142, -130, -157, -249, 55, 390, 306, 32, -318, -272, 144, 362, 158, 74, -178, -161, 106, 356, 312, 51, -296, -188, 218, 48, -57, -129, -59, -152, 36, 275, 91, 149, -46, 64, -164, -16, 79, 358, -82, -145, 41, 110, 241, 81, -57, 1, -190, -66, 207, 371, -47, -293, -295, -52, 263, 61, 119, -126, -384, 31, 282, 90, -85, -151, -70, 135, 137, 102, -172, -356, -202, 428, 283, 10, -224, -95]
6748i5J83J6k80M07j08m94M09o2Q0j14j19P9J85k64L70M3n8k15N7j09l1K11J22
6771B13Ol83j86N37L11m04j53j30N7J26K67L7n86k8K17K37k6k53J7j95O9K68R4
6794A12Ok18l6J14J68j02k82K47Q0N2n5J53j53j63J08R6k28r2J67J39k8j11K9
6817Cm5M3K7J30p9k34J50J68q4l6l19l3K69L28M0m33j14o2K84L70k25l73J12K68
6841A55J28j83r5j50j01J42K26k57J02p5J18K38l46o8J47R1j04J48n0j44LL9K32
6864A96k59j5L2p7J78K44k23j99j57K10L97q1l32l0j08N57j65k04kJ0o2J44m3
6887A1j12K0L6J5L6J96j96O4l8o0J0J01j18J39j0O2qk26k8K79P8k05l08KM02R8
6913B40j2m21j13K42J08L22m01l7KK6J04J59j44k72l8J60J31j00j14nN2N1N08
$$ y = [-95, 88, 104, -176, 231, 123, -371, 38, -24, 56, -58, -177, -98, 87, -177, 193, 236, 178, -37, 20, -89, -120, 91, 213, 219, -164, -350, 187, 498, 94, -59, -189, -132, -6, 261, 298, -288, -316, -99, 138, 112, -141, -124, -319, -250, 18, 112, 118, -100, -136, -22, 146, 44, -238, 9, 89, 141, 86, 239, 86, -77, 31, 127, -101, -193, -26, 113, 85, -26, 3, -42, 1, 28, 158, 79, -155, -5, 163, 79, 43, -276, -309, -40, 288, 328, -105, -219, -281, 3, 373, 148, -225, -113, 155, 283, 100, 5, -145, -246, -104, 122, -135, -33, -108, 10, 248, -98, -166, -19, 72, -32, 116, 66, -78, -75, -36, 196, -63, -78, -46, -123, 55, 299, 76, -123, -280, -70, 327, 246, -86, -116, -224, 333, 168, -36, -38, -28, -90, 54, 11, -101, -81, -45, -30, 6, 202, 6, 70, 32, -28, -18, 83, -35, 104, 94, 156, 148, -78, -106, 173, 251, 46, -262, -260, 142, 240, 228, -193, -306, -64, 44, 366, -35, -72, -70, -44, 60, 219, 75, -197, -235, -75, 56, -44, -158, -163, -111, -60, 448]
6936D48j98k97q0K7J90P9j51l8j58J71M2q1k27O0P8J61J41j88pK37r1l05p9J25
6960a41K40O7J70l19k30n1L17L69k46l58j0n1K14L76o6l63j31J06L38M3k55k07
6982a88k12M41J81L0l15j36Q6P9J46N8k26oL6O2P9j98MRJ28j45Q2m9K6L5j10j11
7008b14L1j5J07K38k61j15J23J52J41O8m82j8LN31M9k62k91n7K99K28M2k42l36
7031b81r4L11L02j53K9l54p5K23L90K3m38k2J46J17J15k40J3k06K14Rn5P4Q0j57
7055b9k2O6k52N3K59j17J75m06K77J73N9j78j79LM6J74P8J09m94j16L56P9J17
7078B31l14j68j02K00K80L55l97m77O6O14O0k80k71J56q8J70L53j26l44j9k8K71
7100A42j64n8K38j20j24q6L15k84j3M0L68k10j42J37O6M4j13r8r0J96J6K55l81
$$ y = [448, 250, -47, -127, -100, 90, 169, 18, -20, -178, -7, 35, -46, -273, -213, -135, 26, 167, -21, -28, 209, 118, -187, -266, -141, 99, 166, 336, 17, -213, -264, 53, 422, 176, -182, -192, -243, -29, 347, 281, -82, -213, -107, 231, 274, 19, -188, -400, 41, 222, 252, -63, -199, -113, -34, 112, 170, -56, -62, -26, 36, 115, -83, -79, -70, 58, -87, -5, -54, -28, 7, -103, -214, -183, -198, -91, 147, -114, -229, -106, 46, 187, 255, -227, -245, -242, 289, 338, 76, -215, -272, 27, 255, 297, 55, -281, -375, -64, 238, 85, 114, -240, -315, -92, 298, 321, -117, -139, 7, 124, 239, -1, 12, -194, 20, 29, -26, 48, 128, -29, -51, 15, -237, -184, 75, -42, 133, -273, 4, 177, 236, 58, -121, -118, -72, 102, 180, 289, -205, -321, 35, 114, 231, -83, -251, -353, -153, 127, 482, 85, -392, -326, 288, 348, 68, -203, -47, -135, 35, 388, 262, -82, -101, -129, 142, -22, -80, 158, 38, -86, -172, 143, -141, -154, -114, 254, 44, -98, 39, 105, 149, 36, -62, -152, 44, 60, 315, -66]
7123f6l98P8O86M0l40k11R1J96P0m0p3l22q9M26K78k87k36rJ63M5J75J3k17k83
7147c10J96M48m4k80j91oK49m3k7l7J6J19M0j14K7k26L47J05j26m55J44K32k5
7170C9j01M0q8j4qM38j49m61j06M54J48p5k5j97Q6j68K65K54j86m38J38K99J00
7193B45p3l40mJ16L63P6l44k89O4L76r6k41j30L14J04q1j54Q5n3k65M84O0j08
7216A09k85k0J82K39j70j02k3J62o2K39q1m34J21K32K75j67l60j29K56L52j99
7237A35j84k4j47J46K21L3k50r7Q4J45l6J42k10j95L60N6Q0l43k02K59K55L3k78
7260a7k03K28P0n1K28m83N8R4L10p8j54j11N0R3P5J18k86j44r5N48q7%k99k7K99
7285A36J91j58l04j57N6L62P7p9m28J80K46j70R8k73p5L97L7n9k66J3J2L29p1
$$ y = [-66, -464, -386, 300, 340, 0, -211, -120, 76, 146, 106, 33, -289, -378, 48, 326, 39, -197, -206, -43, 2, 177, 190, -27, -310, -114, 334, 290, 10, -181, -187, 62, 19, -8, -45, -29, 90, 130, 16, 43, -183, 164, 269, 143, -312, -168, 64, 39, -62, -22, -110, -124, -132, 306, 157, -304, -410, 44, 192, 117, 92, -105, -19, -187, 78, 332, 146, -292, -154, 145, 245, 172, -168, -172, -56, 307, 383, 39, -250, -186, 190, 94, -147, -277, 37, 141, 60, -94, -9, -62, -327, 157, 217, 109, -176, -196, -14, 225, 55, -47, -70, 92, 30, 269, 188, -246, -125, 107, 382, 215, -145, -274, -18, 334, 135, -49, -73, -220, -74, 147, 180, -70, -167, -83, 62, 26, 168, -42, -237, 123, 179, 259, -84, -286, -27, 228, 261, -17, -220, 8, 78, 27, 255, -228, -170, -76, 234, 156, 2, -109, -59, 34, 109, 227, -59, -203, -298, 250, 163, 163, -136, -163, 136, 327, 169, -135, -292, -236, 126, 203, 124, -304, -124, 122, -48, 50, -223, -298, 99, 136, 77, -189, -176, -164, 165, 94]
7308I4j01k24J17J89%qp8j00j13L96J90o7n04k5K19J87j20j40k73K42J16K33r
7331B21k01l97L67K75P5n41R6ML4K15J03k71j60L1K82j52MK4J27j29P4l9m4kr1
7356i5L54j47j53n0J88J10q2k72m6O9L16%j36j14j58K83J22O8j36m92J44L49J08
7379B30k41nj58P7J90J85k56k41J9L58o1J7N4k99o8m7N35m6m42j31K21J44n5m2
7403f2J06j63L68j75o1r0j3J33R2j04n8j6M26k76j31j21oJ56J31J62j68l45Q2
7426a33J49L84k06m21m2R4K34J39j82j65k73K73M00j27k18n1P1K33j06j41Q2k59
7448b65J97N8J92j86k57J25J95J19j38R6k22J15m1L88m68j19J45O0qRl21K62J00
7471C6P2m0j54k95K99K77J09l64l15K61J76R7L1k98j78J47M61Ml24j27K7K21J72
$$ y = [94, -7, -231, -114, 75, 75, 67, -11, -111, -224, 172, 362, 295, -209, -234, -15, 172, 52, -88, -361, -119, -3, 230, 221, 20, -377, -10, 265, 340, -201, -105, -101, -67, 148, 251, -20, -180, -149, 133, -19, -15, 9, 136, 7, 81, 42, -2, -4, -95, 259, 112, -41, -91, 97, 207, 125, -147, -193, -124, 192, 192, 56, -58, -216, 67, 189, 257, 121, -371, -227, 122, 230, -11, -16, -174, -97, 93, 278, 22, -219, -200, 158, 97, 114, 168, -131, -199, -246, 289, 243, -199, -330, -109, 35, -20, -62, 44, -119, 249, 74, 13, -77, -90, 43, 135, 31, -27, -43, 383, 107, -24, -145, -151, 5, 136, 298, 130, -215, -133, 16, 400, 194, -227, -269, -175, 59, 198, 16, -149, -422, -149, 251, 124, -94, -145, -74, 159, 53, -88, -6, -265, -68, -10, 182, -4, -261, -136, 59, 178, 40, 136, -86, 29, -12, 376, -92, -211, -66, -6, -14, -5, -326, -64, 36, 108, 68, -86, -381, -82, 195, 304, -60, -375, -114, 62, 159, 190, -108, -286, -139, 322, 326, 2, -125, -98, 123, 295]
7494B95j22l35j66J40K39J75j99j38j13M4L12N6k56j13K14O3Rj58J4l5N1J4j22
7517a31N3j59K99J05j26J63k31j6P4K34j53k76j62J65M00pl52k48L63J61N1j44
7539F3l10N8jL88j8k04j11Q6K58j18K7m17K30q3K67K62m89k34J85J49J92M2k56
7562c4l56K99J92J26p6m16M4M11J32l33l01J49L55k12J95j83k71J43L34J24k78
7583D4k22j3K05L49l29j62j66J88J26R3o5j60l7K63R3j91M7j25O0k7J26j14k24
7606b41J82P3L26j36o25K71K06N5J83k84l25K15K6M58k22m26J64J66k2Q0k77N2
7628a01KR7K31k16j10m1j43J96K49l29j00K00n6L88j14k06j50l4M67N8l98j32
7650b42K53J59j3j45j12NO0K26k2k37ql9K35K25n26J73k50L68O2O2l65k75K19
$$ y = [295, 173, -162, -328, -188, 51, 226, 27, -111, -224, -180, 132, 188, -68, -181, 33, 96, 105, -53, -39, -74, -23, -9, -131, -78, -237, 62, 167, 41, 204, -27, -43, 31, 265, 112, -164, -326, -161, 239, 232, -120, -368, -5, 156, 207, 63, -247, -189, -190, 198, 180, -24, -135, -49, 209, 91, 118, -299, -69, -152, 115, 377, -112, -346, -161, -12, 180, 222, -34, -390, -91, 101, 227, 151, -265, -221, 190, 322, -11, -312, -163, 192, -20, 175, -8, -279, -136, 198, 322, 44, -178, -191, 14, 363, 34, -128, -294, -106, 20, 113, 48, -112, -149, 114, 207, 16, 63, -62, -2, -29, 97, -17, -241, -59, 14, 340, 204, -421, -150, 56, 111, 294, 10, -315, -100, -74, 384, 162, -264, -100, 66, 44, 124, -153, -101, -99, -2, 229, 13, -97, -138, -281, -85, 164, -165, -265, -65, -121, 267, 153, -53, -203, -237, 230, 288, -110, -242, 11, 170, 157, 12, -100, -95, -35, 191, 169, -68, -76, -115, 120, 345, -181, -8, -258, 110, 172, 234, -131, -406, -187]
7673a87M22J02k18l17j17K25K28R8l27j36p7M24J16j27l85l2L31J09O8k22k75
7694b97J55J69J90j18l45J35Q6R1j08k3k0J96R6o4N6k17j84L64J53j17m88K00
7716i0J85K9J93j74l25r9L17K05j61l56r2L71K94j16j82J05m89L40L39K3m12k11
7738c06L08K04n2j14k16n1K22N0J18j20k79m6M31K80m91j56R2K88j1k38Qo9n5
7761b03K75Q3l83j56K12L63l7j11k14R8O7J24P8j00k48l7K53K17j75l41j0L21
7783G6J82o8j36m03K01K47n5J06l75N4J74J46K4o9k73K5J09J86k68N5j05J11L70
7806C14j92k91j42K58Q9J12J16k71k15K74J78p9k35r1O3K52m3j37n9l9O0K07J16
7829B45k73n6J1K20M0k57P5l9k3K09J5k38j49J04L40J7j53k49j0K46L6j32p2m4
$$ y = [-187, 235, 337, 119, -198, -315, -90, 138, 236, -91, -227, -304, 120, 236, 109, -276, -308, 23, 132, 200, -22, -297, -142, 27, 217, 99, -246, -111, -25, 66, -42, -65, -85, 111, 207, 143, 199, -18, -202, 162, 315, 198, -290, -90, 95, 124, 317, 143, -182, -281, 36, 241, 80, -276, -368, 3, 297, 181, -1, 104, -385, -45, 294, 317, -95, -306, 2, 206, 154, 40, -176, -227, -5, 45, 163, 43, -236, -282, 149, 429, -62, -218, -126, 162, 151, -87, -79, -148, -203, 72, 155, -228, -384, -172, 191, 154, 43, -171, -73, -6, 118, 196, 96, -152, -189, 64, 281, 106, -235, -245, 76, 258, 190, 54, -349, -148, 99, 44, 150, -225, -171, 3, 149, 173, 104, -169, -144, -35, 151, -117, -62, -167, -56, 314, 122, -169, -311, -53, 36, 148, 264, -7, -222, 52, 230, 151, -84, -175, -112, 140, 97, -40, -99, -138, -78, 129, 245, -28, -84, -73, 147, 187, -70, 5, -34, -57, 152, 167, -71, -220, -116, 224, 241, 88, -161, -171, 75, 111, -21, -93, -137]
7853a37Q9J37J49l51O4j31K78J53j28k03j41R2K39M6m0k89JJ91K56k04k96O1m6
7876b10L51N1k5j77j07P3J96j44Qj44j5K25o9j74J6J25Q5Q7k52J31k61J24L79
7899B73j77k81P5LM43o0j49k57j4M62j24N2l65k42J94L20Q8j32l72j3K79K79Q4
7922C66l90l76J02N94k4j59r9k25J84J14J41j34k03l5M09k29j03o6J68j52J37
7943B0j01K3k0J08Q0J37m13L1J17MN8Rk36j76J50K95J32l59j12P4K50K44j38l91
7967b14l4J62L23J23k56l50P7J73J01K15m15m7J5J14K37p7k14l38K39L52L8l28
7989a04j3k1J88p2j3j00J15qK21M0l32r3J46J33q2j44j26L74kJ44j89m04K80K47
8013A85P1k15k27nK03J25m2k2j66j53rM67Q5k63m37J24L61K69k71q8k47J64L26
$$ y = [-137, -48, 89, 238, -113, -49, -180, 98, 251, 123, -80, -221, -129, 110, 156, 116, -173, -172, 19, 275, 71, -225, -164, -210, 141, 192, 167, -10, -117, -44, 152, 8, 16, -128, -143, 82, 13, -161, -145, -20, 65, 152, -100, 31, -230, -106, 273, 96, -185, -110, -107, 336, 276, 127, -130, -144, 318, 194, 246, -119, -361, -167, 153, 241, 109, -263, -276, 3, 282, 366, -24, -400, -298, 296, 272, 113, 14, -211, -27, 87, 228, 94, -109, -144, 265, 36, -67, -133, 35, -117, 20, -81, -58, -78, 30, 110, 247, -166, -135, -18, -14, 44, 53, -183, -359, -209, 86, 218, -141, -253, -179, 71, 315, 177, -214, -248, -86, 237, 360, 104, -246, -169, 4, 105, 320, -95, -142, -127, -13, 224, 147, -67, -405, -166, 186, 224, -104, -117, -138, 50, -22, -35, -135, -20, -28, 193, 233, -99, -192, -46, 87, 5, -139, -265, 109, 107, 251, 62, -342, -62, 185, 256, 41, -186, -191, 12, 137, 95, 73, -93, -246, -255, 212, 297, 34, -403, -279, 82, 351, 80, -8, -255, -91, 235]
8036B35M2j87l18J06J03J27J17l23N5r8K23n8J15l48J17J03J43k58Q3J19n1J20
8058A67j06Pk38K14kJ61k06j71K6J73K60j83k10l64L73J81Q8j51l10j20N71J39
8080B99m78J40l8j41L45P8p5j86k15L13L30l55j15k05K86m1K00K5k66k52L01M20
8102C70k76j71m0K15J35k67J37l68N6K75N2J18m58k0J54K59Q3j70o1m0j5N3K86
8125C07k00m14K63L29p0l49q7J63J52q4N8q5k94K74L15k2l70j47J35K64L3k88
8147a17j62K08R0J96k05J2j09n2K15L00m56q1L9J88J10J93l10n25K27L14L39k15
8169A99l52J16o6L60O2k60k18LK27j8K16n27K50n9J62j84P1r3M6J14p3J69
$$ y = [235, 277, 90, -228, -122, -19, 108, 225, -98, -43, -141, 82, 24, 139, -209, -92, 11, 154, -104, -21, 98, 47, 167, 61, 68, -170, 44, 42, 203, -3, -174, -148, 25, 285, 102, -108, -472, -99, 82, 170, 19, -291, -411, 160, 299, -179, -39, -77, -218, 127, 205, 130, -56, -271, 42, 372, 17, -98, -303, -17, -58, 142, 167, -99, -351, -50, 370, 94, -77, -117, 98, 233, -34, 103, -265, -209, 66, 118, 236, -222, -242, -88, 171, 254, 84, 23, -17, -32, 21, 307, 107, -307, -44, 285, 215, -134, -221, -58, 94, 10, 68, -17, -311, -37, 278, 256, -114, -261, -126, 138, 171, -117, -279, -71, 19, 215, 10, 22, -87, -139, 76, 376, -80, -161, -122, 66, 176, 369, 59, -466, -239, 75, 414, 199, -153, -37, -103, 257, 319, 59, -159, -156, 71, 53, 269, -258, -8, -67, 95, -89, -18, -111, -65, 49, -24, 145]
8191A45
$$ Imaginary data points
##PAGE= N=2
##DATA TABLE= (X++(I..I)), XYDATA
0@%%%%%%%%%qJ6j6J6k4L2m0N4o2P3r1J14j37J61j92K25k65L10l58M12m75N45o20
32c30P06q00R04j018J147j290J442j609J794j997K214k455K719l003L316l659
48a919M033m442M892n391N942o552P235q002Q868r858J1002j2341J3933j5862
62h462J8255k1318K5400l1142L9870n4875Q7609k83626K00944M12213m48369J1649
74e1852P7704j48871Q4923J96398j60573l568J6837j37690J06029J65467j96357
85e1553L4496J60048k35572p9591L08692k5244j69268L6448l7728R048J66993
96A16769r4959j12809J45048m1939j45397J70614O0089j70423O9440Q2423j55129
107g6273O438J20547k364L950q4549j22783J67532J37334j56293k0562P9613j38650
$$ y = [0, 0, 0, 0, 0, 0, 0, 0, 0, 0, -8, 8, -8, 8, -16, 16, -24, 30, -32, 41, -50, 64, -73, 88, -104, 121, -144, 166, -192, 220, -255, 290, -330, 376, -424, 480, -538, 609, -681, 761, -848, 946, -1051, 1163, -1292, 1427, -1576, 1740, -1919, 2114, -2328, 2564, -2827, 3115, -3437, 3798, -4204, 4664, -5194, 5808, -6533, 7400, -8462, 9793, -11525, 13875, -17267, 22603, -32272, 55337, -228289, -27345, 384868, -63501, -51852, 25852, -123019, -38096, 158302, -2271, -5839, 10998, -126692, -20663, 144804, -51553, -17057, 142991, -92581, -172172, 136520, 111276, -57992, -21544, -59272, -50224, 116769, 21810, -90999, 54049, 12110, -133287, 37327, 97416, -73007, -3567, 78856, -76273, -69835, 50712, 48348, 52298, -32251, -155034, 12498, 149832, -6461, -27023, 52590, -86060]
119h6060m19K11534m4331j52789L9038J2324J928R0134m2929o1140O1578o6002
131c7134n9539J61216L5981j44447j142M0710k7544O7053L8357j02149k4254M3572
143i320l510N8192J2596j17012K7814J05775q0526n3263R0836N416n0194O674
155f522j0768P485N1987j7789l6465J7047l1582j8433Q5214O010p9159J7884K1240
168F149l2052L8983L1743m2973j8579j4728r696P7489L9060r2232l8351O0893
180E706Q427n399K7001l5729l9017K9923J6488J4308J5482n2942k5221N4153J908
193A5088k7441L0085o098n5103K8379O0745k9868m3124R545J8011J9642q343m0975
206b9457J5211L9330j5580j1662Q745k0720l117L9193L358m1257p774K7434J3338
$$ y = [-86060, -86479, 125055, 80724, -72065, -33027, -20703, -18775, 71359, 28430, -32710, 28868, -37134, -96673, 64543, 100524, -43923, -45065, -4355, -31899, 35154, 73511, -28638, -52892, -9320, -12830, 45362, 57958, -59054, -31240, 74535, -5991, -59254, 31582, 36998, -13196, -6522, -17290, -9805, 42182, 24393, -12072, 4975, -26607, -45040, 40174, 46184, -32975, -15091, 6149, -25903, 13080, 44823, 1850, -16729, -31457, -41153, 36336, 75396, -16836, -55187, 5706, 14133, 8734, 35735, 6, -39011, -9088, 7400, 21708, 37190, -15752, -40973, 13180, 15088, -12353, 17732, 11634, -43469, -15090, 45655, 15787, -27337, -17792, 219, 19861, 11518, -29457, -14246, 25084, 9504, -2158, 6587, -14133, -17250, 21943, 25301, -15956, -23730, 3704, 17042]
219A7042o193j7902J80K1544k0252k6544M4068K6141m9706k4453L3356K2267q086
232A1462j2193j2666p916J7157K5030p69l1554k8002L3513N4601k8120n8926J4072
245b4311L7527M212m608r625k3967k250L7045K1461k8759l3863L303L3111J5348
258B4624k5887r743J8633j3398j9975K6803K9013j8412l6041l891K6227K1607
270A9560J701j9960k3486k219K4923L5259j0046n5903l353N4606J0795l7874j6750
283b2747K1140K1554r335k4085p001J9180K3157k265k7045k7314J3320N2655N752
296C6966n4211j7160L0787J4932o614m129N444m14k0436r691K9384L2786j5394
309B2250m2713j3326J7474L4613K8935k7988n9092n323M9539M4801j2626n9421
$$ y = [17042, 10849, -7053, -6873, 14671, -5581, -32125, 11943, 38084, -11622, -36075, -2719, 19548, 11462, -731, -13397, -21313, -4156, 20874, 20105, -11449, -39451, -5938, 48663, 20543, -38383, -24311, 13216, 17428, 12820, 3195, -20772, -23022, 14023, 35484, 6725, -27138, -23835, 9276, 24624, -1263, -11006, 7627, -5771, -25746, 1057, 30070, 11658, -24383, -28274, -2047, 19560, 21261, 1301, -22185, -24404, 519, 35778, 25732, -30171, -33524, 21082, 31877, -5997, -22747, -1607, 19947, 10612, -13473, -20474, -1294, 21863, 19598, -7447, -34761, -21441, 31214, 36966, -17245, -34405, -3618, 11314, 4700, 571, 6015, 5601, -14835, -24526, 4858, 37644, 22250, -20463, -33789, -16315, 18298, 47233, 19245, -39847, -45170, 4369, 49170, 36544, -22877]
321b2877k4599L7964L3670p537j6061m729p966J055J7727L322p745m78p287r010
335a4551L896J5093J9556q577l5294k660L3153J0724k3560r074J7165J611j5541
348h059j175J4424J2554o853j8754p366k089J3117L6796M40n5643k9878M3898
361h588N2048j1870m6650j7581J3239K0994J8425O444j7916l6981l573M4449J9967
374C2407k5104j7108J776l994J017K8396K0461l3963m1028J6040L9940K973k6046
387d233m499J1346j0963n114K6423O632k9320j0577K4387N524k5701Q267L7747
400B9919j0581m5038k417L7473J2819k0700m481O387j8532m376M1190K4463m1673
413D453m8506J8805M3980j74j4742J46j4312j7593K3234M3907q544n6233j4400
$$ y = [-22877, -47476, -9512, 24158, 16621, 560, -4169, -12135, -11080, 6647, 9969, 2224, 1746, -5541, -14551, -10655, 4438, 23994, 15417, -19877, -22537, 10616, 21340, -2220, -11294, 5871, 7482, -8059, -9234, 5190, 17744, 10891, -7863, -15229, -17318, -4201, 32595, 33035, -22608, -52486, -8588, 43460, 31590, -15060, -32641, -19402, 1592, 20017, 26461, 8545, -28436, -32009, 12440, 32407, 7303, -9805, -8029, -12023, -11006, 17390, 37851, 3888, -37140, -21100, 18840, 21813, -4233, -8732, 2614, -8349, -13463, 12960, 19592, -9728, -20305, 4082, 9606, -16095, -7828, 29919, 19338, -25700, -28117, 9356, 22175, 1475, -3006, 3381, -15151, -19527, 21663, 46126, 4453, -44053, -25248, 18732, 18558, 3816, 3962, -10350, -27943, -4709, 39198, 30654, -25579, -39979]
426c9979L8790J8916j4035l291Q211j5399j8602K6863L2141k2226l5384O031K5192
439G228K274q101R487m248k5523P826L1906p099l4349L715L7158J62l7868m622
453b2054L3656J3716k6338k2150J1145J2082K439J4895m053l4392l751L6569J5641
466B7405k5989k1342R767J3939j093j467R697L545k3359j4865K5841J8799j2704
479H174j2748q802k170K1949K1145j3395l5280r658L1370K8514j6410l7669L013
492b1967L5878N037j9370p269k396P103J3608p241j1502M549O775M970J97j2440
506d068n569J5742K510j9894L988K0899o231j2959j368L869J8066k56l5090n624
520b5985L3954J2661j4941j3942r403R953L0064j472l8080r944K4913K0204K576
$$ y = [-39979, -1189, 17727, 3692, 401, 8612, -6787, -25389, 1474, 33615, 11389, -23995, -17964, 7228, 9502, 1401, 10888, 6640, -18883, -11057, 20849, 13750, -20599, -16884, 20274, 20436, -17432, -22054, 11602, 25318, -1020, -23170, -12025, 57, 2496, 17391, 13338, -21054, -24805, 11764, 27405, 1416, -19926, -10159, 3780, 2687, 1220, 10917, 14462, -8897, -23762, 2079, 20878, 8174, -4574, -13376, -15546, 6403, 27548, 14153, -21127, -30785, 585, 29099, 12689, -24980, -21967, 13911, 18948, -422, -7691, -10087, -2984, 10624, 3383, -8119, -3570, 3205, 8175, 8372, -4068, -9637, 6105, 8615, -11279, -7291, 13608, 7377, -5582, -6950, -3081, 14985, 14729, -20361, -25985, 7969, 20630, 5689, -8253, -17656, -7703, 22361, 20889, -17191, -27135, -2222, 17982, 20558]
533B0558k6125k0949K7913K4162j9482j6449L649K534O560R255n314j1069M69
546d288M124M412J778j0164K54P769j6137q5L4662L23l7874j0801K2226K3162
560A9361m40k7511j7639J9303K3627p50q626j6093j4156K5319K7017k7322k4119
573b2029J7924J5185k751q635o974P281P951j0262m985R686k627o747J2896J541
587G454j6654N488Q841j0646J445J1444k464r675q797Q532K5217j824l1635r140
601b2414K1366J3237N27l986j9794r844K2335J7280o299j5077j6151M869K2260
614H309M416q137n680j0344j809J6932J1094j1875j2965j215N517J3277L711j4403
628c172k259O107m361L422O185p081j276N377l509k736O090J511l724J157l085
$$ y = [20558, -5567, -26516, 1397, 25559, 6077, -10372, -6723, -4189, 2371, 11626, 6312, -4757, -4288, -164, 4248, 6026, -4138, -3884, 3885, -12252, -12337, 22325, 22648, -15226, -26027, -3801, 19361, 18921, -8590, -26229, -6926, 16701, 15951, 7325, -8768, -22924, 2395, 29412, 2090, -22029, -4105, 11080, 8329, -306, -7280, 1, 7952, -2310, -7295, 2391, -236, -6983, 5913, 7454, -9200, -3712, 5129, -5517, -4072, 7372, 4908, -4767, -13564, -5032, 20185, 18361, -13274, -22414, -1048, 12189, 12716, 8730, -11064, -20908, 1427, 18707, 12408, -2669, -18820, -13951, 8309, 12725, 4588, -1092, -11436, -13245, 3687, 14781, 2906, -10059, -11274, -5757, 7520, 11231, -3172, -5431, 676, -3685, -263, 5922, -1159, -2435, 2942, -567, -3303, 2787, 4298, 574, 1731, -1354]
643a354o214O013N213k633M032m149j3917M632J5756M779p641j5497o983J4518
657c445J9195j633j7542j0283J869J3308J7903n162k4827p842J4521J7652K75
670A3989j6608o661O497L302K434L684l342r468r75Q426R92k415M150l496p606
685g097K051R756M495j0798j0880R870J3707m830j4095j376J4232Q281p367j3354
699g405p869J3566K2728m111k8819j2538K3168K7047r355k8778o813J6872J4609
712A2302m681r763j368j6J364L990k9P36J067p539q053P393J9418L223k4683j5480
728b2119J7665K3948l582k4604q776J5064J5378J812j4452j6081P162K0637L341
741A5393j9220j5520J3711K0877m338j7402m277Q893N979j366r10n298n039P477
$$ y = [-1354, -7568, -1555, 3658, 1025, 5057, 908, -13009, -8377, 7379, 12158, 4517, -10980, -17963, -3445, 15750, 14117, -3425, -13708, -11839, 1469, 19372, 14210, -10617, -18459, -3938, 13714, 13989, -2619, -9280, -2783, 519, 2953, 6637, 3295, -6173, -7148, 1278, 2270, -145, 4005, 509, -7097, -5046, 4710, 9205, -1593, -12473, -2603, 11104, 6274, -7821, -9197, 5035, 13316, 5949, -7405, -15274, -1708, 21020, 16909, -11910, -24448, -1280, 25767, 16412, -12366, -19179, -2307, 12302, 7621, -2142, -3510, -3526, -2162, 1828, 1799, 2535, 3602, -3937, -11990, -4597, 14821, 18044, -6639, -22119, -4454, 19494, 15912, -8692, -17468, -2404, 12974, 14786, 334, -15747, -8585, 12052, 15393, -3827, -19347, -5636, 15241, 10903, -6499, -10776, -1883, 4096, 2730, 1820, -3478, -8517, -1040]
755a040P551k062m753j907K138k083l048R218P029j1736j1753Q206J6021O37j2999
770e81r943j62J1854J2301o026j6838o629J4795K1499r450k8737L47K3075P383
784A2888j1758r523P30Q382P919k458j1398k223O311L966l18m860K424P693q685
799i10r204J2365J0939j0254j5650M04J5244J1637o211j7800l985J4853Q761m747
813E442j1297r136R950J6898m203j2676j161N804N023j889o012k027L486L657
827A859J420J581l947o642M960O858l430l054m081m218R389J1478m810j2748n055
842a0440O527R189K422o622r445j208P904J0494L475j2381j2560M983Q814N599
856F751L454r755j3139M493J7838P002j4330j4770L747J2020M558n685l563R56
$$ y = [-1040, 6511, 4449, -304, -2211, -73, -2156, -5204, 4014, 11043, -693, -12446, -4240, 11781, 12418, -581, -10524, -10686, 1168, 13469, 7443, -9395, -16024, -1229, 20270, 10820, -17917, -17570, 5505, 12888, 1130, -8393, -7663, 719, 8638, 6180, -5218, -7441, -1130, 2836, 2518, -2342, 82, 7775, -910, -10114, 2251, 13190, 2936, -12714, -12310, 2934, 14571, 8360, -9440, -13425, 1428, 10189, 5442, -5855, -14991, -5041, 11857, 7654, -5022, -6183, -379, 4644, 2755, -3257, -5284, -1798, 1859, 3279, 4860, 913, -5729, -769, 6089, 2659, -395, -4476, -8694, 695, 12173, 7363, -5385, -10440, -3913, 5276, 7698, 1076, -8369, -9577, -1673, 8821, 12296, -85, -12645, -7662, 1152, 6751, 10205, 450, -12689, -8196, 9642, 16644, 2314, -12456, -8709, 3311, 7869, 2184, -1379, -423]
870d23j290K715M327o491n383M898M965k440o331K290R403m52p999j484K461j955
886c189k94R504K899j3581m752J1544P433l570p188k731j974j349J1518J2367
900A6637j0108j9425o52J8502J0214r724j2411n133K506J3360J1944p052j9849
913a1191n040K0003J1570j4628j1997P098Q945k383n243L731M769l884m118N7
927b311J189J113L223J646o815m849J0288M921j2006m419J0986N534j2197j0355
941a4052J2170J7065m281j9475r074J3434J6280n28j1954j3031N06J9066J2923
954A9049j1213j9800j706J6149P534p485m792J853J341l156J60Q305Q43j0759
968c677n271N115P184K026k230l969o573J494J3195K091j4583q102J1766J3741
$$ y = [-423, -1713, 1002, 5329, -1162, -6545, -1647, 3318, 878, -5453, -3163, 6240, 5788, -2211, -3695, -1234, -3189, -3483, 6021, 8920, -4661, -9413, 2131, 9564, 5994, -1194, -3925, -5899, -7248, 4270, 16637, 6529, -12896, -13548, 4954, 15168, 5444, -6967, -12100, -9594, 3766, 15710, 8658, -11191, -16231, 3772, 15342, 714, -11283, -4185, 4760, 2377, -2866, 865, 5634, 1750, -2368, -2311, -1122, -9, 3214, 4860, -1955, -6804, 3484, 8405, -3601, -8020, 2966, 8500, -3697, -14052, -1882, 15183, 10902, -8573, -17647, -4213, 12067, 11539, -415, -13446, -12940, 6126, 19049, 7836, -11964, -13670, 2479, 10013, 2528, -2264, -411, 930, -2226, -2066, 6239, 7082, -3677, -8948, -3833, 3351, 5377, 3147, -822, -7395, -5901, 7294, 9385, -5198, -13300, -1534, 12207]
982A2207o883j4772K718J2926L340r226q568K538O407O448K691j0818j2954Q910
996e036J9373r55k0427o492J3271N543m447M90J772m304p012L465J2704L2j1431
1011c454m050L368K754N682P243q156j9791M031K6052M163k2355j1775J3608J5267
1025A2587n910j1047J048K617j53L775K777p971q487J1558J2223j1936j2705Q335
1039c289J0036m650p328N164M205r125k127J2823M191j1991q120Q829P569m046
1053B141o09J610p951l756J2079J0709j0722j7064O361J6521k028j0011p47L439
1067b8k304k18Q175m76j2736n85J2527M234j0247p185P516O504m253j494J912
1082A342l998k365Q695P387j0990j2204R329J1828l909o314q65O83m65K154N783
$$ y = [12207, 5324, -9448, -6730, 6196, 9536, 310, -8258, -5720, 687, 7135, 9826, -992, -13946, -5036, 14337, 13382, -7045, -13537, -266, 5277, 830, 1320, 3092, -1212, -8224, -4759, 7945, 7977, -3454, -7504, -4136, -1382, 4300, 11543, 3387, -16404, -12373, 13679, 17842, -4513, -16288, -2680, 12587, 6677, -4370, -3322, -705, -858, 2917, 5694, -2277, -10764, 794, 13017, 1081, -11624, -3289, 6747, 2097, -5231, -67, 4138, -4987, -7114, 5709, 9900, -2091, -10211, -1382, 6187, 2141, 1532, 3142, -4809, -8565, 3514, 14223, 3501, -13563, -7202, 9319, 7291, -2720, -3467, -28, -2332, -2550, 5625, 5149, -7587, -8172, 4355, 8589, -1658, -8843, -1327, 5177, 924, -570, 1342, -2656, -5021, 3674, 11061, 71, -12133, -2804, 9024, 5115, -1199, -2064, -1381, -1846, 308, 6091]
1097F091j373j0198l416Q539P800m160n718R39l393l00J1530K599j1853p221O033
1112d101J1185J009r885n852N971O564k134l427j11j785L330P244o142r364L538
1127c960Q460K110o637p991L680R133O48n351j855m11k447L409N740k613k945
1142a030j222l069M431P982l36o887q798j538J3743J2047q641j7223l97J3770
1156B832Q176l850j1719o414R063P752k305k950m255M43P771j283r770J288R755
1171D534j66q832j634O650M995j665p283O5N796l524k731N541J154j466P07n145
1187c004l559Q814R827o802j6138l579J5020J6255n356k1149n456J3035Q816K360
1201I084o192j3310j145J3915Q204n932r321l7M917n33k294M499N953p015j0521
$$ y = [6091, 4718, -5480, -8896, -357, 7443, 3283, -2435, -1496, -4889, -5189, 6341, 8940, -2913, -10134, -4101, 7084, 8093, -1792, -7644, -1673, 4891, 2757, -670, -781, -2566, 764, 8008, 1866, -7498, -3960, 4500, 6610, -27, -8018, -4338, 4795, 5443, 92, -1763, -2174, -4621, -1212, 4528, 1915, -1030, -2252, -5321, -890, 7092, 6756, -131, -8929, -10467, 3276, 15323, 6682, -10541, -10938, 2832, 11008, 7158, -4561, -10975, -1912, 5840, 3535, 585, -3670, -3227, 4544, 3261, -6509, -5221, 4534, 4368, -4464, -6098, 552, 5547, 3882, -3401, -3336, 2460, -1064, -3795, 1746, 2900, 1434, 2141, -3004, -6563, 2251, 12078, 5276, -10862, -14441, 579, 16834, 11478, -9671, -15127, -2092, 6724, 9084, 2892, -10418, -11563, 2352, 10556, 4624, -4697, -4734, 183, -350, -2644, 1855, 7808, 793, -9728]
1216i728P724J0946m099o284j494l27K107L499J877l651m424M118N698o086r442
1231i566O569J3453n173j5558J241J1573O291j262q955q317L98R976J1909l810
1245H769j6668m807J4427R792o303o418N93m411k898R968R447m412j3008l975
1259i904J0287O485l091j786m518p597L688J4978L794j4829q555R470P357l942
1273A837m525J955K637k800l56M575j546l185L505J324n734m985O678R791l347
1288E824r227r43L938J824N8K135j895r826j393J3213Q007p705j0411J58N164
1303a079Q79L638L438p877j0012M954J4755L156j2370p126M218L020J640M314
1317E548n84q734m975R401R033o568r373J561O527Q8m786J969M951l666k852K842
$$ y = [-9728, -2004, 8942, 4843, -1441, -2935, -3262, -1155, 2344, 4221, 570, -3854, 264, 5962, -124, -9566, -2997, 10456, 5283, -10275, -9034, 2539, 8830, 7568, -1387, -9704, -9306, 670, 12579, 8769, -7899, -12706, 1721, 11513, 5210, -1208, -615, -5026, -7924, 2044, 11491, 7079, -5929, -9904, 383, 6868, 3777, 1991, -2527, -10124, -6436, 8542, 12336, -2493, -11048, -1578, 5779, 1837, -2688, -733, 1904, -896, -1252, 3323, 1777, -1408, 2097, 3421, -2313, -7298, -620, 9171, 5824, -3403, -4346, -408, 1416, 1474, 3609, 1714, -8112, -9505, 3708, 11715, 4010, -6401, -6243, -1079, -200, 3438, 6876, -1001, -11013, -6059, 8696, 11852, -518, -7644, -3426, -406, 1234, 5548, 4964, -3770, -8745, 656, 9689, 3121, -6252, -4691, 1836, 1924, -2862, -893, 4058, 392, -2460, 382]
1333C82j187m163L788Q188m078j2122K175J3754L067j0198n793M819J534l784
1347c618N888O757q857r432N326R904l67n543r07k889m624O770J3364j515j9232
1362h975p843J8103J2666j0974j1067K337N447J759J438J267n085o048N963P785
1376F773n992q245O379R840p607q897Q533P364p681o286N315M443n646l931Q043
1391B405L616p765k090N678k047m794P052O821j1628j1180J1615J5358m307j6079
1405g345l220J2010N161m265n52k637o014M267J2099j551j4479k119J2638K950
1419F943q797k879O904K338p811j101Q366r24p138J462M591j752j592L099m16
1434A293n797K515R096k236j2494j612J5449O954j4355r766Q335Q626k09m390
$$ y = [382, -805, -4968, -1180, 7008, 2930, -9192, -7017, 6737, 9804, -394, -6187, -1368, 166, -3618, 2270, 9027, 170, -9262, -3936, 5968, 5601, 58, -849, -3738, -8362, -1592, 11772, 10257, -8975, -16818, 1285, 13951, 2977, -8090, -5753, -306, 1453, 2891, 4158, -927, -6975, -1012, 6773, 781, -7464, -1085, 8755, 1148, -7749, 784, 8148, 467, -5819, -504, 3939, -1707, -5638, 2405, 6021, -1744, -3834, 1844, -203, -4997, 2055, 8876, -2752, -13932, -2317, 13041, 8734, -7345, -10565, 1445, 6606, 2341, 1789, -848, -6862, -2595, 9504, 7953, -6526, -8645, 3993, 6943, -1854, -4733, 2171, 4509, -3302, -4403, 3963, 3039, -4099, -2637, 1954, 202, -1390, 1709, 1293, -4504, -1989, 7107, 4871, -7623, -9235, 6214, 13168, -1187, -10953, -2618, 6008, 5799, 1409]
1448A409m299k204K605P586K737q930p338N990Q209l068o751L332L138n239j014
1463c837O110K344m491m772K334N074l54k597o48n90N71K983J808m745m466O132
1479H56N738m651o389O6N838L526k725m295k322J246N726L790m192q790j461R048
1495A009O094m158o815j504M102M090M35j045k969l516J537M510K515j901m594
1510b210p48K431K412J794j761m820j592L761N105j621n977j9M713J566l199l977
1526d142J788L726R59j650l293j328M285M417j73o795m778M687O834O97l771m048
1542b585j431J613N761M455o194q995J144P812M762k920n089j472M07O75M495
1557B438K900m859p072J643P265K284j871k534m505n89N862L983k140n993k20
$$ y = [1409, -2890, -5094, -2489, 5097, 7834, -1096, -8434, -2444, 5765, 2697, -4054, -722, 2416, -2823, -3837, 2273, 4617, 126, -4646, -2312, 2762, 2408, -189, -837, -1427, -856, 2127, 3935, -810, -5276, 856, 6594, 1943, -4446, -4380, 1458, 4984, 2259, -2036, -4358, -3112, 2614, 6404, 2212, -6578, -8039, 1009, 7103, 2945, -3870, -5374, -1272, 2818, 3253, 2208, -761, -4277, -2740, 1770, 4285, 2384, -2210, -2958, -527, 1885, 3679, 1918, -2902, -4494, -733, 4372, 2751, -3226, -3245, 1468, 3034, -165, -4142, -2354, 1372, 2331, 681, -2612, -3940, 345, 4762, 4589, -2206, -6984, -2297, 4537, 5234, 1463, -2585, -4016, -2403, 3358, 7813, 1619, -7376, -6232, 1580, 6342, 3422, -1667, -3139, -2732, -2057, 2438, 5338, 479, -6593, -4950, 2315, 4599, 2728, 194, -4311, -4900, 962, 4945, 2805, -3188, -3408]
1572c408O541O84n834n88N685Q55o021k843L177M421L073k040p395l801M545R359
1588F410J301j1023o011P593N711j532o79L29m037n428L881Q639K233o543p226
1603f382J016O519M837J307n679j1093O02J3150O279p521q911O74O084K589j185
1618B286k576j846r81J646L932j213l044L876J087o481k600N542N586j760o624
1633c170q31N021J580r37O43o63n070j365N738K106r46R33l161n206J039P231
1649B942O278n671j3846j380J4498R149o860r990k849L187P881M713o436p479
1663e863N19N560M837j811m196Q95P7m281J879P682M54q076k600N014L030o27
1679B493k541j861J88K16J214K722k268k111M054Q72o601k636P458N918n314q188
$$ y = [-3408, 3133, 3817, -2017, -2605, 3080, 3935, -2086, -4929, -1752, 2669, 5742, 3702, -3693, -7494, -2949, 6410, 7711, -3312, -9323, -1730, 3981, 2449, 1770, 2099, -1938, -7366, -3485, 5154, 7387, 844, -6382, -5366, 1153, 5990, 7297, 1618, -9475, -8873, 4277, 10556, 3035, -5876, -5202, 882, 3471, 2286, -290, -2136, -3117, -1471, 2461, 1248, -1796, 2080, 3167, -3314, -5914, -372, 5214, 3454, -3170, -4001, 1020, 2600, 1663, 2306, 1643, -3427, -4792, 946, 3052, 2106, 3039, -122, -5328, -4289, 2942, 9220, 3549, -10297, -11677, 2821, 11970, 5110, -4880, -7729, -4542, 3339, 8052, 1616, -5863, -5344, 216, 5053, 3242, -954, -59, 18, -4263, -2384, 5298, 5752, -2324, -4924, 90, 3120, 2493, -48, -1909, -1721, -1505, -291, 2431, 163, -1948, 2106, 2978, -3623, -6259, 1199, 7117, 1803, -6385]
1695f385J020P073M523k316m118l824k525O057R152k541j0541k442O672M979j421
1710C363k538k063k982rN505N407l313p778k32N310P58n30P85l101m172K892P828
1727E130Q03p747l164N447L154l888k102K759J430k672P55K400k636j594L525
1742A600K423n621n118N514O996k736n667l82K254P50Q31J868k344o042J613P606
1758C545J555m944l201J744N26P1L434J039n437l443M357O308j463o351p22K063
1774i19M16K039K508l848n852K746Q466n86q362k537N016M282j473l379m4N36
1790i91L88L244J43n335j749M928L541l413l051K409J365j290k78J225j5k530
1806a409q78L198J098q56r22j698l52J789K898j459n406l05O785K613n279m701
$$ y = [-6385, -5365, 1708, 6231, 3915, -203, -4027, -6552, -495, 8657, 6116, -4425, -6867, -195, 4784, 3363, 825, -1238, -4220, -4229, 1276, 6683, 3370, -4408, -4640, 670, 1428, 898, 1683, -1418, -5590, -2698, 5130, 5933, -1814, -4978, 469, 3623, -265, -2367, 392, 1822, -850, -95, 2305, -331, -1925, 1600, 4023, -1598, -6716, -1202, 5794, 3058, -2609, -2991, -737, 13, 844, 2712, 368, -5674, -4061, 3545, 5100, 156, -3045, -1301, -775, -704, 2730, 3769, -1668, -5111, -754, 5554, 4091, -2260, -2982, -919, -503, 1536, 4044, 196, -5656, -2910, 5556, 4970, -3392, -5929, -913, 3369, 1896, -1483, -1527, -991, -603, 2641, 2784, -2551, -4300, 628, 4169, 756, -2295, 114, 1479, 189, -89, 1136, 1121, -1409, -2287, 911, 2009, 1153, 231, -1467, -1819, -30, 2868, 1409, -3997, -4302, 2483, 5096, -183, -4884]
$$ [...]
8191B9
##END NTUPLES=NMR FID
##END=
