##TITLE=1H_B3dm-2
 CDCl3
 8 sc, 
 13.7.2023
##JCAMPDX= 6.0         $$ Bruker NMR JCAMP-DX V2.0
##DATA TYPE= NMR FID
##DATA CLASS= NTUPLES
##ORIGIN= UXNMR, Bruker Analytische Messtechnik GmbH
##OWNER= root
$$ XWIN-NMR		Version 3.5
$$ Thu Jul 13 14:37:29 2023 Russian Standard Time (UT+4h)  she@DPX200
##.OBSERVE FREQUENCY= 200.13135
##.OBSERVE NUCLEUS= ^1H
##.DELAY= (6, 6)
##.ACQUISITION MODE= SIMULTANEOUS
##.ACQUISITION SCHEME= undefined
##.AVERAGES= 8
##.DIGITISER RES= 18
##SPECTROMETER/DATA SYSTEM= spect
##.PULSE SEQUENCE= zg30
##.SOLVENT NAME= CDCl3
##.SHIFT REFERENCE= (INTERNAL, CDCl3, 0, 15.7039)
##AUDIT TRAIL= $$ (NUMBER, WHEN, WHO, WHERE, WHAT)
$$ ##TITLE= Audit trail, XWIN-NMR		Version 3.5
$$ ##JCAMPDX= 5.01
$$ ##ORIGIN= Bruker BioSpin GmbH
$$ ##OWNER= she
$$ F:/spectra/data/she/nmr/H-F/1/audita.txt
$$ ##AUDIT TRAIL=  $$ (NUMBER, WHEN, WHO, WHERE, WHAT)
(   1,<2023-07-13 14:36:10.98 +0400>,<she>,<DPX200>,
      <created by zg, POWCHK disabled, PULCHK disabled
       configuration hash MD5:
       00 E9 B6 7A A2 85 ED C7 34 08 36 98 17 FE 4E 26
       data hash MD5: 16K
       2F E6 42 E5 AD C1 D1 75 80 33 FB 48 34 FC 68 46>)
$$ ##END=
$$ 
$$ hash MD5
$$ 58 84 FE 6C F3 D2 EE 77 30 B8 30 21 94 63 E7 F4
##$RELAX= 
##$RELAX= 
##$RELAX= 
##$RELAX= 
##$RELAX= 
##$RELAX= 
$$ Bruker specific parameters
$$ --------------------------
##$DU= <F:/spectra>
##$EXPNO= 1
##$NAME= <H-F>
##$PROCNO= 1
##$TYPE= <nmr>
##$USER= <she>
##$AMP= (0..31)
100 100 100 100 100 100 100 100 100 100 100 100 100 100 100 100 100 100 
100 100 100 100 100 100 100 100 100 100 100 100 100 100 
##$AQSEQ= 0
##$AQ_mod= 1
##$AUNM= <au_zg>
##$AUTOPOS= <>
##$BF1= 200.13
##$BF2= 200.13
##$BF3= 200.13
##$BF4= 200.13
##$BF5= 200.13
##$BF6= 200.13
##$BF7= 200.13
##$BF8= 200.13
##$BYTORDA= 1
##$CFDGTYP= 0
##$CFRGTYP= 5
##$CHEMSTR= <none>
##$CNST= (0..31)
1 1 145 1 1 1 1 1 1 1 1 1 1 1 1 1 1 1 1 1 1 1 1 1 1 1 1 1 1 1 1 1 
##$CPDPRG= <>
##$CPDPRG1= <>
##$CPDPRG2= <>
##$CPDPRG3= <>
##$CPDPRG4= <mlev>
##$CPDPRG5= <mlev>
##$CPDPRG6= <mlev>
##$CPDPRG7= <mlev>
##$CPDPRG8= <mlev>
##$CPDPRGB= <>
##$CPDPRGT= <>
##$D= (0..31)
0 1.2 0 0 0 0 0 0 0 0.06 0 0.03 0 0 0 0 0.0002 0 0 0 0 0 0 0 0 0 0 0 0 
0 0 0 
##$DATE= 1689244570
##$DBL= (0..7)
120 120 120 120 120 120 120 120 
##$DBP= (0..7)
150 150 150 150 150 150 150 150 
##$DBP07= 0
##$DBPNAM0= <>
##$DBPNAM1= <>
##$DBPNAM2= <>
##$DBPNAM3= <>
##$DBPNAM4= <>
##$DBPNAM5= <>
##$DBPNAM6= <>
##$DBPNAM7= <>
##$DBPOAL= (0..7)
0.5 0.5 0.5 0.5 0.5 0.5 0.5 0.5 
##$DBPOFFS= (0..7)
0 0 0 0 0 0 0 0 
##$DE= 6
##$DECBNUC= <off>
##$DECIM= 32
##$DECNUC= <off>
##$DECSTAT= 4
##$DIGMOD= 1
##$DIGTYP= 9
##$DL= (0..7)
0 120 120 120 120 120 120 120 
##$DP= (0..7)
150 150 150 150 150 150 150 150 
##$DP07= 0
##$DPNAME0= <>
##$DPNAME1= <>
##$DPNAME2= <>
##$DPNAME3= <>
##$DPNAME4= <>
##$DPNAME5= <>
##$DPNAME6= <>
##$DPNAME7= <>
##$DPOAL= (0..7)
0.5 0.5 0.5 0.5 0.5 0.5 0.5 0.5 
##$DPOFFS= (0..7)
0 0 0 0 0 0 0 0 
##$DQDMODE= 0
##$DR= 18
##$DS= 0
##$DSLIST= <SSSSSSSSSSSSSSS>
$$ [...]
##$SUBNAM2= <"">
##$SUBNAM3= <"">
##$SUBNAM4= <"">
##$SUBNAM5= <"">
##$SUBNAM6= <"">
##$SUBNAM7= <"">
##$SUBNAM8= <"">
##$SUBNAM9= <"">
##$SW= 18.05172834244
##$SWIBOX= (0..15)
0 0 2 0 0 0 0 0 0 0 0 0 0 0 0 0 
##$SW_h= 3612.71676300578
##$TD= 16384
##$TD0= 1
##$TE= 0
##$TE2= 300
##$TE3= 300
##$TEG= 300
##$TL= (0..7)
0 120 120 120 120 120 120 120 
##$TP= (0..7)
150 150 150 150 150 150 150 150 
##$TP07= 0
##$TPNAME0= <>
##$TPNAME1= <>
##$TPNAME2= <>
##$TPNAME3= <>
##$TPNAME4= <>
##$TPNAME5= <>
##$TPNAME6= <>
##$TPNAME7= <>
##$TPOAL= (0..7)
0.5 0.5 0.5 0.5 0.5 0.5 0.5 0.5 
##$TPOFFS= (0..7)
0 0 0 0 0 0 0 0 
##$TUNHIN= 0
##$TUNHOUT= 0
##$TUNXOUT= 0
##$USERA1= <user>
##$USERA2= <user>
##$USERA3= <user>
##$USERA4= <user>
##$USERA5= <user>
##$V9= 5
##$VALIST= <valist>
##$VCLIST= <CCCCCCCCCCCCCCC>
##$VD= 0
##$VDLIST= <DDDDDDDDDDDDDDD>
##$VPLIST= <PPPPPPPPPPPPPPP>
##$VTLIST= <TTTTTTTTTTTTTTT>
##$WBST= 1024
##$WBSW= 4
##$XGAIN= (0..3)
0 0 0 0 
##$XL= 0
##$YL= 0
##$YMAX_a= 427822
##$YMIN_a= -561293
##$ZGOPTNS= <>
##$ZL1= 120
##$ZL2= 120
##$ZL3= 120
##$ZL4= 120
##$ABSF1= 10
##$ABSF2= 0
##$ABSG= 5
##$ABSL= 3
##$ALPHA= 0
##$AQORDER= 0
##$ASSFAC= 0
##$ASSFACI= 0
##$ASSFACX= 0
##$ASSWID= 0
##$AUNMP= <proc_1d>
##$AZFE= 0.1
##$AZFW= 0.1
##$BCFW= 1
##$BC_mod= 2
##$BYTORDP= 1
##$COROFFS= 0
##$CY= 11.3945322036743
##$DATMOD= 1
##$DC= 2
##$DFILT= <>
##$DTYPP= 0
##$F1P= 15.7292609196834
##$F2P= 12.9074282941183
##$FCOR= 0.5
##$FTSIZE= 0
##$FT_mod= 4
##$GAMMA= 1
##$GB= 0.15
##$INTBC= 1
##$INTSCL= 1
##$ISEN= 128
##$LB= 0.24
##$LEV0= 0
##$LPBIN= 0
##$MAXI= 10000
##$MC2= 0
##$MEAN= 0
##$ME_mod= 0
##$MI= 1.114404
##$NCOEF= 0
##$NC_proc= 0
##$NLEV= 6
##$NOISF1= 3.799351
##$NOISF2= 2.8
##$NSP= 1
##$NTH_PI= 0
##$NZP= 0
##$OFFSET= 15.70392
##$PC= 1
##$PHC0= -20995.25
##$PHC1= 16.65272
##$PH_mod= 1
##$PKNL= yes
##$PPARMOD= 0
##$PSCAL= 0
##$PSIGN= 0
##$REVERSE= no
##$SF= 200.130013532006
##$SI= 16384
##$SIGF1= 3
##$SIGF2= 2
##$SINO= 400
##$SIOLD= 16384
##$SREGLST= <1H.CDCl3>
##$SSB= 0
##$STSI= 0
##$STSR= 0
##$SW_p= 3612.71676300578
##$SYMM= 0
##$S_DEV= 0
##$TDeff= 0
##$TDoff= 0
##$TI= <>
##$TILT= no
##$TM1= 0
##$TM2= 0
##$TOPLEV= 0
##$USERP1= <user>
##$USERP2= <user>
##$USERP3= <user>
##$USERP4= <user>
##$USERP5= <user>
##$WDW= 1
##$XDIM= 8192
##$YMAX_p= 0
##$YMIN_p= 0
$$ End of Bruker specific parameters
$$ ---------------------------------
##NTUPLES= NMR FID
##VAR_NAME=  TIME,          FID/REAL,        FID/IMAG
##SYMBOL=    X,             R,               I
##VAR_TYPE=  INDEPENDENT,   DEPENDENT,       DEPENDENT
##VAR_FORM=  AFFN,          ASDF,            ASDF
##VAR_DIM=   8192,          8192,            8192
##UNITS=     SECONDS,       ARBITRARY UNITS, ARBITRARY UNITS
##FACTOR=    0.0002768,     1,               1
##FIRST=     0,             0,               0
##LAST=      2.2672688,     0,               0
##MIN=       0,             -561293,         0
##MAX=       2.2672688,     427822,          0
$$ Real data points
##PAGE= N=1
##DATA TABLE= (X++(R..R)), XYDATA
0@%%%%%%%%%%%%Qj6J6j6J6j6K4l2L2m0M8n6O7p5Q5r8J13j29J46j64J87k12K38
35A26k68L00l35L71m12M58n06N60o18O81p51Q28r12J004j104J216j342J481j636
54h59J812k013K246k516K834l217L688m282N053o098P585r855J3686k1227M1016
69B7853j77986m11160N96757J73645k90537J93555J5694l28432R3426J61325p059
80D7081J19820j38223k66293K21967J16999j90416K04782R1868m19773J4524L34211
91A36547n9199l0721L2078k30655M5877K38578j33053p015J93440k65973j88887
102b68983L51336Q4158k03839Q5079l72j68007P8803R0385K1025O9380k01500
113f2535j71105K87941J03304k13931J13045P3623l00505L5685L00556p6064j20151
$$ y = [0, 0, 0, 0, 0, 0, 0, 0, 0, 0, 0, 0, 0, 8, -8, 8, -8, 8, -8, 16, -16, 16, -24, 24, -32, 35, -40, 45, -53, 60, -69, 77, -87, 100, -112, 126, -142, 158, -177, 194, -218, 240, -266, 294, -324, 357, -394, 434, -478, 526, -578, 638, -704, 777, -859, 953, -1060, 1186, -1330, 1504, -1713, 1975, -2307, 2746, -3352, 4233, -5622, 8064, -13163, 27853, -150133, -561293, 35464, 209109, -81428, 112127, 127821, -200611, -107185, 54140, 47081, 166901, 28678, -237615, -15648, 101351, -89065, 115717, 207585, -212188, -197664, 136547, 77348, 46627, 78705, -151950, -106073, 132505, -548, -7563, 185877, -80096, -268983, 82353, 166511, -37328, 47751, 47379, -120628, -41825, 48560, 69585, 138965, -62535, -233640, 54301, 157605, -56326, 56719, 130342, -170163, -134478, 166078, 90014, -30137]
124c0137M4480r4469J3206J53589n5924j3015P0977j82284n4346K54518J3880
135A20475j49365M0222l1438p9342J31031N8562p8523J9497p1366q0538J97962
146G7177N8504k00975M8490R5621j66038O331J90497l8013j05042N838j7970L9453
158f127P9640n5946k7049L1462r8922J2599J79649n6340j37560P9146R798p2387
170f2037R2421M4768q6227j674p278l6079J05541L9670j40977j419Q8317n9766
182b4740K348R3467n2923o4783L3121K188K1808K9900o3792r206N8011m8605j2912
195c6118J03545l8161j10208O9919N8009p3026R498M5056l4111j461Q783k0244
207a8519L4109O624n5107K3377L3108n2334J3563O8227m8416n3016N1026J1830
$$ y = [-30137, 14343, -80126, -66920, 86669, 30745, 17730, 88707, -93577, -147923, 106595, 120475, -28890, 11332, -20106, -99448, 31583, 90145, 11622, 31119, -40247, -120785, 77177, 135681, -65294, -16804, 78817, -87221, -80890, 109607, 71594, -33448, -27610, -45580, -6127, 73513, 17567, -9482, 21980, -76942, -64343, 115306, 58966, -78594, 552, 10350, -62037, 30384, 75152, -11075, -12749, -20027, -56106, 49435, 89105, -51872, -53291, 35026, -24740, -22392, 71075, 18152, -46631, -13510, -11322, 10486, 40386, -23406, -32612, 25399, -23206, -36118, 67427, 29266, -80942, -11023, 46986, -26040, -16542, 28514, -5597, -7058, 1725, -18519, 15590, 22214, -32893, -9516, 23592, -28742, -15179, 53048, 4632, -48384, 2642, 14472]
219A4472k6870J2606j5129J69M4577l3663l4410O3111J701o6041K4391L6805m0309
232a8590Q35M1491k0635j9302K4526J355j1045j3742j1547M6593J6747p1799J196
245c3917P2337k2322l9789L9249m870n7363K2399N5289j0090k5603j2897l49L1973
258A4047K271l0565J6736L365m4287J8034N6493j0012l1339o88p707n561K7661
271H448J7529j4728k8322k2992L8045O1593l8573n9195L5065J6445m2931J3819
283a5797M7553j0309l3898n307J0234J3451Q619l217m751l1001l2146O0616P1598
296G5645n4781o3979K9953J8094j5039J9378J9199k2833l2595n145L5615M4056
308D7568j2638m7134j0151m341m972N9249M0651o8571o0763L1101N5494J9047
$$ y = [14472, -12398, 208, -14921, -14752, 29825, -3838, -38248, 24863, 26564, -39477, -15086, 21719, -18590, -17755, 23736, 3101, -16201, 8325, 9680, -1365, -15107, -26654, 19939, 36686, -35113, -33917, 38420, 16098, -23691, 15558, 10688, -46675, -24276, 31013, 20923, -4680, -17577, -17926, 14047, 16318, -14247, 2489, 5854, -38433, -20399, 36094, 26082, -5257, -5945, -13652, -19213, 8448, 25977, 11249, -17073, -40065, -2020, 59573, 21000, -38195, -3130, 13315, -29616, -15797, 31756, 21447, -12451, -17758, -7524, 5927, 14546, 11329, 6578, -24423, -56569, 4047, 75645, 20864, -43115, -13162, 4932, -10107, 9271, 28470, 5637, -26958, -32103, 3512, 47568, 34930, -12204, -22355, -26696, -31668, 27581, 68232, -339, -61102, -30001, 25493, 44540]
320D4540k7985l5832m331r46l49M8552M0907n7034o2455L5489L7914j2073J2225
333A8622P020m6087l2349L2734O5722J7986o2678m8870K5157K6947j576K2118
345B4746J2027n6503l8203N0583N0431j0467l3620k2245j309Q89J2800N5315J6287
358F0731q1922n1406O2276N8519k3141l0642l709j8416o409M4398M5747j5101
370D0925o4206k5040M5125K4928j8393Q588O418m6571k2887O0561N3465l6579
382B6334n7003J864K2301n33Q599L1892m948o3892j8368O8470L5430m2461k8395
395b0710J4743l342j9625L5078N6053l0507p7322k137N9486K0148k7151m629N865
408E950l2957r977O5512M1800o0674o6303K5944M3258j1492L116K7503l1412n1224
$$ y = [44540, 16555, -19277, -23608, -24554, -24903, 23649, 64556, 7522, -54933, -19444, 18470, 6397, 18622, 25642, -20445, -52794, -20060, 45662, 63648, 970, -47900, -22743, 4204, 2628, 24746, 36773, -19730, -57933, -7350, 43081, 32614, -1006, -23251, -24560, -23671, -10871, 44444, 60731, -21191, -72597, -10321, 48198, 25057, -5585, -9294, -27710, -34119, 10279, 56026, 40925, -23281, -48321, -3196, 21732, 3339, 11927, 18345, -28226, -51113, 9448, 62913, 26334, -30669, -28805, -6504, -7037, 1562, 33454, 28506, -35386, -53754, 14716, 50146, 7685, -20710, -5967, -9309, -28934, 6144, 62197, 31690, -45632, -47769, 11717, 31865, 4714, 85, 5950, -27007, -36984, 28528, 70328, 9654, -56649, -30705, 12553, 1061, 4177, 31680, 268, -50956]
421e0956K8103P1325R78o7791k3652L8099Q508j9362K6944L3464m5753n4521M1678
434a2936N7805k3656l8339N479J0569j0733L610L8892N628o0258k1359N3761J6901
447B5364l9281L734L3937k2365l4493K9108L8375j4103m0200j1662K9384J1031
459H829j7203K1655J9883m9045k4264N6155K4766m6060k2612K2694R054q348L523
472i73J9442M881l7878j9132M4331J2829l8580O554K0820k5874n109L8492P829
485B7632l4525k1800J6096K9743m292l1303J1976L1175k5681j8429L4451k244
497A2799l0314J3724J1686j5307K977J5370M227p874k1828j021L3304k869m1364
510b6490J2549L5090j9298j1866K0651n242r874M349p167K487Q667q154O202J2106
$$ y = [-50956, -22853, 48472, 49450, -18341, -41993, -3894, 4614, -14748, 12196, 45660, -93, -54614, -12936, 44869, 21213, -17126, -11647, -1078, -11811, -8201, 30691, 36319, -23939, -45298, 8463, 25364, -13917, -10183, 23754, 1389, -33104, -3996, 34379, 20276, -19924, -31586, -2202, 8829, -8374, 13281, 33164, -15881, -40145, 16010, 40776, -5284, -27896, -5202, 3852, -4496, -973, 18469, 23350, -14528, -33660, 10671, 23500, -15080, -8526, 12294, -13580, -18689, 19803, 27632, -6893, -28693, -12597, 17146, 12854, -18449, -6473, 24702, -979, -19408, 15043, 12799, -17515, -3791, 7895, -7412, -4435, 10935, 15162, 7288, -14540, -15561, 17743, 14874, -26490, -13941, 21149, 1851, -10015, 10636, 5394, -4480, -131, -7298, -4811, 3856, -4298, 1904, 14010]
524A4010k0591n071L2847q357l7731J5509K5594j3670n007M262k934R179l61j0529
538b850M832p879j0689K5197J2922k8102n549K0711m127o056P215j0514k642J0790
552C259j1223N872K5869j7080k0218J5181k776p329K3910j880l3771O190K9595
565A5599o44r014o198j0046J0217M331j6260J4217J7305k4505q686J9271k362
578C225l093J1733j1813k2698R328K1982P482m986j8059p821J6620K268n470J4042
592A2740q506k7932J0594K7246K821p411j1100j3003J701J3873R630M634j3516
605A771k8678J0440L8374n142k3317L816m879j4168J6558K5937m502k6011j0387
618b0188J6056J4733o747o578P016q841j9331K0132K9645j6248k0148O927J92
$$ y = [14010, -6581, -11652, 21195, 12838, -24893, -9384, 16210, 2540, -2467, 1795, -1139, 8040, 7679, -2850, 1982, -5897, -16586, 8611, 21533, -6569, -12118, 8593, 4466, -1590, 5625, -4889, -7531, 3259, -7964, -2092, 23777, 6697, -13521, 1660, -1116, -8445, 15465, 13585, -20186, -13996, 15599, 14955, 5941, -257, -10303, -86, 4245, -12015, 2202, 19507, -4998, -13684, 5587, 3225, 132, 11865, 52, -22646, -13318, 8664, 16146, 11160, -6899, -14720, 1900, 4168, -1302, 12740, 4234, -23698, -13104, 14142, 16963, 9552, -1548, -14551, -12850, 1023, 10653, 15287, 1771, -26907, -16467, 21907, 16765, -6552, -2736, -7615, -21783, -5225, 20712, 16210, -9801, -20188, -4132, 10601, 3854, -2724, 4292, -4549, -23880, -3748, 25897, 9649, -10499, -3572, -3380]
631c380p290Q814J5531k603k2488j1968K0696K2973j1517j8434O889j812j6950
644b1539J6746K8799j2308k7182l281J6075J1972m239l059J707j7129j4146L0353
657B769L3619k5599l5875J4137J4479q399J1411J1298k0763k1000R322K9188R781
670B4368k6168j6054J6201K177j5905J6850K5248k6542k8572K1164J9945n041
682G671l937n155o568k071L311J8923J0779k7154j9501K4934J5849j9959k568
695e446J7683r503j8832P218K0494Q949j9046j9561J4082R849j0105J2437R407
708A7626l0710j2639L5404J4983k5858j1673J1420P231l647r732Q399J8925j8387
721A342k1931K2609J4592j6502j158P309j0902j757J3779L380p899q727k078J6200
$$ y = [-3380, -10670, -1856, 13675, 11072, -11416, -23384, -2688, 20285, 8768, -9666, -2777, -4589, -21539, -4793, 24006, 11698, -15484, -18765, -2690, 9282, 5043, 1984, 3691, -13438, -27584, 2769, 36388, 10789, -25086, -10949, 3530, -4869, 6542, 17840, -2923, -23923, -14601, 14587, 24368, -1800, -17854, -1653, 524, -15381, 1469, 26717, 175, -28397, -7233, 12712, 7671, 3734, -1421, -7989, -10060, -6749, 12174, 22953, -4201, -23702, 1232, 17081, -2878, -5446, 12237, 2734, -16098, -8880, 11614, 20563, 1517, -18044, -3962, 5887, -4218, 8219, 17626, -13084, -25723, 9681, 24664, -1194, -12867, -1447, 5784, 2137, -7595, 804, 19729, 1342, -20589, 2020, 16612, 110, -1048, 6261, -4641, -6398, 7381, 10761, 2862, -5865, -7943, 8257]
735H257M330k4755M243K8202j6250k3469J9404J4250j1816o492K438K596m80l685
749c227Q101J0722j9988j7018K9823J5909l1103n395K1610m971r754P381M484
762F574k347q642k937J4904K148j7978M167J7082j6415j2813K5746O515k5262
775i258l983J5375J0187n261k0349L049K4243q563j7645J6388M737k1492R108
788c464K2725j7339j8751J6366J1597r073r853L388J5892n422k3705J3821K4536
801B0718k1142j8256J9769O281j3728M941Q637q830n597L994O348M341j3213o648
815a2385K0528m45k1832J2559J8824j6889j4192J0701Q100l161l571P22L779m382
829a644q713J4378J4782k4149j5133K2013M219j1992R942N587j6610o878J4025
$$ y = [8257, 12587, -12168, -7925, 20277, 4027, -19442, -38, 14212, 2396, -4096, -1658, 938, 458, -3227, 4874, 15596, -4392, -21410, 8413, 24322, -6781, -12176, 9434, 4463, -5291, 2090, 6574, 4227, -4415, -7352, 7552, 9700, -8278, -4111, 12971, -3444, -16257, 9489, 16004, -9258, -13241, 2134, 12321, 7060, -13289, -10240, 14003, 5440, -12205, 4183, 8920, -12572, -3464, 19261, 1922, -16829, -463, 11134, 2061, -7792, -4404, 11488, 6066, -17639, -3818, 20718, -424, -18680, 1089, 7370, -6358, -1417, 7220, -1610, -7207, -3213, 3135, 7476, -5737, -12385, 8143, 7698, -14134, -1575, 17249, 360, -13832, -3131, 4969, 1808, -1763, -1041, 2738, -1644, -10357, 4021, 18803, -5346, -20479, 1534, 5753, -6239, 3703, 9290, -7320, -14198, -173]
842a73J2912o097j6842j515J3746K87o884J3734L335k5686k738K3771K451j0102
856A99k034k545j299M631O944N093q342j6662K235J8904N66j2147N423L326j3009
871h717P96J4298L433r748j0338K383Q460OL543Q896j1650j9455R928K2400m577
886I658j5191K528R44m768Q271J1998k611j6264j0932J1376J3634l701m235K105
900B812o341q690J0872J7998o317k0566m506R840R094L393J81l973j2650l393
914a2246J7676Q941j4004r306P188L208p276N870J7551n021k4379o683J7750J3977
928A3246o605r122j155m413K024J6277O229j7031j5705P498J2904k566o23R093
942A0051n199j8270r20K3351J2026j9373j8546O753J2757M210K301N91j2186j4402
$$ y = [-173, 12739, 6642, -10200, -11715, 2031, 2318, -4566, 9168, 12503, -13183, -15921, 7850, 10301, 199, -1835, -4380, -5679, -1048, 5896, 10989, 2647, -14015, -11780, 7124, 7690, -4457, 966, 4292, -8717, -7921, 6377, 9810, 62, -10276, -7893, 567, 573, 4116, 13012, 1362, -18093, -8165, 14235, 9658, -5533, -3005, -2061, -6829, 1442, 13440, 10829, -5435, -16367, -4991, 8643, 4942, 707, 2812, -3529, -12219, -1347, 16651, 10334, -10232, -14738, -4898, 4196, 7589, 7770, 3797, -8853, -12246, 5430, 14371, 367, -8939, -1751, 1457, -5819, 51, 17602, 12581, -11798, -18481, -731, 13246, 6641, -2481, -3636, -8049, -6025, 10252, 16481, -550, -16255, -8757, 4147, 1581, 958, 10051, 4852, -13418, -14338, 9013, 21039, 1666, -16880, -10127, 2630, 6840, 9141, 9732, -2454, -16856]
956a6856J0972K0822o381j7338K332J0148l960n430J2726Q269j9078j5322J3486
969e610J5274o329p392P815n21j4110N767J8851l986j9501l087J5600M701j0452
983b980L243J1918r049j7851O753K0012l586j5846L871O560q318K507J6871j062
997A3043k5362r953K3704J4952j6362r967J2727L393j3489K752J8584o598k2221
1010a4797L202J6578N80o140M699L868j2800q329J7596J2646j8850j6636J5436
1023b947J6711j2653q685J5076J576j8948j858J6675L805j3985k415J3931j395
1036D888j2825O844J3984j1181j8409R463J8703o482j1526P938P116r561p710
1049h758J1830Q968j7228r756J8994O897j4781J85J3310o245j4320N996J1866
$$ y = [-16856, -5884, 14938, 8557, -8781, -6449, 3699, -261, -5691, 7035, 15304, -3774, -19096, -5610, 9664, 3335, -4057, 3758, 3237, -10873, -5106, 13745, 9759, -9742, -12829, 2771, 7472, -2980, 263, 12181, 3132, -14719, -7966, 12046, 8460, -7386, -3515, 3045, -5273, -2766, 14105, 13043, -12319, -22272, 1432, 16384, 22, -9945, 2782, 6175, -7314, -4562, 14022, 7424, -14797, -11595, 4983, 5563, -577, 4122, 7990, -4810, -13139, 4457, 17103, -1747, -18383, -2947, 13764, 1111, -7574, 7502, 9078, -9870, -11728, 4947, 8752, -5233, -7648, 6283, 4888, -7937, -1093, 12891, 1710, -16699, -7236, 11467, 4985, -6541, 1397, 8513, -1048, -8758, 3072, 12040, -5188, -14944, 4050, 10947, -3834, -3649, 9661, 3416, -10904, -4908, 6958]
1062F958l987j0202J113J1913J866j4041J984J4782j0065j4696J3669J1437j2706
1075a975n934J2852M535j0686o029O724O945o725q575J0588O600j3453K329J5334
1089A2530r527j5342P874J0573m183o816J689P112J138r315L96J2404o756j4994
1103a3217J1019R942j1032M36J0201l735o415o57L291N466n687q863J0154R847
1117A0750j4058l091J7703m481j6648N799O214m370J682K858Q31k411p907N842
1131a287J5328j0477j9919R848J4741q596j366R644o145p436M312K904L491k541
1145B501r697M992P049q117M873J3449j3575j7854J1612J3987m890n805j696J841
1159a330N079m833q98J1826q339j6087J2796Q419j1442O056J2283j3801j3183
$$ y = [6958, 2971, -7231, -6118, 5795, 7661, -6380, -4396, 10386, 321, -14375, -706, 10731, -1975, -7909, 4943, 9478, -1208, -7237, -513, 6432, -293, -8868, 1720, 8320, -5133, -2804, 12530, 3003, -12339, -4465, 6108, 1925, -4891, -3202, 3910, 5048, -4267, -3871, 8533, 1777, -13217, -2198, 7744, -3288, -2852, 7349, 3614, -2801, -3458, -167, 5299, -388, -9251, 903, 10750, -3308, -6399, 11304, 6823, -9825, -4026, 2188, -2182, -500, 2358, 3189, 778, -7129, -1287, 14041, 3564, -16355, -6507, 8234, -362, -1728, 7916, 1771, -5665, -1353, 1551, 5042, 2501, -7196, -2204, 4845, -3272, 1601, 15050, 1475, -16379, -4767, 9220, 4330, -1475, -3171, -1330, 3749, -1084, -1982, 9844, 1505, -14582, -1786, 6633, -4809, 1247, 13530, -271, -13454]
1172a3454J0736J1595q00q419j0005N496J1222m812K077R001j6371j2802J7011
1185D75R308q715j178J075o089k70P511P846l9j7173j2703J7606J5460r928k601
1200E85K726j2126P6J6926K935j1462q400Q79R436L620m594N145L877j8417q257
1215a7051K3104Q174j6384l261L535l955M923R692J47r807j2145L121J6045N28
1229F666j0164M888L183j5181O38K1745L15j6726n359L055O763O433j48j005o479
1244a376j2297O489K0601k781j9308N40Q856l712J582J1439j938j4470p780Q797
1258e358J4279l144j0397M307k04j0981Q412J9219p699k1177J480J2942K021o46
1272C054J593k109p836o350J0928J5424r250j5694N022O067l446N828R227r459
$$ y = [-13454, -2718, 8877, 8077, -342, -10347, -4851, 6371, 1559, 3636, 12637, -3734, -16536, 475, 9783, 1068, -110, 965, -5124, -5394, 2117, 9963, 9924, -7249, -19952, -2346, 13114, 3186, 585, 3311, -8815, -8739, 8187, 11122, -340, -8740, -7861, 1575, 5195, 601, 5746, 9623, -8794, -17051, 6053, 14227, -2157, -5418, -1883, -5838, -915, 8777, 8924, -883, -13028, -9907, 6138, 6666, -3498, 1390, 4573, -10608, -9970, 11775, 12090, -4636, -9995, -6940, -177, 6256, 6108, 5103, -1376, -13673, -7184, 13417, 10636, -8672, -8132, 724, -2988, -1406, 10033, 8095, -6375, -14155, -5358, 8921, 5777, -4620, -313, -517, -11498, -3086, 16133, 8434, -12743, -11263, 1679, 3700, 3054, 4647, 2538, -5298, -11648, -720, 14704, 5454, -10240, -5218, 849, -2597, 3231, 12458, 2999]
1286B999j6979J716J5813P923p741j0950K469M622l694P115J1118j3324j8393
1299a7306Q376J7607o36r070M61J729o003p16J2339O519j4558j2812J2054J0365
1313H349q280NP939q438j1990P975J4724j734j2950k629P340K548m226K491P596
1328H720r063j3484R763J4373n602p211L741O21o849J007J3717K932j8315j0274
1342a5924J5639J3076r945o198Q483m775j0727J0758J2841q687j3117K104R142
1355B670k45l878N434L070j2487q238J6491J3753j4255j2894Q300N980m398R27
1369B30N027j701r616j077J3047L837j2212j614R624m805j0732J0358J3123j1363
1383B126j3790O886J1047r35p766J796M887q686m610J4698N523j5786m895J3109
$$ y = [2999, -13980, -12264, 3549, 11472, 3731, -7219, -4750, -128, -3822, 3293, 14411, 1087, -17306, -8930, 8677, 8041, -1029, -568, 1161, -4842, -5558, 6781, 13300, -1258, -14070, -2016, 8349, 69, 74, 8013, -425, -12415, -4440, 10284, 8550, -4400, -7029, 311, 2859, -1367, 1124, 8720, -343, -13827, -4064, 10309, 4707, -2504, 1237, 1858, -4991, -3984, 9733, 12665, -5650, -15924, -285, 12791, 2846, -3352, 5131, 356, -10371, 387, 13228, 4541, -8576, -6472, 2670, 2425, -1453, 3981, 7051, -5436, -13674, 2817, 16570, 2315, -10579, -2279, 3701, -697, 230, 5257, 3556, -6060, -7137, 5910, 9747, -2465, -4079, 5545, 740, -9992, 366, 13489, 2126, -11664, -4778, 6269, 5334, -2432, -636, 4251, -4435, -9045, 5653, 11176, -4610, -9505, 3604]
1397C604J226r727M223Q759o190r861K810J1858J654j1839k278Q818k492n196
1411d631Q147L804j1476m652J1160N512r379n070O928N373p967o008J0163O082
1425G986j1366l135R430o30o290L735N408n590n626N703O182n292o628N544P843
1440G274p798q073J0219P008r820n124N745L080l592j382L636P57n122L5O383
1455C226J21p793R28Q088m083p308N971O365l865m799J216M037j250l016L524
1470A362K536o685l665Q381N459p380m277N116k04m474K858N368j524p377j101
1485e607P936K501m787j403J451l113j610P047M409o873n685M115M761j152k655
1500f65J161J231m782j095P125L059n335l616K050O22k519L561N246n320p831
$$ y = [3604, 4830, -4897, -674, 8085, 1895, -7966, -5156, 6702, 8356, -3483, -5761, 3057, 565, -4631, 3516, 7320, -4156, -8808, 2352, 7864, -1515, -6585, 343, 5716, -2251, -8259, 1904, 7986, -3380, -6515, 2915, 2285, -4005, -270, 5138, -452, -6078, -375, 5807, 515, -6113, -569, 7274, -524, -8597, 1622, 8630, -1190, -6314, -569, 2511, -1081, -2463, 1173, 1930, -3192, -3157, 3226, 3347, -4446, -3518, 4570, 487, -6821, -850, 5515, 1650, -3149, -1933, 2104, 854, -2162, 1362, 3898, -2787, -6452, 1929, 7388, 8, -4269, 847, 643, -3831, -973, 4395, 2871, -4506, -5607, 2329, 4830, 43, -1360, 91, -3022, -4632, 2415, 6824, -49, -5734, -1619, 3142, 1990, -665, 496, 1727, -3055, -4150, 2975, 6034, 699, -2917, -867, -245, -2764, 797, 6043, 723, -7108]
1515g108L067Q387O92n485q65K96l689J196P971K939o933p063L099O536J28j345
1531A823M43m652m884M895J0972M40j0859m746L954L166J296K607j184q372l826
1546h927J0278Q153n546p609n42J642N11K184N446q01r143l064Q346N631m014
1561B545l240M07m914j236J0700O479q085q983J681O729P39k502J673k65p276
1576e548j113J0343N753p484o053M77o89J899P343K387p957r134L871J3594R99
1591H688j0631k398L440l201N22R898K608j0301n552M654M850P59j035j406l739
1606b844n495N224J3923j851j4113k408O917Q79o51M962r10q753l031Q101Q091
1621H041k773q657m05K526l550L662J1556k910j4636k403J0757O076l482m516
$$ y = [-7108, -4041, 4346, 5038, -447, -1312, -1016, -4705, -3509, 4462, 7401, 468, -6595, -3496, 3040, 3168, 1823, 2266, -2386, -7270, -2375, 8597, 9037, -1822, -6568, -2614, 552, 1848, 4455, 3271, -5101, -8927, 1351, 9504, 3958, -3651, -4193, -2551, -2040, 144, 5590, 4789, -4354, -7418, 928, 6559, 2545, -695, -288, -5202, -6438, 4262, 10741, 2656, -6327, -4646, 2083, 2822, 320, 1993, 1728, -5548, -6661, 3682, 9435, 1951, -4102, -3625, -4314, -2415, 4928, 7315, -642, -9776, -5905, 7689, 8688, -1943, -4341, -901, -4102, -3580, 6318, 8926, -1375, -6927, -2273, 2577, 3336, 2301, 895, -2844, -8339, -3115, 10808, 8957, -5156, -7564, -647, 232, -419, 4543, 3633, -5120, -8151, -50, 8041, 5268, -3389, -3794, -1268, -4818, -1156, 10400, 7490, -7146, -9549, 1208, 7284, 3802, -714]
1635g14k213k184P69Q491O799p776j2236L664P993k111n21L924l527p658P09J1342
1651D751O679q668j1286K114P396k82Q04M997o109r588O776J0110k688o320j131
1666b445R71p48p53O218O246p550j1410M475J0510k863m288L393k993o215N623
1681a829R559n91r356n547N150M778k769J558M519n477q514O854J1059m107q754
1696c467n96J777N60K042M458J415q801o549R402Q170p169o102M148O59m183M231
1712eO740l621p416j037N506K774l841j1M937m903n972Q032P521p471p344L588
1728b523M063j760J76L608K56n750l727O901N167p822l759O556q69m770N269O275
1744G291n516p646K049O114L09m581K4L935k260l493P230L459r401l336P106J567
$$ y = [-714, -2927, -5111, -4342, 4149, 10948, 3172, -9064, -5400, 2593, 482, -39, 3885, 358, -7300, -6591, 4751, 11430, 2762, -8524, -6410, 986, 704, 1508, 6505, 396, -9192, -2416, 7694, 5006, -1314, -2445, -1474, -2222, -2975, 3243, 9489, 1939, -9471, -4996, 5514, 2651, -1637, 1756, -1237, -7452, -1829, 7730, 7139, -2217, -7764, -2614, 2164, -605, 953, 5472, -5, -8519, -1665, 9394, 5287, -3467, -4063, -2286, -1726, 316, 4774, 6189, -2612, -9161, 241, 8411, 1242, -4860, -712, -53, -4236, -5, 6735, 3114, -4302, -5339, 167, 2941, -900, -911, 4026, -877, -6849, 1183, 8704, 1233, -6111, -2523, 1540, -220, -44, 3564, 3820, -1930, -5657, 1244, 6411, -1411, -5170, 1386, 517, -4253, 1016, 7291, 1775, -5871, -3822, 2292, 2601, -1980, -1956, 1979, -281, -3774, 3456, 6915, -2486, -5822, 1284, 2851]
1760B851m367J88L782L40m173j075N064J065o811r11P125j355n932M793M643n484
1776b57l463L839K040k952l022L378M204l026l994M185L284n294j526N017k157
1791B56m178M401L719k852l593J254M092j580n706K374O195l615n376M470M210
1806D071l607j558J794j935j549K465K174M74l757j808N097J301n179P18L976
1821B677l727l238M616M122k521k764m02L41J277l60Q07R59m972j528P887K117
1837E291o537j385K481j078p19K437R47j120j317j087K690J866l221M24J476m533
1853c385p65P384J682m940k379J070J420Q28l97n92k95k176m40N665J480m671
1869e11q65O37l056J856N581l87n123l310K291O552J409n612k836J424m12J756
$$ y = [2851, -1516, -1328, 2454, 2794, -1379, -2454, 2610, 3675, -3136, -4047, 3078, 1723, -4209, 584, 5227, -257, -3720, 119, 2159, -793, -3815, -437, 3767, 741, -3253, 932, 4216, -1078, -2604, 2413, 256, -3922, 479, 4198, 1346, -2247, -993, 3099, 1519, -4187, -1813, 4382, 767, -4609, -139, 4071, 464, -1094, 700, -1235, -2784, -319, 1855, 2329, -1428, -3236, 1861, 3162, -2017, -1299, 2677, -1050, -4288, 328, 4450, 1929, -835, -1237, -896, 381, 21, 828, 1787, -3185, -4713, 3174, 5291, -1246, -2631, -150, -1228, -1947, 490, 1437, 317, -1000, -2087, 603, 2469, -752, -328, 1148, -3385, -4150, 3234, 4916, -24, -2403, -1333, 87, 915, 518, -74, -369, -2545, -2985, 2680, 4160, -511, -1376, -739, -3795, -1939, 3642, 3255, -1868, -5178, -2887, 3665, 5074, -538, -3374, -1950, -2362, -606]
1885f06N446j718o483M12L008J201R83q09k196k261p80L749O005k234p232p70
1901d285M320L46N85J835l365l680J597M058K782k144m973K90K535j276J710M292
1917D627k400o516P17N411J703j355k212k357m36J517M001L274m873o575K765
1932b709M902o51p32Q41k511l725K415O216J041m838m685J654L406k75J706K208
1948D263n184m970M957O377j717m614j554J153N4J721L056M87n019m191M573M418
1964C810k659j269J284l013k528M300N889j666p214j881M758K266j325O24Q07
1979B183m726k532O688M898m769m440Q59J652j11J266L048j717o070p53O332L145
1995D953l903l185J262m61p74M181K659m712n132K740N531j158l803J766J377
$$ y = [-606, 4840, 3122, -3361, -2949, 59, 1260, 2243, 1434, -762, -3023, -3803, -54, 5951, 3717, -3515, -4285, 35, 381, 966, 2801, -564, -4244, -2647, 1411, 4193, 2049, -2924, -2634, -99, -1375, 335, 4627, 2227, -4289, -3572, 1839, 3542, 2187, -25, -2382, -2818, -1301, 2700, 5974, 1101, -5474, -2709, 2193, 1542, 810, 1651, -860, -4585, -2170, 4046, 5087, 249, -4436, -2782, 624, 349, 2055, 4263, -921, -5891, -934, 5443, 3726, -888, -2442, -1289, -1235, 486, 3542, 4029, -990, -5181, -608, 3810, 1151, -118, 1166, -1847, -4375, -75, 5814, 4148, -3066, -4947, -189, 2077, 752, 1376, 2183, -2543, -5075, 1613, 6511, 1742, -2698, -1839, -187, -298, 968, 4016, 2299, -3771, -4524, 1808, 4953, 1050, -2135, -873, -1334, -2108, 2073, 4732, 20, -5112, -2372, 3159, 2001, -1802, -36, 1341]
2010A341l370r53M819K760m755l338K755K036j436N37K509j870n087J501O611
2025D060q53n507O8L248q04k279K770K763l936l904L111L524j461j966J319K33
2041C86k984R33N204p18n587j236N250K360m316j499L672m43l260J853L125k028
2057G12l434K041L069k762k176K974J964l470k130L955K432m453j869M100R27
2072A880l220l05K558K00k571Q73K518j716k520J943L593k636m181L296L889l481
2088A20k661K382K455j877k676J694K044k090r83K579O39l837JM872p00m742Q20
2105a960L285r89j779J796J900k195k975K394L659k289l088J947J540k623J56
2120a221M753j034n654J13M488J618l159k254K147P02j834J868K480k780l688
$$ y = [1341, -2029, -2982, 1837, 4597, -158, -3496, -741, 1295, -141, 396, 2905, 1035, -4052, -2551, 4060, 3207, -2300, -2232, 1016, 212, -2067, 703, 3466, -470, -4374, -1263, 2261, 800, -1166, 153, 386, -2598, -1665, 3539, 2821, -2766, -4002, 1248, 3608, -708, -2207, 1465, 1022, -2238, -385, 2740, 712, -2722, -681, 2388, -374, -2550, 424, 2388, -1082, -3212, 743, 3175, -1278, -3147, 953, 1880, -1340, -1645, 913, 1113, -1458, -585, 1933, 217, -2303, -360, 3233, 597, -3584, -288, 3601, 120, -2541, -159, 2296, 419, -2257, -563, 1481, -609, -1592, 987, 1626, -2211, -2210, 2662, 1962, -2780, -1960, 1325, 336, -1443, 353, 2253, 58, -2917, -523, 3136, 847, -2241, -294, 1246, -1377, -1221, 3532, 2498, -3156, -3043, 1445, 3063, -96, -2350, -203, 499, -1335, 533, 3013, 233, -3455]
2135c455J962L440j448j255J708k35k485m25L797K596m599l476L583K394k350
2150b48R01K070l224k982L163L598j587l162o9J422J48o13K054J702m808l270
2166d905M615L485k158j616K96r62n96L027K172k024m269l45M206J928k813P4
2182A15J451l445j024M711J575l566k311J355J639j40L49J248r85m058o24N462
2198A752J796m593p54J932q53N0K597N39l028k614J410L050M05j079K02l21k951
2215b460L22N586N01n485k000K084K203J165r3j084k257j841K401M231q56m886
2231b469l41L214m72L2K933j092m320j330L200L833q96l495J82Q14l58J729K288
2248C452k793m312J454L632J02r79J52n61q71j349J579L220j547m381J193L033
$$ y = [-3455, -1493, 1947, 499, -756, 952, 717, -1768, -2193, 1604, 4200, -399, -3875, -292, 2102, -248, 653, 2723, -501, -3483, -320, 3278, 1691, -1471, -1540, -118, 30, -583, 1471, 3173, -1635, -4905, -290, 3195, 1037, -579, -283, -1245, -1841, 1186, 3358, 1334, -2935, -3280, 926, 2854, 41, 115, 1566, -1879, -2903, 1808, 3383, -183, -2494, -1139, 500, 360, 709, 1957, 972, -3086, -3710, 1752, 3548, -1045, -1799, 133, -720, -670, 1927, 2466, -562, -3176, -1766, 1284, 1689, 610, 812, 491, -2460, -2138, 3448, 3949, -1536, -3536, -1452, 751, 1916, 1823, 739, -1518, -3359, -958, 3273, 2417, -2469, -2810, 404, -68, -36, 2897, 1805, -2515, -3845, -645, 3188, 2292, -1203, -1021, -207, -565, 1164, 3452, 659, -3653, -2199, 1433, 1535, 556, 708, 147, -724, -2073, -494, 2726, 1179, -3202, -2009, 1024]
2264A024p25K9J782j806l553J035L591J194j949k481Q33K320r91k42K057j770
2280C48l306J350L373j21j261M5l41j463K32K672Q28l421l328L946L698k629j694
2297a072J589j50j818K78J896J27j526m20J683P78j476M1J983j907l259K738L182
2314B667k013j911J296J351j095j489J132J135j957j228K434J922k846p03L026
2329A721q94l148J395K461j007k307N75K848J57k688p7K028p31j741J786J419
2345A797k777o33L470O45k856j610J628J236j237r67K253J40k638M11L186n23
2361A525l221K78K003q03q58K014J217k304k330K194L503k207l586J937J888j602
2377c52l89K866Nl475m44K327N65j282k76J089o23j821J633L677k220m034L94
$$ y = [1024, 299, 328, 2110, 304, -3249, -2214, 1377, 2571, 622, -1859, -1026, 1294, 303, 61, 2118, 348, -2958, -1608, 1765, 1644, 383, 428, 87, -1376, -1144, 1528, 2356, -1065, -4393, -447, 3251, 622, -1072, 517, 367, -1451, -1173, 723, 850, -676, -1096, 587, 1365, -111, -70, 1913, 6, -3253, -515, 2667, 654, -1257, 39, 1390, 295, -1194, -62, 1073, -884, -2112, 322, 2244, -602, -1305, 1721, 827, -2321, -926, 1535, 528, -1779, -1204, 1644, 1801, -887, -964, 1064, 333, -1408, 378, 1797, -980, -1613, 1857, 2502, -354, -1964, -336, 900, -337, -1304, 949, 1089, -1549, -1138, 2048, 1525, -1696, -1418, 585, -218, -1076, 938, 2155, -149, -2479, -285, 3218, 1011, -2575, -638, 1250, -352, -741, 2125, 2130, -1345, -1789, 538, 1103, -179, -455, 634, 11, -1810, -177, 3500, 1280, -2754, -2360]
2394b360K514M78m67J067l26k489n09L383J995k887l336J671K290j283J050K298
2410C089k032m313R96M320P77l163j508Q87K25N74K470P04m127k972L208L284
2426B419j283j642K72n8j050J171K647r3m004j379K382J794n09L56P99k809k303
2443c290L074L926j896l807n69K340P89k37J470q0l527j923L331L080j623k087
2459a029L94p04o69L237K864k975m736j70M368K039j406r78l67j992L13L945J606
2476C740m067k925J434K317O21L06J69j797l397Q04M934J417m104k337J282J491
2492a12L16K078K70m363k479K903L799j57k467l04J22j221R45L756P8m901k392
2509d129L033L083k43m28p69k806r44L388L707k009m778j79L172R14l06J278r74
$$ y = [-2360, 154, 632, 165, 1232, 906, -1583, -2092, 1291, 3286, 399, -2937, -1266, 1024, -259, 791, 3089, 1057, -3256, -2260, 2060, 2837, -326, -1834, -947, -722, -148, 2322, 3026, -1101, -4073, -865, 2419, 1136, -506, -234, -292, -1342, -171, 2476, 2383, -1621, -3000, -618, 1176, 667, 1023, 1822, -987, -3290, -216, 3710, 1814, -1993, -2562, -222, 567, 330, 1800, 1720, -1807, -3730, -399, 2681, 1058, -1029, -635, -1339, -2008, 1229, 4093, 1118, -3618, -3788, 580, 2619, 1213, 235, -132, -2124, -1811, 2134, 3740, -327, -3252, -1818, 499, 1120, 1426, 1595, -202, -3599, -2795, 2139, 3556, -548, -2885, -1603, -112, 204, 2282, 2552, -1811, -4290, -1387, 2412, 2255, -212, -516, -394, -1615, -670, 3086, 3164, -1737, -4129, -1096, 1987, 1744, 1316, 547, -2259, -3203, 185, 3892, 1883, -2895, -3074, 98, 1012, 706, 1984, 1010]
2526A010l683q38M156K721k025k596o3P38M51J564J742k452m352R83M578O91k429
2543A96l83N58j372q53L074J811k775k998J144K343N8l75J461j615l519J113M141
2560B009J057l224j887J301P85M91J347m7k529k478K040L820q79k078K01N9j277
2577a289O50L107k01l936j609L320K032j097j134M55o87j271J481K558j437k674
2593a732P95K032m88r76J154N45k164j114K204J838j259j620P86Q75j418K69J962
2610A689r84k375J87K368L87j911K22J355j088j244J059J656r02k173J128J667
2626A041o37r53J208L59j691m11J981L54k097m61K071O29k001o00J913k5j494
2643h14P54R24j220r96J516J378j355j837R76J540o38q67R69O84j910r70K642
$$ y = [1010, -2673, -3511, 645, 3366, 1341, -1255, -1318, -580, -129, 1435, 3177, 725, -3627, -2644, 1934, 2625, 196, -187, 371, -1001, -1854, 1220, 3031, 256, -2742, -1598, 745, 803, 428, 1889, 274, -3245, -2132, 2009, 3066, -158, -2045, -744, 41, 532, 1879, 1832, -697, -3175, -1135, 2685, 1806, -272, -71, -12, -1289, -639, 2468, 2267, -1669, -3278, 42, 2074, 977, -157, 298, -389, -1660, -179, 2379, 942, -1732, -937, 1095, 607, -369, 785, 1330, -834, -1948, 256, 2094, 835, -785, 1, 876, -542, -273, 1689, 705, -1670, -1483, 885, 1272, -639, -417, 938, -150, -1394, -335, 1321, 419, -1754, -626, 1041, 404, -549, 659, 1018, -673, -1084, 897, 1251, -846, -1307, 764, 1393, -608, -1208, 705, 680, -814, -60, 864, -356, -1352, 164, 1542, 187, -1650, -674, 866, 228, -639, 330, 1014, -896, -1866, 776]
2660G76J180k072j036O36O50k39N16J088j541j999J194K234o1k181r5J334p79
2677c95p09J831R00j941j830J079J654j51l72M51q03j753J119K923L38l594j013
2694b266K117O80k18Q00k50j823j325J722K907o94k401m75P73j42Q15J863m78
2711A605l836p95K891K137q39j899l37j15J00J734J988j646l265J78K711O61p30
2728E43N70o36k536N7L104J948j609l423p7J845Q35P25N71k149k615R24L729R28
2746B734k125j765m80L09J003K171R85k997l692J839M199N35j795j486j310n00
2762b375K359L237l10m085k318K065L295K29j339m63k094j399L053L295p91l457
2778a098j388J178J083J507J024j322l226j077L540L033j559k474m80L8J09K140
$$ y = [776, 1956, -116, -1152, -516, 134, -105, 411, 1499, -42, -2041, -847, 1387, 1326, -855, -950, 384, -395, -1104, 727, 1627, -314, -2144, -1065, 589, 438, 66, 517, -286, -2039, -920, 2003, 2341, -1253, -2266, -149, 531, 313, 1113, 863, -960, -2285, -563, 2344, 1650, -751, -1226, -453, -595, 220, 2083, 1605, -2231, -3026, -135, 2002, 1163, -736, -1073, -1188, -1088, 646, 2634, 988, -2277, -2099, 612, 1273, 543, 1113, 477, -2059, -2002, 1102, 3050, 1441, -1982, -2059, -214, 621, 1346, 1917, -232, -2847, -1923, 1806, 2734, 609, -1156, -1636, -1327, -324, 1847, 2832, -165, -3857, -2018, 2181, 2716, 921, -565, -1875, -2375, -16, 3221, 2911, -1174, -3492, -1427, 1868, 2097, 758, 295, -1799, -3198, -145, 3150, 2359, -1098, -2486, -1308, -225, 1282, 2306, 984, -2242, -3319, 221, 3254, 1695, -779, -1259, -1221, -1112, 1028]
2794A028J741j349l333r11K805K159k42j202j180j757k81L911K735k918l872K
2810b664K270J666M24m40j850k420O00M275J704k853k754K39Q29Q24K285N59l206
2827e12k778J472L757J213k481j844J6j67R21K797M60l562k415K118K189k9l54
2844H01o06j608r25J423L564L66l688k016J452J402N86J175p23k817j167K801
2860B0K965j046k649j048R01L41O20K318n43l897o89L070J534q93j297l14q39
2877a446j9K369J609j493l096L5K794J99j242O33N7j682R8K331J044j889j441
2894a139N14N51m01O90J665j154k832N75L063p9j996kL85o65R6J509J104j807
2912G7k003J171J780n46j020J044p7j886R46K258j11k304q93J329R79q83K27R38
$$ y = [1028, 2769, 1420, -1913, -2824, -19, 2140, 1898, 696, -484, -2241, -2522, 1389, 4124, 1206, -2666, -2664, -394, 1272, 1696, 1256, -594, -3014, -2414, 1861, 3565, 712, -2042, -1803, -974, -150, 2135, 2694, -512, -3290, -1818, 1939, 3152, 671, -1173, -1157, -1324, -403, 2394, 2854, -708, -3123, -1005, 1184, 1155, 801, 195, -1413, -2338, -915, 2649, 3015, -673, -2689, -1237, 165, 751, 1926, 1203, -1614, -2781, 20, 2985, 1939, -710, -1758, -857, -516, 104, 2422, 1879, -2018, -2707, 363, 1897, 1004, -293, -607, -1446, -1465, 904, 2513, 1020, -2076, -2041, 753, 952, -290, 343, 400, -1282, -1184, 1147, 2191, 302, -1139, -625, -74, -475, 215, 1880, 726, -2106, -1531, 1532, 1453, -543, -545, -160, -825, -729, 780, 1884, 77, -1926, -755, 1025, 479, -541, 503, 426, -1460, -514, 1744, 1633, -671, -1564, -235, 744, -139, 88, 1026]
2930A026r74j168J364J446j594j561J391Q90j423l61J509O55j259j009J044P19
2946F95j188l77J612l00j479P09J615o58j661Q07R26r03q35J052J413j042j620
2963a234J311J158j382o93J206r6j059L58J215K6j270J36Q40j00j667L62K094
2980A205l93j982O79J475n22o04O48K39j841j60J833R70j206j028N09O79r25Q5
2998c39J633r44k240P06K216M47j249r09L39l62p8J552O99j926j427J529J985
3015A632j001r05M14m41j006P22J973K80j915r37J113P26n29M98J45j493j418
3032b142J877K250r30j627l62N58p7J27J315L98k604q04K189J508o79j157p2o99
3050i31n45J838J865j018k348m68J965J080n53p16o34r93r9K389J480j576k058
$$ y = [1026, 52, -1116, 248, 1694, 100, -1461, -70, 820, -603, -964, 545, 1200, -59, -1068, -24, 695, -493, -870, 742, 442, -1037, -328, 1287, 629, -1032, -225, 701, -202, -1037, 15, 1428, 386, -1234, 77, 1235, -147, -840, 366, 270, -789, -431, 784, 810, -460, -324, 516, 416, -1251, -889, 1205, 812, -1170, -491, 984, 462, -142, 506, 745, -1096, -1256, 577, 1547, 341, -687, -178, 501, -424, -339, 1294, 350, -1890, -1184, 1032, 1479, 230, -679, -340, -702, -780, 772, 1471, -455, -1882, -353, 1632, 631, -274, 140, -301, -1307, -585, 1388, 1668, -247, -1184, -71, 655, 126, 624, 769, -724, -2142, -265, 1985, 1055, -572, -934, -376, -453, -326, 989, 1387, -1217, -2021, 168, 1676, 997, -160, -232, -931, -1476, 362, 2227, 1209, -1139, -1607, 358, 1438, 885, 169, -465, -1458, -1557, 832, 2312, 736, -1322]
3067a322K75Q93j16P96P49j258j969K07K727J136j618j351p1L2L48J580P48j740
3085D6j996Q53K225K22q05n49o63j171O84K857P93k462k144P11J618P57l3l93
3103E50j975j089K037L021m05k712j210R63O51N78J084k32k369j092K027K303
3119B130n26k068m89j60J52J229J773q11k640l62K064Q57o23o35j09p58p21K090
3137C93J520q10k038l85Q06M84L20P88m97k189k84K719J480j454j744l33O83J53
3155c88J233Q10j332j751k9K205P21j358m19k14q31M15K238P57j778k020Q70J533
3173F62J27o26R4m41q93L36K117K63j950p07R56K18l45N60Q42j190j458R74J801
3192A340k82j428k70M03l91J25J648K23j818j012J173J129m42q12O90l00j023
$$ y = [-1322, -1047, -154, -270, 526, 1275, 17, -1952, -1745, 982, 2118, 500, -851, -922, -890, -542, 1038, 1786, 46, -1950, -1097, 1128, 1350, 545, -4, -667, -1838, -1154, 1703, 2496, 34, -2110, -1399, 219, 976, 943, 550, -1425, -2514, -477, 2544, 2139, -573, -1783, -820, -169, 409, 1493, 1261, -1108, -2200, -173, 2130, 1604, -464, -953, -1113, -961, 268, 2041, 1230, -1410, -1772, 292, 1149, 526, -109, -218, -976, -1697, 393, 1913, 1103, -935, -1320, -514, -30, 290, 1078, 581, -1608, -1892, 827, 2307, 853, -891, -1224, -541, -388, 845, 1655, 323, -1428, -1457, 748, 1469, 111, -308, -522, -1353, -938, 1300, 2057, 279, -1741, -871, 662, 789, 163, 257, -184, -1077, -741, 1376, 1639, -311, -1018, -62, 156, -189, 371, 1213, 23, -1435, -461, 1340, 1058, -370, -640, -237, -628, -503, 1145, 1368, -450, -1462, -289, 840, 398, -414, 276, -24, -1047]
3209a047Q15J777k27k007n37J452K39m70L98J97j182l13J386J253j589j257Q56
3226b56R28q05m30R47M26j360l32J374j4q88o8Q59k41q04N29J393r17j438Q16
3245b81J055o65r56J065P53j164n28J095L02p36n48O15L82r79K35J257l55j413
3263h66K22J369k62j373M41J034k34r45L98Q76n89n47R14K23j431l42J762L46
3281I96j231n10J002R1o29K38O29m38j164L52J508j39j399L95N43m32n78J212
3299D46M11j569m87J289J089q31j071P75P0p47J93J358m30j277L21J166j14r55
3317c63M90N49q76j056J115J428o48j371M35O14q23N1J240k78j383j91J368M75
3335G76o59k83M09o89n02J092J504j017j892M60J480N6k44K4q14o63J58J550Q08
$$ y = [-1047, -232, 1545, 1318, -689, -1226, 226, 465, -5, 393, 590, -592, -905, 481, 1734, 145, -1112, -256, 672, -133, -563, 384, 810, -550, -882, 492, 478, -410, -478, 381, 140, -664, -135, 1258, 341, -1097, -281, 774, 109, -847, 218, 971, -193, -721, 374, 676, -60, -608, 7, 389, -590, -355, 902, 547, -866, -644, 725, 463, -910, -469, 565, 331, -614, -216, 660, 71, -476, 438, 661, -770, -1112, 650, 996, -235, -745, 257, 348, -281, -43, 586, 148, -1016, -664, 844, 705, -694, -299, 244, -188, -766, 446, 857, -712, -1199, 90, 1179, 348, -723, 52, 122, -625, -432, 926, 496, -781, -460, 706, 592, -363, 127, 676, -200, -1256, -141, 1287, 639, -732, -297, 317, -506, -455, 785, 507, -876, -1067, 301, 776, 117, -166, 243, -446, -948, 144, 1648, 631, -1261, -801, 679, 735, 491, 515, -299, -962, -804, 746, 1554]
3354A554j493j377J012N14m03L86N93p44j643J131J678l00r31l63L9m4k5J126
3372G10M55j510j093J540J028o00p83N76l29j011O03J393m1j339p92R95N40l56
3390a4O44L5j500j042J886J541q99j334J46L80l2L81P47l13j416p26J927P98r99
3409B10k69K42n23l59J098J008q53j664K51J300J64o32J11L34j175l18J634O55
3427A214j288p76P04J90m07M39Q74m09j498k19J892Q04j464l96M49m13j48J247
3445G95N12j670j064J020J197k69q42L98n8q31K37J317M87j934l57J165N10o20
3463gJ83J56m05r48P16J456q02j177L39J161n07o03P33M35j008m58R36K85l32
3482A53m10N91j3j070L44J117j42j181j38J180o1p64M17M57o73n44N45J059n86
$$ y = [1554, 61, -1316, -304, 210, -193, 193, 786, 42, -1601, -470, 1208, 908, -23, -386, -347, -391, -416, 710, 1165, -345, -1438, 102, 1130, 530, -253, 323, -6, -1017, -414, 979, 938, -401, -1193, -198, 342, -14, 630, 665, -835, -1877, 9, 1550, 651, -683, -537, -157, -189, 192, 939, 626, -790, -1516, 411, 1209, 210, -59, 183, -340, -699, 399, 1407, 554, -1110, -859, 441, 605, -27, 84, 418, -757, -1075, 559, 1214, -74, -850, -146, 44, -363, 76, 950, 541, -957, -1176, 716, 1520, 56, -340, 109, -304, -452, 795, 1307, -363, -1427, -407, 790, 521, -321, 77, 19, -812, -575, 742, 1229, -705, -1062, 103, 613, -7, 176, 332, -73, -1021, -305, 1151, 349, -828, -489, 672, 165, -438, 295, 730, -278, -736, 200, 485, 153, -257, 334, 321, -749, -405, 712, 570, -611, -749, 431, 370, -394, 23, 480, -193, -737, -192, 867, 281]
3501B81j132P02Q37q13k32Q65R7j229k64J590O2j146l35R64L39p40k85P79k01
3520A39q49M98Q38o49o27N82R96p77j060N61P14m04m37P83K80p81l77J279P3j023
3540b41l51P86J81o28J01Q60n85q42K74J239k96j177J97R21k78o60O89L62p43
3559a91n86P46N48q98QQ50q3r41q9J221K06j158k40P12j03k36N62L74o38q99L79
3580d56J306n16o70l5N00n17J32R98K02j375p54J234O19m22m61L03j75n66P49
3599I6J058q00j157J53Q76K28n66L92L41j015m10R02P71o11r32K15M15j98N79
3618C37M67m22j321j27J413K69o24k69K65k76l40J180P10r87j421K29J305L07
3636F95m10P9k31j021K75J557M11j731q86R40P51j7n4L30r28p32P97R45j57j133
$$ y = [281, -851, -149, 688, -125, -357, 508, 605, -624, -888, 702, 764, -382, -717, 247, 586, -154, -439, 340, 139, -710, -212, 626, -23, -650, -68, 928, 151, -909, -348, 366, -38, -475, 308, 588, -193, -570, 709, 782, -241, -592, 194, 375, -253, -152, 708, 123, -719, -445, 794, 498, -679, -482, 439, 161, -499, 190, 552, -191, -777, -31, 517, -381, -373, 477, 394, -547, -636, 585, 791, -367, -607, 105, 2, -234, 328, 702, 64, -835, -456, 850, 334, -336, -371, 129, -388, -256, 742, 944, -431, -1185, 49, 668, 246, -215, 88, -87, -653, 96, 1154, 354, -803, -650, 226, 454, -112, 280, 621, -394, -804, 98, 869, 258, -674, -459, -44, -242, 337, 804, 382, -939, -1066, 347, 616, -8, -277, -12, -288, -628, 552, 1262, 275, -1146, -917, 388, 695, 285, 364, 133, -888, -613, 944, 1355, -376, -1262, -322, 429, 412, 358, 688, -240, -972, -175, 770, 613, -520]
3656e20J38K67m8J13O86K27j285o99Q94Q99k29m86L14l89n00N76J114l79j505
3675h12j32P05L25L1N72O7j222p51R82J576q30j183P1L38J83N86O73q57j764N04
3695i38J437M34p54m71K78k09k48R27R25j360j406N07J284J01n52L48j45r48M12
3714c78R64J25j036q00J007N68n83J52Q11n85j323L85J446l30o98K64K0l72J9
3733c44J222L64j599j025J178J034n64n15N12k54q57M19J354k13j540j73R52K39
3751A90k03N6P34j180q85J310P61n53j032O10Q10p19j57Q44N3j279k85J280O6
3770D21p26K05Q89o11j053Q35J038n06j321J99J107l09m60M85L82r71p51J407
3788B60Q94j440o09J251o5n71J97R79m72j310L42J276k09r99J59Q59k53p75O63
$$ y = [-520, -382, -115, -163, -50, 636, 863, -422, -1121, -227, 672, 443, -43, 271, -118, -618, -42, 1072, 693, -812, -944, -239, 86, 117, 689, 756, -466, -1217, -235, 1341, 511, -672, -601, -263, -80, 506, 1179, 322, -1442, -938, 499, 933, 179, -292, -14, -223, -471, 456, 1381, 21, -1385, -878, 406, 507, -45, 303, 158, -790, -378, 586, 711, -325, -1125, -118, 450, -133, 19, 830, 245, -1078, -693, 753, 423, -275, -11, 9, -363, -344, 878, 1242, -357, -1382, -204, 830, 266, -249, 263, 9, -848, -429, 925, 712, -828, -1001, -49, 190, -13, 43, 777, -403, -1288, 22, 783, 230, -802, -192, 618, -101, -258, 586, 639, -640, -925, 355, 421, -305, -100, 789, 178, -875, -40, 998, 492, -829, -630, 477, 168, -292, 193, 575, -396, -1147, 260, 1154, -286, -895, 356, 291, -280, -83, 896, 424, -886, -544, 732, 523, -476, -317, 542, 289, -486, 177]
3807A77O39j120n62Q81P83p96p56R96N91r72o81R96K96r74m3J100k81q79M77R44
3827H16l04j022J56R18l48p09Q25O34j021q11R15O47o57p88O12N00n53j56Q83
3846E37p4j002j91J232k8j066K72R04k69r94M24J114n88n18qM63k15l34O99K90
3866F48r73o66J276O34p33o74L56J3l82L81J029n11j128k22J060M40n47j90L56
3885A67n39j70J284K05r29j083M28J208k67k69J37k25m69Q9R10L03j149l27N77
3904a19Qj26N65K31n09r31K53J210j26q20Q6K08n17N0J136K23r87p23M19Q22j
3925C52k54o3j05q68O41J347l9j487o69Q15M43J79K64j54j089l20J066Q48m27
3944D80r92j63K88J20P02L53j19j503m03J358O99l05o46k57Q2k83R45R38r01j339
$$ y = [177, 816, -304, -866, 15, 798, 2, -754, 242, 833, -139, -820, 176, 472, -502, -545, 555, 274, -605, -128, 816, 512, -510, -354, 564, 216, -493, 332, 966, -55, -866, 49, 696, 39, -749, -137, 363, -190, -346, 537, 463, -539, -730, 502, 474, -592, -320, 584, 315, -679, -255, 859, 271, -247, -255, 208, -7, -341, 358, 648, -325, -991, 285, 919, 186, -488, -132, -119, -501, -120, 909, 398, -730, -952, 108, 548, 1, -189, 167, -372, -542, 742, 947, 18, -1065, -637, 571, 304, 35, 172, -53, -522, -433, 477, 780, -369, -696, -119, -111, -237, 328, 559, 50, -881, -628, 582, 456, -364, -278, -70, -587, -537, 599, 822, -165, -888, -469, 353, 352, 98, 35, -70, -938, -297, 1050, 1011, -476, -1145, -330, 113, 292, 556, 402, -687, -1007, 59, 907, 480, -512, -675, -387, -267, 435, 788, 669, -834, -1237, 121, 820, 515, -131, -388, -306, -589, 356, 1294, 393, -946]
3964i46J83J029O1J53k4n62o08k5J067P86q01r93K1K60N76N32L98j401j022N24
3984g92J648K41r04o12j27K39L50P74K7j093j045Q47J150qm66k28m42l87P71R68
4004I11k28j112o49P20N73P9k8p0o17l89N65J162l29r59L4R7m7M01Q65j99j441
4025f61n33J033R98j26o50k33m46r4J085P32n77j588J00J088N33l31j56j17r23
4044h66r6J530O62j131r77K49O57L42J87O8o22r00L31J343K1j043j75L34j27k32
4064d45P71O58j022r00L55J085Jo72K86j03o88J40J267K82j448m50R27M57n60
4083e9RO65p19q76Q36J062k81j074l4O74k24p8P28R7j487l33J305Q66j041o02
4103e66M64L78l84j1Q10k17j319K08J323j14j014L15M21k03n96O81R11j079p99
$$ y = [-946, -763, 266, 327, 480, 456, -106, -714, -739, 328, 1114, 313, -680, -659, -399, 177, 709, 1107, -294, -1316, -792, 856, 1097, 193, -419, -546, -307, 43, 817, 844, -249, -1294, -447, 703, 695, 229, 1, -441, -828, -57, 911, 683, -429, -1078, -358, 215, 294, 266, 196, -421, -810, -245, 917, 588, -371, -337, -240, -287, 114, 979, 780, -661, -1194, -161, 837, 711, 61, -172, -618, -712, 373, 1105, 528, -1060, -960, 128, 661, 330, 174, 57, -866, -962, 568, 1230, 99, -878, -629, 28, 370, 557, 625, 3, -897, -566, 777, 798, -245, -420, -86, -213, -445, 326, 984, -38, -938, -583, 502, 503, -169, 117, 14, -674, -534, 733, 1015, -433, -883, 44, 501, -59, -50, 615, -104, -980, -144, 918, 637, -437, -471, 203, -21, -99, 629, 726, -761, -1094, 211, 1077, 36, -566, -102, 276, -108, -119, 691, 474, -845, -637, 686, 572, -442, -127, 294, 91, -505, 176, 1087, 8, -791]
4122g91O93O31m90l46N22L14j052j20J107K47r44l06P79rp95M24J007o96r68M23
4142c70R69j00r63K27O41n39j66O64L22j035o04J258L88r65k58P74P0q16K55Q87
4162F39k69r66J53J078k85j033M47Q62m48p68P26M25n90n18O37P56r47n29Q88
4181B58N13q53k4M90p4p61K23Q74j92j069L42O56j8q78L92Q64p69r81P90O52l53
4202H2k41K77J48o67j14J017J20r40l95Q23L08n29J49L73k94r76N10J220k40j028
4222c97k45O83K03o7K31Q3j194k69J298Q91j155n35J60L43q1K94J84k67r60M9
4242g51J445O6p41j99K60l21KO41N68j161o09N20P37q1k55j74n8n93L34Q14J67
4263F11p09l86K57O9J46M30J49p82q58P45J031K05r86k78J25j70M75R00l08j204
$$ y = [-791, -98, 533, 43, -303, 219, 533, -519, -639, 468, 715, -229, -535, 244, 235, -560, -136, 871, 175, -793, -370, 599, 499, -464, -237, 404, -135, -301, 363, 685, -350, -954, 304, 692, -273, -531, 243, 313, -503, -248, 639, 370, -596, -443, 635, 350, -683, -236, 626, 178, -590, 136, 561, -29, -547, 90, 846, -101, -630, 258, 771, -82, -106, 384, 310, -451, -228, 646, 454, -615, -273, 383, 365, -513, -121, 743, -26, -1007, -217, 435, 82, -159, 118, 266, -401, -515, 502, 622, -318, -713, 110, 418, -111, 38, 411, 117, -859, -349, 871, 631, -397, -642, 41, 244, 177, 408, 491, -703, -972, 326, 1217, 62, -473, -313, 30, -51, 243, 427, 160, -800, -751, 694, 760, 19, -180, 80, -241, -239, 402, 970, -191, -800, -280, 457, 376, 121, -53, -111, -704, -370, 444, 611, -98, -484, -227, -158, -12, 418, 567, -215, -1073, -328, 703, 908, -78, -356, -231, -401, 74, 974, 666, -538]
4283e38l91Q32P53j7m15n73j33j15O56R96n94j178j35N65O78J30k05m23o44j4
4303g65J135M76l03j051J50K17PJ88P01o44q75N0J101N28m66m92l69k43L91Q60
4323E96L22q92j016K58J190M2j75k53o71l96P77J057N7q58q42M00L04K86L35k52
4343B69o90o79J137J132n03q91k99K04K31K53K77rr95l04R63M74j23n05k98n1
4363d07j67M07R88k06j032m05Q06L06o4n7k1r19R7J020Q14o85p95l00M03K08L67
4384C58K34l31j144j57J462P91p43j065J27K9R6Q02N33j103r49O82J040np11k8
4404h2l04j84K89J019L63j158o79N35N42l18p6K50k88n50L42J074J27j285k47
4423f30N74J65m20N72M32p15q94P33Q49k84o53j2N6k05J72J160M1j402m64J208
$$ y = [-538, -929, -97, 656, 639, 224, -349, -482, -597, 59, 1055, 461, -717, -852, -287, 391, 521, 316, -107, -751, -765, 370, 846, 543, -508, -358, -141, -134, 54, 755, 111, -764, -714, 387, 915, 449, -43, -412, -655, -264, 596, 918, 26, -990, -732, 458, 500, 325, 72, -599, -995, -218, 839, 896, 38, -804, -404, -100, 186, 521, 269, -421, -1100, 37, 1169, 666, -225, -524, -320, -89, 164, 441, 432, -563, -867, 96, 570, 447, -58, -356, -407, -574, -167, 821, 615, -417, -822, -16, 290, 226, 169, 148, -771, -674, 346, 1160, 475, -320, -620, -217, -9, 358, 592, 261, -883, -1040, 422, 1213, 470, -595, -468, -439, -343, 459, 992, -111, -1060, -378, 662, 657, -54, -82, -386, -570, -281, 738, 1101, -57, -736, -201, 341, 23, -53, 197, -91, -641, -299, 775, 902, -383, -630, -56, 109, -311, 261, 693, -22, -916, -183, 666, 382, -271, -283, -227, -432, -260, 900, 941, -461, -925, 283]
4443B83N29n51m19J19j40r2L96R38n49j340N0J001J86o82L10K73o70l12J116M58
4463I04r07q07O11N41o02M2O72j30p68OQ52L9p72M0O83k54o00L67R07o88p80L08
4485c36Q14j97o00L43M34q57j47R85K36q93o18R47L13o33J11M49Jq41L62Q06k75
4506D04j034M0R54k65m18K51M54m47m48O00N39q05n37Q59L82p19l25O27K18n66
4526b36J6O48l77o26K05R91k88q12J69Q79n33n68M42N30l67m40L56N37n52m73
4546d99N95J09n19o5O45J08o83l6M75J29n71K80M48k69q39L54R55l5p19j31M49
4567A81l81j43Q54J73j216j58R71L55m31m88N5J10l26N20O00k24j051L3P84J22
4587C40j90j12O2o45K15P30L27p86p02N16M67k12l4M68k92o23L07N99J16n20l29
$$ y = [283, 812, 261, -158, -39, -179, -271, 125, 1063, 514, -826, -776, 225, 411, -271, 39, 312, -358, -670, 446, 904, -3, -810, -199, 342, -260, -218, 454, 324, -444, -438, 414, 453, -319, -279, 404, 150, -450, -83, 824, 136, -644, -336, 478, 281, -319, 24, 458, -399, -546, 439, 675, -218, -836, 111, 424, -209, -98, 351, 352, -489, -127, 679, 404, -630, -590, 364, 99, -319, -68, 386, -61, -509, 91, 630, -175, -712, 147, 529, -190, -515, 112, 330, -236, -220, 428, 51, -575, -370, 621, 333, -479, -310, 569, 36, -532, -90, 440, 73, -367, -11, 526, -26, -499, 96, 205, -314, -379, 266, 374, -309, -345, 130, 259, -312, -32, 416, 147, -692, -338, 617, 582, -137, -268, 181, -200, -343, 511, 684, -532, -690, 281, 636, 205, -283, -228, -118, -444, 76, 676, 452, -599, -566, 218, 340, 150, 38, 100, -545, -330, 400, 727, -59, -761, -245, 222, 10, -24, 444, 152, -471, -164, 435, 551, 31, -298]
4608b98R4O4k70N97P00p64q87L27Q48N6l77k7k58m41J73J235j10r00l80M72L66
4629B20J03m3N5p18m59Q68Q58k57r07k31K59J18K14M74k31q75j94Q33N43m67n39
4650c76M38k17j16M16M36k38r09J28P41l8o5N9l21m82J35P53M69o50m63J60J17
4671b3O4L36K59o02p97L57R50K08p58m12L4O2J95N30M75j311n39P04Q23j4m98
4692D3j59k23j74N54N87n8r10l48O00N74l79J11k43j52n68P31P57l66p75N0L78
4713C0n2m3N52Q7q85n99J096L39n53j91J64j41l20O16O85l90r98j1O38M53l94
4734H3k13O3l67j79R94M58p61r16M91N37P4m45L00j99n61mR04M67q13m76N89J54
4756A80k47Q3K99k28p65N47P07k39n63K59L25m15m38N81O64o79p43P08K09j52
$$ y = [-298, -204, -140, -410, 187, 887, 123, -764, -437, 411, 467, 90, 63, -195, -636, -463, 772, 662, -238, -618, -146, 220, 323, 280, 335, -383, -842, 26, 884, 627, -280, -511, -252, -134, 80, 554, 323, -552, -746, 87, 630, 163, -376, 62, -155, -271, 145, 581, 343, -566, -438, 303, 265, 200, 259, -62, -544, -409, 344, 813, 163, -300, -140, -23, 41, 377, 636, 34, -763, -406, 544, 752, -6, -418, -384, -322, -127, 403, 878, -433, -972, -268, 555, 541, 43, -116, -339, -513, 41, 628, 570, -340, -688, -88, 486, 107, 218, -25, -177, -745, -14, 743, 377, -398, -348, 30, -22, -65, 487, 574, -311, -910, 186, 525, -28, -219, -55, -196, -516, 100, 785, 395, -603, -614, 24, 477, 83, -130, -67, -434, -613, 381, 839, 78, -838, -347, 190, 264, -181, 119, -80, -641, -645, 259, 726, -87, -563, 26, 180, -67, 16, 315, 87, -678, -131, 576, 337, -226, 33, 358, -57, -495, 86, 750, 71, -672, 36, 245, 93]
4776I3j86L52j70p74J65P79L41r05k31N00L80l86J09L89m64m22L26P67l18o49
4796c04K36M07l23k99L30J87o09j42P27N62j087j08N46K62m40k23L95M0n56L13
4816h6N21k77o51L08N85m8q42K81N35l96j10M29K47n90m57O80L80n42k32N13P2
4837C20p19P1P81j76p35J34M68J78n24l3P07l10p06L32N91j79n61L28J82k60j36
4858b47N33K64r17k83O17O47o22j05J56K2n47M12P21n00p85K6P63K09m92j09M43
4879B06k89m90N87P21o98p20O20N05l28l4K55j66n28j77P88J25n20j91L39J80
4899A85m79L72O77o08q47K25N82K10k28l5M9m85m8P35L69q38p10N39O52j76O8
4920B09J19n57l56L92O88N6j018j88M50K64K09J23n8q14j77P83N23n67k92J4J07
$$ y = [93, -93, 259, 89, -685, -520, 259, 600, -305, -536, -36, 344, -42, 67, 456, -8, -430, -104, 663, 345, -304, -68, 339, 16, -283, 47, 234, -375, -517, 210, 772, -315, -423, 123, 385, -55, -278, 117, 157, -399, -86, 435, 158, -493, -185, 400, 352, -490, -209, 326, -70, -180, 249, 496, -94, -551, 129, 509, -33, -265, 248, 320, -399, -328, 453, 277, -458, -324, 144, 322, -202, -235, 472, 162, -544, -212, 379, 200, -361, -33, 149, -111, -247, 286, 550, -367, -650, -33, 614, -8, -113, 43, 65, -482, -70, 651, 151, -634, -608, 155, 364, -128, -237, 206, -83, -573, 14, 735, 37, -683, -63, 442, 114, 80, 335, 169, -359, -536, 252, 377, -143, -334, 5, 185, -294, 78, 755, 147, -700, -475, 107, 317, 89, 54, 103, -382, -430, 305, 674, -164, -874, -335, 317, 141, 209, 328, -229, -585, -193, 495, 551, -467, -655, -205, 59, 268, 391, 333, -481, -658, 125, 648, 81, -211, -197, -90]
4941i0KK08K17p0q71q8R81O3j80K4k8n05l08P06O21m60o51K30K80n3j40N84l85
4964H7p03J42P13K20k17m97J68j32M8N83j5n33q47O30P99k75k40Q0k24k89O42
4985A40M82k14r71N8P33J61k01k08L52m77m03L48O14%p55O5N52k70l0K98K09q49
5007c66k37P56K93m25l67M09m9l60K46O45l74o20K42M33J97m39J15J51n24j80
5027d54N89O36p69n91M50N23l47ML64j75m81R4N30J21p79k2M57R7l13J2M23n96
5049b27m72P11M97l49n01L69M00n98k19M92L56n87k97P05K15o78q4P63p4r07J33
5070c52N71J38o64R6M02L9o01J68O06m78l12M13N05o54j87M73K30o73o1N43P2
5091B74n16OO35j21o56P2P93j04n96pL19m11r6N82M04o88p69O99R04n55n01J20
$$ y = [-90, -88, 120, 337, 267, -604, -692, 289, 352, 172, 196, 168, -337, -645, 61, 682, 222, -429, -199, 81, 28, -112, 472, 87, -616, -474, 239, 459, 242, -255, -87, -219, -171, 412, 397, -136, -983, -353, 446, 171, -69, 11, -213, -502, 140, 622, 408, -563, -505, 228, 389, 188, -20, 332, -145, -548, -200, 414, 414, -341, -276, 276, 6, -24, 274, 483, -366, -603, 153, 446, 21, -346, 63, 14, -346, -100, 545, 171, -449, -207, 226, 423, -16, 99, 250, -274, -454, 135, 771, 2, -589, -139, 384, 37, 41, 405, 230, -251, -157, 373, 494, -285, -307, 150, 247, -66, -54, 369, -227, -699, 12, 509, 160, -341, 28, 428, -170, -389, 103, 459, -128, -425, 280, 495, -183, -267, 496, 422, -485, -352, 219, 357, -307, -211, 191, 230, -371, -203, 403, -75, -387, 26, 531, -123, -310, 163, 393, -280, -341, 202, 274, -242, -236, 399, 278, -378, -306, 487, 383, -213, -220, 99, -312, -408, 174, 578, -110, -879, -180, 724, 169, -332, -212]
5113b12L99l02%O40j25r05m2O64K19m96P2L82k35n76M04P68n11o41P1N28l9j43
5135h0L02K20p24l95N37P38n46l64J02K19k17K51N55l7j051j37P07N33m44j87
5155a8o5k83r7N88R25q48r68K33N73L19p9r1r8p92J26R18O18r80o71K13M77K26
5177B26m7L84n35q73L72R28J51p21k55J02L03rM59K17p02r13M55P32J30k98M3
5198A49k14m50L0J107J15r48o57O20N03K9O2q9m34n35O24Q72J7r89k49J21M32
5219A16J10K98j47r73j27N97Q22j01o97k27P7p8N53M91l94q73j52Q57L56l41k3
5240A44j79l23j18O40P13p05p09K15J30M26J11Q1k96q71K37N97R64q45p15K04
5260b99K1K68M68J31n90r30L96J008P2l12l68l19L7K71R40q7j037m10L93O62J63
$$ y = [-212, 187, -115, -115, 525, 400, -505, -547, 117, 336, -160, -88, 294, 59, -517, -113, 655, 144, -497, -426, 102, 63, -80, 222, 442, -282, -677, -140, 598, 52, -312, -210, 9, -208, 43, 598, 561, -490, -627, 80, 613, 169, -18, -83, -366, -463, 125, 1050, 202, -766, -533, 40, 359, 280, 189, 91, -701, -575, 343, 961, -19, -690, -477, 0, 226, 179, 563, 28, -845, -473, 455, 606, -115, -370, -268, 35, 26, 485, 702, 0, -913, -458, 274, 404, 106, 149, -65, -515, -485, 622, 737, -211, -868, -248, 255, 284, 346, 257, -177, -712, -88, 784, 801, -188, -437, -316, 116, 226, 524, 377, -596, -723, -126, 696, 595, -102, -329, -252, -330, 223, 714, 320, -553, -705, 152, 508, 167, 144, -35, -358, -476, 164, 877, 172, -537, -322, -192, 234, 345, 426, 130, -741, -504, 93, 1057, 212, -503, -299, -278, -10, 458, 589, -1, -931, -535, 473, 545, 233, -135, -454, -417, -146, 794, 707, -330, -740, -347, 315, 478]
5281D78m27J8k48l41N06P00q7p69j28K52K67j94N57l60o51k76M97M98j53j64n7
5302h2k13m3L14O12j27q87j11N20J76K4L7k11m74M6N63O13m37q89J36M17P4oK58
5325C10j07o62j07J114k41n35j03K64Q6l36L95L94n43k22Q4N25j46l67O7M23m66
5346a73MK78L40m21j96L46o3m08J26O65j17p63K58M22m6l21O4K55m12j91M28O65
5368G40q07k10K55L54k80k76L95K57o80k15P56Nm70l4N13j30n48k2R09l44n49
5389c81L15J96l9n30M78N26p05o62O52Q19m20m52J45J32n32J99J022k94j051J18
5409d64O78J27l58j38N22n35m31M86J010o08q25Q8O91k16j17O14k54j024NR49
5429B00O67o88n75L15N8k99L09O94l96j211K86J241L5n13j38K5l84j23R47O96
$$ y = [478, 51, 69, -179, -520, -14, 686, 599, -170, -298, -46, 221, 27, 584, 224, -427, -703, -206, 292, 139, -25, -82, -295, -338, -24, 588, 461, -426, -537, -17, 159, 183, 220, 9, -465, -419, 144, 757, 320, -569, -433, -16, 58, 52, 310, 203, -459, -566, 548, 307, -228, -331, -67, 19, -317, 78, 472, -71, -293, -209, 316, 170, -197, -130, 293, -173, -169, 109, 449, 28, -168, 178, 115, -293, -167, 498, 381, -382, -124, 298, 252, -69, -5, 250, -162, -353, 75, 740, -67, -277, -22, 332, 52, -224, 171, 428, -252, -467, 289, 294, -176, -210, 303, 173, -375, -397, 512, 168, -381, -66, 130, 91, -439, 39, 565, -140, -802, -150, 669, 249, -203, -58, 74, -458, -259, 763, 469, -582, -464, 214, 341, -17, -155, 367, -168, -599, -113, 897, 289, -536, -448, 243, 27, -90, 524, 270, -754, -749, 200, 867, 179, -396, -81, -23, -322, -13, 681, 285, -926, -640, 601, 636, 123, -15, 10, -374, -497, 450, 1146]
5449A146j222p62L88O98L70l68j01k82q86L98J510j00r46m50M15M92l62M02J19
5468D59o76p65N47J192k8p49l21Q4K6K20O88j65r35l37N41Q60r3m47j4m00k04
5489e17K88J316l25j254m06P71L59J15J08j76q10m28R57J165n06r69k07J77L23
5508a9L16N27m97j126k04J109R94n70n95n14K94k32R16M96p91j126K55J083L85
5527G01j85m73k75m67L27P00O23n59j106K22O92J01K52l14m95m81K02J108L92
5546I65o57j030J84J14N00O27o3q42p68M81R83K23m13o40l08J06M27R10j06j013
5566c20m51K66R97J77m44l41l52j34O88P16j14q55l58K16L07L06K25k48q71j55
5586g45P82P10j98n89l30j73J73O09M56m99q57j4O34N39n1k78k93k94K2P85N69
$$ y = [1146, -76, -838, -450, 248, 618, 250, 149, -133, -1019, -621, 889, 789, -157, -607, -192, 300, -62, 340, 459, -217, -982, -435, 757, 729, -20, -341, -257, -231, -11, 677, 512, -423, -760, -219, 641, 548, 101, 87, -313, -517, -229, 1087, 762, -492, -898, -127, 232, 347, 455, 279, -531, -959, -2, 1163, 657, -312, -519, -342, -19, 297, 824, 327, -799, -1003, 106, 1100, 530, -65, -579, -285, -517, 399, 895, 104, -1022, -767, 316, 701, 516, 43, -232, -699, -372, 328, 951, 392, -714, -492, 200, 301, 553, 239, -256, -737, -535, 573, 965, 308, -722, -538, -424, 76, 703, 640, -202, -970, -489, 494, 717, 304, -336, -644, -538, -111, 799, 693, -320, -771, -505, 492, 669, 225, -116, -468, -602, 86, 802, 688, -167, -525, -309, -2, 304, 529, 281, -590, -745, 37, 747, 549, -40, -370, -543, -370, 239, 695, 196, -661, -675, -41, 498, 447, 169, -124, -418, -396, 389, 958]
5607I58o92p37n1M85K69J18K06q04m05K82R11J28n31o03R3L30R8L62J7n98l97
5628e61L56P90j38m68r8m3k7j24N74L66q36l98N97J37l7j9J68l49l55K06Q29k97
5650B73n95N4Q2l1J01K49K92o12l20N43M19j42m28Q1j7Nl46Q03j74n17RN48Pn54
5674b70J45K89q9m48L63L22l86m23N24L28m56k97L07N18n64j20N59J08q39K34
5694a95N81jq43J9O83J96p11J73K45r3n40M40M54m20m06K56M96l35k84M80J6p84
5716e73O3P21K63o53k49N52J08o34L34M82k82o95L13O72j16l33J49K39n32l00
5736d71Q53K06o44o07L27O88j52k74M09l08n90J45R18J09r70j81N55J42m74O69
5756C50J31o73p37P35R32j69q14J34k6k8j3P78n2r49m17Q87M20l43k13J72k96
$$ y = [958, 266, -471, -522, -37, 232, 350, 556, -248, -653, -371, 540, 668, 137, -466, -373, -43, 55, 417, 434, -164, -561, -205, 585, 447, -21, -119, -162, -189, -313, 261, 627, -209, -607, -10, 127, 90, 71, 239, -110, -465, -259, 570, 273, -322, -268, -186, -217, -116, 133, 425, -187, -507, 36, 455, 313, -115, -34, -51, -46, -392, 411, 237, -280, -271, 277, 284, -270, -125, 164, 75, -373, -10, 312, -74, -497, 27, 355, -101, -398, -91, 427, -137, -257, 302, 410, -429, -195, 386, 385, -458, -439, 244, 440, -271, -98, 147, 54, -486, -46, 408, -12, -418, -162, 334, -1, -285, 195, 211, -573, -510, 211, 474, -179, -428, 124, 232, -402, -68, 414, 132, -563, -250, 422, 306, -27, 122, 361, -171, -471, 382, 588, -56, -663, -336, 352, 200, -74, 335, 27, -563, -418, 500, 609, -361, -542, 13, 155, -319, 350, 481, -192, -929, -194, 738, 569, -245, -111, -137, -165, -178, 600, 548, -401, -818, 69, 489, 146, -67, 105, -191]
5777a91m52L17J328k97j145j71O77M1n5J39mn95m70J169N40m15r77J85M01M8J84
5798B57L85l38j062M7J174M18p94l91K70k41p6O52N35p79q92J46J114O6m87l4
5818c0n7m24O6J147K41j065n04K48O24j17lK58m36p47L62R66L60r57l79L15L0
5839a02k9N79K98j030n38M24J102Jo56k66L9l53N38P10j03r77n89P63O81k09o1
5860B22k26m33j53O28J018m96j163k3O46J52o2K92j16r00j0P88N79n91m60MQ5
5881b19j05N42N44n12q57M1P44N35m00m58J51n60J98P15M38o30p60Q6P05J6J64
5902C78j1n20k75j00R20J24m20p81K99K58R0K44J30n79o12P98M79m4l60q4j95
5923b61P4J64N42j64l69o10N28L87j3j34j38j64l20N72L45m02k11k88N02J06k33
$$ y = [-191, -643, -326, 1002, 705, -440, -611, 66, 107, 52, 191, 187, -408, -878, 291, 831, 416, -561, -376, 25, 73, 257, 642, 304, -758, -711, 463, 881, 87, -304, -34, -275, -351, 301, 836, 57, -835, -689, 425, 491, 4, -30, -87, -511, -445, 702, 943, -122, -626, -378, 246, 129, 126, 384, -52, -799, -437, 529, 889, -68, -447, -132, -102, -131, 448, 746, -284, -822, -398, 704, 705, 49, -217, -178, -531, 7, 717, 614, -363, -952, -189, 492, 283, 222, -4, -437, -590, 38, 1056, 560, -603, -626, 20, 172, 110, 402, 286, -614, -624, 164, 743, 152, -308, -304, -219, -324, 218, 762, 250, -607, -566, 178, 713, 313, -145, 6, -554, -356, 359, 797, 167, -593, -507, 198, 214, 378, 367, -153, -428, -528, 392, 516, 96, -685, -386, -128, -38, 206, 336, -243, -855, -57, 422, 378, 18, -66, -261, -187, -23, 519, 355, -14, -624, -96, 291, 278, 144, 6, -158, -478, 94, 439, 37, -174, -462, 40, 146, -87]
5944h7L02j20m54k8L75M05k47m43M08j78k6K09K95l47k76o5M72P5j93r3q6p4L5
5967a41L26M2k83m13L93K03j30NK0K02l32k01M65O0m51O2L93j20k28J84R8o8k01
5990a15J37J99k02k91L72R2j38k66M33q8k37RK27K5l33j14M85R2m95J71J90r0
6012F3m36M06L48l65l30PM38J9k81K4M75o86Q6L88K12l45m37K19L30l13R3N21
6034D36k91o19K67N26K61j006J13L90Oj98K99J51m50o14P47M07k47l23m1L64l08
6055a30R9M66p6q18N9M24M39n74j28K77j37k86L10P94m36p76J74M08p1k03M92
6076C07K5p20j69N93O27n32n64K08L84l21J20M99j28q89o7R13L23o17k03K62j57
6097a06o0K57P49r57m83J60P48j9n38L27m5n01LR07K48r15m75M47M34L1j08K73
$$ y = [-87, 215, 95, -359, -387, -12, 393, 146, -297, 111, -67, -93, 116, 411, 64, -212, -277, 195, 270, 77, -16, -102, -176, -141, 185, 227, -56, -469, -76, 127, -3, 2, 22, 224, -108, -309, 156, 216, -235, -173, 220, 100, -128, 56, 154, 86, -115, 22, 221, 19, -272, 100, 192, 54, -212, 221, 133, -104, -95, 132, 157, -176, -290, 195, 287, -208, -37, 153, 63, -373, 33, 381, 16, -314, -307, 131, 150, -131, -107, 368, -318, -232, 156, 368, 23, -414, -195, 135, -178, -85, 436, 145, -474, -207, 319, 580, -426, -313, 77, 83, -115, 184, 335, -115, -729, 18, 425, 178, -145, -186, 178, -130, -31, 435, 359, -459, -400, 24, 463, -111, -239, 38, -99, -385, -75, 719, 283, -493, -319, 89, 18, -185, 307, 332, -388, -557, 36, 663, 131, -433, -225, 159, -162, -42, 457, 329, -560, -627, 286, 609, -8, -211, 51, -106, -166, 91, 840, -117, -600, -440, 308, 289, -249, 78, 33, -468, -465, 442, 690, -225, -700, -253, 181, 212, 104, 377]
6119C77k89o72K97P77K5q39m5N07j27j16N41K22r01o03O75P70m39m23L10k13m1
6140b07q3Q85J0j185j54O94M01l20j9P9k81m62P05P25o14p55J20N38J02j97J91
6161A73J86p19l74R13M21n28m26L30K29l70P4N12k20p74J63N97K76m91pK27l31
6182a39l34P62K32m34p51M32O36l56K8N0L7n15r7Q04J92o95j60K21L56l30K12
6203A51N3k41o02N02P47m79l12N5J70j32K8L45p0l95k75N25L54m17p0K47j10k74
6225b00L0M20k1l89l8N12k73j78L23L14m59l52K17L66j82j98J90J63m20l3N68
6246C60r5m54k2N28j83k74Q7J02o7k81L76J82k27k19L70pj10l9K5O4k41kM53j80
6270A46l51R1M66p1l75oK01k45NJ06J07k37j16L97L80m54k86K39P7j22j33M44
$$ y = [377, 88, -584, -287, 490, 515, -324, -369, 138, 11, -105, 436, 658, -243, -846, -171, 599, 160, -263, 47, -166, -207, -290, 595, 605, -580, -734, -40, 361, 41, 22, 101, -180, -642, 63, 788, 174, -581, -461, 77, 179, -18, 173, 359, -360, -734, 179, 600, 72, -354, -24, 205, -165, -91, 421, 201, -573, -410, 187, 463, -28, -35, 192, -139, -473, 289, 521, 87, -664, -232, 404, 48, 76, 126, 163, -352, -449, 355, 547, -148, -308, -87, 269, -61, 151, 204, -37, -639, -137, 610, 131, -181, -126, 44, -88, -60, 285, 215, -180, -455, 70, 424, 7, -63, 184, 74, -200, -170, 250, 229, -160, -198, 314, 41, -137, 186, 500, 41, -311, -94, 272, 90, -108, 82, 245, -175, -208, 360, 265, -189, -211, 317, 134, -140, -53, 49, -18, -299, 77, 259, 32, -187, 183, 176, 66, 27, 52, 116, -125, -127, 326, 146, -205, -114, 352, 281, -94, -100, 101, -144, -139, -33, 74, -163, -279, 118, 498, 44, -242, -3, 74, -48, -181, 263]
6292B63q9m30mM96J9m02j10K01j54m8L18L39l45m39J64L42Kr9L3m7l88L55L02
6315B79J11n34j20M66j54o8j7K54k98l45L08N22p9m47j29K27j16J5M22J97q00
6336c06k27N46J72j42k44J30P1k61L51M94m06m65j24N46Q8q5j97K05l83j74M23
6357A2N78n70m55K95J33p4O8L42j92n11j21O58J65m11j32K39l11J90L56M00n53
6378A06p22K21P70k2l03r1p3m6p6M84O11r03m79M47M01q4j34L3l39k63K60P57
6400E55j12p38k81L21M24k39J22J78k79l93M15M23j89l88n1L12j81J56L65Op77
6421c51k47O61L29l49r3J2l5l12K59O23l47l55k84P13J40m21K10J14n69k76O58
6442H0N23m39o66K60L18q9N2K52j66m37K8N11K75o94k3M06k24k40K84M26k86p85
$$ y = [263, 174, -256, -260, 236, 255, -147, -257, -56, -210, -258, 60, 399, 54, -385, -221, 121, 123, 24, 57, 10, -378, -23, 279, 390, -144, -264, 202, 48, -20, -37, 217, -81, -426, -118, 404, 325, -122, -251, -24, -140, -125, 297, 494, -306, -533, 13, 185, 43, -201, -71, 0, -261, 90, 584, 178, -287, -411, 135, 223, 138, -59, 146, -237, -411, 12, 590, 20, -435, -140, -7, -81, -13, 329, 137, -374, -495, 163, 328, -83, -215, 24, -287, -97, 259, 659, 106, -616, -395, 375, 353, 50, -41, -114, -160, -236, 248, 859, -44, -523, -76, 325, 241, 107, 140, -199, -462, -202, 555, 443, -295, -576, -255, 169, -70, 52, 230, -49, -442, -27, 396, 207, -181, -232, 80, -101, 55, 420, 426, -351, -598, 63, 392, 43, -50, -38, -73, -385, -126, 497, 150, -205, -489, 224, 364, -57, 153, 267, -302, -578, 80, 603, 164, -502, -242, 76, -13, 39, 291, 125, -312, -284, 227, 502, -192, -215, 191, -33, -273, 11, 437, 151, -634]
6464f34L38M59J35l35j02K25j64j15M51L48o33l55L71L61j08j43R8j08n63K87
6484a87M73N3o14o4L64J03k25J61Q5j74m00K14N65j08l38N1j9k39J11L59J92n69
6506b06k11O03Jj90j45J12K33m09J63K11J7m18J92K19o5n32M28L81l78l21L17
6527BK68l79l1N7L92m76L2L71m6k28j92M52j48q6pK81k32k68J71K64l01l2O9L11
6551B44j70l24L72J35k66k81J91K42j67o0M20k75k46l3N24j24m18L89J10m11j47
6572b95M12K52k93l53J68N21k55j04J78j39l36O2M07J00n70r0M25r6q0J85l6k17
6594a54j07J34M45l17q8K18L0l29Q2M57n0n87j6K96K80k30ppk30j87J51P71m17
6617A38m46j8M08j94L6M43k65n44j16O54L02k96l83K34q5L8J98L79j99m98j22
$$ y = [-634, -296, 163, 298, -37, -139, 86, -78, -193, 258, 606, -27, -382, -11, 350, 242, 99, 197, 89, -474, -187, 286, 339, -275, -339, 25, 128, -97, 64, 149, -25, -425, -211, 354, 246, -92, -41, -60, -299, -188, 171, 363, -206, -417, 186, 187, -3, -148, -36, 197, -212, -49, 162, 179, -239, -47, 172, 107, -425, 3, 384, 6, -315, 2, 270, -109, -140, -83, 309, -167, -135, 236, 190, -38, -230, 222, 74, -12, -19, 262, 30, -238, -67, 197, -104, -136, -67, 244, 74, -250, 122, 257, -9, -290, -99, 143, -24, -84, 336, 61, -185, -218, 306, 182, -236, 153, 263, -148, -295, 117, 369, 76, -277, -109, 412, 157, 53, 231, 92, -244, -182, 225, 325, -245, -335, 90, -6, -86, 99, 63, -154, -261, -127, 318, 1, -87, 131, 161, -168, -86, 371, 321, -266, -282, 14, 294, 64, 57, 50, -180, -367, -216, 555, 138, -308, -326, 82, -112, -76, 367, 102, -442, -558, 96, 398, 102, -281, -47, -132, -94, 104, 483, 284, -214, -336]
6638c36N54K20m14O2o5k22r3M70L12m02o10L98K22k9M6K45l69n62K47N82K44n54
6660e4j32R7K7r4L38L24o42m83K63Q52j14l60R2j6m11J65N21J66p81k14M25L16
6682B85K1k70K76o25j93O98N16l32n76k38M20L00k90K57j6n21l66P27N04m18m67
6703c08J00Q2q0J97N63l52l63m52R05N2k37l03O2Rk33M74L76n30l93R1L25K84
6725B69n7l8k39l51L4P09K04l20p08L72K72Ok0K53m82n74L24P33N4n06M8k34R5
6748a56Q9L47R4n62n17L71N48R1l60J4l3l04J49M83L04q07k45L99J48PL5L32n99
6771a72k04L68N32o5o02j30L02q8J07K13r5m17m99O57M87k35l38o6R4o1J75M58
6793D21n0p75j4N94J97m24p6J51j32j18L06M99m52m93J78J53K53r9J00o9m54m9
$$ y = [-336, 218, 438, 24, 86, 21, -201, -294, 176, 488, 86, -524, -126, 96, 67, 113, 358, -11, -573, -326, 256, 500, -54, -186, -89, -62, -156, 182, 506, -136, -619, -356, 496, 382, 22, 114, 98, -313, -148, 373, 539, -242, -456, -31, 285, 306, 36, 312, -313, -506, 192, 708, 376, -200, -438, -18, 282, -8, 249, 233, -288, -654, 73, 577, 159, -308, -208, -126, -206, -9, 554, 202, -161, -613, 292, 344, 107, -196, -134, -125, -358, 116, 492, -38, -431, -340, -15, 269, 212, 174, -65, -416, -382, 327, 531, 211, -497, -125, 147, 153, 133, 386, -96, -670, -346, 387, 441, -65, -17, -251, -156, -67, 280, 374, -188, -705, -334, 214, 305, -55, -41, -74, -378, -229, 254, 558, -249, -494, -95, 53, 60, 95, 427, -172, -376, -8, 524, 459, -143, -273, 29, -59, 48, 261, 166, -251, -750, -93, 394, 159, -179, -245, -151, -212, -37, 421, 371, -404, -418, 176, 373, -51, -127, 24, -108, -226, 80, 579, 127, -366, -188, -35, 218, 119, 219, 150, -304, -353]
6815c53N47P8k23l16J97q8r9K78J02r7k75K7L22J45l74n0J69j27j41M96J37k12
6837A43m48J37L48j84k09L34o8j79r1L76J35m67O2K31k01l6J04J74j13l54L48
6858D2J40j80k55J44K79r4k99L14M7k01j11J80K04l60P2K54o0l03J31J60Q0k60
6880g6r1N24k96j29k0J88j03J05m7J21j55j65J53K42m04j38M87o3k85O6K04j15
6902Cj14o0N12k17m44L42J06l12P4J76N6k81m9K35L32l28l44L21P6j35m5L67k28
6925D3k89M8J91K51k86Nn3l4K50qK00m06o6J00N9P8j82K38n0k73K4N40p6l32j40
6950a68J26J43j61K18N0m70j78L98L47k54k27J81J8k33J39K71p7l45l60M75L46
6971B39m1p4r4j40k75M65M21m40k77N3J57k1K37l4m4m74p4N23L68m09r8m2Rk9
$$ y = [-353, 194, 272, 49, -267, -70, -158, -257, 21, 123, 26, -249, -222, 100, 245, -129, -179, -10, -137, -278, 218, 355, 143, -305, -168, 180, -4, -213, 121, 53, -126, -217, 159, 294, -173, -111, 120, -81, -117, -13, 161, 48, -306, 42, 182, 2, -253, -109, 170, 76, -223, 91, 138, -63, -174, 6, 210, -150, -78, 176, 116, -187, -56, 104, 184, -76, -167, 357, 61, -68, -88, 100, -3, 102, 55, 176, 21, -144, 9, 251, -153, -291, 196, 133, -152, -86, 118, 3, -111, -171, 341, 124, -320, 22, 128, -184, -110, 66, 122, -159, -208, 27, 359, 31, -313, 8, 84, -51, -96, 271, 43, -246, -198, -7, 244, -42, -37, -90, -124, 126, 118, 318, -88, -154, -54, 5, 83, -99, 139, 89, -184, -160, 380, 304, -28, -168, -42, 101, -60, 158, 208, -262, -440, -42, 305, 51, -176, 5, 23, -210, -71, 200, 123, -222, -582, -107, 239, 198, 124, 30, -110, -385, 80, 501, 61, -216, -163, -6, -27, 210, 176, 132, -342, -416, 107, 475, 66, -32, -74, -65, -94]
6995i4R2L37j56n03L3L97K53j82k57Lk10r5O23L03n77l74qN21O4j37L57l27o13
7018e50K08P42J3p20J0K64J96j98R5K79k48n47K66N55j38n42P2O5J3k3N91q8n90
7041b75j98L91M94k33l15Q9pl90J84Q63k63o52j5L39J18j5M4K13o99j37N01L43
7063C80q5o45J60K51j58J1M25j31o05j88O68M40m17q7j28j29J42P4M48n0r01J36
7085c89M82K06k93m2J65k96j33M69K99m87l28J98K26L2o4L06j97m64M6N08O1m50
7107a45j78K57j8l0L37J32m05m44L69L83P3k52p4m6J0q7N76j29o41j52N48M9J1
7130A44k75J60j19k22L81K61k8n99O1L15k5j09N8J57k15k78L23L18l41k83J30
7151a86K67o9O4J53J64o76j21N31R3j05r0r5j75j33M24L75k04n82P9N75j30p3
$$ y = [-94, -2, 335, 179, -324, -291, 106, 359, 177, -80, -77, -287, -382, 241, 544, -33, -407, -415, 106, 170, 33, 390, 63, -550, -342, 400, 413, -307, -297, -33, 163, -35, 60, 339, 91, -456, -190, 365, 227, -315, -243, -178, -165, -188, 403, 315, -275, -473, -82, 412, 179, -136, -47, -54, -444, -260, 603, 340, -312, -327, 12, 130, 115, 159, 372, -327, -464, 37, 380, 295, -350, -190, 61, -97, -86, 339, 208, -397, -585, 83, 523, 106, 19, -109, -238, -96, -22, 426, 376, -525, -389, 93, 299, 6, -36, 129, -167, -300, 169, 468, -19, -347, -149, 77, 109, 45, 351, 154, -310, -264, 244, 305, -145, -323, -66, -84, -114, 223, 355, -50, -494, -125, 258, 331, 79, 5, -41, -31, -118, 458, 329, -312, -464, 84, 133, 144, -131, 29, -90, -312, 69, 330, 302, -297, -236, 79, 54, -55, 3, 160, -55, -333, -10, 308, -33, -316, -186, 81, 12, 76, 229, 393, -283, -404, 127, 220, 115, 25, -70, -245, -378, 46, 421, 217, -365, -286, 289, 159, 86]
7173H6q7J34l36j95N74q9j99j32J75L37k49K0J30j70j68O0J10L16m32k67M44j06
7195d4O9O5J5k13j99M8L51M2k32J7J88l59Q7K33J06k10r9J62L0n0r9J96m6l85
7219c27M18J50k52J68k23J04j79J94Q4K6l85l2L82o1k44J31J4K2o0M2J8o3k96
7242c69M37n5Np4K2P0n2j06J03K3j57J35L65j03n02J63K68j21k87J48J76j36L2
7265a5R9O8j21l74J86K02J01l76K58K46l46j17R9K02k99O1L07M5l32q2L68j70
7287A0j62n7M06j36k42K39k9N4k65J82K08p9k73M6M3O5j78K60ll13J31K89q1q3
7311C2q4l1J59k65M44q8j81l37K09M03k4k05j22L09k48p8M47m9n09pK29J42j5
7334A31l53K46j6j65J48M07j72k97j59K65J09k29L10j87J15m09L66M34m83l19
$$ y = [86, -1, 133, -203, -398, 176, 87, -112, -244, -69, 268, 19, 39, 169, -1, -169, -109, 1, 317, -115, -382, 62, -44, 25, 90, 105, -108, -307, -259, 92, 134, -98, -81, 107, -252, -165, 68, 174, -36, -135, 27, 57, 7, -92, 104, 58, -327, 91, 241, -11, 157, -66, 38, -141, 53, 137, 163, -222, -254, 128, 67, -177, -46, -32, -10, -70, -28, -10, -73, -369, 68, 13, 18, -56, -34, 36, -16, -122, -19, 4, -153, -18, 347, 244, -258, -95, 173, 52, -235, -87, 89, -47, -15, 84, 152, 31, -343, -157, 45, 146, -230, 28, 274, -72, -189, -90, 112, -187, -126, 181, 226, -106, -188, 180, 10, -152, -209, 197, 61, -181, 58, 29, 83, -182, 0, 208, 129, -144, -98, -55, 10, -168, 92, 89, -224, -93, 196, 115, 32, -52, -83, 76, -189, 255, 167, -14, -351, -142, 261, 237, 32, -90, 219, -29, -107, 340, 291, -218, -225, 4, 146, 131, -222, 24, 8, -157, -9, 398, 226, -71, -230, 35, 144, -85, 225, 38, 153, -256, 110, 544, 61, -258]
7354b58K96j64J71Q7J13j80l97%L79K29k04j46r2J68r1J89K39l48l25J26M08j44
7376E6j39J86k03j07K7N14J16n59j53J70L4o8R5K21l05j85M1O15j27l24j07J97
7398eo0N2J63J42l75l52L40L86j8m22m7O4J07k5M16k07k16j46K18L00j88j04O0
7421H3o5l43J48M43Ln49J96J12k40J49K41j83l01Q4N08M4k22n02L16J77j14MK43
7444B32l2n24O7N30r2k69kR7J7j09K68J36l21l35M24J26k42o1K17k6l14j53N28
7467A62j0r9m51K32J70J0J49q2j56k19J65N07k14l04J41K4j88K51l2R5l46J8J59
7490a8M57l73j79p9J00K5m0K36r7k83l3L85q3j92K9J50l2l09M55J18k19j99K40
7513E9O4m1O4m9k2l00J70J38K74k95l23L50q2j11J19J21k67k13J79J84P4n8K5
$$ y = [-258, 38, -126, 45, 132, 245, 65, -332, -332, 47, 276, 72, -74, -166, 2, -89, 100, 339, -9, -334, -208, 200, 56, -83, 103, -100, -207, -180, 334, 450, -109, -262, -92, -58, -126, -31, 190, -115, -300, -259, 356, 229, -95, -202, -5, -65, -13, 150, 292, -83, -435, -95, 291, 273, -149, -196, -132, -25, -50, 366, 159, -57, -203, 15, 315, 127, 23, 83, 18, -325, -177, 266, 269, -280, -84, 28, -212, -63, 178, -5, -306, -222, 286, 330, 108, -394, -78, 99, -15, -11, 232, 200, -324, -257, 273, 181, -88, -90, 7, 24, -85, 183, 319, -2, -337, 87, 213, -29, -90, 127, 101, -213, -366, 162, 152, 53, -398, -166, 4, 14, 163, 81, -75, -294, -129, 378, 164, -140, 1, 25, -163, 88, 56, 151, -195, -177, -18, 439, 66, -113, -192, -92, -67, -107, 129, 32, -251, -284, 101, 18, -174, -145, 5, -27, -336, 119, 237, 18, -181, 59, 123, 82, 146, 97, 75, -225, -55, 83, 357, 62, -261, 89, 7, -104, 15, 136, -131, -344, -165, 19, 93, 35, 60]
7536F0J44j40q8N4N3n5k60M50j0l40J87J41o4j49JJ05n9j38L0K14j04k62J05K96
7560A71j11k21J52K96k51k65K87N0k07q4L69n1k26K1L13j52j48P4J4j18j5Q6J59
7583A43j81k43L34J29k92r0N3J22j9q4K19o9o8P2J05R3k87J4K21k42n0J44J18
7606A42k11j72R2L14j27k26J16J61j23q1K63K18n81JK75J17k11J06l3j4n8j9L40
7629B89j7n74J41L23k64J13J98p1k95j51N88N2m08l1P5PN1j2J76j65l36Q4L35
7652A08K26k83j07oj63ML36R1k44k89K62K40j89Q4J7k23p9O3M28j03n7k21J91
7675H6m0l3K68j93j10j45N4K82n4k33m7J41k3j12L09J63m46j51J09M25j83J32
7697A99l20K17j72L0K45j29k74j30K81L23j76j29K36k69j91L11K31k5n43J48K63
$$ y = [60, 204, 64, -24, 30, 83, 28, -232, 218, 208, -132, 55, 196, 132, -17, -16, 89, 30, -108, -78, 136, 32, -230, -125, 171, 60, -161, -9, 287, 36, -229, 58, 108, -99, -183, 186, 135, -91, -70, 243, 91, -57, 17, 31, -87, -102, -16, 143, -38, -281, 53, 182, -110, -200, -147, -25, -44, -128, 91, 22, -46, 26, 131, 224, -63, -49, 172, -70, -120, 24, 142, -69, -241, -149, 165, 38, -188, -72, 89, -34, -115, 148, 366, -215, -214, 61, 178, -33, 73, 40, 26, -32, -51, 289, 272, -302, -161, 162, -102, 11, 209, 138, -157, -308, 280, 332, -76, -107, -32, -25, 26, 14, 190, 25, -311, -227, 108, 334, 51, -56, -62, -225, -221, 115, 206, -38, -327, -65, 175, -14, 70, 87, -136, -215, -152, 276, 173, 116, -105, 86, 46, 13, 281, 88, -22, -167, -113, 169, 115, -118, -165, -24, -47, -159, 150, 313, -133, -284, -175, 250, 67, 199, -121, 96, -76, -46, 199, 70, -204, -334, -53, 270, 94, -35, 201, -68, -259, 52, 283, 258, -285, -137, 126]
7718A26L2j11J9L0j91j43L97n9n8k13L14j29j14L8J79r7l85K80K59Q1k65o3K38
7741A65k68K2R7K66l80j22K68j0J13k84J83k22n5L7L14P0j23l64M11k6j73J92
7763A11M3j73l47L30K12j75j57K9O6P5p9k7K95l64j7L27l2k4j89J39k1j08%J85
7787I9j85O3k1J15j55Q9j86K47kk08J22K60j68k42K57p4j43k4M72j73l42R5K04
7810A00L9k93K61j03Q5k82J93J25j62k35K40J50l9j24k6K04N3j81j40N9k5R5J0
7833DM4k37j38M17J29k72J29K3o1r1Q9K5r0k44K32J79j91N0Q0j2k32R4J30J39
7857A96k23k25P2L79l35K70M4k08k9L7J05L4j03j34K69k66j4K53J23r5k67K7J45
7880E5P9j26O3p9r7J05J53R0l20j42J35J31j10K8R7j13j85K63J81qk85L8m1M8
$$ y = [126, 158, 47, 66, 96, -95, -238, 159, 100, 42, -171, 143, 14, -100, -62, 117, 20, -365, -85, 174, 255, -10, -73, 165, -103, -81, 16, 282, -98, -220, 48, 38, 151, -133, 50, -172, -227, -190, 124, 194, 71, -293, 118, 92, -81, 111, 154, -19, -366, -36, 176, 1, -156, -127, -61, 14, -65, -92, 203, -161, -178, 149, 117, 93, -96, 43, 22, -86, -86, 99, -86, -23, -44, 71, -84, 5, -181, 66, 64, -144, -22, 238, 70, -172, 85, 11, -132, -156, 316, 143, -199, -104, 100, 139, -154, 107, 4, 89, -193, 0, 125, -37, -272, -32, 118, 79, -45, -71, 133, 186, 5, -135, -76, -101, -6, 4, 48, -189, -327, 90, 219, -53, 76, 99, 38, -53, 36, 61, -29, -273, -41, 138, -53, -3, 77, 65, -167, -73, 57, 196, -27, -252, -180, 199, -136, 134, 178, -30, -59, -22, 83, 117, 14, -120, 149, -117, -131, 122, 245, 150, -117, -90, 55, 134, 8, 71, -8, -105, 0, 153, 243, -77, -219, -84, 47, -63, -35, 62, -51, -236, 27, 208, 200, -85, -47, -88, -40]
7904d0RJ79k9l21o3K05L66k56r7J69k36q7K46J93P4n64O3K16K2K6P0j08l11K7
7928b47M70o7j64j21o2R7J23M4J01j16m98L84L24k4l04M4q7p8J20L84o5k01l76
7951c19K10J58J23r7k6j16j13J38K93k40p4k64L35K57j34M3n4j83j77J41M81k56
7973A26j44Nj93J03K97o6J5k48k04L35K22pk26K4j81j05K95K35k65j77m1J79K39
7996B18k67L36j44m60J66K79K11r3l43p7K79l7L2j79J64k61p2M16L2k35j17mN6
8019a00m2O2K87j42j27j55L69n6j08j8j8p4kK41J10l03o3%K40J0JK2j76k22J12
8044a52K93J4j33j5OQ7m4o9J59j57k02K34J16j51k58J70J89j47k1J18J7k22L7
8067a31K85o6j41R6j26R2R2j40Q5N0k07J09J08q2q7J39J85m30j69K31K05J9j89
$$ y = [-40, -31, 148, 119, -202, -265, -60, 306, 50, -47, 122, -114, -201, 45, 238, 312, -252, -189, 27, 49, 75, 145, 37, -274, -247, 223, 156, -8, -129, -191, -94, 29, 73, 174, 58, -440, -56, 268, 244, -60, -16, -103, -181, -61, 323, 258, 57, -319, -109, 49, 172, 75, 49, -67, -180, -42, 251, 11, -63, -327, 8, 265, 131, 174, 120, -63, -240, -99, 382, 126, -18, -13, -206, -103, 194, 128, 143, -105, -309, 26, 248, 241, 15, 39, -142, -247, 48, 283, 18, -159, -200, -21, 218, -49, 287, 143, -317, -151, 128, 339, 246, -97, -174, 105, 68, 100, -79, 85, -176, -248, 168, 200, -35, -152, -156, -100, -142, -80, 207, 65, -62, -217, 152, 96, -12, -30, -48, -122, -124, 117, 227, -76, -139, -139, 101, 111, 112, 134, -42, -264, -152, 141, 155, 22, 7, 13, 100, 56, -13, 146, -11, -213, 21, 137, -14, -272, -102, 87, -60, -81, 37, 54, -168, -131, 154, 88, -53, 43, -83, 9, 101, -39, 46, 96, -111, -2, 106, 24, -63, 76, 261, -169, -338, -107, 98, 117, -72]
8090g2N9J34k62J53J95M3m26J2L22L2k06m1q1J36r2J2J99o4k98K76K2j75l4J58
8114BK46l6k27J21K1j58M5L07j42k24j91L61No0J7P1j42o7K5J76j49l27K74K35
8138A83j09j83K9J07k06o2L65Q3l91J00P2K2j5k9J79j30j93M7L60j75j50l3J97
8161F8m28M00k8kO9l47L21P9M3k34J64l31N4J47L43j99k83J00M3k00K91J70k50
8184a0j32k47N26K54k77j89k04
$$ y = [-72, -13, 121, -141, 12, 207, 250, -176, -164, 158, 190, -16, -57, -138, -2, -94, -82, 117, 53, -245, 31, 53, -122, -156, 2, 248, 212, -15, 106, 127, -31, 14, 321, 179, -45, -236, 125, 130, 70, 87, 158, 16, -51, -26, 150, 1, -326, -52, 183, 74, -109, -80, 27, -179, -241, 124, 207, -184, -84, -12, 10, -5, -34, 145, 15, -178, -131, 229, 54, -96, -129, 68, -360, 40, 12, 10, 79, -268, 53, 132, 175, -59, 105, -226, -172, -25, 318, 119, -164, -64, -21, -221, 70, 240, -10, -142, -389, 137, 391, 114, -75, -279]
8191b79
$$ Imaginary data points
##PAGE= N=2
##DATA TABLE= (X++(I..I)), XYDATA
0@%%%%%%%%JrJ6j6K4l2M0m9N7p2Q9j13J36j60J92k25K66l14L64m21M89n65O47
31C45p39Q40r50J074j213J366j533J714j915K136k374K635k921L235l576L945
47B069m353M801n289N825o417P072p800Q613r523J0554j1735J3097j4688J6582
61H808j8877K1725k5371L0227l7057M7433o5271J04183l36134K28525M69631n18114
73i0292Q2997J04665k69315L5544K90844r3953p885q2866k09015J88637K45945
84A95306k21733N0295J36984l41438m8802M14862n5173j89678N4269j11991M685
95a12414K76515r5167j45075J60546j43680k06915L43194J52108k92157M914R9299
106D1168j46443O1119J42439n1410j5003j11427j33155K70814J66579k63469n268
$$ y = [0, 0, 0, 0, 0, 0, 0, 0, 0, 1, -8, 8, -8, 16, -16, 24, -25, 32, -40, 49, -64, 72, -88, 104, -121, 145, -169, 195, -226, 263, -302, 345, -394, 446, -504, 570, -643, 723, -810, 904, -1011, 1125, -1249, 1386, -1535, 1700, -1876, 2069, -2284, 2517, -2772, 3053, -3364, 3708, -4092, 4521, -5002, 5552, -6183, 6914, -7774, 8808, -10069, 11656, -13715, 16512, -20545, 26888, -38383, 65800, -270334, -41809, 427822, -90292, -7295, 97370, -171945, -136401, 154443, 60490, 52605, -30261, -239276, -50639, 195306, -26427, 23868, 160852, -180586, -229388, 185474, 130301, -59377, -5108, -117099, -112414, 164101, 68934, -76141, 84405, -59275, -266190, 77004, 229112, -63045, -58131, 41168, -105275, -44156, 98283, 46873, 31870, -79557, -212712, 58102, 224681, -38788, -44056]
117d4056J41534k28274j6034L25205o5367k23585P1813Q458j2813J51430m0541
128F7770j06992O2737r3953o7042K43051M0467k15721J6920N9217o6835R4405
139C4024P3196j25941k3093J2029n2217J51020Q6262k15682j3678J51981j18347
150d0446m2741J91349l1310j54848L2796M6739K1359O1242n6790p3629M1817l7249
162d1711j0807J55143l1198j69516P4589P8945q0865M7459N5938j07763k6033
173e5819M7572j5455O5935M7972j31584k5547J21082l3407m7300Q0592l6245q3559
185f5763N4750L6896m667J9706n0090k9362O3965k0008l9528Q0826j1319j11717
197g6311N9386R0339p7070k4787N8985l1520k3584K7925j0577J6988J9560m9070
$$ y = [-44056, 97478, -130796, -146830, 178375, 113008, -110577, -38764, -30306, -43119, 108311, 67770, -39222, 23515, -70438, -137480, 105571, 146038, -69683, -52763, 6454, -60381, 34024, 107220, -18721, -41814, -29785, -82002, 69018, 155280, -60402, -74080, 77901, -40446, -83187, 108162, 76852, -77996, -45200, 1539, 22898, 84140, 27350, -46279, -4462, -41711, -52518, 102625, 71427, -98089, -23500, 55445, -25420, 22039, 77977, -29786, -55819, -8247, -23702, 42233, 90205, -41379, -66926, 54156, 20749, -26551, 54041, 17796, -65763, -11013, 25883, 21216, 40922, -9168, -38530, 25435, 5427, -34101, 46725, 35406, -76311, -16925, 73414, -3656, -28443, 30542, -978, -24562, 3363, -7214, 9774, 29334, -19736]
209a9736O233M6592m1061j2138O2626l3469o2958N6374L5319m1497L213L672j3665
222a0495L1178j6935m3454N3349K1817o6539J3478N2618l7375k0738M1093j3949
234D048l1098K7390J1117j6530j495j000K6652J4279o4987j1268P6470j0344n5473
247c2239L4178J9087m8488J5677N5699k3187m5670j767J2452K7203P987l2507
259a1575N949J7837l3704O431N0902j8473m7578N502J5027L032K4124J1801k7305
272A970k6429n116L2158M5419l7293o3583L8960M1968l7923J854M4524j8711m5578
285b7780J573K3249J3663L477r089j0435j2912j2882M5891N2888o3038p3851M5392
298b3854M5508j8036M653J4224k7262k7840J0511L6481K7073k4579n0036O28K7185
$$ y = [-19736, -13503, 33089, -7972, -20110, 42516, 9047, -53911, 2463, 37782, -3715, -502, 3170, -10495, 20683, 3748, -39706, 13643, 35460, -31079, -17601, 35017, -2358, -23096, 17997, 4048, -27050, 340, 11457, -5073, -6568, -7568, 19084, 33363, -31624, -42892, 33578, 23234, -32239, 1939, 21026, -27462, -11785, 43914, 20727, -24943, -26710, -14258, 12945, 20932, -11575, -5626, 12211, -21493, -15062, 35840, 17367, -30211, -24709, -9682, -6650, 17474, 29275, 1970, -24459, -29575, 2583, 48002, 10709, -52874, -13914, 28054, -9869, -8015, 36509, 17798, -27780, -26207, -2958, 10705, 14182, 5093, -5342, -18254, -31136, 14755, 67643, 4605, -69246, -23854, 21654, 3618, 8271, 22495, -4767, -32607, -22096, 14385, 41458, 16879, -33157, -32529, -5344]
311e344O826L3331J9971p3438n5017N4338O3452j685m1446l3278Q616J9778N081
324A185K4857J8012n7584n5386N0964N8300k0802j3500M018l6618j9411M4045
336a920N1278p109o6555l5216M8438M4931j1065o198p31m5973k5798O0199M9798
349E4079l0159m2832r143J5753J6512Q626K3271m302p4775l3945P9839O2871m0752
362B5043m8604M538L751Q34L5487K5385l4296n6989m682O0184L1813l1553j2272
375a361O899l1208j2473N8889M0711n0112n8921J8694M1460K236o077J0980j1901
388G816m9604m091P2846L0892n7306l5852K4870J2662j3905K0840L6614l6525
400I257o9100J7681P4029J5103m4430j8628J2145j3990l678N4088K6142o6631
$$ y = [-5344, 1482, 34813, 54784, -18654, -73671, -19333, 44119, 42434, 988, -32290, -23674, -3896, 1185, 26042, 44054, -13530, -68916, -17952, 40348, 19546, 6046, 10064, -26554, -45965, -1920, 49358, 42249, -24306, -59522, -11084, 33847, 22782, 16584, 15853, -30120, -55918, 4281, 54079, 23920, -18912, -28055, -12302, 4210, 12836, 36107, 31805, -42970, -76915, 2924, 65795, 25043, -23561, -19023, -15272, -14438, 21049, 46434, 12138, -44851, -49533, 10651, 42464, 10911, -1361, 5538, -25670, -38143, 20746, 61457, 11345, -47576, -28882, 12578, 14814, 8737, 19717, 7816, -41788, -45879, 26967, 57859, 553, -35299, -10429, 2233, -11672, 9168, 45782, 9257, -59843, -42162, 31867, 46970, 2540, -16088, -3943, -17933, -21611, 32477, 58619, -8012]
412h012n7400M3387N9066j6703k2405J5372k1552l7875L5811O5539j3588p3046
424c1406j7386N1756J7977k7082Q865K4556l7308m2038M8981O0315l4348n2769
436b9887J0388K1937n567M4K5429J351m9951j2702N9806K0499m8852j0586L3092
449A5001j4805l2488L0402L8492k2394l9624o99L3378J3927k3889K491J7841l6268
462a8635k0204N7212K6094n3048k6128L2725J5189j3828o19J3023K99k7208j2214
475b7342M2812J7397m5283n946K9533j6666j0414L5130N416l8186j4427K5124
487b852K5029r937l2010N959L3184j7137k4901L2464Q060l5364P970K0260j6032
500e307j918J6953Q9j0547j1829K717K7099j244l9869O100M0229j5695k2604K3094
$$ y = [-8012, -65412, -22025, 37041, 20338, -2067, 13305, -8247, -46122, -10311, 55228, 41640, -31406, -48792, 2964, 20941, -6141, 2724, 27280, -10028, -52066, -3085, 57230, 22882, -29887, -19499, 2438, -3129, -3085, 22344, 23695, -26256, -38958, 20848, 41347, -7505, -18091, 15001, 196, -32292, -1890, 36602, 14208, -25416, -26115, 7263, 21190, -2699, -208, 17633, -18635, -38839, 18373, 44467, -8581, -34709, -1984, 13205, -623, -1242, 11781, 12080, -15128, -27342, 15470, 32867, -12416, -18362, 11171, -5495, -15909, 19221, 24637, -13549, -27976, -2852, 22177, 12240, -19770, -13811, 19373, 2236, -22665, 9799, 17859, -17505, -9535, 10725, -5307, -7225, 9728, 9817, -730, -12559, -9842, 17257, 16013, -23856, -17756, 22473, 6778, -15826, 7268]
514G268K692j6493N201j474l373Q500o100j254J2969j1313q014K7947k159l8517
528b4120J1076L1731j6772j4796J1446J589N558L695j1548J269L69r921J5964
541E540J2411k7467q212K7666K161j3908N610n011q421J1365m224l022K1317j0995
555D810k4078J8645R663j2892J2487P93l1437N448L5266k089j8853j721k307P306
569A041Q502j4802L957J7791k0314j2366K5107M053j1829O041p404j9621J1908
582g936K4349p29j3239j2364k746J9428O278j3747L924l461k2127J2980L1856
595B2466k889j7953q390m848O658J4626L130o854j2044j5425J4570L8337p172
608B4212l4838J661O538r926J2947K1115j1284k5770j696K2700J3976j2149j4043
$$ y = [7268, 9960, -6533, -1332, -2806, -6179, 2321, -3779, -5033, 7936, -3377, -11391, 16556, 14397, -24120, -13044, 18687, 1915, -12881, -1435, 154, 5712, 9407, -2141, -872, -503, -10424, 5540, 17951, -9516, -17728, 9938, 12099, -1809, 3801, -1210, -9631, 1734, -2490, -5512, 15805, 4810, -19268, -623, 9040, -3852, 8635, 9428, -22009, -16561, 18705, 16616, -2237, -3958, -6265, 1041, 9543, -5259, -1302, 16489, -3825, -16191, 8916, 12969, 1140, 7181, -223, -19844, -7936, 16413, 15684, 2445, -9919, -12665, 6763, 13041, -706, 3218, -243, -22370, -9390, 22466, 19577, 1624, -6766, -11614, -4956, 9670, 12800, 5946, -6098, -21523, -6953, 31384, 24212, -10626, -8965, -2427, -12353, 594, 21709, 10425, -15345, -17041, 5659, 19635, 7486, -6557]
621f557L013k226j2469J7133K8547j7458k5819J1859R184p687M134R364p818j9222
635a6022k559K5198K0410j5397k3551N667P141j2559R915K3673j6129k7999O464
648a5748K3861R475j0844j1765p69p869o278K6633K6129k8107l6640K0325K6865
661A5268j1612k117P766j9279j4961J8421K7484K095k8495j6125J9617R162j5855
674h631P405K0462k2364k6863K6852K6000j4428j3291l557m277L361P354J1968
687I991M704k3175j5568K6467J8173k3537j1705J7536m150j6332J2726K1588J057
700A7775k0471j7447J5047J5184j2753M44J0405k0913r271L6231J4631l3004j5688
713a9830J6521P323o927o816O448J6416j1359k0980K1106J8448k2670r590J1001
$$ y = [-6557, -3544, -5770, -18239, -1106, 27441, 9983, -15836, -3977, 5207, -2480, 1654, 11018, 3200, -16022, -18581, 6617, 27027, 11630, -11921, -6254, 887, -11672, -1757, 21916, 5787, -22212, -15748, 8113, 17588, 6744, -5021, -5790, -13659, -19937, 6696, 32825, 4718, -31922, -11597, 15268, 3656, 1539, 9305, -9974, -24935, -6514, 20970, 23065, -5430, -21555, -1938, 7224, -8631, -1226, 19236, -3128, -29991, -3139, 22861, 8433, -4858, -8415, -12692, -9331, -1977, 9991, 14695, -8480, -24048, 2419, 20592, -2945, -14650, 2886, -1264, -17596, -4870, 16718, 17775, -2696, -20143, -5096, 10088, -2665, -2221, 8184, -12729, -22000, 14231, 28862, -4142, -19830, -3309, 4014, -2913, -9729, -3281, 13135, 1776, -19204, 1902, 20350, -2320, -11910, -909]
726i09n409j948J5427M157j0755n607J736J0589K981k2139j502K8083q853k5164
740a9313K0478J9513j7303j1618M865K572p88k104M439Q546j2237j3880K5411
753H581J6737l3236j2469K7111m20j4370R297P183m540n791j676J0529K250j7606
767h420K12J9124q873j4040K2331R395k7830n811J9553N338r829j4568M053K4890
781A5525m244k2112J2120R985k0963J752K2761j3140j9863J9641J6116j2933j0144
794e499M179J0701m504k0540R692K6487j6768k0877K1894J2198j8248k202R248
807E761q999o543Q310O909J669q235o780J6329K472k3724N944K0487j5356j5025
821a6781J6384J2687o336n973p9J436k733o366R122J3058j8506j4670K5194J0215
$$ y = [-909, -6318, -8266, 7161, 11318, 563, -5044, -3308, 7281, 10262, -11877, -13379, 14704, 5851, -19313, 1165, 20678, 3375, -8243, -3378, -806, -1594, -3698, 741, 9287, -2950, -16830, 8581, 25318, -7918, -20387, 6724, 6304, -8066, 1231, 8414, 3874, -1917, -3593, 6936, 9186, -8420, -8208, 10916, 2043, -11997, 10334, 19729, -8101, -13912, 5641, 10979, 1150, -13418, -9365, 15525, 11281, -10831, 1289, 11274, -9689, -7937, 14824, 1684, -18179, 1462, 17578, 4645, -5499, -1320, 9381, 4877, -15663, -5971, 20516, 3748, -17129, 4765, 16963, -1285, -3487, 5761, -3238, -9781, -1471, 5438, 7107, -1128, -7908, 8421, 10893, -12831, -6887, 13600, -1756, -16781, -397, 12290, 5954, -19, -98, 1338, -1395, -7761, 1361, 14419, -4087, -18757, 6437, 16652]
835A6652j8311J715O351j5476n055J6639J0951r088j4991J609J5592J132j1653
848c933N106M440k0106j518K7941L445j7376l114J737j66M820M165n13p399j0324
863a2795O607J9472q38j7180M70O466r960O7J5527J449j1943p181N469R965j691
878C904l810L262q347j3401J2914K3483o699k0244K128O884l712M593Q459n984
892C430j3516l333J5526J3856q017j1227L38k468m617J0528J4776q236k0311J241
906a2030J5731O957l687p054n606o448J712J8051P776j5968j0192R390N987p103
920b484J326J1964o351k0613R38K3069J1695j2725j4243R02J867K335J2141J957
934A1778j7239j0807J2454J5725m775q143L647m037j3501M360K2846P355k2386
$$ y = [16652, -1659, 56, 6407, -9069, -14124, 2515, 13466, 4378, -10613, -9004, 6588, 7720, -3933, 1173, 5613, -14493, -16011, 11930, 15375, -2001, -5115, -3378, -3544, 1276, 5441, 4928, -2471, -12795, -6188, 13284, 12446, -4734, -4264, 2202, -7758, -7691, 7836, 9285, -2658, -9839, -4370, 5595, 3904, 94, 3356, -4991, -18392, -5478, 18005, 11306, -8938, -6810, 74, -3638, 955, 9414, 3430, -10086, -13419, 2107, 15963, 7946, -3281, -2943, -5411, -10028, 500, 15276, 7040, -13271, -12030, 3701, 10658, 6971, -83, -5689, -12137, -10425, 7626, 15402, -566, -10758, -1368, 4619, -2484, -1158, 10806, 4455, -16158, -15220, 7849, 19544, 6819, -7424, -6522, -4655, -2320, 9821, 11778, -5461, -16268, -3814, 11911, 7136, -1007, 2640, -1397, -14898, -10538, 12308, 19663, -2723]
947b723j7035J2934J6749o48n995l389p715o310J3520J9276r030k0405K809J2832
961D870k319o800Q559O973j6533j1664J7139J5447j0460j2738N633L374j0284
974h803M742J7765n300j9858j46J7073M064j3123j132J1021n798j3777R517K0033
988A6278n252j9979J888J0935n787r35J3253k289k0873l870K5272J3100k1582
1001A59j4498J3134O808j1774R97J6771m670k1368M612J9534j633j1655J326M451
1015B194p715m639J6747J0795j9516j5611J6759J6579j3782j2805J4050N552j6473
1028g865q77J8013K165j6103m718J3370R80j2540M934J3635r416j6335R907J8811
1042A3961q171j5850O796R392p740o422J1027Q561j5296j0489J8528Q723j7090
$$ y = [-2723, -19758, -6824, 9925, 9277, 3282, -107, -7822, -14132, -612, 18664, 9634, -10771, -7962, 4870, 2551, -4249, 4310, 11283, -5250, -16914, 225, 15672, 5212, -7526, -1893, 1481, -8803, -4061, 13704, 8404, -11454, -11600, 5473, 9537, -3586, -4718, 6303, 505, -13272, -3755, 16278, 11026, -8953, -7065, 3870, -1917, -2852, 10401, 8112, -12761, -16631, 8641, 21741, 159, -14339, -1205, 5603, -6171, -5174, 11597, 6927, -14441, -9829, 9705, 8072, -3583, -2257, 2194, -5521, -10160, 6587, 17382, -2134, -17745, -986, 15593, 1811, -10994, 3056, 8608, -7865, -8742, 9271, 11436, -4667, -9385, 3985, 4965, -7575, -2641, 10994, 1578, -14757, -4850, 13961, 5790, -10060, -3264, 6128, -1612, -8034, 2993, 11554, -3742, -14231, 4297, 13020, -4070]
1055d070l086J4298k933j3419O233J3089n998j1828K344J0644J339j2172j37J4794
1069I098n879j5639J1443J2469j3686q486J3007N854j1240m320Q857O139o854
1082G63q885P652Q256j1759j679J5725n925j5452R037J2515o947r226K083O767
1096B925M54p146q1J1221l353j5125Q649J2378j2332m592J1390k511p281K728
1110b676M736K888m483q384P204R635j1619o331J6897J31j8175N684J1484o159
1124H32k098L347j752j650l271M238J2014q346j9448R899J8003r604q323R810
1138C651k868q335P040M930j105k923p938L111R838n707o23J1148r565j6123J3229
1153b240J6039r167j0536J382L412M751j563l627Q279m227j5895J0591J2955j2434
$$ y = [-4070, -7156, 7142, 4209, -9210, -2977, 10112, 4114, -7714, -5370, 5274, 6613, -5559, -5696, 9098, 3219, -12420, -977, 11492, -2194, -10680, 2327, 8181, -3059, -7379, 1478, 7617, 763, -8122, -470, 7786, -3973, -5652, 10073, 4148, -11304, -2267, 10248, 3301, -5925, -3842, 2925, 3379, -3767, -3848, 7373, 4020, -11105, -2456, 9922, -2410, -7002, 4388, 1877, -5404, -2676, 2060, 4948, 465, -7919, -715, 8920, -2699, -9030, 7867, 7998, -10177, -4493, 6991, 832, -1266, 2081, 329, -1321, -4592, -354, 11660, 3314, -16134, -6235, 11768, 2164, -6159, 3651, 783, -7552, -512, 4418, 3313, 390, -7548, -4437, 5401, -306, -929, 10219, 654, -15469, -2240, 13799, 4632, -5904, -4522, -1110, 3641, 2078, -1549, 6730, 2503, -13392, -2801, 10154, -2280]
1167b280r92J2271j0364j2163J3858J2440p050j0972o060O672J2980m065m647
1180c72P308r567j1143J7544J1010j4467o016M323k233J362Q683L921n068j3270
1194g985p697J7605J5478j4718j0237O500m373K78J6210P05j6154o622N431R477
1208C898L240o482J17M085j1321o140K1935Q279k1951o422J0040l9L039P954l774
1223F458j0748o527N976J4702r83j3810J198P014r173k22J9706j456k1467l595
1237a2927R941P075L615l412m956k997n450O985J7278n756k1505O02J5244m95
1251C242k137Q358l391j4392l164J1192J1318n533j3494L461O115o555N479J5228
1265A5727r787k2356L930J7526J075n537k15j414m084r41R384J0856j1435j7567
$$ y = [-2280, -3272, 8999, -1365, -13528, 330, 12770, 5720, -5252, -11312, -4640, 8340, 4275, -372, 6936, -2631, -13774, 3770, 14780, 313, -5703, -1380, -3613, -2251, 6432, 10353, 5285, -7985, -15682, 1923, 17401, 2683, -7554, -1054, -5427, -5149, 11061, 11766, -4388, -11010, -5579, 3898, 7138, 656, 773, 4858, -6463, -12603, 9332, 17611, -4340, -10762, -722, -761, 2278, 10232, 6458, -4290, -10817, -4841, 9861, 8878, -4932, -3734, 3280, -5893, -6115, 13591, 12135, -9332, -12927, -2986, 4089, 7704, 4292, -664, -3661, -9111, -2126, 15152, 9396, -12109, -11507, 3737, 3242, 1105, 9463, 6072, -8320, -11484, -292, 11026, 5493, -8001, -4540, 1575, -4980, 499, 15727, 5940, -16416, -12486, 5040, 6115, 578, 363, -1051, -5135, -6076, 3308, 14164, 2729, -14838]
1279a4838O982J2252k428R80O032q685j4258N960J6882K936j2556j0564M918R768
1293C381j531J332O915j2231j6392J1289J8739l964j3328M53N593k309N4R082
1307G083K409j5253j0782J3855J3568r159n112Q085m943r951Q658J3240n809j4676
1321h787p54J0975L967n049k49M923o749j1382R691J4756p723j0890M870M109
1335A708m303P77R803n71j7278o548J7987J3394j1900r971R026O27r929Q109J1115
1350A2046j1344j3329N800J2509P65o129J980K360j0012n879J4479J0978j5498
1363a274j3863J2554J0659n656k343L322k753p807L72J2491L257j2155k820J1046
1377E030j044j0453P127J1349j2237j3480R967J3754k912r093M42N390n357n543
$$ y = [-14838, -7856, 4396, 1968, 2948, 8980, 295, -13963, -8003, 8879, 11815, -741, -11305, -6387, 3381, 1850, 3182, 10097, -2134, -18526, -7237, 11502, 7538, -5790, -5337, 256, -2053, -1999, 7083, 9492, -5761, -16543, -2688, 10880, 1721, -3391, 4694, -249, -10200, -1542, 11698, 5889, -8787, -9541, 1434, 5401, 352, 103, 5026, -1723, -13105, -3414, 11342, 3619, -7271, -2401, 1708, -2595, -1818, 7985, 7414, -9864, -16412, 1575, 14969, 3069, -6902, 2124, 2751, -7178, 931, 12046, 702, -12627, -6827, 5682, 6447, 318, 2298, 4658, -5354, -11233, 3246, 14224, -1274, -15137, -2583, 8076, 2420, 77, 3399, 646, -7161, -6789, 5702, 8959, -3196, -6016, 5030, 3986, -6467, 660, 12009, -228, -13708, -3741, 10013, 7101, -1992, -1550, 3840, -1517, -7060]
1391g060J1531M985j5615n052J5638L977j0975J407Q271o677r639M783J1030M64
1405G068j1378k030J0977J40p373M995L825j0860m119J2196N970j0054n174Q091
1419B274M519p801o303Q530O352j0896m137J1641J387q162J987M704n234n706
1433f845N857O428m895n618N616P123o591q318Q330P155j0751n825Q745M812m125
1448A098j890K972N08n151j120N674J31o806J005Q472k134p844M787O553o194
1463F1o055K394M909K2k863K622L079n678l510P153M314q392n019O967K938m088
1479a146K105M143k986o985l34P723K231o485j775L608p00o00M618K215q059n651
1495h078N471O091j673l426J210J895l207j060N758J700o606l415M133K974j146
$$ y = [-7060, 4471, 9456, -6159, -11211, 4427, 8404, -2571, -1164, 7107, 430, -9209, -4426, 6604, 7068, -4310, -6340, 4637, 4777, -2596, 2399, 6224, -4636, -8755, 3441, 9411, -643, -5817, 2274, 6793, -1008, -7311, 1219, 7571, -3325, -7462, 4179, 5566, -2596, -609, 4095, -1139, -6845, -988, 5440, 545, -5073, 543, 7666, 1075, -7243, 1087, 8242, -2509, -8334, 411, 5223, 1098, -792, 2180, 2688, -2463, -3583, 2091, 2222, -4584, -3579, 4893, 2759, -5085, -298, 6255, 61, -5994, -3600, 1309, 1331, -1532, 1090, 4169, -1509, -5019, 2134, 6448, -1944, -6963, 4, 2942, -1146, 959, 5102, 2116, -4869, -5203, 2520, 4751, -1734, -3509, 99, -601, -1201, 3417, 5632, -2427, -8078, -2607, 3484, 1811, -1615, -405, 1490, -1717, -2777, 2981, 4681, -1925, -5340, -1207, 1767, 621]
1510F21J340L557n534p242M027Q573r49o813q75K926j085R42N738k05q316n481
1526h776N344P950q39l772j59k211k434N080P786k714j1493k770Q547N199n30
1541D208o44k578o333j451R867O427q160q094K496M920J835L91J444k673q165
1556f510j518R943N272n790m832J787o04m87P987L402j0687p933N254R034J003
1571E321m656l34N17m846k29R132L435r288o411M346L689J226L954q16r055n971
1587i986O140J2370j044j2202k150O969L2o43O072K32j0897m230Q478O019q41
1602D319l038k274j872j580M706J0069l897j4825k47J1067K476l329J472j689
1616A358p567r94R557O097n386q891N50O169j034N95P137m380j3905R49J3957
$$ y = [621, 1961, 5518, -16, -7258, -3231, 5342, 4393, -2420, -3295, -369, -1454, -512, 5226, 5021, -3295, -8776, -3432, 4518, 3679, -93, -252, -2463, -4897, 183, 7969, 5255, -6238, -9008, -461, 4738, 4208, 3564, 986, -5347, -6798, 3069, 9496, 1336, -6758, -4262, 658, 2493, 2884, 4328, 1655, -6510, -8028, 1915, 7187, 1397, -3435, -1648, -2252, -2739, 5248, 8650, -2037, -9970, -4716, 4318, 5321, 665, 331, 848, -3998, -4227, 4905, 8340, -948, -7359, -3013, 676, 1902, 5856, 5040, -4015, -9986, -3846, 8524, 7480, -4722, -6872, 97, 129, -514, 5558, 5790, -5107, -9337, -859, 5160, 4319, 1281, -993, -2865, -4445, 261, 10330, 6433, -8392, -8639, 2428, 4904, 1575, 3047, 1358, -6209, -7203, 2354, 8451, 3065, -5826, -5276, 893, -141, 454, 7591, 3211, -10694, -9745, 4212]
1631D212N641p264o105k95R76K524N352K788q556j0417O495J1414k267m431J977
1646B044k705o044K682J0052L351j0477r467N286J0380q52l773J769m135p525
1660i414P465J0992m647q150L47L128L46m76L399L111p376q551O708J2024l219
1675E687q235K002r4m711N041Q089l494r670k669P561O103l869k153K741m183
1690a854o355P277J0693n768j0451J346N473Q78N21J650j107o430l640R809Q054
1705A0096q500q220N094L154l632K150N676m318p237J613O467K460n177k493M071
1720A204k185n285P304P263p999p711N543N491k693j740K630n01m326j624O720
1735B091N095p722n217O832J474n734L474N720n393p170L904O962q91n387r74
$$ y = [4212, 9853, 2589, -3516, -3811, -2835, -311, 5041, 7829, -727, -11144, -4649, 6765, 4498, 67, 2044, -661, -6705, -4023, 6029, 9380, -1097, -10564, -5278, 5102, 4250, 477, 2246, -1889, -9414, -1949, 9043, 4396, -3754, -3407, -279, 67, -409, 2990, 6101, -1275, -9826, -3118, 8906, 5687, -2548, -546, -640, -5351, -310, 7779, 4285, -5385, -8054, -493, 5610, 1741, -412, 2329, -1854, -8209, -932, 9761, 3993, -6458, -5112, 361, 1239, 1760, 3410, 2303, -4127, -7767, 2042, 10096, 1596, -6624, -1530, 1624, -2008, 142, 5818, 1500, -5737, -4124, 2343, 4803, -374, -2867, 1204, -981, -6266, 1038, 8301, 302, -7409, -1866, 3625, 932, -808, 1822, 1321, -3005, -4629, 2091, 7186, -536, -5753, 1079, 2553, -3181, 293, 6013, 620, -6550, -2646, 4316, 3425, -1962, -2936]
$$ [...]
8191D2
##END NTUPLES=NMR FID
##END=
