##TITLE=1H_B3dm-1
 CDCl3
 8 sc, 
 11.7.2023
##JCAMPDX= 6.0         $$ Bruker NMR JCAMP-DX V2.0
##DATA TYPE= NMR FID
##DATA CLASS= NTUPLES
##ORIGIN= UXNMR, Bruker Analytische Messtechnik GmbH
##OWNER= root
$$ XWIN-NMR		Version 3.5
$$ Tue Jul 11 14:16:21 2023 Russian Standard Time (UT+4h)  she@DPX200
##.OBSERVE FREQUENCY= 200.13135
##.OBSERVE NUCLEUS= ^1H
##.DELAY= (6, 6)
##.ACQUISITION MODE= SIMULTANEOUS
##.ACQUISITION SCHEME= undefined
##.AVERAGES= 8
##.DIGITISER RES= 18
##SPECTROMETER/DATA SYSTEM= spect
##.PULSE SEQUENCE= zg30
##.SOLVENT NAME= CDCl3
##.SHIFT REFERENCE= (INTERNAL, CDCl3, 0, 15.7039)
##AUDIT TRAIL= $$ (NUMBER, WHEN, WHO, WHERE, WHAT)
$$ ##TITLE= Audit trail, XWIN-NMR		Version 3.5
$$ ##JCAMPDX= 5.01
$$ ##ORIGIN= Bruker BioSpin GmbH
$$ ##OWNER= she
$$ F:/spectra/data/she/nmr/H-F/1/audita.txt
$$ ##AUDIT TRAIL=  $$ (NUMBER, WHEN, WHO, WHERE, WHAT)
(   1,<2023-07-11 14:15:00.10 +0400>,<she>,<DPX200>,
      <created by zg, POWCHK disabled, PULCHK disabled
       configuration hash MD5:
       00 E9 B6 7A A2 85 ED C7 34 08 36 98 17 FE 4E 26
       data hash MD5: 16K
       5D DD 6B 2D 4B 1F F2 C6 3B FB B6 65 7D A3 1F F9>)
$$ ##END=
$$ 
$$ hash MD5
$$ B5 0D B7 01 70 76 72 D2 9C 8F 16 C0 B9 7B D8 76
##$RELAX= 
##$RELAX= 
##$RELAX= 
##$RELAX= 
##$RELAX= 
##$RELAX= 
$$ Bruker specific parameters
$$ --------------------------
##$DU= <F:/spectra>
##$EXPNO= 1
##$NAME= <H-F>
##$PROCNO= 1
##$TYPE= <nmr>
##$USER= <she>
##$AMP= (0..31)
100 100 100 100 100 100 100 100 100 100 100 100 100 100 100 100 100 100 
100 100 100 100 100 100 100 100 100 100 100 100 100 100 
##$AQSEQ= 0
##$AQ_mod= 1
##$AUNM= <au_zg>
##$AUTOPOS= <>
##$BF1= 200.13
##$BF2= 200.13
##$BF3= 200.13
##$BF4= 200.13
##$BF5= 200.13
##$BF6= 200.13
##$BF7= 200.13
##$BF8= 200.13
##$BYTORDA= 1
##$CFDGTYP= 0
##$CFRGTYP= 5
##$CHEMSTR= <none>
##$CNST= (0..31)
1 1 145 1 1 1 1 1 1 1 1 1 1 1 1 1 1 1 1 1 1 1 1 1 1 1 1 1 1 1 1 1 
##$CPDPRG= <>
##$CPDPRG1= <>
##$CPDPRG2= <>
##$CPDPRG3= <>
##$CPDPRG4= <mlev>
##$CPDPRG5= <mlev>
##$CPDPRG6= <mlev>
##$CPDPRG7= <mlev>
##$CPDPRG8= <mlev>
##$CPDPRGB= <>
##$CPDPRGT= <>
##$D= (0..31)
0 1.2 0 0 0 0 0 0 0 0.06 0 0.03 0 0 0 0 0.0002 0 0 0 0 0 0 0 0 0 0 0 0 
0 0 0 
##$DATE= 1689070499
##$DBL= (0..7)
120 120 120 120 120 120 120 120 
##$DBP= (0..7)
150 150 150 150 150 150 150 150 
##$DBP07= 0
##$DBPNAM0= <>
##$DBPNAM1= <>
##$DBPNAM2= <>
##$DBPNAM3= <>
##$DBPNAM4= <>
##$DBPNAM5= <>
##$DBPNAM6= <>
##$DBPNAM7= <>
##$DBPOAL= (0..7)
0.5 0.5 0.5 0.5 0.5 0.5 0.5 0.5 
##$DBPOFFS= (0..7)
0 0 0 0 0 0 0 0 
##$DE= 6
##$DECBNUC= <off>
##$DECIM= 32
##$DECNUC= <off>
##$DECSTAT= 4
##$DIGMOD= 1
##$DIGTYP= 9
##$DL= (0..7)
0 120 120 120 120 120 120 120 
##$DP= (0..7)
150 150 150 150 150 150 150 150 
##$DP07= 0
##$DPNAME0= <>
##$DPNAME1= <>
##$DPNAME2= <>
##$DPNAME3= <>
##$DPNAME4= <>
##$DPNAME5= <>
##$DPNAME6= <>
##$DPNAME7= <>
##$DPOAL= (0..7)
0.5 0.5 0.5 0.5 0.5 0.5 0.5 0.5 
##$DPOFFS= (0..7)
0 0 0 0 0 0 0 0 
##$DQDMODE= 0
##$DR= 18
##$DS= 0
##$DSLIST= <SSSSSSSSSSSSSSS>
$$ [...]
##$SUBNAM2= <"">
##$SUBNAM3= <"">
##$SUBNAM4= <"">
##$SUBNAM5= <"">
##$SUBNAM6= <"">
##$SUBNAM7= <"">
##$SUBNAM8= <"">
##$SUBNAM9= <"">
##$SW= 18.05172834244
##$SWIBOX= (0..15)
0 0 2 0 0 0 0 0 0 0 0 0 0 0 0 0 
##$SW_h= 3612.71676300578
##$TD= 16384
##$TD0= 1
##$TE= 0
##$TE2= 300
##$TE3= 300
##$TEG= 300
##$TL= (0..7)
0 120 120 120 120 120 120 120 
##$TP= (0..7)
150 150 150 150 150 150 150 150 
##$TP07= 0
##$TPNAME0= <>
##$TPNAME1= <>
##$TPNAME2= <>
##$TPNAME3= <>
##$TPNAME4= <>
##$TPNAME5= <>
##$TPNAME6= <>
##$TPNAME7= <>
##$TPOAL= (0..7)
0.5 0.5 0.5 0.5 0.5 0.5 0.5 0.5 
##$TPOFFS= (0..7)
0 0 0 0 0 0 0 0 
##$TUNHIN= 0
##$TUNHOUT= 0
##$TUNXOUT= 0
##$USERA1= <user>
##$USERA2= <user>
##$USERA3= <user>
##$USERA4= <user>
##$USERA5= <user>
##$V9= 5
##$VALIST= <valist>
##$VCLIST= <CCCCCCCCCCCCCCC>
##$VD= 0
##$VDLIST= <DDDDDDDDDDDDDDD>
##$VPLIST= <PPPPPPPPPPPPPPP>
##$VTLIST= <TTTTTTTTTTTTTTT>
##$WBST= 1024
##$WBSW= 4
##$XGAIN= (0..3)
0 0 0 0 
##$XL= 0
##$YL= 0
##$YMAX_a= 283697
##$YMIN_a= -242451
##$ZGOPTNS= <>
##$ZL1= 120
##$ZL2= 120
##$ZL3= 120
##$ZL4= 120
##$ABSF1= 10
##$ABSF2= 0
##$ABSG= 5
##$ABSL= 3
##$ALPHA= 0
##$AQORDER= 0
##$ASSFAC= 0
##$ASSFACI= 0
##$ASSFACX= 0
##$ASSWID= 0
##$AUNMP= <proc_1d>
##$AZFE= 0.1
##$AZFW= 0.1
##$BCFW= 1
##$BC_mod= 2
##$BYTORDP= 1
##$COROFFS= 0
##$CY= 11.3945322036743
##$DATMOD= 1
##$DC= 2
##$DFILT= <>
##$DTYPP= 0
##$F1P= 15.7292609196834
##$F2P= 12.9074282941183
##$FCOR= 0.5
##$FTSIZE= 0
##$FT_mod= 4
##$GAMMA= 1
##$GB= 0.15
##$INTBC= 1
##$INTSCL= 1
##$ISEN= 128
##$LB= 0.24
##$LEV0= 0
##$LPBIN= 0
##$MAXI= 10000
##$MC2= 0
##$MEAN= 0
##$ME_mod= 0
##$MI= 1.114404
##$NCOEF= 0
##$NC_proc= 0
##$NLEV= 6
##$NOISF1= 3.799351
##$NOISF2= 2.8
##$NSP= 1
##$NTH_PI= 0
##$NZP= 0
##$OFFSET= 15.70392
##$PC= 1
##$PHC0= -21148.07
##$PHC1= 12.45272
##$PH_mod= 1
##$PKNL= yes
##$PPARMOD= 0
##$PSCAL= 0
##$PSIGN= 0
##$REVERSE= no
##$SF= 200.130013532006
##$SI= 16384
##$SIGF1= 3
##$SIGF2= 2
##$SINO= 400
##$SIOLD= 16384
##$SREGLST= <1H.CDCl3>
##$SSB= 0
##$STSI= 0
##$STSR= 0
##$SW_p= 3612.71676300578
##$SYMM= 0
##$S_DEV= 0
##$TDeff= 0
##$TDoff= 0
##$TI= <>
##$TILT= no
##$TM1= 0
##$TM2= 0
##$TOPLEV= 0
##$USERP1= <user>
##$USERP2= <user>
##$USERP3= <user>
##$USERP4= <user>
##$USERP5= <user>
##$WDW= 1
##$XDIM= 8192
##$YMAX_p= 0
##$YMIN_p= 0
$$ End of Bruker specific parameters
$$ ---------------------------------
##NTUPLES= NMR FID
##VAR_NAME=  TIME,          FID/REAL,        FID/IMAG
##SYMBOL=    X,             R,               I
##VAR_TYPE=  INDEPENDENT,   DEPENDENT,       DEPENDENT
##VAR_FORM=  AFFN,          ASDF,            ASDF
##VAR_DIM=   8192,          8192,            8192
##UNITS=     SECONDS,       ARBITRARY UNITS, ARBITRARY UNITS
##FACTOR=    0.0002768,     1,               1
##FIRST=     0,             0,               0
##LAST=      2.2672688,     0,               0
##MIN=       0,             -242451,         0
##MAX=       2.2672688,     283697,          0
$$ Real data points
##PAGE= N=1
##DATA TABLE= (X++(R..R)), XYDATA
0 0 0 0 0 0 0 0 0 0 0 0 0 0 0 0 0 0 0 -3 8 -8 8 -8 9 -16 16 -19 24 -25 31 -36 40 -47 53 -60 68 -77 90 -100
38 -100 112 -125 141 -157 174 -194 217 -238 263 -292 321 -354 390 -429 471 -521 573 -632 696 -769
58 -769 852 -944 1051 -1173 1315 -1480 1671 -1879 2065 -2026 543 16493 283697 29244
72 29244 -171754 102666 37268 -118184 43277 88146 -32955 -28506 -83101 -67856 100101
83 100101 30283 -101911 51386 40628 -120766 31109 133594 -42129 -48950 5420 -57939
94 -57939 18941 51480 -86185 -6211 82916 -108132 -79158 156178 35200 -116214 33576
105 33576 36717 -83894 -3364 43141 -8024 -11057 -78880 -67042 100807 44605 -95364 37196
117 37196 58916 -122556 -16461 147309 -17042 -107787 4358 783 -3999 51096 -8575
128 -8575 -23051 18906 -57544 -23103 116118 11675 -109418 8663 37733 -44705 18360
139 18360 40925 -47527 -23103 5025 -24781 47582 43268 -77203 -6655 82444 -42271 -50860
151 -50860 82202 18612 -80307 2588 48852 -2697 -5248 11344 16867 8755 -44180 -16558
163 -16558 75516 10822 -69471 19324 35485 -44953 12218 60806 -23604 -37661 7438 -2450
175 -2450 25779 42109 -33195 -23629 42022 -12224 -21072 62810 5818 -74908 8777 57317 709
188 709 -6745 4778 -6477 7060 3189 -5909 29149 8027 -49274 7137 57351 -15093 -29514
201 -29514 29486 6594 -22869 8319 10937 -3878 -1899 -5214 12496 19306 -27532 -20750 42069
214 42069 9978 -44768 8886 32745 -21696 -6645 30334 -944 -14910 -2299 -3626 15213
226 15213 15037 -23461 -9835 26228 -1924 -15998 18417 2141 -31524 -632 22017 -165
238 -165 -14169 -13541 6724 21841 -15192 -23984 23194 4920 -36839 13265 38872 -29294 -33849
251 -33849 30497 18960 -18891 -1670 1027 -11379 4356 8397 2939 3254 -18498 -19919 20484
264 20484 21303 -18032 -18451 3544 -2563 -5650 12288 12579 -11493 -28115 -5773 32060 11417 -32560
278 -32560 -7453 20017 -10335 -10327 21553 5609 -19501 -5022 7845 4631 2136 -4952 10 11616
292 11616 -12182 -20951 23289 19683 -28254 -7303 23683 -11801 -21595 19939 21703 -15907 -25055
305 -25055 -2089 16338 11422 -5605 -5968 -677 -15496 -6736 30734 19888 -22713 -23111 2064
318 2064 18339 18046 -2612 -13463 -5433 -8165 -1107 29920 18503 -32198 -22760 23938 11420
331 11420 -12444 8119 8174 -22074 -18924 14018 25782 -1020 -23928 -4568 14737 -2803 -9462
344 -9462 13259 10581 -16362 -10953 11060 9116 1028 -1081 -1708 112 -10255 -8692 25569 24629
358 24629 -22803 -23102 15604 9268 -10254 9723 11185 -25022 -23342 16338 28825 8277 -17385
371 -17385 -20698 1542 10394 1878 6821 5131 -21086 -22412 18878 33942 -2670 -23239 -3706
384 -3706 5125 -3252 6170 20390 -86 -29081 -8376 27408 12046 -16567 -6632 8024 -3140
397 -3140 -10377 6662 18360 2004 -16894 -10182 9110 7074 -10541 -1462 15221 -6410 -22472
410 -22472 10065 29651 -1139 -19094 760 2122 -13968 4540 26970 3158 -26674 -13551
422 -13551 19110 22160 -5288 -13960 855 -3383 -12603 10961 27812 -5273 -33789 -7447 22263
435 22263 11669 -7974 -8575 698 -1968 -7535 13318 23303 -15355 -30101 11430 20814 -12450
448 -12450 -7560 16960 -77 -16176 4253 14281 1316 -9484 -9831 5491 8568 -14191 -7603
461 -7603 21840 6372 -22341 -4677 15828 552 -10546 1808 6629 -6050 -13771 6089 26033
474 26033 -2731 -29687 3878 19359 -11583 -1839 22337 -7220 -25105 5765 20201 4750
486 4750 -9592 -15626 206 18386 -2505 -12631 15823 3394 -27281 6711 28581 -12282
498 -12282 -21449 8903 8705 -4358 -157 4038 2267 -4144 -8468 9196 16013 -15296 -16239 21599
512 21599 12583 -17064 -2252 10746 -33 -770 1630 3315 4677 -10723 -8288 23411 11194
525 11194 -28820 -6008 26220 -5093 -15980 14297 3708 -17164 1750 12423 1446 -7182
537 -7182 -9290 5441 14844 -6996 -10989 15020 5610 -17768 5288 19799 -8195 -12703 6540
550 6540 8652 5745 -6210 -15774 8375 14758 -13545 -4116 16200 -13600 -20046 22968 16525 -24320
564 -24320 -11210 12267 -53 -2334 5076 -613 -3033 -6778 -3889 16921 8442 -23370 -9568
577 -9568 19200 2703 -12555 5621 6396 -12344 -8117 6923 8470 -3875 -16562 -640 16909
590 16909 -6078 -15528 12642 7189 -19381 -3062 14183 -6013 -12349 6563 8579 -2819 -10318
603 -10318 -8606 11066 12724 -17332 -12760 15774 -1254 -16332 14448 17072 -20408 -19324 12795
616 12795 14132 -4836 -8420 -162 1960 -5604 -632 19050 3717 -30963 -10017 25361 5479
629 5479 -15904 1058 6268 -7818 -4731 8858 10142 -4010 -18619 -3857 23306 6747 -18979
642 -18979 4700 18120 -11037 -10903 16656 8409 -13730 -5063 12798 6464 -10995 -4804 17230
655 17230 7711 -22091 -8868 21644 2468 -17143 9754 15861 -13158 -12988 12690 18039 -1407
668 -1407 -18306 -3790 19663 6271 -10605 11558 14317 -21924 -11988 30827 12998 -23843 -6714
681 -6714 14029 2999 -3218 5054 7863 -4620 -16311 894 23560 4104 -23466 -2079 22581
694 22581 334 -14540 7318 13080 -8841 -13762 9057 18038 -8301 -17181 15091 17797 -18776
707 -18776 -12949 21196 7085 -20086 -160 17787 -4110 -14386 5966 16189 -1427 -20129
719 -20129 -5562 18984 3518 -17100 1915 11632 -11707 -11677 14900 11454 -16638 -17379 7493
732 7493 16067 -3287 -15134 3526 10548 -13014 -7377 20851 2613 -25558 -2249 21014 578
745 578 -15540 -22 9836 -3494 -12188 1615 12585 -6054 -20880 5277 20448 -10258 -21315
758 -21315 6731 12524 -8246 -10074 5669 4421 -10965 -5038 14898 4741 -19316 -6056 18598
771 18598 3553 -15275 851 8686 -6399 -5333 6381 5755 -3563 -12713 -2356 16697 2456
784 2456 -19832 -750 16753 -6829 -14457 11525 8994 -15078 -5734 14198 5304 -11823 -7591
797 -7591 9858 8704 -8580 -3527 10629 -2063 -10535 9179 13481 -9722 -13200 6972 12783
810 12783 1053 -7731 -3755 6786 2643 -6342 5886 8994 -12925 -10728 13801 11071 -6776
823 -6776 -4968 2604 378 -1419 2446 5676 476 -10059 -2501 16661 6084 -13795 -170 11925
837 11925 -2998 -6023 6768 5628 -3873 -3449 3965 6951 -1578 -8152 3560 10397 -7624 -11298
851 -11298 9547 7607 -7854 999 6865 -7479 -8535 6736 9243 -2101 -8542 -2990 6449 6626
865 6626 -674 -441 1315 -6715 -5532 10047 11147 -4990 -11767 -451 10619 4149 -5152 -299
879 -299 61 -9790 -2047 14359 4412 -13714 -4392 7526 -1273 -3674 3891 -419 -6407 -2252 3913
894 3913 5508 -496 -5951 474 6333 -3178 -8578 4621 9442 -4352 -6428 4662 3207 -3949
908 -3949 -99 5040 -1001 -9680 -3486 8797 6069 -4386 -4894 -126 -1966 -2161 6380 4849 -9451
923 -9451 -10326 4441 10703 2253 -5952 -3863 273 -1428 786 7145 3233 -8678 -7163 8565 10355
938 10355 -4073 -6637 1560 299 -3234 2296 5724 -1616 -6676 683 6110 -1308 -5583 829 4243
953 4243 -2638 -5981 2562 5634 -1810 -3697 2027 2948 -3602 -5881 5230 10437 -3839 -10412 3062
968 3062 8048 -1891 -1285 4812 -5006 -9324 6819 11503 -2483 -7409 -2579 1421 4164 631 -2594
983 -2594 118 -1989 -6323 3442 12483 -2333 -13886 1200 9586 -1549 -3934 3046 1704 -4430
997 -4430 -2280 6625 5243 -6646 -5909 6361 5295 -5770 -3190 5490 784 -4340 1156 2546 -2910
1012 -2910 -4029 1201 7214 104 -11284 -1478 12233 1104 -10096 905 6287 -4946 -4030 8086
1026 8086 4534 -6952 -6031 3957 9096 -347 -8151 2035 5445 -5298 -1038 9811 -1056 -11810
1040 -11810 456 10167 1041 -6900 -3024 3778 3699 -4880 -3746 7422 -1042 -12190 5206 13326
1054 13326 -8064 -11754 7917 8794 -4952 -4267 2720 1311 -1691 -568 5237 4887 -8355 -7551 10780
1069 10780 7778 -9666 -4794 6042 -50 -4923 2770 7060 -2982 -12104 -1132 13780 1903
1082 1903 -15548 -465 13383 -4528 -8533 9650 4116 -10625 -2133 6848 2065 -3074 -3662 2603
1096 2603 7751 -3260 -9157 6369 7189 -10810 -2516 12314 -3575 -12035 5913 11298 -2786
1109 -2786 -10314 -3740 6820 3779 -6578 -265 8078 -5948 -10364 11283 11994 -11297 -10562 5247
1123 5247 4675 -369 586 2186 399 -6388 -2801 12443 6070 -14689 -6367 12708 2215 -8445
1137 -8445 4823 6874 -6976 -6610 3540 6270 -797 -8648 258 10389 -2790 -9895 6981 8183
1151 8183 -8721 -5378 6687 698 -3711 3570 5164 918 -4769 -5413 8569 10177 -9742 -7305
1165 -7305 10105 -185 -8959 10090 12018 -11581 -12866 6434 9383 -444 -4919 -2631 1434 -724
1179 -724 -779 8541 3698 -12598 -6547 10193 6510 -3489 -1832 2448 87 -3096 1844 8557 1119
1194 1119 -12050 -2812 12527 1011 -9168 5177 7012 -7971 -5762 5387 3745 -2747 -3874
1207 -3874 1112 3530 -3849 -5350 7520 7306 -10365 -8183 8113 3394 -4828 3268 3489 -6963
1221 -6963 -6331 5306 10961 -716 -13346 -3415 9415 1232 -4454 5850 2566 -12700 -5074 11554
1235 11554 5668 -6780 -6603 -849 3051 268 -1376 3414 -1413 -10841 -1058 11332 701 -10428
1249 -10428 -1097 5974 -2160 -5197 2844 6069 -2766 -8972 2247 9737 -4863 -8088 9480 5514
1263 5514 -12899 -4821 10490 2706 -6522 -1064 1560 -2507 -2769 1820 5901 -245 -11785 -3466
1277 -3466 11531 2201 -8575 1111 3497 -6982 -2589 10886 6759 -8854 -9354 4964 10271 -896
1291 -896 -6277 2705 2119 -7539 715 12093 656 -10519 -1658 7228 2153 -5036 -1193 5366 -628
1306 -628 -7870 2557 11005 -3492 -10560 6968 9108 -8423 -5207 10220 5134 -6433 -3291 4861
1320 4861 3972 -2972 -1725 6410 2415 -8723 -1528 12967 4337 -9320 -1896 4993 -1174 -1867 4522
1335 4522 3875 -4653 -7530 4781 12636 -1606 -11974 1661 8550 -5304 -4526 10253 2951 -11767
1349 -11767 -1643 11557 3996 -7232 -3772 5324 2965 -4381 457 7045 -1352 -7725 2678 7600
1363 7600 -3547 -7141 3241 5888 -2282 -5451 1501 5978 -2721 -7751 4084 5707 -9146 -6004
1377 -6004 10749 5462 -9441 -3663 6638 1553 -3646 -628 1318 -937 -3963 480 8478 686
1391 686 -10594 -942 9191 -1467 -7747 2703 4097 -6689 -3893 7330 3582 -7592 -6578
1404 -6578 4215 5420 -4904 -5295 4705 2177 -5318 444 5561 -1885 -7102 67 5909 1065
1418 1065 -5171 -2424 4713 2826 -4203 -487 4317 -4315 -6226 5783 6027 -6093 -6562 4101 5449
1433 5449 -2880 -4132 2179 1388 -5097 -1935 6863 2414 -7777 -2098 6915 965 -4517 336 2296
1448 2296 -962 -1449 2131 3366 -1267 -4004 1701 5899 -1686 -6980 1982 6749 -2463 -4033 3551
1463 3551 1498 -4302 -330 5525 291 -6773 -2222 5429 3577 -2366 -2975 747 1107 -1116 1691
1478 1691 4011 -1797 -5771 1019 7121 1662 -4368 -44 2525 -2206 -439 5600 1743 -6367 -3287
1493 -3287 5500 4203 -3415 -2952 1821 876 -1775 -394 2169 259 -2636 -644 2261 709 -2271
1508 -2271 -370 3849 508 -4748 -12 4433 -717 -2123 2803 1264 -4398 -1096 5890 3162 -4138
1523 -4138 -4695 578 3579 745 -975 964 -1675 -5094 1568 6606 2 -5690 -3100 1118 2450
1538 2450 2326 290 -1729 -2556 -1963 2760 5826 -1617 -6791 1070 4415 -1167 -189 3539 -710 -4501
1554 -4501 -796 3290 1712 -1805 -2207 1122 1430 -2307 -1197 3086 145 -3704 -941 942 120 387
1570 387 1315 1543 -2206 -4734 1133 6458 -10 -5135 391 2034 -2194 2524 6287 -2259 -6731 -1118
1586 -1118 3311 4121 1144 -4397 -2826 2074 792 482 3529 -1647 -7939 -592 6697 1357 -2598
1601 -2598 -489 -529 -1611 99 2832 2532 -3086 -4783 2550 5146 -1240 -2059 2953 676 -4020 -669
1617 -669 2897 1216 -972 -1317 654 1588 -1982 -819 4398 51 -6590 -1929 4506 1760 -1182 903
1633 903 -351 -3841 -1112 4789 4410 -3345 -6925 783 6148 513 -1266 2210 -1486 -5250 853
1648 853 6450 2481 -4058 -4182 1043 4514 970 -2434 230 -827 -5334 1247 7375 -761 -6395
1663 -6395 707 4031 -1900 -2699 2576 1880 -3658 -2964 2866 3753 -1500 -2236 3038 1858 -4574 -2113
1679 -2113 4776 3349 -3212 -3529 2025 2721 -1927 -219 4032 -1679 -7363 966 8159 208 -5892
1694 -5892 -205 1802 -2366 -132 4414 1070 -5648 -4733 4350 7491 -1202 -5890 171 3161 -1839
1709 -1839 -835 4750 442 -6319 -1189 6110 2731 -4091 -2218 2994 -87 -4064 1476 4720 -2843
1724 -2843 -5505 2223 4761 -2694 -4283 2614 3512 -3234 -3967 2691 4110 -2722 -3389 3455 1803 -4690
1740 -4690 -883 6019 1953 -5504 -3010 4418 3117 -3114 -1259 2885 -1717 -4941 3368 6839 -4086
1755 -4086 -7621 2731 4904 -2171 -2294 1651 293 -3422 -1430 4116 3157 -4604 -5223 3789 5371
1770 5371 -3170 -3071 3874 850 -4337 1065 5241 -1112 -5700 989 6154 -529 -5206 1230 4125
1785 4125 -2257 -3285 3208 2237 -4170 -2139 4055 2721 -3252 -3949 2547 4599 -3056 -4055 4176 2634
1801 2634 -4577 135 6181 -907 -6013 1726 5392 -641 -3289 615 2997 192 -2264 1967 3364
1816 3364 -3816 -4233 5030 4587 -4436 -3977 3521 3033 -1878 -1195 1710 155 -3335 -754 5648 2324
1832 2324 -6203 -1754 6194 1408 -3709 1058 2453 -2757 -2020 4495 3883 -3106 -4141 2558 4568
1847 4568 -1977 -3744 2776 1902 -4296 -623 4901 798 -4256 -1774 2817 1704 -3110 -2297 3348
1862 3348 1834 -4209 -290 5129 -1496 -4905 3672 3646 -5288 -2777 4773 3022 -2662 -2555 940 1475
1878 1475 -1346 -1345 2383 713 -5576 -2230 6452 2829 -5673 -3112 2111 132 -2145 1255 2766 -3085
1894 -3085 -5619 2502 6327 -1514 -5340 528 1804 -2553 77 4463 -295 -5171 -1118 4100 2690
1909 2690 -3352 -3583 2359 1809 -3907 -665 4850 -256 -5495 42 3735 -1677 -3368 1832 2673 -2323
1925 -2323 -3619 1828 4147 -1663 -3776 2032 1636 -4007 -387 6119 1388 -5660 -2169 4081 2563
1940 2563 -1625 -1262 848 -808 -2672 2180 5867 -1307 -6789 -364 5055 656 -2746 609 914
1955 914 -3399 -1001 5572 2955 -4996 -3810 3717 3088 -2394 -177 3526 -621 -3419 906 4480
1970 4480 847 -3627 -1352 3496 1344 -3276 155 4494 -652 -4718 1496 3887 -2365 -2232 3615
1985 3615 1311 -4642 -1551 4904 2517 -3326 -2124 1804 892 -986 1124 3058 -878 -4658 156
2000 156 5799 1993 -4081 -2008 2593 776 -1608 2264 2646 -3839 -3827 3359 4508 -1886 -3462 803
2016 803 1166 -1715 15 2859 -52 -4166 -1170 4282 1661 -3780 -1280 3022 232 -2861 57
2031 57 2974 -74 -2830 461 2592 -836 -2695 1237 3082 -1832 -3755 1678 2928 -1644 -1615 1474
2047 1474 -76 -3278 -266 3631 292 -4154 -1604 2709 1663 -1473 -1221 686 -691 -2066 1096
2062 1096 3395 -405 -4186 -459 4342 938 -3109 33 1256 -2221 -703 3718 1026 -3998 -1535
2077 -1535 2782 981 -2023 -1242 375 285 -877 -286 1733 303 -2777 -913 2871 733 -3255 -971
2093 -971 2934 548 -1869 818 1828 -1200 -1531 1763 1689 -1982 -1738 2194 1606 -1334 -985 846 478
2110 478 -1286 -406 1470 -140 -2193 -105 2991 1032 -3203 -1594 2381 1044 -1590 -257 972
2125 972 -503 -799 2051 2424 -1627 -2839 804 2269 193 -805 237 9 -1083 741 2481 133
2141 133 -2944 -1821 1652 2274 -763 -1611 311 218 -955 531 1830 -681 -3130 -161 3067 644
2157 644 -1556 143 1252 -520 -1040 1402 1008 -1548 -469 1597 282 -899 6 1008 613 -992
2173 -992 -1686 303 1630 -348 -1224 1346 390 -2910 -62 3272 -36 -3275 -901 1494 685 285
2189 285 800 -737 -2244 -341 2286 2000 -1272 -2460 -32 1873 766 121 95 -739 -1893 -465 2727
2206 2727 1692 -2673 -2269 1720 1361 -1239 -189 1296 -1209 -2050 974 1611 -190 -1101 -253 857
2222 857 66 -1233 454 1722 -765 -1374 958 896 -1095 46 1977 -73 -2618 -1053 2133 2322
2238 2322 -1324 -2449 850 917 -1458 1025 2428 -2094 -3459 1100 2951 199 -1323 -743 -417 94
2254 94 867 1313 943 -2105 -2341 2104 3120 -959 -2007 486 594 -954 142 2028 296 -2967 -1113
2271 -1113 2810 1098 -2951 -544 2458 -950 -2106 1506 1160 -1572 -580 1016 260 -746 -736 1107
2287 1107 2367 -1003 -2961 1313 2856 -1737 -1313 2748 24 -3034 740 3376 -25 -3011 -1202
2302 -1202 1766 1104 -1030 -133 1101 -1362 -2010 2286 2562 -2234 -2784 978 1708 2 -817 479 801
2319 801 -1434 -1295 2821 1637 -3662 -1689 3917 1605 -2886 -134 2438 -453 -1673 689 1527 -697
2335 -697 -2258 524 2868 -565 -2883 636 1920 -1431 -1372 1777 242 -2134 -168 2396 1134 -1915
2351 -1915 -2044 1843 2303 -2278 -1645 2919 675 -3090 774 3410 -1452 -3463 1310 2406 -1128 -1956
2367 -1956 356 1607 -164 -1715 542 1173 -2166 -1685 2557 1524 -2888 -2042 2488 1909 -1698 -1025
2383 -1025 1444 59 -2619 576 4088 -74 -4359 137 3545 -156 -1880 383 116 -1658 -543
2398 -543 2042 1513 -1631 -2798 733 2634 -1338 -2644 1713 1186 -2946 -465 3555 489 -3251 -472
2414 -472 2486 -74 -2451 269 2654 -51 -2570 206 2699 -560 -1756 1419 980 -2444 -1255
2429 -1255 2457 2128 -1386 -2213 446 1174 -573 -380 1764 -363 -3791 -396 4581 1313 -3548 -1732
2445 -1732 1647 590 -810 1351 1942 -1965 -2719 2017 3842 -416 -2462 408 1148 -892 338 2531
2461 2531 300 -2601 -1234 2168 1756 -1569 -1448 1716 562 -2673 144 3558 -2 -3360 296
2476 296 2334 -1099 -1192 2409 1558 -2030 -1968 1358 2739 431 -1258 -181 214 -807 289 3025 1191
2493 1191 -3670 -2428 2713 2452 -1192 -957 850 -1103 -2284 2028 3853 -1538 -4127 59 2816
2508 2816 424 -781 662 -136 -2050 -351 2730 1781 -1887 -2133 1126 1585 -1074 -290 1692 -352
2524 -352 -2574 -362 2518 489 -2169 -203 1690 -936 -2205 945 2692 -949 -3126 64 1854
2539 1854 -544 -678 1402 27 -2853 -1182 2661 1889 -1629 -1590 439 637 -452 789 1691 -1395
2555 -1395 -3639 185 3768 776 -2814 -965 1471 -562 -1283 1847 955 -2810 -2133 1901 1828 -1163
2571 -1163 -1528 499 247 -903 -165 1130 498 -1457 -785 1803 741 -1827 -325 2124 -111 -2524
2587 -2524 199 2675 -235 -1883 1094 1305 -1851 -1588 1900 1632 -1906 -1952 1019 1295 -137 -219 317
2604 317 -321 -1456 22 2343 792 -2301 -893 2148 1216 -1235 168 1290 -1048 -1421 1709 2166
2620 2166 -1083 -1899 913 2148 -410 -1322 576 700 -930 -382 1557 458 -1719 -389 1855 453
2636 453 -1666 -715 1064 606 -653 289 1327 -451 -1509 970 2282 -688 -2372 591 2174 -129
2652 -129 -1033 909 693 -1373 -632 1496 677 -1611 -614 1146 458 -618 -255 527 49 -920 -281 1018
2670 1018 175 -1398 210 2179 -287 -2496 510 2366 -604 -1531 849 535 -1010 237 1808 275
2686 275 -2003 -1199 1016 1546 -39 -1170 -493 -112 -245 678 1369 -650 -2477 -771 1914 950 -1020
2703 -1020 -377 395 -890 -551 1666 1527 -1525 -1843 723 1340 65 -180 210 -78 -800 -627 1036 960
2721 960 -844 -918 494 58 -802 207 1346 -367 -2001 -718 1250 839 -476 -183 144 -1136 -946
2738 -946 1969 1998 -1283 -2304 -75 1132 890 615 119 -1108 -1413 368 1931 1454 -1228 -2224 -125
2755 -125 1153 544 440 238 -1170 -1809 478 2599 520 -2016 -1136 733 167 -283 1097 908 -1497
2772 -1497 -1258 894 1100 173 -122 -341 -223 -292 -34 1067 1418 -671 -1827 66 1117 -188 503 1163
2790 1163 -1371 -2330 749 2314 546 -1196 -1220 -362 76 714 1480 609 -1764 -2077 761 2586 841
2807 841 -1319 -1273 -308 396 997 1419 437 -2094 -1765 1460 1719 -651 -507 219 -853 -951 1383 1621 -605
2826 -605 -1580 -557 647 415 -267 152 810 -817 -1489 795 1569 -234 -907 -14 -7 -356 618 1339 655
2845 655 -1417 -1992 821 1917 -244 -644 428 -1034 -1380 1635 2435 -807 -2493 -797 953 1040 261
2862 261 -172 -309 -885 -783 1402 2046 -1022 -2075 -1 1221 282 63 629 -183 -1439 -222 1778
2879 1778 757 -1733 -688 1340 -53 -1090 729 1164 -917 -1147 23 458 125 -565 12 797 -472
2896 -472 -1577 642 2091 -505 -1789 520 757 -673 571 1670 -550 -1854 -187 1767 886 -1173
2912 -1173 -733 637 -10 -724 873 1271 -1369 -1897 768 1637 -65 -1276 -273 897 -42 -709 861
2929 861 775 -1554 -1011 1669 1007 -1543 -641 1472 276 -1078 -28 914 -81 -1102 275 1511 -464
2946 -464 -1789 550 1681 -470 -1358 283 777 -535 -448 739 574 -1028 -1057 1089 1526 -1242 -1391
2963 -1391 1292 787 -1308 171 1707 -597 -1713 786 1588 -594 -1543 337 1419 47 -1233 61
2979 61 1154 -340 -924 884 684 -1443 -1084 1326 1422 -1212 -1455 849 677 -901 233 1488 -693
2996 -693 -2151 586 2419 -233 -1708 -57 811 4 -182 813 610 -1239 -1485 1084 2005 -563 -1922
3013 -1922 335 1078 -889 -451 1300 205 -1713 -491 1466 302 -1410 8 1210 -571 -1586
3028 -1586 404 1663 -345 -1338 373 907 -722 -501 1215 977 -1505 -1728 959 1800 -449 -873 241
3045 241 -221 -1012 428 1972 -57 -2467 -917 1600 1037 -656 -419 179 -1148 -1139 1758 1806 -1546 -2051
3063 -2051 495 1326 12 -339 481 20 -1186 -348 1386 1161 -1200 -1346 997 751 -1017 -8 1414
3080 1414 -350 -1974 99 1750 -219 -979 703 634 -1338 -977 1297 1498 -809 -1443 192 855 299
3097 299 145 718 -144 -1781 -688 2016 1610 -1379 -1438 792 507 -387 901 1089 -1651 -2102 1066 2119
3115 2119 -35 -1247 -324 415 -374 -91 1264 546 -1578 -1297 1424 1750 -668 -774 766 327 -919
3132 -919 104 1389 506 -1106 -306 1067 73 -752 595 1266 -848 -1672 729 1538 -286 -758 444
3149 444 62 -1140 -191 1544 750 -1671 -1466 970 1391 -81 -391 132 -346 -1033 656 1999 150
3166 150 -1981 -613 1450 714 -626 156 348 -1337 -695 1610 1213 -1261 -1161 553 645 -488 -420 407
3184 407 92 -740 -627 969 803 -1079 -649 1046 64 -1248 86 1372 -189 -1181 370 669 -587
3201 -587 -489 768 434 -1183 -967 1029 1098 -584 -1106 -134 273 -327 -40 788 -78 -1488 -608 1374 908
3220 908 -1033 -856 563 175 -678 477 846 -953 -1040 729 1187 -461 -961 236 473 -371 -344 510
3238 510 186 -878 -382 1051 522 -1062 -659 837 546 -621 -426 416 167 -445 184 603 -213 -914
3256 -914 195 1353 -9 -1092 340 693 -433 -71 752 42 -862 -84 939 506 -648 -656 517 749
3274 749 -233 -593 423 332 -616 -40 906 -150 -1203 -10 1138 123 -738 58 452 -280 -49 861
3292 861 293 -1100 -288 1160 724 -382 -663 -10 559 305 -174 144 102 -870 -187 1292 474 -1194 -499
3311 -499 740 161 -286 427 153 -581 -298 588 630 -322 -750 171 716 -261 -392 464 482 -471 -302 492
3331 492 168 -478 -194 407 385 -697 -543 727 646 -436 -300 173 -365 -382 772 508 -825 -778 339
3350 339 743 186 -309 -271 -143 -275 253 1035 335 -922 -651 640 756 -16 -544 -250 113 -104 95 727
3370 727 -39 -1209 -277 873 150 -652 124 205 -394 -53 501 72 -280 -164 84 260 -192 -422 426 823
3390 823 -439 -845 323 656 -283 -139 445 -320 -762 375 950 285 -840 -651 240 139 34 402 -195
3409 -195 -1021 -268 706 842 -108 -961 -353 500 527 -159 122 231 -600 -342 1076 512 -991 -470 497 327
3429 327 -123 -101 211 47 -394 -4 625 -157 -750 304 723 -308 -709 223 508 -218 -276 -36 93 -372
3449 -372 -203 757 576 -732 -873 601 950 -408 -593 377 -172 -397 585 745 -269 -1020 -33 835 183
3468 183 -431 -92 92 -200 -72 514 456 -778 -911 461 797 -368 -885 204 820 -426 -410 780 238
3487 238 -1059 107 1085 -30 -925 79 762 71 -282 -116 83 -37 -328 385 633 -547 -1057 473
3505 473 1256 -280 -1017 237 481 -498 -233 900 117 -979 -224 996 551 -825 -346 599 200 -419
3523 -419 159 504 -380 -574 416 905 -308 -970 176 893 -170 -903 211 524 -559 -401 805 371
3541 371 -1266 -605 1039 749 -828 -722 579 382 -362 199 703 -538 -967 413 1190 -214 -1022 66
3559 66 566 -27 -270 329 309 -786 -765 841 1032 -837 -1158 674 713 -755 -467 650 66 -879 104
3578 104 865 -109 -863 266 833 -238 -705 36 658 89 -466 198 465 -424 -546 1071 913 -1129 -1337
3597 -1337 849 1026 -473 -385 650 -79 -934 405 1295 -230 -1393 -239 847 426 -219 -14 96
3614 96 -422 -490 758 914 -650 -1183 542 1126 -256 -551 562 348 -768 -388 920 273 -876 -313
3632 -313 986 179 -1003 -43 861 148 -836 10 714 -259 -375 623 402 -853 -811 660 1119 -396 -781
3651 -781 301 398 -331 -53 824 -45 -1501 -371 1401 702 -724 -491 506 -17 -316 520 542 -788 -998
3670 -998 521 988 -260 -664 91 215 -338 -224 407 389 -642 -559 730 661 -868 -600 1047 318 -923
3689 -923 -133 797 -123 -655 339 512 -779 -642 456 619 -359 -941 63 552 -176 -111 438 -14 -896
3708 -896 -340 1160 656 -1070 -752 663 649 -343 -114 588 -467 -932 522 1067 -448 -970 24 544
3726 544 -81 -294 231 125 -524 -383 653 525 -706 -607 868 421 -717 -334 710 149 -473 52 531
3745 531 -107 -681 259 936 -126 -1132 25 1183 23 -634 294 153 -620 55 950 190 -777 -648
3763 -648 567 653 -200 -439 289 207 -657 117 1073 -106 -1211 41 1006 157 -651 41 626 -176 -382
3782 -382 496 460 -552 -410 768 462 -599 -379 451 289 -279 -151 96 165 -351 -66 852 189 -1171
3801 -1171 -242 1312 359 -778 -44 515 -324 -16 699 376 -574 -636 373 826 -9 -579 36 199 -310
3820 -310 -64 725 27 -979 -190 757 310 -610 -407 528 177 -548 -155 723 -82 -740 331 693 -485
3839 -485 -668 559 771 -234 -470 -32 369 -63 -99 446 -15 -962 -177 1043 518 -774 -490 91 128
3858 128 -151 84 69 -282 -690 80 1059 186 -1268 -286 506 -6 -177 446 -33 -687 -117 556 253 -266
3878 -266 -327 -19 311 -162 -507 408 402 -578 -249 443 -66 -683 92 597 -195 -806 -177 743 236 -398 -132
3899 -132 -5 -319 -49 752 235 -629 -468 257 605 344 -255 -301 -51 -177 175 915 204 -1141 -520 865
3919 865 396 -367 -44 1 -389 -90 370 442 -240 -661 -144 569 200 -303 175 349 -279 -196 503 198 -311
3940 -311 -94 225 9 -312 -167 676 423 -591 -454 252 214 -196 71 242 -522 -566 351 749 65 -632
3960 -632 -464 174 302 234 273 -158 -573 -206 606 559 -196 -618 -153 204 243 189 317 -25 -765 -27 1036
3981 1036 245 -674 -236 393 -119 -133 215 84 -261 -94 31 153 155 -275 11 250 -83 -497 307 450 -113
4002 -113 -308 149 114 -367 316 730 -158 -764 -253 536 538 -203 -201 -148 -159 40 463 446 -251 -690 -197 605 411
4025 411 -393 -258 -177 -206 39 582 145 -746 -444 487 361 -146 -248 156 92 -320 4 429 35 -501 -136
4046 -136 508 -83 -522 107 442 -112 -366 -30 135 -13 -44 154 101 -488 -345 491 627 -434 -516 169 196
4067 196 -262 178 459 -419 -716 185 810 116 -650 -276 248 97 12 59 107 -383 -335 347 595 -252 -592
4088 -592 35 377 -190 -318 480 230 -662 -25 751 20 -719 -90 663 83 -557 -41 277 180 -63 170
4108 170 280 -273 -510 382 607 -298 -709 200 542 -122 -314 358 -63 -664 -124 817 241 -820 -294 639
4128 639 277 -470 -54 339 -144 -453 302 710 -240 -712 206 691 -35 -637 16 363 -152 -179 372 103
4148 103 -616 -308 756 486 -956 -637 601 421 -352 -115 446 -156 -661 290 839 -301 -848 35 617
4167 617 281 -269 -5 202 -317 -337 505 592 -530 -647 481 773 -601 -517 530 89 -795 -9 706 -255
4187 -255 -822 170 722 -98 -690 -70 603 111 -570 10 451 -146 -277 536 421 -658 -753 528 841 -480
4207 -480 -623 355 214 -518 69 869 -246 -1088 -42 1105 281 -637 -374 357 89 -358 402 683 -595
4226 -595 -908 347 917 -213 -615 186 318 -423 -188 462 209 -706 -322 697 296 -762 -29 819 14
4245 14 -803 -130 721 -10 -380 120 304 -316 -465 436 709 -191 -755 83 722 24 -230 326 38 -754
4265 -754 -32 1113 425 -1024 -718 558 396 -207 152 397 -530 -716 680 995 -389 -971 -86 349
4283 349 60 -92 127 183 -378 -466 377 552 -414 -652 533 373 -502 -66 796 2 -663 102 595 -177
4303 -177 -412 261 550 -299 -555 156 813 -112 -556 -125 207 -230 66 560 146 -841 -541 745 606 -317
4323 -317 -448 96 -45 -242 507 808 -518 -991 160 807 119 -331 -130 105 -136 -103 519 505 -603 -718
4343 -718 352 563 -289 -388 329 131 -403 -18 429 100 -389 -124 455 -48 -515 196 732 -183 -917 151
4363 151 578 -171 -164 384 16 -639 -165 596 391 -390 -729 -16 367 65 -102 225 -263 -689 178 772 71
4384 71 -782 -411 450 114 -244 230 201 -722 -453 711 672 -421 -646 105 245 91 -38 152 55 -305 -185
4405 -185 453 278 -489 -253 601 211 -516 112 521 -173 -446 164 255 -249 -226 431 469 -282 -540 225 658
4426 658 -110 -309 165 171 -235 144 573 2 -734 -337 527 492 -270 -292 143 -51 -184 437 479 -472 -770 167
4448 167 804 -82 -448 -16 239 -149 -39 372 258 -413 -392 487 464 -258 -331 149 165 -168 -90 305 71 -327
4470 -327 -97 500 21 -587 -7 570 -141 -462 281 290 -118 -147 382 10 -456 -300 450 408 -200 -607 54
4491 54 432 9 -185 163 -47 -271 24 670 153 -771 -270 517 67 -283 73 18 -357 -210 455 396 -437
4512 -437 -631 75 541 161 -383 -154 294 -142 -145 423 113 -435 -299 362 349 -332 -239 176 129 -150 -4 256
4534 256 -180 -398 65 529 -223 -490 116 384 20 -395 46 166 -24 -200 214 254 -276 -347 235 550 -278
4555 -278 -348 -18 252 88 -3 228 -157 -388 198 566 1 -681 -159 415 371 -63 2 -43 -236 -123 211 297
4577 297 -139 -627 -180 578 262 -341 -174 197 -210 -116 714 135 -557 -235 375 127 -251 2 223 -22
4597 -22 -171 70 182 -107 -333 -6 400 -1 -462 -48 460 102 -445 -49 311 -11 -103 287 -44 -506 -114
4618 -114 427 361 -146 -295 77 141 58 126 76 -121 -426 -53 683 296 -604 -483 233 182 -61 112 153 -404
4640 -404 -223 356 466 -116 -529 -153 178 78 -30 315 6 -323 66 346 80 -403 -175 257 -29 -311
4660 -311 -66 303 114 -220 -98 104 -18 -316 125 404 -278 -463 137 538 -39 -285 -28 -212 -261 217
4680 217 543 -10 -552 -249 403 340 101 -148 -184 -233 -155 398 465 -179 -727 -197 659 261 -334 -133 140 -309
4702 -309 -148 633 110 -399 -295 195 139 -194 -61 174 32 -170 109 407 21 -437 -64 277 -128 -458
4722 -458 239 502 -31 -486 13 330 -73 -98 211 73 -439 -265 611 390 -463 -429 36 210 67 165 194
4743 194 -237 -555 196 733 78 -650 -286 333 61 -192 218 181 -460 -459 418 610 -223 -657 69 411 -253
4764 -253 -82 424 20 -515 0 729 -115 -480 167 415 -35 -275 54 403 43 -258 121 441 -79 -495
4784 -495 272 694 -461 -741 389 575 -266 -212 316 6 -458 124 572 30 -611 -237 595 279 -380 -85
4804 -85 147 -183 -228 196 518 -243 -676 298 858 -55 -649 225 468 -301 -137 610 129 -614 -129 632 258
4825 258 -362 -241 181 -13 -277 -40 515 -32 -776 136 701 -312 -753 209 577 -269 -350 197 373 -188
4845 -188 -365 333 270 -516 -372 638 437 -670 -288 484 173 -314 45 366 -354 -459 326 720 -95 -717
4865 -717 -20 509 46 -420 11 116 -321 -319 585 641 -638 -643 330 549 -188 -283 273 74 -546 184 627 -147
4887 -147 -648 -51 508 68 -313 -41 316 -37 -282 251 565 -259 -653 398 668 -426 -391 500 381 -302
4907 -302 -199 399 -18 -299 113 322 -33 -377 -37 562 183 -505 -170 157 15 -227 279 303 -405 -435 275
4928 275 719 -264 -762 125 343 -145 -44 479 -28 -574 -90 604 257 -289 -202 171 126 -90 155 272 -323
4949 -323 -478 317 558 -153 -382 132 246 45 -207 238 214 -132 -403 316 321 -502 -207 509 222 -434 -79
4970 -79 389 118 -268 168 135 -189 -155 308 371 -337 -296 85 305 158 -268 33 69 -275 -151 491 226 -472
4992 -472 -488 376 385 -295 -202 33 -295 -214 459 471 -301 -388 86 199 39 -258 26 44 -119 -61 201 259 -330
5015 -330 -388 423 357 -403 -392 297 129 -190 -108 287 50 -277 9 291 -126 -354 65 320 -17 -222 -90
5036 -90 85 -126 -48 354 0 -526 -334 433 456 -176 -336 65 237 -227 -30 246 -59 -396 124 468 71
5057 71 -391 -159 115 24 -171 100 56 -272 -157 366 199 -288 -149 149 273 0 -137 167 170 -194 -121 405
5079 405 218 -394 -284 499 98 -347 3 247 -129 -151 115 92 -331 -167 240 242 -149 -182 2 245 -59 -229
5101 -229 59 218 -143 -127 447 352 -389 -278 393 356 -309 -84 88 76 -127 117 180 -191 -154 12 265 20
5123 20 -293 -150 163 79 -51 42 48 -400 -233 420 279 -238 -430 136 366 -11 -152 60 43 -252 6 433
5145 433 71 -422 -33 229 111 -177 -73 29 -103 -209 115 206 -71 -318 199 333 -164 -345 56 437
5165 437 -116 -287 51 179 -249 -44 346 92 -561 -214 438 329 -169 -194 -27 -63 25 132 211 -167 -536
5186 -536 -123 574 263 -418 -243 213 -28 -78 401 260 -414 -486 368 478 -128 -301 40 106 -78 147 180
5207 180 -4 -256 -218 82 137 -205 -159 388 131 -397 -41 403 -114 -153 21 201 -286 -208 304 369 -330 -410
5229 -410 15 320 112 -92 59 -74 -242 56 438 274 -332 -419 224 416 143 -26 -117 -235 -279 227 460
5250 460 -115 -485 -78 330 51 -144 -5 225 -343 -290 306 266 -284 -313 232 234 -205 -96 228 50 -45 -175
5272 -175 5 139 -256 -122 369 131 -496 18 593 101 -439 -29 148 -213 -118 367 42 -362 -430 263 391
5293 391 -56 -337 -181 169 -4 130 194 -70 -468 -150 567 227 -231 -278 100 82 -111 203 294 -299 -370 200
5315 200 294 -168 -265 -23 76 -69 -137 -12 183 -149 -272 197 100 -336 1 384 80 -355 -59 190 76 -88
5337 -88 274 201 -282 -323 302 508 -236 -465 149 266 -97 -123 109 15 -340 8 274 172 -265 -293 136 261
5359 261 -165 -94 240 -72 -320 152 365 -194 -433 133 487 -21 -431 67 298 -292 -128 260 123 -544
5379 -544 -197 470 252 -333 -363 100 189 -76 -18 28 -173 -329 103 566 26 -609 -147 326 -156 -105 355 198
5401 198 -464 -162 394 391 -274 -255 213 131 -313 -179 185 157 -232 -96 272 -87 -302 3 408 -67 -516 164
5423 164 421 -59 -297 70 54 -333 -137 445 337 -541 -452 246 482 -56 -186 80 -24 -240 151 605 103
5444 103 -639 -166 403 195 -230 -58 98 -115 -330 278 550 -319 -618 138 404 -236 -259 319 324 -488 -292
5465 -292 372 218 -315 -120 157 -71 -373 -2 400 216 -431 -164 315 146 -125 113 270 -405 -507 447
5485 447 735 -187 -594 7 246 -151 -19 454 -53 -708 -240 623 416 -243 -521 39 214 -168 36 369
5505 369 -111 -615 31 598 59 -510 -122 136 -315 -340 465 382 -438 -410 369 301 -139 -182 394 200 -326 -218
5527 -218 422 328 -273 -213 145 128 -189 107 500 -109 -691 -36 573 114 -274 -126 -89 -303 -158 505 249
5548 249 -548 -599 202 452 -106 -175 -2 -79 -294 183 627 89 -547 -247 248 207 -66 -14 129 -218 -385 320
5570 320 325 -10 -303 147 186 -139 -246 394 214 -342 -149 245 106 -168 -20 127 8 -394 -22 363 335
5591 335 -289 -266 127 132 2 153 209 -330 -401 385 659 32 -523 -27 -48 -63 104 342 -179 -480 -93 426
5613 426 297 -111 -268 23 103 0 -17 283 -19 -332 7 267 -48 -229 101 159 -97 -194 172 49 -266
5634 -266 -69 125 -2 -267 5 276 128 -310 -212 159 165 -125 -63 45 -66 -242 73 301 -57 -211 -127 175
5656 175 108 -46 77 -69 -172 -56 312 180 -365 -201 233 145 -116 -152 -16 -23 -140 98 204 -73 -242 -83
5678 -83 262 105 -203 -85 -4 55 -23 35 12 -213 -209 374 341 -294 -262 205 179 -21 140 119 -206 -259 75 195
5702 195 107 -144 -227 133 190 -50 -47 131 -69 -161 -17 258 -53 -265 257 189 -176 -244 247 145 -101 42 172
5725 172 1 -155 72 268 -20 -312 -195 235 121 -31 -205 -16 -86 -21 216 196 -228 -452 -16 441 92
5746 92 -113 -109 -77 -119 146 424 138 -299 -232 213 288 -80 -49 88 63 -140 52 339 -63 -178 -172 165 126 -98
5770 -98 -55 232 93 -317 -62 284 -24 -150 81 96 -196 -130 351 111 -183 -379 -3 117 176 32 -49 -114
5792 -114 -317 12 488 306 -367 -498 102 363 15 10 84 -322 -501 286 468 -77 -375 -165 37 44 103 218
5814 218 -50 -336 -131 193 382 -122 -231 49 274 -152 -63 347 115 -263 -301 345 154 -180 -12 247 -223
5835 -223 -332 103 365 178 -302 -128 21 91 30 215 93 -295 -462 302 488 -5 -304 -121 63 -21 96
5856 96 259 2 -573 -118 371 477 -144 -260 111 7 -125 185 354 -259 -427 83 312 -7 -86 34 196
5877 196 -179 -297 147 334 -45 -327 192 302 -156 -196 239 127 -336 -274 246 252 -235 -21 135 -236 -235 263
5899 263 369 -56 -385 -166 192 249 -68 -30 64 -363 -218 378 393 -359 -501 65 329 22 -67 124 -90 -267
5921 -267 93 498 91 -309 -156 163 30 4 -38 221 -158 -157 108 140 -129 -237 213 264 -214 -313 177 229 -108
5944 -108 -168 295 11 -181 4 338 159 -257 -158 278 237 -177 -182 109 -39 -120 188 128 -301 -290 159 316 27
5967 27 -228 -59 100 -209 -120 240 58 -382 -329 346 302 -466 -140 214 33 3 128 158 -187 -193 231 200 -74
5990 -74 -245 132 250 -28 -164 6 99 -254 -214 217 214 -261 -325 225 241 -185 -188 171 42 -173 43 292 -100
6013 -100 -114 117 156 -115 -162 1 143 9 -267 112 152 -150 -191 225 220 -419 -340 360 326 -162 -177 189 -71
6036 -71 -120 52 233 -143 -411 88 424 86 -199 -35 142 -135 70 303 96 -312 -349 272 329 -215 -385
6057 -385 165 176 -239 -15 325 44 -381 -101 300 51 -207 -91 240 36 -218 94 308 -110 -135 201 108
6078 108 -219 -101 291 202 -194 -250 82 210 -44 -61 164 37 -332 17 540 94 -549 -125 309 89 -140
6099 -140 44 -26 -361 -208 420 313 -80 -326 35 203 77 8 79 105 -317 -24 404 287 -403 -296 351
6120 351 148 -280 1 218 -69 -319 55 277 -142 -255 67 240 -151 -215 114 372 -52 -333 -51 141
6140 141 -147 -2 255 67 -372 -284 412 230 -162 -161 108 82 -48 133 348 -206 -476 -5 373 55 -291
6161 -291 -27 124 -96 -69 290 93 -339 -160 202 266 -133 -271 158 151 -289 -28 371 131 -459 -167 254
6182 254 44 -266 23 335 -66 -253 -62 186 47 -42 190 42 -223 -121 133 274 -140 -352 -68 209
6202 209 9 -101 103 -84 -308 -104 452 91 -407 -117 204 17 -176 -38 112 -258 -85 160 269 -50
6222 -50 -323 -40 255 46 -203 -18 126 -117 -104 191 58 -194 4 342 184 -179 -163 156 15 -45 44 24
6244 24 -13 -112 99 238 -49 -267 -120 141 41 -83 -47 -5 -81 -52 175 40 -228 -185 120 198 -116 -66 50
6267 50 -16 -236 28 263 -33 -243 1 132 -9 -90 118 110 0 98 -28 -98 -60 -31 208 84 -174 -105 68
6290 68 243 3 -43 84 -92 -210 99 232 -27 -352 -51 304 65 28 -18 -90 -77 31 6 57 -71 -135 63
6313 63 91 74 -171 29 19 -33 -67 115 31 -137 -107 211 -52 -165 48 201 216 -40 -100 19 52 -39 -33 -13 -47
6338 -47 -113 16 255 58 -237 -43 44 31 60 134 -5 -270 -55 183 133 -156 -166 -46 90 122 -65 150 -184
6361 -184 -161 4 150 45 -213 -72 11 24 15 54 46 -52 -91 71 166 22 -50 158 243 -84 -109 133 153 -168 -191
6386 -191 189 -22 -121 83 203 -102 -242 -118 136 62 -17 -44 -104 -47 -76 153 221 -119 -333 -16 262 32 -76
6409 -76 107 16 -278 -21 302 75 -191 -140 148 57 -90 -53 128 30 -190 -69 48 -5 -126 -59 167 -43 -217
6432 -217 9 170 92 -244 40 144 -133 77 190 -69 -350 -148 267 229 -120 -274 5 8 -54 138 156 -166
6454 -166 -392 65 367 190 -234 -160 53 -30 17 117 212 -77 -221 136 306 -78 -342 125 149 -109 -64 133
6476 133 41 -264 -64 160 55 -286 -83 265 71 -170 -114 153 93 -133 -32 122 -142 -163 140 275 -64
6497 -64 -359 78 281 -32 -63 163 -2 -320 -6 334 186 -371 -309 175 188 -90 -42 129 24 -319 8 247
6519 247 -40 -475 -51 329 55 -146 81 145 -159 -123 115 125 -143 -173 297 219 -200 -164 294 273 -210 -117 78
6542 78 127 -131 72 189 -18 -385 -97 394 142 -181 -46 69 -85 -122 281 252 -299 -313 125 227 -129 -120
6564 -120 13 91 -133 -21 179 90 -269 -38 242 102 -55 -68 141 -61 -202 -120 246 -1 -210 59 204
6585 204 -134 -235 197 436 -194 -219 25 -39 -70 9 142 -49 -280 -119 269 163 -231 -109 29 49 -71 150
6607 150 275 -179 -349 119 320 37 -246 -67 144 -99 -30 189 118 -325 -9 243 177 -281 -180 114 89
6628 89 -176 -107 188 67 -122 -154 287 -15 -229 48 271 -235 -323 26 275 -48 21 50 -112 -283 26 276
6650 276 39 -230 -290 220 191 -41 12 56 -107 -205 97 318 28 -309 -90 215 85 -32 32 97 -240 -301 210
6673 210 188 -176 -182 272 47 -244 -15 242 143 -328 -11 280 23 -217 33 159 -9 -257 -31 316 59
6694 59 -178 -2 147 -46 -201 324 132 -373 -283 248 224 -103 -170 -17 -95 -40 110 239 -191 -293 -210 303
6716 303 176 -111 -45 90 -60 -175 164 269 -69 -257 77 144 -159 -133 188 87 -285 -174 209 84 -221
6737 -221 -19 254 -124 -143 -7 286 -19 -282 -157 145 97 -26 81 67 -115 -307 218 429 -201 -215 -13
6758 -13 181 -179 -57 236 -62 -246 -117 289 156 -362 -94 167 8 -140 290 180 -97 -237 106 293
6778 293 15 -207 105 168 -84 -149 142 276 -203 -165 180 149 -167 -93 194 113 -395 -107 267 19 -118 9
6800 9 28 -69 -191 73 303 -34 -355 -118 152 76 -147 -54 81 -93 -131 281 141 -274 -226 167 119 -210 -61
6823 -61 122 -168 -224 -54 266 83 -260 -23 139 128 -181 -44 155 140 -235 -77 157 71 -242 141 245 -160
6845 -160 -332 134 195 -188 -89 27 45 -26 66 129 23 -284 -202 230 54 -53 -75 32 -53 -93 46 74 -93 -140
6869 -140 -37 238 40 -204 -48 208 -62 -76 199 104 -163 -164 226 139 -138 -63 183 2 -155 8 144 52
6891 52 -51 -91 90 -102 -236 42 247 98 -130 -8 98 46 -133 52 83 -280 -145 262 235 -83 -231 -142
6913 -142 7 48 73 141 7 -81 -130 82 137 -92 24 54 80 -139 -17 39 27 -272 -3 38 -160 -20 148 21
6937 21 -185 -47 -60 62 -6 -40 55 -45 -44 98 125 8 -197 -142 119 199 -68 53 -44 -30 -26 45 288 -40 -270
6962 -270 -25 205 55 -91 28 -72 -80 -55 116 63 -150 -93 80 53 50 -28 54 19 -172 90 153 16 14 13 -33 2
6988 2 -158 61 359 65 -224 -21 117 -50 75 146 39 -137 -53 192 117 -124 -99 -79 152 122 21 29 -19 -239
7012 -239 -29 170 198 -221 -116 56 23 -13 -12 80 -205 -211 21 160 -74 -133 -90 13 -68 -38 111 19 -160 -116 83
7037 83 112 -92 -38 139 -61 -187 31 155 28 -114 -2 188 7 -144 13 242 -121 -299 171 209 -32
7058 -32 -69 -43 -109 -171 12 224 -26 -207 -194 101 169 -68 -99 163 -31 -68 82 357 70 -253 -72 246 168
7081 168 -66 -2 93 -183 -158 164 172 -25 -220 1 28 -86 -155 83 144 -54 -125 3 72 -179 7 253 -124
7104 -124 -231 -53 332 67 -288 56 67 -51 -38 57 -3 -187 -36 166 232 -117 -120 -9 63 -85 -29 221 -62
7127 -62 -233 -76 296 27 -166 -146 161 25 -116 88 132 -16 -225 46 284 12 -145 109 80 -142 -73 150
7149 150 141 -154 -178 138 58 -233 -54 238 109 -242 -46 256 47 -191 -26 102 13 -140 43 206 -174 -294
7171 -294 71 283 -120 -62 72 59 -178 -76 194 197 -154 -269 211 206 -86 -118 105 89 -213 36 299 -34 -352
7194 -352 -29 277 -31 -263 66 175 -65 -117 71 126 -34 3 155 148 -25 -254 71 127 -130 -99 110 138 -189
7217 -189 -77 209 -50 -226 -29 269 -64 -296 -23 79 -22 -56 183 198 -146 -146 -28 212 -148 -268 70
7238 70 68 -98 5 134 3 -275 30 183 68 -264 -73 143 44 -128 23 133 -27 -210 50 122 -95 -199
7260 -199 -18 203 -47 -158 108 -63 -117 -79 195 88 -269 -60 208 51 -248 62 213 76 -136 -48 185
7281 185 12 -168 78 196 0 -225 -42 69 -106 -50 32 150 -153 -40 133 -53 -170 -26 305 183 -149
7302 -149 -200 186 70 -55 111 208 -64 -239 43 239 -206 -107 21 84 -58 -107 193 -3 -160 -65 71 126
7324 126 -125 -64 88 130 -17 -32 152 1 -232 -34 247 53 -173 117 195 -68 -131 294 59 -43 -36 85
7346 85 60 -76 -48 132 79 -214 -57 108 95 -103 -142 89 -19 -142 25 98 34 -247 -40 145 199 -136 7
7369 7 32 -139 50 194 132 -95 -176 114 141 17 -40 -4 46 -9 28 166 76 -103 -130 150 40 2 74 204 -141
7394 -141 -214 50 166 -51 -121 62 146 -139 -99 186 177 -37 -112 193 0 -58 -94 106 -52 -112 -205 255 32 -196
7418 -196 -174 43 121 -21 -32 201 -149 -216 182 297 31 -106 -33 55 62 -65 113 58 -130 -50 97 136 -111 -122
7442 -122 7 64 -52 -28 151 -28 -143 -127 138 -40 -152 -1 193 -36 -108 65 151 -141 -171 118 89 40 -54
7465 -54 141 -24 -131 -78 220 6 2 -29 149 -34 -15 -25 166 -21 -80 -65 124 129 -83 -54 165 -35 -113 225
7489 225 27 -176 -189 62 76 -31 -55 -10 -67 103 124 184 86 -60 -119 170 137 -57 -71 194 3 -166 70 214
7513 214 23 -195 38 110 -115 -207 131 136 -172 -50 67 17 -72 -168 -13 29 -89 -26 143 91 -15 -20 -13 -14 -65 -93
7539 -93 23 -86 -156 28 124 -101 -168 -43 114 33 -117 -92 91 -62 -24 138 31 -11 -50 -13 82 36 -17 -27 -9
7564 -9 -92 58 25 -5 -72 -9 88 -11 -71 -99 117 16 -171 -64 96 -39 -18 97 -10 -63 -66 20 144 -46 -18 -93
7590 -93 52 44 11 4 -7 -143 -102 156 23 -148 -18 214 25 -58 77 -67 -116 -16 77 113 95 -75 -132 55 118
7615 118 -91 72 -28 -29 42 148 165 -128 -107 2 -53 68 123 182 51 -97 11 210 -36 -44 -16 95 -66 -175
7639 -175 210 128 -59 -84 -50 88 -6 -6 5 4 -95 -98 90 61 -94 -62 -8 68 22 105 52 -45 -224 -37 214 82 -166
7666 -166 64 73 -56 -138 65 105 -124 -109 29 130 -38 -178 -84 71 -74 36 13 149 -258 -95 63 127 -67
7689 -67 -164 54 -45 -93 128 60 -55 -205 -24 158 55 -19 81 13 42 -47 64 183 -114 -85 32 149 -155
7712 -155 -94 125 7 -198 -22 122 -119 -110 -95 92 1 -133 90 184 -88 -113 28 131 -33 -114 127 37 -186
7735 -186 -14 153 38 -274 -226 142 -19 -38 -34 68 -26 -164 -22 190 -73 -169 27 53 34 -193 24 126 -103
7758 -103 -160 107 179 25 -94 80 73 -214 -111 88 126 -188 -96 213 139 -55 -62 57 -68 -138 -4 141 77 -118
7782 -118 1 73 8 38 -50 36 -29 -73 180 216 -79 -195 83 45 -93 -115 235 17 -129 -48 259 14 -204 69
7806 69 186 -113 -208 -48 187 -38 -160 117 135 -81 -133 61 97 -38 -172 49 60 -143 -97 220 158 -117 -5
7829 -5 208 26 -173 -24 157 29 -133 -31 100 0 -102 16 188 -143 -129 169 212 -82 -133 73 166 -71
7851 -71 -64 13 40 -109 -50 120 -58 -126 -89 199 -13 -109 -3 110 -71 -268 27 79 -162 -226 -43 70 -140 -112
7875 -112 1 0 -143 -81 -18 132 -56 -46 53 82 -27 -137 217 96 52 40 73 -57 -152 106 51 -105 -146 46
7899 46 168 6 -69 100 120 -64 0 47 73 -122 35 60 129 -45 -127 80 30 -82 -45 175 -107 -224 16 190
7923 190 76 -103 5 74 15 -26 91 85 -79 -63 95 101 -203 -18 -20 58 -53 -8 95 -26 -48 -37 82 -71 -125
7948 -125 99 84 -93 -207 -57 149 34 -58 -3 91 -14 -47 110 72 -77 -87 -40 98 14 45 65 -114 -159 26
7972 26 149 55 -106 1 13 182 -5 83 -75 -148 -46 152 158 -77 -163 8 94 -75 64 32 1 -159 -226 51
7996 51 87 -59 -18 151 -52 -102 -17 234 -14 -127 14 22 -75 -39 90 138 -126 -95 84 108 25 37 -82 9 2 55
8022 55 121 -4 -104 -56 151 18 -133 -37 64 -23 -140 -4 159 -32 -158 50 106 -14 -56 30 97 91 -126 30
8046 30 -32 -26 -80 -21 -17 -89 -61 36 17 -113 -63 103 62 -88 25 72 29 -26 77 61 -36 -69 -96 -92 -129 -41 25 -34 -8
8075 -8 -79 65 62 4 -75 42 32 -158 -42 86 6 -12 -128 38 80 27 -41 41 68 -131 -12 119 -13 -61 -6 -25
8101 -25 -176 -165 46 22 -36 -55 -14 73 -22 -59 65 -31 -41 -10 -43 1 -99 33 43 20 -82 15 19 -70 -11 -51 6 -50
8129 -50 -55 102 -19 -39 -49 39 -51 -44 4 -14 107 3 -38 59 178 -72 -62 84 46 -83 -105 -96 14 -4 126 120 -165
8156 -165 -125 117 102 107 -55 -50 -56 -99 -34 71 63 -194 -159 83 122 -1 40 -23 9 -82 0 38 40 -124 2 88 58 -62
8184 -62 82 70 -11 -167 -81 79 22
8191B2
$$ Imaginary data points
##PAGE= N=2
##DATA TABLE= (X++(I..I)), XYDATA
0 0 0 0 0 0 0 0 0 0 0 0 -8 8 -8 8 -16 16 -18 24 -32 40 -42 50 -64 72 -88 98 -114 135 -153 177 -202 230 -259
33 -259 296 -332 377 -420 473 -527 588 -654 726 -805 893 -989 1091 -1202 1328 -1464 1610
50 1610 -1774 1955 -2157 2379 -2628 2909 -3232 3601 -4031 4539 -5148 5899 -6845 8082 -9775
65 -9775 12243 -16179 23448 -41290 176175 130279 -242451 73726 96394 -107150 6398
76 6398 115559 -58829 -57587 -28358 -20482 99014 67470 -108662 11260 74833 -87574 -662
88 -662 143305 -43775 -97162 24762 -10955 2838 67365 -52634 -30089 97225 -39986
99 -39986 -73885 152996 67177 -143243 -3463 72307 -72008 -19173 66118 -13114 -30662
110 -30662 -32753 -32329 95904 64435 -106691 -13323 74708 -88047 -40827 140418 -8504 -142183
122 -142183 7805 49668 -9065 30952 -4835 -49005 13350 -15706 -23793 90537 14264 -128992
134 -128992 -11021 69468 -34252 -10331 44404 -41533 -36684 29875 -4507 17146 33939 -72660
146 -72660 -36300 78387 -22689 -73551 61654 28831 -91984 -11880 61092 -9682 -29296
157 -29296 4335 3128 -4119 -30027 -16063 59812 13229 -81000 -261 53627 -33905 -9586
169 -9586 57043 -21735 -52988 18123 17379 7433 23453 -34227 -40674 38135 7361 -33712 38569
182 38569 11474 -76375 570 68179 -6036 -31526 3264 -1975 3069 10174 -5554 13023 8904
195 8904 -39914 691 59786 -7253 -41253 27960 21037 -25495 4115 17127 -8226 -4662 1087
208 1087 7487 15554 -17188 -19780 36778 17238 -45668 -1013 41163 -14772 -16980 31489 4617
221 4617 -20934 3758 7375 9887 12150 -18779 -11684 29850 9253 -17586 14216 11376 -25171
234 -25171 367 29054 -102 -16429 -4006 11563 21275 -7659 -23535 19067 15096 -31793
246 -31793 2963 38242 -22195 -36098 34175 29374 -24938 -9994 9033 -7168 3097 12124
258 12124 -1000 -1464 -8743 -9945 22790 22967 -20529 -22210 9879 8414 -2349 10278 9785 -12636
272 -12636 -20167 2281 28912 7270 -36445 -13340 25760 -1206 -14242 17596 6845 -23264
284 -23264 -6976 12017 2803 -3447 -4806 -2324 8793 -3671 -15396 19134 21675 -28259 -16197
297 -16197 25584 -2770 -21295 18824 22180 -19519 -24782 5730 19525 5827 -13498 -13026 59
310 59 -4200 -1385 25323 13045 -30885 -25143 10870 19995 8777 -10750 -17697 -1390 5279 5134
324 5134 20758 9546 -33981 -23373 28847 19318 -16862 -540 9693 -17034 -13316 18414 21249
337 21249 -9273 -27774 -4041 19672 2458 -10968 7873 8209 -18105 -13322 13146 9806 -4550
350 -4550 -4220 -1800 1062 -1644 -2406 19089 16813 -26726 -26274 19920 18722 -10465 1926 10638 -18912
365 -18912 -17339 22577 26705 -5365 -25355 -17301 9052 17808 1318 -3037 -1481 -17484 -15296
378 -15296 20809 29686 -10824 -30022 -1102 15081 2310 2084 10962 -5471 -26302 -3631 31393
391 31393 13425 -20293 -8473 12228 1847 -8090 5596 13931 -3628 -18932 -6883 13098
403 13098 9789 -9316 -5799 10669 -4453 -20230 8700 27143 -5598 -25720 -575 10196
415 10196 -6652 2596 21360 -1953 -27475 -6641 25982 21574 -10043 -18811 1596 5019 -5758
428 -5758 8672 20995 -8820 -31497 135 30586 10911 -15628 -12679 882 2359 -3520 7862
441 7862 15416 -15231 -28453 13161 26483 -11969 -15045 14014 2840 -16421 4602 17323 -693
454 -693 -11042 -5702 6240 9580 -8952 -7577 19755 8509 -21761 -4560 19810 2167 -14167
467 -14167 -1175 5834 -5434 -9824 6426 20245 -4301 -30010 1238 24554 -8949 -12190 16127
480 16127 -4325 -24338 8941 24753 -370 -14848 -10805 3687 17738 465 -15782 9465
492 9465 9735 -21162 2648 29114 -11617 -27710 9428 13622 -7189 -3615 4139 274 -4168 -6075
506 -6075 4461 10713 -13838 -18349 18467 15437 -19369 -5944 15567 1063 -5152 781 160 1020
520 1020 -5907 -5427 18850 12076 -25815 -8866 28585 131 -22714 9553 9371 -16453 993
533 993 16501 -378 -9233 -5501 4909 11993 -6348 -13772 11627 10239 -14813 1696 20889
546 20889 -6909 -16737 8399 10646 -84 -5238 -9461 9162 19064 -9006 -9456 15480 -4607
559 -4607 -18327 19849 19975 -23677 -12684 20733 6550 -6523 3027 -1481 -5902 -2667 -157 12656
573 12656 7788 -20102 -8951 22547 6857 -16170 1444 9099 -9151 -5077 12517 10250 -3378
586 -3378 -11291 1532 17488 -1969 -16691 9899 12442 -15802 -4507 17542 -2133 -14328 5526
599 5526 8279 -7538 -10528 -3696 9911 11208 -14899 -15087 15592 4949 -17534 7153 15639 -18857
613 -18857 -17858 18401 17906 -8630 -11922 233 3504 -2397 -1509 11226 1095 -26861 -8147 28585
627 28585 6979 -23408 -5117 7780 -7084 -6130 8072 5716 -8278 -15865 -2011 19615 4531
640 4531 -23393 -3106 17788 -8739 -14821 14343 8904 -16597 -7783 11713 4378 -12264 -5815
653 -5815 13740 6225 -20141 -9354 21666 5429 -20979 2335 15207 -12965 -14148 13839 15100
666 15100 -7864 -19559 -3016 18343 5462 -15743 1559 12322 -16484 -12618 28312 13064
678 13064 -28769 -10300 19383 5650 -6245 3148 6224 -3727 -10330 4011 21151 2531 -23613
691 -23613 -3122 24420 2857 -17047 4947 14010 -8324 -13060 8660 15848 -7994 -17168 12907
704 12907 19679 -15479 -13980 21806 11216 -20098 -2319 20661 -430 -13338 8525 17452 -2018
717 -2018 -16643 -1284 20725 6071 -17546 -309 15602 -5393 -9674 15027 11650 -16704 -15065
730 -15065 11972 17120 -4396 -14995 3581 14246 -6598 -8113 17674 4889 -23997 -1915
742 -1915 24669 2551 -16407 1261 13466 -1060 -10296 2273 11503 -4129 -16865 5942 21829
755 21829 -7249 -21172 8667 16241 -8744 -12615 5126 5869 -8546 -4578 13004 4770 -17840
768 -17840 -6775 17820 3604 -18939 -2724 11507 -3851 -6010 7122 4693 -5883 -9828 -706
781 -706 13923 2141 -19174 -2133 18874 -2701 -16123 8403 10161 -15732 -9177 13230 3625
794 3625 -14033 -7127 10060 7711 -10355 -8491 7628 -993 -12013 5027 11731 -10104 -13328
807 -13328 9043 13126 -3466 -11033 -3948 6229 4020 -6020 1791 8252 -9738 -10147 13723 10329
821 10329 -11902 -9536 3473 1961 -1637 1677 3013 -1824 -8551 -2526 12773 4104 -16288 -3424
835 -3424 13782 -702 -7960 5989 5925 -5614 -4481 3833 5345 -1773 -6359 3315 10416 -4694
849 -4694 -10953 9061 9985 -9207 -3577 7437 -4259 -6659 8610 9495 -4701 -9737 -1095 7426
863 7426 5466 -2961 -3612 1241 -2319 -2411 9825 8930 -8060 -11683 2673 12634 4291 -6905 -1789
878 -1789 3239 -4000 -308 12862 3381 -14635 -4710 11483 2439 -4724 3306 1074 -6151 -1216
892 -1216 4860 3425 -2117 -5797 340 6398 -1303 -7175 3875 9042 -4782 -8183 5059 5804 -3221
907 -3221 -510 4937 -726 -7633 -1222 9783 5161 -6746 -5767 2175 1989 -342 4083 2696 -9634
922 -9634 -8900 6587 10698 -1145 -8760 -3874 2851 1388 334 3927 165 -8844 -5287 9421 10034
937 10034 -5536 -8612 2820 3281 -2091 1409 4326 -1928 -6092 1555 7199 -601 -6097 423 3807
952 3807 -2816 -5884 2249 5789 -2152 -4665 1754 2689 -3295 -4801 3790 7680 -5100 -10755 4092
967 4092 10526 -1274 -4482 3007 -2408 -7218 6723 11436 -4580 -9077 605 5050 4341 -48 -4401
982 -4401 -1831 -490 -3247 3081 9785 -2880 -13960 1366 11637 -2051 -7735 1479 1855 -3672
996 -3672 -1103 6344 4589 -6372 -5449 6559 5593 -6136 -4407 6106 2906 -4243 1268 4077 -1943
1011 -1943 -2971 1772 4920 -987 -9550 -701 12600 1667 -11486 -893 7330 -3800 -5949 6038
1025 6038 3531 -8106 -4889 6126 8110 -1846 -9218 302 6644 -3726 -3048 8318 474 -10247
1039 -10247 1916 11960 305 -8892 -2293 4671 3422 -3757 -3727 6388 1913 -9932 2707 12371
1053 12371 -8032 -13675 7939 10276 -6531 -6253 3988 2689 -1871 -826 2814 2142 -6782 -6134
1067 -6134 10542 8994 -9740 -5959 8168 2412 -5153 1460 5500 -3126 -9139 1641 13706 2161
1081 2161 -14976 -2306 14085 -2555 -11645 7124 5998 -10558 -2631 9134 1573 -5198 -3320
1094 -3320 1849 5282 -2631 -8424 5383 9392 -8128 -4875 11822 -847 -12467 5558 11830
1107 11830 -4613 -10449 -169 8881 4435 -6767 -3224 6252 -3464 -9675 8621 11186 -12230
1120 -12230 -11998 8045 6992 -3057 -2420 -254 -969 -3911 -1068 10072 4972 -13985 -6998 13810
1134 13810 4676 -10568 1627 7554 -6226 -5986 6051 6243 -2249 -7867 -676 9098 -1690 -10734
1148 -10734 4775 9038 -8569 -7513 7347 2394 -5767 1360 3820 -1972 -4507 -2857 6989 8471
1162 8471 -9553 -9907 9766 4057 -8936 6158 10896 -11070 -12226 9925 11643 -3304 -7494
1175 -7494 -1974 2872 2114 -33 5065 2468 -11281 -5516 11764 6562 -7118 -4599 2514 1226
1189 1226 -1649 1764 5956 -468 -10604 -2471 12948 3006 -10272 3084 9064 -6263 -5385 7843
1203 7843 4955 -3737 -3450 1895 4290 -1167 -3337 6554 6827 -9291 -8495 9389 5996 -6613 203
1218 203 4031 -5321 -3824 7158 8865 -3237 -12988 -1920 12131 3779 -5875 3005 4069 -8963
1232 -8963 -3016 13258 5521 -9775 -6430 2770 5684 2045 -1606 1332 -391 -7819 -425 10766
1246 10766 286 -11719 -1291 8243 -219 -5063 2505 4748 -3662 -8268 1874 9586 -3096
1259 -3096 -8863 7413 6916 -11676 -5364 11839 3292 -9173 -2331 3642 -876 -1410 2609 3664
1273 3664 -1936 -10141 -3037 11170 2326 -11016 -1239 5506 -4311 -3035 8708 3333 -11747 -9371
1287 -9371 6040 9676 -2628 -8619 1207 4013 -5219 -823 9633 -992 -12357 -1351 8931
1300 8931 2351 -5590 -1869 4588 -368 -7429 695 9026 -3294 -11345 5052 9952 -8060 -7696
1314 -7696 8775 3881 -9533 -4992 5206 3664 -3253 -2448 4847 2177 -7436 -2003 11006 3085
1328 3085 -11426 -3092 7905 1231 -2163 3585 2597 -4844 -5704 4793 10530 -2812 -12607 1355
1342 1355 10822 -3033 -6469 7577 3206 -11662 -1919 12507 3400 -8670 -3498 6452 4084 -4382
1356 -4382 -1018 6068 -570 -6592 3123 9026 -2062 -6552 4265 6844 -2644 -5217 2044 6053
1370 6053 -1327 -6401 3709 7324 -6398 -5619 10244 5605 -10331 -4455 8655 3082 -4741 -757
1384 -757 2255 -276 -2231 1006 6442 625 -9182 -176 11100 484 -8387 2130 6005 -4734
1398 -4734 -3694 7644 4127 -7232 -4672 5976 6063 -4783 -6137 4281 3297 -5313 -985 5420
1412 5420 -1501 -6594 853 6135 19 -6016 -1996 4865 3021 -4136 -1746 4156 -1986 -5506 5062
1427 5062 6026 -6381 -6303 5354 6408 -3247 -5005 1996 1960 -4300 -2191 5333 1700 -7823 -2584 7381
1443 7381 1222 -6287 -1090 2353 -1511 -2254 1350 2190 -1652 -3516 1500 4735 -1848 -6917 1407
1458 1407 6917 -2169 -5138 3381 3060 -3730 -775 4533 -471 -6881 -1646 6063 3048 -3967 -3434
1473 -3434 1344 1879 -1234 -201 1803 -2670 -5371 1622 6991 869 -5585 -1001 3362 -1087 -1440
1488 -1440 4063 1023 -5875 -1971 6799 4686 -4160 -3479 2376 1518 -1948 -611 1931 437 -2119
1503 -2119 -211 2718 535 -2596 -1062 2378 43 -4533 -95 5174 177 -3090 1799 1465 -3906
1518 -3906 -1121 5307 2443 -4711 -3335 3155 5120 759 -2364 -356 -654 -3048 2128 6451 -605
1533 -605 -6311 -1529 3595 2819 536 -1719 -3055 -1995 215 3111 4369 -2058 -6750 1050 5583
1548 5583 -1270 -2455 2293 -265 -3678 627 4700 1707 -2335 -2230 1059 1850 -1408 -1119 3033 854
1564 854 -3411 -549 2228 263 -594 143 -162 -2173 -3165 1898 6048 -807 -6375 -531 3481 -1252
1580 -1252 384 4328 -2564 -6656 1183 5630 2932 -1021 -4790 -2508 3557 2525 -302 1675 -1145
1595 -1145 -6047 559 7618 858 -5225 -1515 579 -519 782 2217 1033 -3485 -4341 2464 4832
1610 4832 -1978 -3688 2158 1469 -3251 -195 3857 868 -2061 -1210 692 1838 -632 -782 3424 609
1626 609 -5779 -1080 5760 1788 -3130 -646 320 -2430 -1 4548 2375 -4748 -6426 1494 6683
1641 6683 141 -3715 831 -218 -3683 1692 6345 635 -5737 -3593 2711 5028 773 -3243 -510
1656 -510 845 -2718 1132 6700 -1091 -7418 785 5312 -1207 -3198 1923 1680 -3725 -2936 3005 3433
1672 3433 -1912 -2812 2236 2069 -3960 -1904 4653 2483 -4117 -3488 2702 3846 -1111 -1126 3117 -926
1688 -926 -5925 1400 8082 -159 -7239 -284 4105 -783 -511 3361 -220 -5604 -3154 5167 6413
1703 6413 -2723 -6979 420 4622 -853 -2068 3074 312 -5656 -310 7044 2611 -4634 -2380 3431
1718 3431 1196 -3491 947 4507 -2148 -4831 3071 5497 -2241 -4653 2393 3439 -3391 -3965 2795
1733 2795 4262 -2497 -3814 2874 2370 -4311 -1444 5306 1052 -5912 -2406 5407 3678 -3381 -2269
1748 -2269 2685 -341 -3912 2573 6343 -3531 -7201 3955 6700 -2491 -3792 1380 470 -2884 -771
1763 -771 3669 2030 -4550 -4482 3886 5095 -3832 -5056 2910 1582 -4191 437 4901 -1027 -5450 1064
1779 1064 5757 -904 -5883 757 4808 -1622 -3360 2951 2722 -3924 -2521 3889 1913 -4056 -3498
1794 -3498 2742 4432 -2817 -4802 3251 2960 -4823 -1683 5108 -999 -6208 1609 5884 -1165 -4372
1809 -4372 514 2870 -155 -2465 848 3105 -2570 -3455 4895 4681 -4927 -4553 3816 3600 -2478 -1936
1825 -1936 1697 617 -2354 -430 4384 1322 -6387 -2434 6312 1777 -4894 55 3248 -1849 -1932
1840 -1932 3849 2895 -3791 -3704 3224 5044 -1491 -3737 2586 3041 -3305 -850 5058 759 -4452 -868
1856 -868 3810 2071 -2743 -2118 3122 1958 -3882 -1120 4968 -264 -4959 2965 4453 -4615 -3140
1871 -3140 5340 2970 -3521 -2551 2067 2544 -340 -923 1934 1039 -3808 -1196 6450 3040 -6107 -2926
1887 -2926 4188 1755 -1905 536 2005 -2665 -4327 2948 6148 -2096 -6235 623 3384 -1539 -920
1902 -920 3482 -637 -5030 -60 4902 2278 -3351 -3402 2453 2675 -3046 -1184 4430 179 -5195 184
1918 184 4617 -1117 -4020 1360 2400 -2541 -3379 1789 3798 -1923 -4440 1381 2268 -3642 -1309 4814
1934 4814 565 -6213 -1834 5042 2467 -3030 -2353 656 -42 -1746 1620 4399 -1893 -6684 493
1949 493 6037 389 -4320 -744 1252 -2330 -930 4679 1800 -5832 -4004 3889 3218 -3403 -2090
1964 -2090 2726 -315 -3389 1037 3998 -68 -4203 -1519 3378 1404 -3174 -347 4134 -50 -4321
1979 -4321 1217 4422 -1947 -3228 2908 1721 -4073 -1006 5059 2080 -4136 -2820 2258 1396 -1383
1994 -1383 -6 1838 -1122 -3600 1043 5715 1006 -5176 -2257 3412 1858 -1588 1245 2540 -2606
2009 -2606 -2811 4178 4441 -2640 -4070 1388 2658 -721 -156 2532 43 -3595 -652 4149 1359 -4269
2025 -4269 -1578 3509 918 -2542 206 2967 -127 -3015 140 2757 -553 -2302 1583 3415 -1303
2040 -1303 -3125 1928 3450 -1640 -2272 1675 923 -1978 349 3697 172 -4249 -1197 3326 1592
2055 1592 -2087 -1674 855 325 -1113 1146 2586 -1140 -4168 -267 4363 986 -3687 -484 2243
2070 2243 -1029 -777 2993 604 -4068 -1342 3601 1442 -2397 -1111 1005 478 -736 -464 1002 5
2086 5 -2467 -715 2705 679 -3168 -1359 2794 645 -2764 -102 1689 -1066 -1561 1438 1742 -1868
2102 -1868 -1753 2043 1612 -1732 -1245 1193 953 -870 -375 1278 -238 -1975 -51 2451 471 -3180
2118 -3180 -1424 2799 1200 -2330 -919 862 -337 -878 1279 1523 -1754 -2566 1323 2682 -256 -1612
2134 -1612 -144 471 -383 737 2191 -247 -2616 -796 2377 2142 -1126 -2181 433 981 -531 396
2150 396 1280 -954 -2745 132 3075 271 -2636 -377 1510 -136 -1067 1115 1058 -1565 -728 1702
2166 1702 551 -987 152 1229 408 -874 -1130 680 1706 -250 -1532 783 1054 -1954 -43 3279
2182 3279 -280 -3852 -630 2384 871 -598 -148 -718 -1688 219 2328 1088 -2069 -2576 576 2533
2198 2533 698 -487 -193 -489 -903 433 2424 1103 -2743 -2005 2493 2232 -1288 -806 1032 -781
2214 -781 -1847 1031 1811 -780 -1428 -96 923 302 -1179 -86 1258 -922 -1772 889 1481 -681
2230 -681 -171 1639 -93 -2285 -452 2441 1712 -1708 -2358 1262 1985 -948 124 1744 -2030 -3286
2246 -3286 1629 3396 -519 -2174 -566 221 380 695 264 -363 -2058 -1787 2336 3177 -1521 -2493 696
2263 696 1224 -631 -188 1549 46 -2520 -471 3252 1503 -2823 -1016 2631 -392 -2570 1257 1690
2279 1690 -1601 -710 1256 265 -987 -717 629 1156 -1268 -2832 1184 3216 -1291 -2136 2027 546
2295 546 -2995 647 3217 -329 -3070 -494 2675 1518 -1436 -679 764 -700 -1536 1939 2478 -2254
2311 -2254 -2719 1618 2105 -575 -1481 -208 580 -986 -917 2219 1574 -3158 -1633 3845 1749 -3507 -841
2328 -841 2957 -110 -1730 1059 1687 -550 -1704 571 2653 -482 -2971 667 2515 -823 -1655 1547
2344 1547 730 -2057 -147 2298 489 -2162 -1645 1862 2448 -1900 -2036 2586 1102 -2944 188 3469
2360 3469 -1111 -3188 1835 3147 -1279 -2163 827 1914 -104 -1527 392 1478 -1189 -1280 2420 1608
2376 1608 -2858 -1913 2679 2017 -2064 -1582 1402 389 -2019 88 3125 -574 -4386 198 4186 148
2392 148 -2702 354 955 -964 -136 1877 898 -1958 -2015 1515 2816 -849 -2723 1395 1750 -2560 -763
2409 -763 3379 306 -3713 -686 2751 23 -2645 30 2296 -302 -2822 76 2565 -304 -2107
2424 -2107 916 1191 -2101 -1138 2598 1604 -1883 -2093 892 1782 -511 -795 852 -374 -2986 -101
2440 -101 4396 917 -4495 -1832 2403 1059 -1361 188 879 -1876 -2420 2180 3523 -1287 -3496 15
2456 15 1655 -597 -239 1955 -69 -2554 -492 2594 1517 -1857 -1778 1405 765 -2117 -2 3365
2472 3365 52 -3644 0 2762 -851 -1858 1663 1227 -2245 -1621 1757 2523 -431 -2106 -472 823
2488 823 -101 210 2122 550 -3228 -1648 3445 2625 -1795 -1872 867 -9 -1158 1963 3457 -1746 -4132
2505 -4132 814 3615 205 -1674 -26 286 -1335 130 2833 1187 -2373 -2061 1484 2052 -783 -641
2521 -641 1612 258 -1817 300 2934 555 -2381 -247 1834 -186 -1555 1324 2701 -801 -3021
2536 -3021 433 2404 -445 -1388 771 186 -1954 -435 2781 1374 -2325 -2104 894 1273 -216 325
2552 325 909 -1017 -2482 930 3922 422 -3492 -1050 2135 370 -1146 1454 1198 -2548 -1737 2409
2568 2409 1967 -1756 -1908 644 743 -740 -115 820 65 -1649 -973 1383 719 -1899 -730 1856 20
2585 20 -2413 128 2580 -375 -2366 519 1566 -1512 -1355 1872 1489 -2198 -1946 1364 1504 -697
2601 -697 -895 91 -304 -959 102 1741 20 -2746 -1131 2212 1073 -1706 -624 1256 -558 -1457
2617 -1457 1349 1730 -1526 -2049 992 1977 -551 -1652 634 1009 -849 -575 1304 329 -1644 -437
2633 -437 1885 458 -1834 -688 1218 693 -1020 -330 1034 -485 -1347 986 1938 -842 -2351 567
2649 567 2381 -341 -1430 801 1097 -850 -394 1566 658 -1604 -722 1478 654 -657 -215 642 212
2666 212 -720 -343 873 153 -1262 -46 1733 -245 -2321 484 2565 -601 -2014 650 969 -716
2682 -716 212 1712 14 -1783 -539 1643 1477 -379 -1405 -180 818 343 751 970 -723 -2128 -94
2699 -94 2287 917 -1740 -868 633 -247 -357 1356 891 -1761 -1886 1002 1691 -213 -796 99 133 -476
2717 -476 -215 944 784 -1001 -935 722 853 -418 204 1175 -370 -1873 -317 1507 771 -821 -587
2734 -587 276 -461 -518 1545 1346 -2005 -2532 358 1851 616 -163 -407 -966 -686 871 1727 408 -1706
2752 -1706 -1922 632 1987 707 -283 -242 -1126 -1090 1043 2299 -39 -2471 -892 1238 572 -442 430
2769 430 299 -1575 -1271 1168 1309 -308 -514 -246 -218 60 155 709 732 -1046 -1551 597 1776 221 -210
2788 -210 581 -1118 -1828 1082 2476 -155 -1815 -894 388 896 599 724 -365 -2021 -1453 1341 2625
2805 2625 42 -2045 -1161 409 900 737 572 -413 -1880 -957 2195 2056 -900 -1256 261 -162 -510
2822 -510 1207 1348 -1120 -1721 -93 1143 580 -363 -393 149 -736 -1216 928 1662 -512 -1442 -56 287
2840 287 -77 369 870 -44 -1465 -1243 1278 2080 -293 -1394 315 -172 -910 1650 1950 -1233 -2612
2857 -2612 -39 1810 915 -318 -962 -600 -391 -219 1335 1391 -1340 -2226 360 1812 194 -618 111
2874 111 -184 -1040 62 1923 707 -1836 -823 1587 420 -1129 593 1235 -840 -1189 472 793
2890 793 26 -568 -282 496 -186 -1266 586 1798 -782 -2209 397 1169 -769 -9 1184 -681 -1763
2907 -1763 185 1995 627 -1427 -940 730 353 -480 577 1054 -1092 -1685 1076 1834 -315 -1483
2923 -1483 -125 1027 231 -872 349 723 -1448 -1139 1654 904 -1699 -758 1553 369 -1249 -142
2939 -142 984 -50 -940 248 1276 -345 -1627 614 1989 -550 -1546 278 1067 -481 -591 702
2955 702 409 -941 -751 969 1297 -1215 -1640 1191 1041 -1271 -347 1591 -280 -1622 752 1793 -787
2972 -787 -1598 510 1379 -216 -1049 257 1239 -154 -954 568 803 -1078 -880 1515 1387 -1155 -1272
2989 -1272 986 1074 -952 -351 1109 -549 -1791 821 2534 -503 -2151 -29 1209 83 -538 307
3005 307 358 -996 -901 1244 1867 -863 -1965 515 1529 -543 -508 1200 361 -1398 -186 1595 455
3022 455 -1404 -184 1218 -370 -1331 492 1596 -521 -1605 289 1057 -584 -600 1066 770 -1303
3038 -1303 -1340 1305 1919 -547 -1432 292 473 -354 505 1647 -241 -2381 -455 2131 1046 -1292 -851
3055 -851 238 -453 -591 1600 1500 -1676 -2192 864 1584 -177 -1048 60 37 -893 -44 1472 908 -1370
3073 -1370 -1397 958 1077 -972 -330 1294 -293 -1823 156 1794 -178 -1435 342 642 -1213 -855
3089 -855 1386 1153 -1128 -1896 307 1130 -38 -304 125 -296 -1192 -337 1950 1209 -1836 -1768 914 1133
3107 1133 -254 355 714 -1432 -1668 1470 2050 -453 -1845 -371 784 52 -184 852 230 -1732 -1097
3124 -1097 1352 1585 -1044 -1321 460 491 -866 -50 1106 111 -1209 -325 1326 346 -700 348 1138
3141 1138 -687 -1351 997 1810 -451 -1129 375 433 -592 57 1444 438 -1693 -1207 1279 1491 -385
3158 -385 -880 46 45 -508 566 1556 -270 -2112 -323 1884 932 -810 -252 531 -791 -369 1588 1044
3176 1044 -1484 -1078 1005 1096 -411 -512 401 124 -582 -314 912 604 -912 -645 1151 329 -1238 -72
3194 -72 1251 -156 -1394 328 1190 -231 -519 691 552 -1040 -728 1174 1150 -682 -1079 304 711
3211 711 -65 -127 502 -128 -1188 -236 1439 832 -1237 -1016 660 471 -652 143 591 -846 -910 912
3229 912 1223 -638 -1046 351 724 -382 -394 404 349 -598 -345 1043 532 -1169 -592 822 533 -733
3247 -733 -581 493 374 -399 -77 472 -352 -963 37 1077 -250 -1241 208 901 -345 -358 544 0
3265 0 -1092 -172 938 413 -649 -447 514 664 -299 -741 239 411 -599 -51 813 -156 -996 73 1014
3284 1014 -80 -1014 -167 511 -264 -293 484 96 -971 -280 1139 409 -774 -683 194 732 246 -293 -23
3303 -23 -3 -557 -50 1115 376 -1349 -451 1015 379 -420 285 75 -596 -230 682 481 -476 -768 343
3322 343 703 -105 -502 305 331 -550 -435 509 267 -274 -49 524 394 -488 -418 836 661 -515 -488 282
3342 282 195 -225 734 444 -960 -854 591 742 21 -590 -325 37 -51 251 650 -64 -1148 -455 955
3361 955 887 -246 -589 -195 260 138 86 405 65 -835 -132 1163 184 -787 108 291 -220 -82 600 113
3381 113 -416 -58 76 116 -104 -450 256 651 -558 -882 366 763 -234 -357 272 -154 -559 507 982
3400 982 52 -980 -469 513 510 32 20 -238 -677 -142 974 526 -650 -1022 -178 707 368 -365 -349 106
3420 106 -486 -202 1000 551 -1104 -649 781 450 -224 -136 235 -55 -266 127 451 -140 -576 190 700
3439 700 -318 -664 483 619 -125 -471 -29 179 -167 -116 373 382 -783 -760 724 951 -533 -960 280
3458 280 215 -276 442 728 -451 -895 173 960 165 -637 -257 244 69 -58 406 323 -631 -772 588 753
3478 753 -445 -953 272 871 -301 -609 629 216 -999 -76 986 9 -920 128 922 -9 -441 -11
3496 -11 150 8 -140 224 523 -301 -728 632 1065 -411 -1054 167 707 -374 -434 571 165 -1053 -229
3515 -229 1038 361 -1068 -478 786 332 -450 51 474 -143 -524 332 749 -506 -910 349 980 -200
3533 -200 -772 227 689 -296 -495 611 323 -999 -429 1095 810 -979 -812 578 399 -491 -162 487
3551 487 -419 -875 591 1131 -371 -1078 135 750 7 -449 163 351 -604 -441 779 870 -757 -1169 577
3570 577 866 -672 -646 675 262 -883 65 890 -294 -1003 224 836 -239 -753 59 749 129 -642
3588 -642 29 472 -490 -575 770 706 -1036 -1132 979 1233 -744 -880 457 211 -820 230 1055 -490
3606 -490 -1400 -139 1008 214 -770 -269 137 -194 -272 671 652 -682 -910 594 1120 -305 -823 425 519
3625 519 -712 -273 918 257 -1011 -363 983 258 -928 -150 934 149 -956 -180 751 -108 -517 464
3643 464 402 -831 -638 925 987 -578 -1153 239 685 -197 -121 563 0 -1089 -127 1544 588 -1030 -669
3662 -669 687 489 -229 192 356 -726 -797 814 980 -342 -809 92 447 -160 -270 409 130 -689 -468
3681 -468 828 733 -843 -577 1009 380 -946 -231 1078 193 -680 315 562 -495 -404 627 699 -528
3699 -528 -952 111 728 31 -276 244 -76 -709 -26 1008 347 -1216 -751 798 751 -317 -204 444 -236
3718 -236 -794 551 1042 -449 -1081 223 863 28 -512 147 126 -409 -243 580 315 -679 -551 777 475
3737 475 -966 -429 721 129 -685 -170 464 -44 -609 114 766 -257 -1232 121 1113 105 -847 134
3755 134 270 -548 8 778 -44 -989 -535 660 621 -291 -580 105 265 -452 -131 739 -120 -1252 -60
3774 -60 1086 263 -800 -161 594 -100 -539 330 465 -541 -389 743 514 -720 -366 676 352 -405
3792 -405 -402 192 127 -110 -148 671 190 -1178 -337 1152 217 -1200 -274 695 -216 -315 621 326 -670 -509 487
3813 487 848 -175 -805 188 541 -44 -80 684 33 -860 -13 846 248 -566 -144 524 359 -495 -201 667
3833 667 31 -759 210 716 -418 -606 574 657 -397 -563 82 393 185 -173 225 127 -685 -31 944 346
3853 346 -918 -524 609 457 -124 -25 149 -323 -479 199 1000 76 -1172 -256 960 60 -417 228 -65
3872 -65 -602 -51 686 200 -380 -327 81 369 -21 -320 206 368 -577 -365 633 21 -458 59 647 -135 -675
3893 -675 -22 816 120 -579 -258 100 -35 -33 534 104 -714 -410 487 548 182 -562 -450 57 126 107 585 54
3915 54 -1065 -390 1096 613 -685 -349 183 -217 -97 416 420 -213 -749 -60 478 93 -405 -51 302 -242
3935 -242 -266 355 175 -380 -56 180 79 -182 -121 526 331 -609 -381 596 461 -287 -38 198 -306 -290 614
3956 614 597 -203 -764 -448 463 381 101 -92 -326 -536 77 768 462 -481 -741 -2 576 331 -120 37 -155
3977 -155 -630 75 976 235 -802 -258 590 96 -78 214 128 -291 -92 85 76 35 -272 -35 156 -131 -462
3998 -462 280 661 -230 -556 235 77 -168 131 568 -208 -853 -53 756 376 -449 -332 -43 -26 49 533 171
4019 171 -473 -545 74 636 288 -438 -528 101 72 86 378 11 -850 -362 620 341 -359 -231 195 271 -137 68
4041 68 402 -139 -518 -38 495 19 -494 74 464 -101 -449 -26 94 -14 -114 82 130 -392 -203 491 379
4062 379 -614 -709 232 453 -145 21 292 -386 -535 236 707 -71 -747 -221 486 323 -30 44 24 -173 -219
4083 -219 415 587 -270 -605 98 605 -120 -403 241 204 -725 -155 686 25 -792 -108 754 175 -543 -88
4103 -88 538 203 -191 -40 181 -158 -261 282 555 -291 -696 145 696 12 -405 206 107 -456 38 732 68
4124 68 -826 -351 840 317 -555 -130 315 -25 -331 93 546 -317 -722 181 615 -65 -623 49 576 -104
4144 -104 -407 391 277 -524 -106 800 336 -728 -580 728 600 -600 -151 275 6 -589 401 729 -307
4163 -307 -987 157 817 149 -467 -194 329 -53 -185 463 378 -754 -716 645 805 -551 -524 514 230
4182 230 -724 -35 772 -198 -833 198 750 -135 -828 5 622 -40 -551 -161 576 61 -310 198 483 -549
4202 -549 -540 710 741 -546 -811 367 400 -306 -23 653 -210 -1053 202 1104 178 -794 -390 318 291 -282
4222 -282 112 335 -569 -827 417 906 -256 -859 108 495 -186 -320 391 117 -645 -201 757 351 -772
4241 -772 -203 740 109 -817 -14 730 61 -673 51 526 -282 -389 449 547 -461 -891 122 799 -86 -470
4261 -470 121 64 -468 -8 896 241 -1176 -505 786 597 -329 -117 402 -267 -615 523 946 -521 -902
4280 -902 169 703 82 -312 0 53 -305 -165 277 492 -317 -659 500 546 -516 -215 775 -25 -710 -34
4300 -34 756 10 -425 281 504 -309 -693 370 866 -148 -768 -83 495 -77 -125 332 -2 -766 -362 835
4320 835 681 -610 -685 205 262 -165 278 474 -611 -932 317 1032 96 -555 -158 228 9 -27 386 226
4340 226 -600 -499 621 732 -354 -467 180 222 -343 -36 420 109 -386 -149 492 42 -687 212 580 -207
4360 -207 -877 212 685 -148 -382 268 48 -454 104 593 239 -505 -540 162 627 70 -107 -44 -133 -570 275
4381 275 815 -147 -905 -340 601 203 -269 56 -50 -591 -374 612 667 -605 -712 319 379 -12 -249 135
4401 135 -22 -224 -182 443 353 -465 -201 606 166 -508 -36 634 -181 -574 189 311 -286 -291 199 226 -542 -491
4423 -491 312 602 -136 -521 -19 211 -205 -83 551 -42 -571 -188 673 501 -353 -470 41 66 -89 264
4443 264 287 -551 -624 298 811 -136 -624 -36 259 -111 -94 202 210 -476 -286 520 350 -368 -343 222 295 -109
4465 -109 -188 31 108 -197 -138 474 100 -575 30 751 -193 -639 89 421 -348 -115 276 33 -437 -271 349
4486 349 304 -392 -470 24 502 22 -277 99 93 -203 65 537 54 -718 -148 655 144 -390 -118 196 -144
4507 -144 -146 348 297 -480 -547 326 621 -71 -529 -252 254 65 -105 217 169 -312 -192 498 324 -385 -285 241
4529 241 136 -88 31 249 1 -222 189 429 -174 -544 2 453 17 -408 -4 182 -130 -273 27 186
4549 186 -196 -248 331 549 -347 -483 232 386 -78 -181 75 -52 -363 121 605 -178 -556 -198 512 223
4569 223 -194 -143 42 -152 57 375 247 -212 -592 -27 649 81 -566 -218 273 -26 -80 530 122 -495 -183
4590 -183 458 261 -325 -154 233 62 -149 98 117 -28 -203 -81 252 58 -403 -15 358 54 -591 -165
4610 -165 363 154 -287 170 123 -504 -228 465 232 -386 -309 134 142 23 82 -5 -254 -286 206 558 281 -657
4632 -657 -323 380 289 -33 19 -65 -316 -158 460 445 -117 -588 -100 305 34 -102 108 -69 -394 -109 428
4653 428 117 -392 -113 282 22 -404 -13 227 55 -275 -61 232 126 -218 103 290 -283 -446 192 594
4673 594 -72 -389 -168 98 -141 222 359 -229 -636 -116 613 240 -190 -228 -72 -84 134 307 273 -329 -580
4694 -580 77 689 366 -503 -300 202 -128 -129 502 150 -589 -204 445 206 -247 -199 52 -152 -209 60 280
4715 280 37 -391 -8 386 -88 -574 62 510 -138 -424 50 416 -12 -233 273 -41 -276 -91 509 239
4735 239 -602 -384 227 278 -126 38 60 -289 -426 263 711 34 -632 -314 397 164 -256 -24 264 -323 -297
4756 -297 539 455 -328 -559 181 465 -105 -266 264 44 -510 -11 579 -26 -653 -60 440 -177 -334 17
4776 17 374 47 -380 48 335 -107 -497 145 634 -308 -529 502 600 -294 -413 326 102 -268 143 558
4796 558 -25 -635 -39 670 141 -415 -188 267 14 -97 403 420 -365 -722 186 816 -143 -807 85 544
4816 544 -166 -256 400 207 -630 -206 677 223 -459 -364 274 224 -230 -159 389 -80 -521 177 673 -172 -699
4837 -699 129 720 -157 -465 250 424 -143 -283 235 292 -411 -393 674 426 -589 -367 626 272 -442 -88
4857 -88 267 -240 -389 289 389 -157 -694 -8 664 84 -401 29 265 -216 -387 468 293 -541 -718 439
4877 439 621 -322 -456 296 220 -486 83 682 -138 -660 164 480 103 -426 48 321 -41 -198 25 339
4897 339 -256 -610 265 610 -410 -565 358 339 -309 -274 370 22 -406 -175 296 0 -446 41 574 147
4917 147 -457 -123 414 41 -224 140 224 -348 -483 399 649 -357 -771 122 452 -91 -130 242 32 -496
4937 -496 71 557 65 -534 -394 314 348 -65 57 162 -292 -454 253 368 -215 -461 94 362 -40 -121 232
4958 232 184 -275 -219 373 347 -283 -261 374 222 -445 -172 470 117 -354 59 224 -236 -59 349 323 -276 -424
4980 -424 195 488 -113 -321 -23 122 -32 -133 402 192 -524 -400 497 425 -271 -300 170 -56 -206 365 230
5001 230 -340 -337 164 298 -79 -145 -70 96 -42 -73 82 121 -249 -365 472 447 -206 -314 345 252 -335 -119 222
5024 222 -42 -301 79 311 -151 -335 112 293 -78 -352 -60 57 -88 -9 170 88 -332 -177 516 303 -252
5045 -252 -381 207 306 -58 -47 171 -118 -334 106 474 -10 -531 -267 355 17 -163 42 130 -336 -103 279
5066 279 199 -265 -263 137 250 -178 -283 50 148 -192 -81 257 89 -397 -142 475 284 -416 -143 320 11
5087 11 -155 126 73 -235 -228 282 230 -92 -322 -27 299 19 -276 -39 141 -57 -67 362 208 -336 -219 518
5109 518 300 -415 -254 320 -63 -31 221 112 -141 -174 194 245 62 -299 -62 297 92 -112 29 -90 -358
5130 -358 -199 438 307 -246 -492 136 429 -29 -197 114 183 -215 -32 275 -36 -396 -63 277 120 -135
5150 -135 -62 131 -40 -222 100 117 -93 -222 85 161 -87 -271 95 343 -233 -372 113 283 -78 -112 278
5171 278 11 -448 -197 409 248 -278 -351 91 109 185 231 79 -125 -241 21 515 179 -464 -256 205 110 -159
5193 -159 220 213 -462 -409 386 431 -332 -437 26 224 -57 -125 98 -36 -107 -7 169 258 -152 -270 316 230 -282
5216 -282 -59 449 76 -259 143 271 -185 -193 362 278 -321 -534 116 449 18 -337 -91 -123 -263 99 288
5237 288 50 -409 -279 327 404 -90 -187 -155 -184 -165 253 451 -153 -611 80 422 36 -273 -119 106 -171 -133
5259 -133 402 245 -164 -328 173 179 -95 -177 125 41 -43 -175 46 209 -227 -91 135 128 -337 19 506 -59
5281 -59 -424 -60 249 30 -59 193 59 -231 -163 434 456 -177 -358 -145 220 124 -71 41 -11 -400 -29 476
5303 476 252 -398 -363 224 121 -134 69 189 -442 -337 384 485 -173 -281 103 123 -35 -67 71 187 -91
5324 -91 -186 202 179 -286 -143 381 118 -353 -141 279 42 -208 18 66 -182 -188 240 373 -177 -433 137 360
5346 360 -27 -73 181 -52 -200 -18 217 72 -307 -302 216 309 -150 -231 177 94 -243 112 229 -204 -432 96
5368 96 500 -72 -442 126 322 -107 -279 310 117 -447 -43 434 132 -333 -313 207 140 -58 -206 102 -110
5389 -110 -309 56 411 18 -609 17 511 -54 -301 104 182 -491 -192 404 311 -502 -280 212 274 -239 -294
5410 -294 233 358 -339 -205 189 54 -299 -21 315 -90 -467 129 540 -73 -484 -2 203 -215 -134 454
5430 454 163 -440 -305 465 444 -351 -330 -41 142 -170 119 455 -110 -634 -172 544 312 -415 -144 156 -127
5451 -127 -31 285 374 -305 -574 183 523 -99 -410 245 278 -459 -251 434 313 -375 -285 350 87 -255 142
5472 142 415 32 -382 -246 297 188 -261 -163 336 -238 -389 411 636 -367 -672 179 499 -39 -175 202
5492 202 -131 -480 -16 690 171 -529 -482 233 240 -29 -2 76 -204 -530 94 710 -9 -659 5 333 -80 -301
5514 -301 230 287 -471 -479 371 330 -282 -122 176 25 -418 -194 407 283 -366 -297 86 97 -175 104 411 -270
5536 -270 -621 -76 629 164 -495 -107 154 -104 -36 530 105 -539 -456 359 598 -99 -315 59 -25 -120 176
5557 176 399 34 -451 -256 386 415 -131 -41 74 -45 -246 197 389 -105 -431 211 236 -158 -225 256 197 -368
5579 -368 -313 224 236 -235 -123 167 -7 -168 51 368 182 -412 -237 176 275 28 -62 176 -271 -206 413 551
5601 551 -157 -485 109 231 -29 44 153 -86 -378 13 368 137 -277 -375 81 315 -86 -95 174 -39 -309
5622 -309 182 387 -72 -295 30 278 -25 -149 154 208 -38 -108 151 71 -187 -40 322 118 -274 -158 172
5643 172 222 -244 -42 142 13 -164 104 282 -158 -322 -82 329 71 -204 -96 -130 -176 -48 225 93 -222
5664 -222 -321 299 292 -104 -111 158 -18 -67 48 114 -109 -275 67 154 112 -242 -210 122 110 -77 121 23 -157 -95
5688 -95 147 159 -249 -222 178 154 -141 -30 -12 -245 -154 55 195 80 -201 -23 290 120 -92 -181 11 -26 -137
5711 -137 5 164 -77 -290 -16 183 -173 -236 189 131 -27 -3 166 101 -153 106 225 21 -259 -164 292 334
5733 334 -134 -229 136 121 89 157 136 -230 -352 86 435 113 -247 -161 6 -16 49 195 -32 -384 -194 306 301
5756 301 -119 -233 7 40 -47 7 211 -70 -362 -91 294 101 -70 -19 236 164 -153 -20 317 123 -266 48
5778 48 53 -177 -119 192 151 -274 -341 127 328 77 -66 -111 -47 -149 117 331 142 -387 -370 204 479 27 -249
5801 -249 -39 -54 -213 289 395 -112 -481 -79 292 95 49 -36 -50 -255 -64 295 216 -240 -322 57 276 -43
5823 -43 -129 166 48 -365 -275 155 147 -91 -87 136 -129 -189 26 411 154 -369 -187 69 141 78 88 15 -304 -367
5847 -367 407 543 -159 -396 -91 214 90 44 215 -62 -518 -108 421 245 -262 -405 86 183 -65 240 213
5868 213 -120 -377 107 314 129 -305 -54 47 -152 -248 277 244 -156 -317 170 245 -93 -162 314 127 -400
5889 -400 -229 362 282 -205 -106 138 -32 -116 320 335 -151 -299 7 302 278 -172 -135 56 -146 -140 354 265 -402
5912 -402 -552 282 446 -66 -168 78 39 -218 28 286 -14 -338 -191 239 176 -110 -103 192 -85 -169 90 225
5934 225 -60 -275 113 367 -246 -261 165 314 -132 -349 177 123 -165 -48 241 38 -220 -45 333 173 -89
5955 -89 -134 243 123 -156 72 53 -378 -222 180 310 7 -265 58 87 -6 -135 139 101 -386 -161 331 250
5977 250 -354 -210 272 98 -164 40 -28 -177 -77 162 185 -205 -260 156 245 3 -79 -2 121 -147 -92 218
5999 218 94 -277 -339 277 247 -372 -236 188 116 -248 35 158 -118 -299 102 293 -75 -144 12 112 99 -177
6021 -177 34 298 -91 -124 283 151 -315 -160 389 250 -339 -210 157 56 -51 32 127 -194 -406 95 365
6042 365 -53 -403 -102 160 5 -1 265 -45 -405 -142 347 275 -150 -295 74 176 -103 0 246 -44 -295
6063 -295 16 419 111 -427 -69 174 -34 -367 83 273 -151 -195 110 182 -186 -133 288 156 -354 -270 328
6084 328 304 15 -304 41 -15 -228 -18 557 73 -572 -60 460 142 -267 101 66 -268 -160 209 178 -226
6105 -226 -525 108 356 -105 -231 85 68 -283 -43 465 128 -333 -227 230 206 -248 21 224 -45 -331 50
6126 50 395 -50 -283 106 165 -228 -194 163 276 -28 -282 17 227 -202 -34 313 114 -374 -36 497 317
6147 317 -276 -276 137 99 -133 142 273 -153 -420 100 366 53 -382 -86 172 0 -95 179 80 -327 -126 244
6169 244 373 -208 -202 27 26 -302 -109 295 58 -388 -99 347 74 -274 -132 369 10 -312 113 300 42
6190 42 -40 68 97 -191 -111 217 258 -212 -408 111 250 12 -122 34 41 -294 -9 397 64 -449 -191 376
6212 376 231 -189 106 39 -149 -107 151 225 -131 -288 159 289 11 -150 -42 97 -84 -94 59 104 -321 -96
6234 -96 303 167 -327 -134 203 92 -123 -52 145 -21 -198 193 112 6 -223 43 155 -28 -82 -37 156 -183
6256 -183 -92 290 112 -176 -154 114 164 -6 -115 119 64 -139 32 200 10 -209 -141 278 -37 -221 2 152
6278 152 91 122 28 87 -85 28 87 -21 -69 -135 11 218 23 -147 -35 146 -112 15 309 -79 -376 -43
6300 -43 270 -15 -227 -32 -62 -23 41 83 100 -131 -173 49 103 139 -128 -14 101 -29 -121 193 -17 -173 25
6323 25 152 48 -220 -50 204 10 -208 -99 92 16 -106 88 -1 -144 -54 86 14 -41 -272 -97 2 55 78
6346 78 86 -28 -109 -39 290 195 -196 -250 31 86 -1 -8 37 -32 -255 66 248 -40 -173 25 6 28 -6 -36 100 -134
6372 -134 -4 -73 142 -30 -163 23 216 -93 -220 199 193 -71 -203 10 75 -225 124 242 -219 -216 11 222
6394 222 44 -109 -39 -190 48 23 49 131 -182 -192 82 363 31 -276 7 159 -3 101 327 66 -217 -93
6416 -93 98 195 -65 -82 -2 -51 -239 -49 144 95 -211 -101 162 15 -206 45 209 -108 -199 30 143 -43
6438 -43 23 171 16 -364 -52 355 216 -265 -299 185 69 13 24 106 -97 -320 106 326 59 -343 -138 93
6460 93 56 -64 72 109 -124 -215 172 158 -209 -207 152 216 -138 -15 284 69 -171 -24 199 26 -214 -55 232
6483 232 53 -273 -107 180 122 -106 -90 145 -122 -180 183 194 -176 -323 107 290 -57 -171 26 -5 -219 25
6505 25 351 20 -313 -270 362 244 -14 -153 20 25 -142 -9 344 -51 -380 -61 303 40 -171 149 151 -166
6527 -166 -121 78 92 -158 -142 119 182 -177 -135 204 241 -173 -149 109 67 -119 -3 231 16 -365 2 389 206
6550 206 -259 -72 145 -64 -73 258 82 -263 -286 228 250 -81 -181 25 64 -155 -43 272 96 -314 -106 176
6572 176 34 -178 -122 208 60 -182 -91 74 -45 -263 22 288 -152 -133 170 308 -186 -245 59 156 -27 23
6594 23 172 -77 -309 -74 241 132 -258 -161 236 133 -66 -4 181 -88 -270 37 363 -3 -364 -18 123
6615 123 -30 -12 143 58 -325 -24 203 15 -154 -154 54 96 -126 9 195 85 -250 -14 119 52 -290 122
6637 122 258 -161 -281 145 263 -17 -84 -10 -101 -203 -87 291 52 -318 -203 205 194 -199 -90 -21 -125 -75
6659 -75 55 234 -21 -418 -65 244 92 -242 9 45 -44 -151 272 114 -261 -291 209 161 -222 -63 191 -12
6681 -12 -216 -83 249 -93 -166 8 108 -103 -182 48 357 88 -257 -108 215 15 -78 206 87 -362 -225
6702 -225 255 322 -148 -240 -42 -15 -149 4 238 -67 -506 -26 279 250 -290 -91 160 -76 -181 208 251 -108
6724 -108 -278 178 261 -201 -194 120 165 -125 -103 229 214 -167 -48 210 13 -125 109 257 -58 -356 41 244
6746 244 154 -152 63 44 -228 -90 131 264 -124 -239 -1 158 -32 -73 193 -16 -295 42 374 48 -331
6767 -331 -109 204 60 -116 121 86 -77 -143 -36 215 -36 -390 -79 133 -50 -224 -50 135 -27 -230 132
6788 132 206 -114 -172 184 151 -356 -129 142 196 -94 -59 158 -50 -129 48 210 -55 -321 2 345 204 -98
6810 -98 -144 150 -119 -185 221 182 -222 -216 287 216 -130 -44 128 73 -89 -7 231 -18 -251 -30 217 130 -111 89
6834 89 123 95 -129 -21 237 72 -218 48 118 -107 -225 108 225 -112 -194 120 85 -116 122 167 -79 -250
6856 -250 -19 211 43 -183 -58 102 126 20 68 118 -97 -146 85 135 13 -148 -54 165 -78 -80 -14 116 -158
6879 -158 -233 145 125 -165 -7 161 35 -226 21 101 71 -51 -17 18 -33 -134 50 180 18 -330 -60 213
6901 213 60 -115 85 49 -192 -256 296 171 -169 -202 81 89 87 -13 77 -38 -93 -35 157 -15 -158 -72 10 106
6925 106 -190 -10 239 7 -184 66 206 -107 -52 136 58 -167 -61 17 -11 46 -182 -73 75 -86 -52 105
6947 105 0 -45 -85 216 225 -68 -61 -51 -7 -39 59 95 -114 -282 -96 157 47 -128 -147 -60 36 -59 165 109 -285
6972 -285 -130 60 104 -57 -81 -19 -1 -154 -5 19 -3 3 -9 57 105 -91 89 274 -56 -267 -62 285 57 -54
6996 -54 44 -68 -145 -48 108 268 -35 -254 51 47 -2 50 38 -79 -231 35 375 74 -134 -197 121 81 38 -24
7020 -24 137 -158 -96 56 226 -14 -98 -71 -78 97 -46 54 23 -155 -128 170 186 -115 -124 113 57 -170 -97 138
7044 138 -42 -258 -124 81 40 -85 97 121 -143 -209 132 310 61 -78 11 -55 -28 113 61 -25 -333 -247 50
7067 50 168 -17 -214 20 63 -74 49 269 -84 -234 -46 303 37 -69 2 66 -129 -138 211 129 -25 -208
7089 -208 -34 99 -108 -61 32 18 -97 -76 152 168 -183 22 156 50 -312 -50 269 -67 -325 93 238 -45
7111 -45 -18 176 64 -187 -99 91 199 -28 -153 69 186 76 -49 131 -30 -126 -21 231 123 -293 -185
7132 -185 244 79 -92 -6 172 -92 -117 8 226 -99 -101 93 227 -74 -89 147 209 -93 -159 88 139 -141 -56
7155 -56 252 126 -222 7 163 54 -146 -104 159 -11 -186 52 125 -84 -233 2 207 -123 -106 115 150 5
7177 5 -23 179 42 -246 -143 197 216 -42 -199 71 7 -190 82 237 129 -286 24 336 86 -308 24 130
7199 130 -56 -173 83 3 -70 -102 191 267 -55 -86 117 143 -86 -146 79 60 -220 44 310 40 -304 -33 265
7222 265 -34 -245 63 162 -19 -94 62 117 0 -167 39 237 -153 -139 190 108 -16 -118 47 56 -105 12
7244 12 175 131 -115 -76 285 -44 -127 18 198 -66 -97 201 245 -114 -168 66 241 -16 -136 40 12 -116 -122
7267 -122 87 90 -156 -183 85 49 -167 -97 174 58 -145 -31 260 36 -163 100 204 -144 -206 60 243 -188
7289 -188 -147 107 27 -209 82 175 -35 -163 -98 218 42 -230 -161 130 32 -121 -25 211 -110 -210 178 303
7311 303 -106 -236 -13 10 -87 -77 89 -21 -85 -58 198 127 -54 -161 112 60 -58 -64 102 46 -131 14 146
7334 146 22 -255 -27 79 -91 -225 19 96 -77 -110 23 22 -33 -53 117 77 -213 -57 2 65 -123 -23 74
7357 74 -10 -127 95 134 -54 -194 41 238 72 -142 -17 105 -85 -216 191 32 -81 -126 137 172 -30 -31
7379 -31 116 97 -174 48 109 -20 -158 -2 178 42 -48 6 -12 -59 -216 14 93 -26 -230 9 288 -107 -146
7402 -146 106 170 -134 -124 178 195 -98 26 98 22 -110 -47 211 57 -145 -165 167 14 -105 32 80 -104 -197
7425 -197 110 140 -249 -218 -45 201 -100 -112 46 5 -198 -36 159 309 -154 -115 155 125 -28 -21 94 7 -24
7448 -24 -17 195 -2 -104 -33 56 -96 -176 56 78 -125 -141 -13 116 -48 -110 2 28 -118 12 167 3 -126
7471 -126 -159 -21 19 95 78 94 -92 -204 -73 214 200 -140 -31 166 -28 -164 135 24 -123 -146 174 100 -75
7494 -75 -128 -13 -25 -13 -39 102 101 -95 -7 205 45 -59 -116 52 -14 -134 90 191 6 -136 43 132 -15 -38
7518 -38 121 49 -61 -191 124 -50 23 -100 -77 -12 -80 -22 117 105 -71 -108 141 64 -218 -117 -24 1 56 204
7542 204 211 55 -291 35 135 37 -142 -43 -29 -72 -22 30 21 -132 -102 112 70 -46 -11 84 50 -42 80 67 49 -121
7568 -121 3 211 48 -139 -49 99 23 -88 144 127 -47 -159 50 47 -48 -118 41 87 -118 -218 -3 37 -74
7591 -74 -63 54 24 -64 -134 100 86 -220 -67 99 44 -94 65 13 -93 27 107 87 -110 -214 -5 81 1 -71
7615 -71 -27 36 -7 -60 85 23 -71 -148 58 97 -139 10 59 -10 -88 40 97 75 -116 -41 68 -50 -29 44 209 39
7641 39 -150 18 178 5 -91 26 55 -156 -115 67 95 -206 -62 -53 46 -15 1 60 28 -21 60 170 21 -234 -6
7666 -6 107 -41 -133 19 67 -53 -68 83 93 -74 -74 -29 36 -72 -94 113 -21 -151 -106 84 36 -41 -170 9 -82
7691 -82 -98 26 123 -49 -115 9 115 -44 -68 89 85 -35 -76 -11 255 -42 -144 -25 121 -158 -21 141 53
7714 53 -129 -160 221 -21 -159 -59 97 -40 62 111 63 -81 -237 27 90 127 -213 -11 173 11 -21 123
7736 123 146 -119 -75 163 95 -103 -78 155 -64 -145 2 71 103 -105 -60 156 -46 -43 -2 52 -14 -283 38 90 7
7761 7 -201 104 126 3 -22 125 83 -212 -84 130 127 -111 -92 148 46 -183 107 244 -97 -283 31 144 -18
7784 -18 -100 45 -13 -158 0 181 217 -109 -175 8 230 -101 -26 131 109 -105 -20 249 192 -225 -23 103 -42
7807 -42 -127 30 102 -41 -116 25 152 -60 -45 41 134 -63 -80 100 -43 -43 -148 96 127 -143 -43 215 20 -154
7831 -154 68 210 -44 -90 61 203 -72 -40 22 96 -25 -207 99 103 -55 -150 54 106 -47 -73 95 135 -130
7854 -130 -205 171 14 -52 -84 41 1 -109 76 148 -117 -123 69 150 -16 -105 34 96 -36 -74 136 67 -15 -7 85
7879 85 21 -29 -175 116 73 -102 -37 175 67 -135 -58 127 -1 -40 134 -44 -19 -131 133 181 -101 8 92
7902 92 53 -12 8 -7 204 -190 -132 133 174 -54 -108 191 55 -144 106 116 -46 -225 9 138 -2 -115 14
7925 14 61 -36 -1 60 110 40 -121 -57 124 -25 -76 120 60 -67 -3 76 117 -180 -38 100 -26 -116 14 35 -123
7950 -123 -72 97 61 53 -43 108 -2 -6 -22 185 131 -140 -14 119 -15 48 19 103 -61 -101 6 70 10 -150 -121
7975 -121 -10 34 -84 -79 21 -51 -157 166 -3 -80 33 66 -37 -126 -9 127 -5 61 -31 -66 139 -14 -30 97
7999 97 83 -71 -44 120 -27 -188 -52 121 100 -15 44 8 -60 -56 113 107 -68 -89 -18 11 -50 -2 -30 32 -28 -128
8025 -128 140 -17 -80 -99 50 -12 -84 -49 99 -39 -90 77 36 -101 -62 -125 -8 2 -19 102 16 -136 -134 -58 87
8050 87 -28 -64 166 57 -64 -52 77 32 -16 -37 -7 -27 -27 51 112 -40 -131 -37 10 45 -80 71 -36 -113 17 128
8076 128 79 -39 -119 83 -83 -70 -53 -15 -49 -57 49 98 43 -130 21 61 72 -51 -26 -22 5 -142 57 73 -69 -11
8102 -11 58 10 -126 -95 38 71 33 69 30 58 -104 -16 16 129 -136 -118 164 35 -28 24 21 -58 -127 -3 66 -30 13
8129 13 -15 80 56 -127 -2 17 -51 -71 -43 -12 -166 -65 39 16 -135 -53 178 116 -173 20 -27 11 -102 -13 51
8154 51 -55 -76 10 236 -53 -71 -9 -12 20 100 27 -46 -94 -22 -30 110 -18 -118 -120 -52 45 26 53 -51 -15 -20 49 94 -46
8183 -46 120 67 -49 21 17 56 3 34
8191C4
##END NTUPLES=NMR FID
##END=
