##TITLE=1H_B3d2410
 CDCl3
 8 sc, 
 25.10.2023
##JCAMPDX= 6.0         $$ Bruker NMR JCAMP-DX V2.0
##DATA TYPE= NMR FID
##DATA CLASS= NTUPLES
##ORIGIN= UXNMR, Bruker Analytische Messtechnik GmbH
##OWNER= root
$$ XWIN-NMR		Version 3.5
$$ Wed Oct 25 13:46:33 2023 Russian Standard Time (UT+4h)  she@DPX200
##.OBSERVE FREQUENCY= 200.13135
##.OBSERVE NUCLEUS= ^1H
##.DELAY= (6, 6)
##.ACQUISITION MODE= SIMULTANEOUS
##.ACQUISITION SCHEME= undefined
##.AVERAGES= 8
##.DIGITISER RES= 18
##SPECTROMETER/DATA SYSTEM= spect
##.PULSE SEQUENCE= zg30
##.SOLVENT NAME= D2O
##.SHIFT REFERENCE= (INTERNAL, D2O, 0, 15.7039)
##AUDIT TRAIL= $$ (NUMBER, WHEN, WHO, WHERE, WHAT)
$$ ##TITLE= Audit trail, XWIN-NMR		Version 3.5
$$ ##JCAMPDX= 5.01
$$ ##ORIGIN= Bruker BioSpin GmbH
$$ ##OWNER= she
$$ F:/spectra/data/she/nmr/H-F/1/audita.txt
$$ ##AUDIT TRAIL=  $$ (NUMBER, WHEN, WHO, WHERE, WHAT)
(   1,<2023-10-25 13:45:13.84 +0400>,<she>,<DPX200>,
      <created by zg, POWCHK disabled, PULCHK disabled
       configuration hash MD5:
       00 E9 B6 7A A2 85 ED C7 34 08 36 98 17 FE 4E 26
       data hash MD5: 16K
       04 A2 16 8C 4D 41 C4 1D 6C CF 65 82 ED 4D EF D6>)
$$ ##END=
$$ 
$$ hash MD5
$$ 2F D4 0B D3 A0 3D 14 2B 43 AF 29 15 8F E3 A5 BC
##$RELAX= 
##$RELAX= 
##$RELAX= 
##$RELAX= 
##$RELAX= 
##$RELAX= 
$$ Bruker specific parameters
$$ --------------------------
##$DU= <F:/spectra>
##$EXPNO= 1
##$NAME= <H-F>
##$PROCNO= 1
##$TYPE= <nmr>
##$USER= <she>
##$AMP= (0..31)
100 100 100 100 100 100 100 100 100 100 100 100 100 100 100 100 100 100 
100 100 100 100 100 100 100 100 100 100 100 100 100 100 
##$AQSEQ= 0
##$AQ_mod= 1
##$AUNM= <au_zg>
##$AUTOPOS= <>
##$BF1= 200.13
##$BF2= 200.13
##$BF3= 200.13
##$BF4= 200.13
##$BF5= 200.13
##$BF6= 200.13
##$BF7= 200.13
##$BF8= 200.13
##$BYTORDA= 1
##$CFDGTYP= 0
##$CFRGTYP= 5
##$CHEMSTR= <none>
##$CNST= (0..31)
1 1 145 1 1 1 1 1 1 1 1 1 1 1 1 1 1 1 1 1 1 1 1 1 1 1 1 1 1 1 1 1 
##$CPDPRG= <>
##$CPDPRG1= <>
##$CPDPRG2= <>
##$CPDPRG3= <>
##$CPDPRG4= <mlev>
##$CPDPRG5= <mlev>
##$CPDPRG6= <mlev>
##$CPDPRG7= <mlev>
##$CPDPRG8= <mlev>
##$CPDPRGB= <>
##$CPDPRGT= <>
##$D= (0..31)
0 1.2 0 0 0 0 0 0 0 0.06 0 0.03 0 0 0 0 0.0002 0 0 0 0 0 0 0 0 0 0 0 0 
0 0 0 
##$DATE= 1698227113
##$DBL= (0..7)
120 120 120 120 120 120 120 120 
##$DBP= (0..7)
150 150 150 150 150 150 150 150 
##$DBP07= 0
##$DBPNAM0= <>
##$DBPNAM1= <>
##$DBPNAM2= <>
##$DBPNAM3= <>
##$DBPNAM4= <>
##$DBPNAM5= <>
##$DBPNAM6= <>
##$DBPNAM7= <>
##$DBPOAL= (0..7)
0.5 0.5 0.5 0.5 0.5 0.5 0.5 0.5 
##$DBPOFFS= (0..7)
0 0 0 0 0 0 0 0 
##$DE= 6
##$DECBNUC= <off>
##$DECIM= 32
##$DECNUC= <off>
##$DECSTAT= 4
##$DIGMOD= 1
##$DIGTYP= 9
##$DL= (0..7)
0 120 120 120 120 120 120 120 
##$DP= (0..7)
150 150 150 150 150 150 150 150 
##$DP07= 0
##$DPNAME0= <>
##$DPNAME1= <>
##$DPNAME2= <>
##$DPNAME3= <>
##$DPNAME4= <>
##$DPNAME5= <>
##$DPNAME6= <>
##$DPNAME7= <>
##$DPOAL= (0..7)
0.5 0.5 0.5 0.5 0.5 0.5 0.5 0.5 
##$DPOFFS= (0..7)
0 0 0 0 0 0 0 0 
##$DQDMODE= 0
##$DR= 18
##$DS= 0
##$DSLIST= <SSSSSSSSSSSSSSS>
$$ [...]
##$SUBNAM2= <"">
##$SUBNAM3= <"">
##$SUBNAM4= <"">
##$SUBNAM5= <"">
##$SUBNAM6= <"">
##$SUBNAM7= <"">
##$SUBNAM8= <"">
##$SUBNAM9= <"">
##$SW= 18.05172834244
##$SWIBOX= (0..15)
0 0 2 0 0 0 0 0 0 0 0 0 0 0 0 0 
##$SW_h= 3612.71676300578
##$TD= 16384
##$TD0= 1
##$TE= 0
##$TE2= 300
##$TE3= 300
##$TEG= 300
##$TL= (0..7)
0 120 120 120 120 120 120 120 
##$TP= (0..7)
150 150 150 150 150 150 150 150 
##$TP07= 0
##$TPNAME0= <>
##$TPNAME1= <>
##$TPNAME2= <>
##$TPNAME3= <>
##$TPNAME4= <>
##$TPNAME5= <>
##$TPNAME6= <>
##$TPNAME7= <>
##$TPOAL= (0..7)
0.5 0.5 0.5 0.5 0.5 0.5 0.5 0.5 
##$TPOFFS= (0..7)
0 0 0 0 0 0 0 0 
##$TUNHIN= 0
##$TUNHOUT= 0
##$TUNXOUT= 0
##$USERA1= <user>
##$USERA2= <user>
##$USERA3= <user>
##$USERA4= <user>
##$USERA5= <user>
##$V9= 5
##$VALIST= <valist>
##$VCLIST= <CCCCCCCCCCCCCCC>
##$VD= 0
##$VDLIST= <DDDDDDDDDDDDDDD>
##$VPLIST= <PPPPPPPPPPPPPPP>
##$VTLIST= <TTTTTTTTTTTTTTT>
##$WBST= 1024
##$WBSW= 4
##$XGAIN= (0..3)
0 0 0 0 
##$XL= 0
##$YL= 0
##$YMAX_a= 817476
##$YMIN_a= -928192
##$ZGOPTNS= <>
##$ZL1= 120
##$ZL2= 120
##$ZL3= 120
##$ZL4= 120
##$ABSF1= 10
##$ABSF2= 0
##$ABSG= 5
##$ABSL= 3
##$ALPHA= 0
##$AQORDER= 0
##$ASSFAC= 0
##$ASSFACI= 0
##$ASSFACX= 0
##$ASSWID= 0
##$AUNMP= <proc_1d>
##$AZFE= 0.1
##$AZFW= 0.1
##$BCFW= 1
##$BC_mod= 2
##$BYTORDP= 1
##$COROFFS= 0
##$CY= 11.3945322036743
##$DATMOD= 1
##$DC= 2
##$DFILT= <>
##$DTYPP= 0
##$F1P= 15.7292609196834
##$F2P= 12.9074282941183
##$FCOR= 0.5
##$FTSIZE= 0
##$FT_mod= 4
##$GAMMA= 1
##$GB= 0.15
##$INTBC= 1
##$INTSCL= 1
##$ISEN= 128
##$LB= 0.24
##$LEV0= 0
##$LPBIN= 0
##$MAXI= 10000
##$MC2= 0
##$MEAN= 0
##$ME_mod= 0
##$MI= 1.114404
##$NCOEF= 0
##$NC_proc= 0
##$NLEV= 6
##$NOISF1= 3.799351
##$NOISF2= 2.8
##$NSP= 1
##$NTH_PI= 0
##$NZP= 0
##$OFFSET= 15.70392
##$PC= 1
##$PHC0= -23509.1
##$PHC1= 13.8527
##$PH_mod= 1
##$PKNL= yes
##$PPARMOD= 0
##$PSCAL= 0
##$PSIGN= 0
##$REVERSE= no
##$SF= 200.130013532006
##$SI= 16384
##$SIGF1= 3
##$SIGF2= 2
##$SINO= 400
##$SIOLD= 16384
##$SREGLST= <1H.CDCl3>
##$SSB= 0
##$STSI= 0
##$STSR= 0
##$SW_p= 3612.71676300578
##$SYMM= 0
##$S_DEV= 0
##$TDeff= 0
##$TDoff= 0
##$TI= <>
##$TILT= no
##$TM1= 0
##$TM2= 0
##$TOPLEV= 0
##$USERP1= <user>
##$USERP2= <user>
##$USERP3= <user>
##$USERP4= <user>
##$USERP5= <user>
##$WDW= 1
##$XDIM= 8192
##$YMAX_p= 0
##$YMIN_p= 0
$$ End of Bruker specific parameters
$$ ---------------------------------
##NTUPLES= NMR FID
##VAR_NAME=  TIME,          FID/REAL,        FID/IMAG
##SYMBOL=    X,             R,               I
##VAR_TYPE=  INDEPENDENT,   DEPENDENT,       DEPENDENT
##VAR_FORM=  AFFN,          ASDF,            ASDF
##VAR_DIM=   8192,          8192,            8192
##UNITS=     SECONDS,       ARBITRARY UNITS, ARBITRARY UNITS
##FACTOR=    0.0002768,     1,               1
##FIRST=     0,             0,               0
##LAST=      2.2672688,     0,               0
##MIN=       0,             -928192,         0
##MAX=       2.2672688,     817476,          0
$$ Real data points
##PAGE= N=1
##DATA TABLE= (X++(R..R)), XYDATA
0@%%%%%%%%%%%qJ6j6J6j6K4l2L2l3M1n2O0o8P8r2J07j17J30j51J74j96K17k41
34a27K73l08L41l77M17m62N15n69O23o86P56q34R18j005J103j215J340j478J632
53H57j804K004k236K503k820L201l669M257n014O023p427R486j2736J8414l0008
68a8969O1501k80648o90076J258122K9830j080056Q91004O46768j214262n4657
78d51443R41356n27139m37612Q29306Q211p68483K29042M71989l61039j54222
88b20034M96818k2569n94953J06255N05820k94365k25711O20471q1686p74963
98d84917L44289M77229o27128Q6843P84726n29118n37109P15326m2973o52993
108d65825N71619L58972p43989N9076N32169m18524j44677N57789j41686m10626
$$ y = [0, 0, 0, 0, 0, 0, 0, 0, 0, 0, 0, 0, -8, 8, -8, 8, -8, 16, -16, 16, -17, 24, -28, 32, -36, 42, -50, 57, -60, 70, -81, 93, -103, 114, -127, 146, -162, 179, -198, 219, -243, 272, -297, 326, -360, 396, -438, 480, -525, 578, -637, 703, -775, 857, -947, 1057, -1179, 1324, -1496, 1705, -1964, 2293, -2721, 3302, -4125, 5361, -7375, 11039, -18969, 42532, -238116, -928192, 329930, 359760, -720296, 170708, 817476, -396786, -451443, 489913, -37226, -474838, 354468, 362679, -405804, -176762, 295227, -65812, -220034, 276784, 254215, -340738, -234483, 271337, -23028, -248739, 371732, 290046, -484917, -140628, 336601, -290527, -203684, 581042, 51924, -485185, 230141, 187168, -465825, 105794, 464766, -279223, -220147, 312022, -106502, -251179, 306610, 164924, -245702]
118b45702K34330J01202k35023J04342K24540p8432j89828k2030J29666m0616
128a7551j19208K48943J28719l84813m561L37233k63872j55158M71095q8936m35066
139b83175L11834J66942m12075J67945L51554l54887j43980L23521j21244j91964
149a85529K73109P8444k27712M520R9340o7707n5565R5425J09860j06734j37768
160a20317J53959M0240k39519J46301K54882l18052r8294L88451j80611k94200
170b67160M27299N6160m84562K28033K98730m41633J3770M72198k74548k78827
180b50540M00956k1175l83643K46021K40825l23151m7307K89092j15674k17939
190a82535K04793J42709k35080m7417K49440q0252k44834K21540J69803l31938
$$ y = [-245702, -11372, 89830, -145193, -40851, 183689, 105257, -84571, -106601, 23065, -17551, -136759, 112184, 240903, -143910, -148471, 188762, -75110, -230268, 240827, 151891, -283175, 28659, 195601, -216474, -48529, 303025, -51862, -195842, 127679, 6435, -185529, 87580, 166024, -61688, -57168, 42172, -25535, -81100, 14325, 124185, 17451, -120317, 33642, 73882, -165637, -19336, 235546, -82506, -180800, 207651, 27040, -267160, 160139, 216299, -268263, -40230, 258500, -183133, -169363, 302835, 28287, -250540, 150416, 129241, -254402, -8381, 232444, -90707, -138014, 151078, 35404, -182535, 22258, 164967, -70113, -117530, 131910, 51658, -193176, 28364, 198167, -133771]
200a33771L501L51103k30089k35561M09355J2077m26661K49217K60012m34244
210a75061O614M34870k61689k52013M05760j3906l85163K37136K27133l38120
220a14439j8861L09899j53768k08117K35893Q2094k40786L5082K10505j25515
230A1987j55357J98574P1748k43883M7323K32803j88291j46806K94415q465l01370
241a87322J94058J94986l22690q187L28156j88294k10117L06306J7808l04071
251a79367J58437J94162k52521l4333K50154j01840j73556J76372O7494j93743
261h8741K4402J66700r4954j16087J49958N6073j76643K9092J71684j27226j21709
272a27451K01590J3851k22533J19427J69097k23213m3538K54643j06292j95712
$$ y = [-133771, -130270, 220833, -9256, -244817, 164538, 176615, -250046, -829, 259183, -175061, -168447, 266423, 4734, -247279, 158481, 144575, -240588, -3452, 223681, -114439, -133300, 176599, 22831, -185286, 50607, 132701, -108085, -73003, 137502, 11987, -143370, 55204, 126952, -116931, -69608, 163195, -25096, -171902, 122513, 114048, -187322, 6736, 201722, -120968, -129155, 199001, 10707, -199410, 106896, 124704, -179367, -20930, 173232, -79289, -113622, 136532, 34692, -138864, 37508, 105002, -88741, -64339, 102361, 7407, -108680, 41278, 97351, -79292, -50200, 121484, -5742, -127451, 74139, 87990, -134543, -15116, 153981, -69232, -112770, 141873, 35581, -160131]
282a60131K17367O6202k50327P7990J93094j83873q1560K16754m1480j76856J38401
293A5581R8132j79844k392J70904q8078j29814J48959N7741j76269L5656J70487
304A21063j20193j12136J82118J1910k01413R4704J52457j81409m9570K14209
314A11740p0206j74518J67740P6310k08440M1250J80236j39613r6455J87026j1614
325F3456j76463J05223J14381j61290k0319J75431o8944j37014J39516N9226j78035
336h4832K9011J63152j13854r9893J73744J3025j79348Q2473J29650j57831m7350
347i2053J79811n3054j46875J36093P2801j73814K2701J58726j10326r7942J63843
358E9911J2135j67915P8663J24184j49174m7050J73414m6047j45249J32164P9129
$$ y = [-160131, 57236, 123438, -126889, -48899, 144195, -39678, -121238, 95516, 54036, -122820, 15581, 113713, -66131, -68523, 102381, 14303, -115511, 33448, 91189, -85080, -49424, 121063, 870, -111266, 70852, 82762, -118651, -23947, 128510, -52899, -102469, 111740, 41534, -132984, 34756, 111066, -97374, -56124, 124112, -15501, -111956, 75070, 63456, -113007, -7784, 106597, -54693, -75012, 100419, 31475, -105539, 33977, 93203, -84832, -55821, 107331, -6523, -106416, 67328, 80353, -98995, -16522, 113128, -44703, -92053, 87758, 34704, -112171, 23922, 96723, -77091, -54390, 104336, -5990, -103932, 59911, 72046, -95869, -17206, 106978, -42196, -89246, 84168, 38121, -107128, 25036, 104165]
369A04165j73368J6202J60922j11637j06032J64668J3141j66153Q4289J21853
379A08050j45190l8866J58064n3780j28736J19115O1429j47376K0194J36191r1588
390b493q7863J37641J7605j46550O0373J19121j23456n5214J54216l0550j43015
401a00185J07608Q2562j53239J1149J54897r5478r8556J45693L738j53203Q0288
412a4726J04983j30465k3299J37694n3504j01824J03187M2888j16248J6034R6850
423F1570o5015o1682R5186K1974j01272K4547Q7007p2320n4425J09439Q849j13278
435e9420M9243P9591j07315k5441J27068l7571r5178R6236L1919j21637L5521
446b6984J00661q6958m5688J02599k1218r2591O9290O4598q1559j7656P8719l0460
$$ y = [104165, -69203, -53001, 107921, -3716, -109748, 54920, 68061, -98092, -13803, 108050, -37140, -76006, 82058, 28278, -100458, 18657, 80086, -67290, -47096, 89095, -2493, -90356, 47285, 64890, -81660, -21287, 97834, -25622, -80836, 73380, 42830, -100185, 7423, 89985, -63254, -52105, 102792, 7314, -91242, 54451, 58189, -95014, -14726, 90257, -40208, -63507, 74187, 20683, -81141, 22046, 64934, -51314, -35280, 61570, -3445, -65127, 30059, 52033, -49239, -24692, 62315, -10005, -64430, 45009, 53858, -59420, -10177, 69414, -37901, -63342, 63726, 26155, -69023, 27213, 59132, -62505, -26984, 73677, -13281, -58969, 43630, 22412, -70179, -889, 63709, -17850, -35506, 43213, 12753]
458A2753p4638O2005O0035p7021k1163Q6384l6701q7543Q9014O1298j14394Q533
470c1438J10866r2964p6032J42993M332j38016Q1468P9722j46793K254J55245
481I1637p4557r4056J27861L32j48825P0475J14295j08001l5836J26259m2289
492B7295j19923R2327Q2631j12644j1238J17221o7922j06380J19815N6018j34671
503e7471L4300J19003j26237p0440J70570j2842j47066J13379P2406j86230J5301
514g5327J75575j00053q6711J65462j9342j72649R9083J06771j38689j924J41422
525I3618q6761j07886J23190L9847j14631M4959R2760j01837n9958J11842J755
536C6898r1153O6096O0625j14847k3174J15071l3996p3494R8743K4223j29585
$$ y = [12753, -61885, 120, 60155, -16866, -38029, 48355, 11654, -75889, 13125, 74423, -39971, -31438, 79428, -13536, -89568, 53425, 57757, -80259, 1209, 80931, -65862, -63608, 91637, 17080, -76976, 50885, 51217, -97608, -27133, 87162, -20839, -56675, 69584, 27295, -92628, -301, 82330, -30314, -41552, 75669, 7747, -98633, 21182, 77200, -57471, -23171, 95832, -30405, -100845, 69725, 56883, -90183, 23196, 95602, -90628, -75327, 100248, 195, -86516, 78946, 59604, -113045, -13962, 92809, -45880, -47804, 93618, 6857, -101029, 22161, 62008, -52623, -7664, 85096, -16741, -76699, 35143, 36898, -54255, 11841, 72466, -42381, -65555, 49516, 15520, -57974, 40769, 64992, -64593]
547f4593K2539R7813p1815l1554J06014k7737r7069O0384M4525o7661K3322O2502
559E6670n7959m1146N0078j198l0312L8031K0773m2060j4703K3185J1q180J9239
572A2429J2505k7695k2469J8235Q959j3102J9483K0167l3820j9915K9118J09j8148
585a4144K7551J2720m0215j0263K7233k477r332K5256Q296l3625j0163K4858k821
598B874j5013K7978R993m7926k984M4387k1078k2717N7422j68p3753K4758N0259
611C4032n5855o563P6581l4758o6391O1527K1794o9919L6200O2593p1629l1383
623d3771P5312k2067n9170O8572L1727q4882P910O9169n1647l3880Q4224m620
635C6877q5023M1407M8738p8050m64R3233m3402o9914P7090J8649r1531L8924
$$ y = [-64593, -42054, 55759, -16056, -47610, 58404, 30667, -66402, -6018, 38507, -29154, -5832, 56670, -1289, -42435, 7643, 6445, -23867, 14164, 34937, -7123, -21826, 1359, 1370, -6810, 12429, 24934, -2761, -25230, -6995, 1964, -11138, 8345, 28512, -5308, -25223, 3895, 4004, -14144, 13407, 26127, -14088, -24351, 2882, 405, -8927, 16329, 24625, -9000, -19163, 5695, 2874, -12139, 15839, 25832, -22094, -25078, 19309, -1769, -24486, 32936, 32768, -40985, -16227, 34032, -21823, -28386, 48195, 13437, -52954, 8573, 30367, -39552, -3352, 59241, -12388, -43771, 31541, 9474, -49696, 18876, 50603, -34279, -26369, 42800, -8847, -42727, 41497, 36877, -48146, -6739, 41999, -36051, -36515, 56718, 13316, -56598, 20492, 39141, -52390, -13466]
647a3466P8995q0184l5839R0301k6051p4590P7673L9573r3978J4238P7526o5737
659a1539m0865R3794m493q8165M7442N2657q0486p993Q9175l1900o5010O3513
671A6130K1245p8358K1688O6454n5619l2588O9520j2470o2110N1252L8083o5379
683b2152J304N8547m0355l6319N8329N360n4174K6081L4526m5272q566M9228j3635
696A2902l6936L0506J6508m1054O67L8183j7130k6713K9262J1113l4022P843K9999
709B1128k1750j6636K8470m357k8742K0159J8362k7111J174K8384j5380j9872
721a6171K3420P208k5335L819K0096j1682j5286J6410R910j8657j489K1429q417
734E255j9909J8229J0806k7982K526K7758j9699j8164L2728O94l1210K1170J9536
$$ y = [-13466, 65529, -14655, -50494, 39807, 13756, -60834, 16839, 56412, -37566, -23328, 54198, -11539, -52404, 41390, 36897, -51268, -3826, 48831, -31655, -39648, 49527, 17627, -47383, 16130, 37375, -40983, -19295, 47159, -8460, -41048, 28472, 16002, -46108, 5144, 43227, -22152, -20848, 37699, -2656, -38975, 19354, 24714, -29460, -3379, 31147, -14125, -22691, 26537, 12902, -24034, 6472, 22980, -18074, -17407, 20776, 3646, -23067, 6195, 17308, -16714, -8871, 21128, -622, -17258, 11212, 6855, -21887, -1728, 16634, -10477, -9303, 19081, 3701, -16171, 7249, 14457, -10878, -7059, 13037, 1355, -13931, 2479, 12389, -6268, -7757, 13672, 5255, -14654, 3575, 14381, -13601, -11075, 16683, -3016, -21180, 11548, 12242, -18968, 2202, 21738]
747B1738l4227l63L1854k1048j9352L3612J544l2626J7688K3266k7976q658L1136
760A6588o010k9039J6382J8967k4873p701K9530n520k6615K0002J6404k9956J877
773i964L0376k2275k0667L4625j755l5312K5952K3432l7678M31L7572k3085k3721
786b2069L4872J806l4958J6922K2200k7120m303K8437q433k0925J6646R786k0783
799g922j515J9189p376j6314J4669R087j9600K869K1358j4126j3325K3239j247
812H986k6478J6469J7380k7759q96K9835j4544j8935K5887M152k5455Q535J5784
825A2961j7814m903J7108n070j0743J1064M394j1039Q53R860n700q578Q143N037
839E573j2512j04J3963n938j0793J4508M595j7062O077J3625j5319n896J7487
$$ y = [21738, -12489, -12852, 19002, -2046, -21398, 12214, 13758, -18868, -1180, 22086, -5890, -14548, 16588, 10578, -18461, -2079, 16888, -7985, -15686, 13844, 8324, -18291, 1711, 18115, -11841, -9964, 20412, -1863, -22530, 12095, 10340, -24972, 980, 24412, -13266, -12835, 24737, 1652, -22069, 12803, 14609, -20349, -3427, 18773, -8347, -12650, 15787, 7354, -13571, 3075, 12861, -7922, -9437, 9752, 2376, -13938, 731, 9818, -9782, -6913, 14445, 319, -13006, 10233, 8986, -17492, -1023, 16357, -11402, -12298, 17537, 2993, -15942, 9945, 14097, -11358, -2823, 12961, -4853, -9756, 7352, 2282, -8461, 2603, 6997, -4042, -3189, 6671, 971, -7607, 536, 5573, -6939, -7043, 6920, 982, -9811, 4697, 9292, -7770, -1693, 11932, -3387, -9283, 8204]
852H204n419j4042J4244O061j5116M650J1115j0335m286R904l726p429O401J622
866A848o205K261N384l457k935M909J960n874j539O230j743p150N042O117o767
881a919j434R139k042o524N104J773p053J353M466m797j007N619j629l087M150
896B112J529m950M16K434l330k215L303R98k644Q45L300j487j685K849J640l979
912h64j128L721k034l897M312L927m750j20M791k188k970L652q36m143K698m68
928b97m901M919L665o400K009P170p433m075R528k898p421P200J062q740N484
943a128O051p651K848Q069r387l019R932m808p235J0115O11j1199N505P891q246
958a651j313J0277l350j0711N063O543q929l127J2238j552j2940Q302J0329j4110
$$ y = [8204, 2785, -11257, 2987, 9048, -6068, -1418, 9697, -638, -4924, 4980, 1254, -6175, 226, 1848, -4357, -2096, 3288, -169, -3104, 1805, 3765, -2109, -3648, 2582, 839, -6311, -1269, 4848, -1919, -3353, 5786, 3744, -2780, 2324, 4097, -2956, -1603, 2863, -1934, -2941, 2678, 1049, -2038, 2112, 3641, -1309, -893, 1541, -1789, -4004, -701, 297, -2347, -1502, 1798, 311, -1374, 1475, 3115, -864, -1992, 1729, -305, -4202, 110, 4037, -713, -833, 3958, 1770, -1200, 2452, 1616, -2527, 171, -297, -5198, -279, 3386, -3014, -1005, 6165, -1268, -5343, 4185, 1287, -6134, 1066, 2128, -6612, -1128, 4923, -2728, 120, 8189, -1198, -4217, 5715, 907, -6328, 3787, 4398, -6801, -1296, 6595, -1651, -2964, 7313, 3963, -6748, -1685, 4858, -4071, -7198, 5040, 3488, -9452, -1150, 9179, -4931]
972d931J26J6949j2119j2494J9371j943k0382J9217J2144k7928N616K6137k3710
985c947j1128L2607q880k8867K3911J0420l0493J0518K4227k2775q104K4800q530
998C759j8287J8970O396k0779L276J5219j1698q386J7926L482j8049N760J5250
1011A2839j6309r421K5048l151k6667J8412J6857l1840K995L5029k2570k0651
1023a9429L4753n129l3881K7093J5162l6032R856K7546k9743o251L4704j4016
1035D633k2710K7434J696k7459J2636J6768j8110k575J5617n545q900P662O187
1048G334o003m936O016J977j1723K564J3814r691q387J7171l454j6295J5616O461
1062A0464k0678P618J2893j9753J136J8895j3313n621J8390q301j0466J5415l471
$$ y = [-4931, -4805, 12144, 25, -12469, 6902, 4959, -15423, 3794, 15938, -11990, -6374, 19763, -3947, -15075, 17532, 8652, -20215, 3696, 14116, -16377, -5859, 18368, -4407, -12511, 12289, 3759, -14528, 4442, 10838, -9941, -6665, 8554, -3144, -11530, 6396, 9878, -8171, -2411, 12839, -3470, -12891, 12157, 9006, -17661, 751, 17608, -14232, -11237, 23792, 1222, -19429, 15324, 10195, -23686, 3407, 18569, -17463, -7607, 19939, -9804, -16055, 18649, 4633, -18077, 9357, 11053, -16406, -3770, 12998, -5112, -7687, 7930, 2385, -6515, 1147, 7334, 1331, -3605, 2411, 4388, -7335, -4771, 9043, -648, -9035, 8136, 4682, -11613, 4003, 10464, -10214, -2596, 10297, -9456, -8320, 10575, -2738, -8359, 10031, 1730, -8736, 6679, 3208]
1075C208r837J2047l914j0811J4777k389j3649J7900K486k1770J3974J1160k4236
1088a1054O370J9320k2232l782K4200j4556j2218K5155m145k0548J6996P017k0280
1101i757N403J3574j1795m597J0029R93o624M61P814k93j1425N535J1708j6617
1115e591m669K3944j1969k0680K9375L675l4335K1422K2151l9617L250L8027l1813
1128f830j7357M5193j3940l5854L9240J0691m3690J8670K9858l7067n231L5221
1140A8904j7038k0304K6688K735k3468J0749J4630j4434n963J4839j62j7016M393
1153e447J7498j4212j3191K5233J457l0968J8479K4049l5803k394L9802k5826
1165a323k6748M4180k084m1979L1792K2167m5408Q590L7656l1638j3854L7482
$$ y = [3208, -6629, 5418, 1504, -9307, 5470, 3081, -10568, 7332, 9818, -11952, 2022, 13182, -11054, -4684, 14636, -7596, -11378, 12822, -1734, -13952, 11203, 7058, -13490, 3506, 10523, -9757, -4354, 9220, -2575, -7172, 2857, 3850, -2774, -2313, 5501, 5208, -6217, -682, 11026, -5591, -10260, 13684, 1715, -18965, 10410, 14085, -20250, 1172, 23323, -16294, -13044, 24983, -6830, -24187, 21006, 7066, -28788, 10452, 21143, -22547, -3877, 25981, -11086, -16317, 18904, 1866, -18438, 8250, 10985, -12483, -1734, 12896, -1538, -7501, 7338, 7176, -9840, -5447, 12051, -2161, -15352, 9881, 11338, -19630, -1151, 22898, -12905, -15299, 24503, -1323, -28071, 16109, 14025, -27954, 3838, 26005, -19403, -10813, 26843, -4795, -18649, 18833]
1177A8833j2847k6215K6155O072k4680J0730J5054j6066m398J2980p09j0000P62
1190d329R791l321j3832R854J3783j8744l250K5246j2087k0881K6637L252l0148
1203a8029J7174J8240l0050K738K8355k0736j1071K8155q361k0742J9539L907
1215I119j9474Q682R427j1623k21O959j779j298j502K443M642j0192k736J6872
1229I319r300j4645K2465K465k6538J6483J7934k8734K120K6885k1643j2439K8946
1242A3318q496k1891K3674N950k5490J0867J6530j8593m792J7225m900j2151O231
1255b518Q060o758o467R544O851j4789q61J9703j1610j6848K4171K388k9537J7299
1269a372K1399l2245L47L4730k2848j9661L5418m768l2970K5398J4536l3278O570
$$ y = [18833, 5986, -20229, 5926, 11998, -12682, -1952, 13102, -2964, -7362, 5618, 4909, -5091, -4329, 5462, 2141, -11691, -1837, 11946, -6798, -10048, 15198, 3111, -17770, 8867, 12119, -18029, -855, 17385, -12665, -9927, 18428, -2308, -13379, 14776, 6415, -14327, 5212, 9119, -10355, -1673, 7754, -3869, -4090, 2869, 1090, -208, -1710, 733, 5375, -4817, -7553, 9319, 19, -14626, 7839, 10304, -16234, 249, 18183, -10551, -8431, 18454, -3189, -15628, 13318, 4822, -17069, 6605, 12555, -12935, -2068, 14462, -4131, -8923, 8302, 3402, -8749, -2518, 5542, -1216, -7683, 1861, 8712, -6077, -6938, 12765, 1155, -15693, 8478, 10866, -18671, -1372, 20027, -12218, -11871, 22859, 11, -19650, 15768, 11000, -21970, 3428, 17964, -15314, -8744]
1282h744K7480k1598j2060K6483l206k1000J1203J2480j4698p140J5304K246j6051
1295i301M375J7354j2866j2247K2358P56k6640J5543J8878l0274j179L4421k0633
1308E45k2291L6013Q76l6398K2007K1174l4912l71L1726j8795j8427K7506J529
1321A0182k4156J1339J6547j7695o374J7488j169j7052O986J5149j3162j0342
1333a2259K0902J319k3850J2854J9359k6266n521L1527j4787k4921L0417P352
1345A6126l5116J4814K6177k9311p998L2045j1656k3717K3243P310k5292P194
1357f181J9349j5453r253J9820J54j8557P398J5161j4732j0337K0572R49k2896
1370a4006J1346J9877k2318q246K9012q294k6370K3579J1753l1836O893K7313
$$ y = [-8744, 18736, -2862, -14922, 11561, 8355, -12645, -1442, 11038, -3660, -10800, 4504, 6750, -9301, -4926, 12428, -438, -12685, 9673, 10429, -16211, -668, 18210, -12064, -13243, 21178, 545, -21746, 14267, 15143, -21255, 752, 21926, -12986, -13357, 18369, -426, -18853, 8653, 10182, -13974, -2635, 13912, -3783, -10157, 7331, 6162, -10890, -3904, 11245, -1917, -12259, 8643, 9962, -13888, -1034, 18325, -7941, -13462, 18065, 3278, -21643, 8774, 16126, -18990, -4176, 22001, -7310, -15308, 16737, 5081, -18636, 4607, 11917, -13375, -6181, 13168, -2285, -11538, 8282, 8436, -10121, -2723, 12438, -2294, -12631, 7941, 8890, -14006, -2660, 17217, -5101, -13347, 15665, 7371, -18999, 4580, 16333, -15503, -8610, 18703]
1382A8703k2654j3404L0419l965k6034J8669J3626k5782O99K3131j3359j4884
1394a4835K0284N174k1600O244K0056j5507j3163K2062K560k5458R250K2052k1659
1407d540j1243K9089m104k6750J9429J6479k9496K2K7994j7613j7969K7802J974
1420A1074k8477J4928K0083k5197m938K7904j0119k2586K1025J0420k6903L977
1432h809K5624j6830j6429K6101L367k7475J1054K2403k4052j0866K8611n404
1444G295k5733K0100J5120k7774J101K6645j6420j6680K5782J208k7441J3475
1456c322J8792k4016m450K8226r156k2509K0729J0917k7115L800K4902j6592j6553
1469a6347K4183K350k4215J2329J8870k1999o674K3652q209j9160J8644R024k3211
$$ y = [18703, -3951, -17355, 13064, 9099, -16935, 1734, 15360, -10422, -9723, 13408, 49, -14835, 5449, 10623, -10977, -4733, 15323, -184, -13347, 8715, 11275, -14183, -4933, 17119, -4540, -15783, 13306, 9202, -17548, 1881, 18360, -11136, -11114, 16880, -733, -18702, 9100, 11074, -17403, -2475, 17608, -7589, -12527, 15377, 5258, -17328, 3697, 14117, -12786, -8809, 16815, -15, -16444, 9657, 13024, -14451, -3397, 19006, -5046, -15912, 12699, 7295, -18438, 1662, 16782, -10992, -9891, 16754, 334, -16346, 9436, 10644, -16797, -3322, 15470, -8546, -12996, 15230, 6074, -16435, 4294, 15211, -11904, -8104, 16798, 206, -16347, 7836, 10186, -14029, -1700, 17170, -4829, -11503, 12149, 3940, -15220, 3424, 12448, -10763]
1482a0763L332J9425j3651j0603K1158M99k0633Q714J3912j6905n081K0553l998
1495E959j8670J2979J1652j8750m40K0919r048j7216J6057N878k0059N660J8212
1508A3133j4540r377J8405k312j6543J2256J1456j8137k992J6659p253j3142J4896
1521B509Q682j7170j066J6759q223j3155J6335P450k1078J979J8674j4185j1096
1534a3585K4039R45k4742J2482J5624k3981k019K7419j2495k0917K2541M953k6166
1547a5902J1942K2403k1536j0106K4115n598k2594J8541J5175k4376l402K3886
1559A2548j0363j8829K2614J1134k7163L003K2828j9364j4288L0247k14l0008
1571a7855J7647J8252l1055J04L4846j8344k3734L0035K484l4398J7359K6018
$$ y = [-10763, -7431, 11994, -1657, -12260, 8898, 9397, -11236, -2522, 11390, -5515, -10596, 9957, 5959, -12711, 268, 11920, -6830, -7270, 13649, 4601, -12615, 3442, 9320, -10739, -5079, 13133, -1407, -10784, 7621, 5309, -11234, 1022, 12478, -5659, -8651, 8008, 755, -12387, 2509, 11191, -5979, -7045, 9714, 1491, -11664, 4671, 12121, -8957, -6978, 11696, -2489, -13585, 10454, 11399, -13343, -861, 14763, -9218, -11237, 16182, 3687, -17230, 5311, 10264, -15902, -3960, 18443, -3093, -13199, 10916, 5318, -17276, 1265, 16440, -7936, -11338, 12548, 2185, -16644, 5970, 17104, -10059, -7056, 15772, -3592, -17880, 12367, 12153, -17855, -208, 18044, -13011, -12907, 21939, 3595, -20139, 9896, 12380, -22018, -4659, 21359]
1583B1359k8349p378L0098j1875k3649K5160J1787k7960L754K2144j8516j3795
1595a7220K6388L041k4258J0423J7683k2770p536K8484n776k4813J9584J1153
1607A4383k9976M488L0207j8451j7204K8985j847l0405J7537K0539k6179l234
1619a1157K5462j3622j8197K2789O774k0916O910J5165j6504q731J9143J82j6385
1632i087Q157J1723j5745o199J9885r95j8069J1266J1625k1161k727K3085q651
1645C107j7158J9648M919k3424P484K0012j6461q473K0096m573j8576J2659J0996
1658A0256j5095q09J5092p108j1696J1684O888j3859m08J4506q360j3946J5332
1671B477Q285j9579L252J9962j5813j3322K3443P10k4058J3825J5785k4889j933
$$ y = [21359, -6990, -14368, 15730, 3855, -19794, 5366, 17153, -10807, -7053, 15091, -3425, -17220, 9168, 12209, -12049, -1626, 16057, -6713, -14249, 14235, 8459, -16354, 3230, 14383, -15593, -11105, 19102, 651, -16553, 12432, 10585, -19820, -2283, 18256, -7923, -11157, 14305, 683, -17514, 5275, 12049, -8867, -1957, 13208, -3296, -12027, 7116, 7298, -9087, -930, 10793, -4952, -11151, 8734, 7739, -10330, 936, 12561, -8600, -11327, 11758, 3107, -14051, 5597, 10516, -12908, -5424, 14588, -1873, -10346, 9750, 5177, -13399, -740, 10256, -4839, -5648, 9444, 2336, -9360, 2324, 9212, -4647, -5055, 9451, 1091, -12855, 2477, 10762, -8817, -5565, 14397, -1416, -14738, 8705, 9415, -14643, -818, 14967, -9922, -11855]
1684a1855K5432j1201j6442K1831L499k3682Q767J7545j7698p039K0782m142j8651
1697a2854J2643J2746j7989k618K0167q053j8037J6949R206k3190K880K2984j5842
1710a008j5885K6288J810k6933J4593J8720k6239m500K7937j2619j9250K4430
1722G344N205k6376J0288J9910k0424p373K3681o029k0721J5265J2000k0607j133
1735h970K1012q771j6223J6903P966k1422K617K0211j4830j2988K2318J207k3298
1748a4268J2629J7132k2342m028K4961j0454j8662K0446O243k4202P594J9323
1760A4372j7556q172K1566l087j9443J2805J1845j8218k874J8075o434j5238J4094
1773A735Q477j7215M79J7712j0269j2762J7369L399k0590P931J6545j7512o707
$$ y = [-11855, 13577, 2376, -14066, 7765, 11264, -12418, -3651, 13894, -3804, -10843, 9939, 5797, -12854, -211, 12535, -5454, -8072, 12095, 4042, -13995, 2954, 12160, -11030, -8150, 14834, -1008, -16893, 9395, 11205, -15728, -1135, 17585, -8654, -13154, 14783, 2164, -17086, 7344, 12549, -13827, -3539, 16371, -4053, -11426, 12255, 6226, -14495, 770, 12770, -7837, -8970, 12042, 3271, -12952, 3951, 11917, -9505, -6888, 13323, -1507, -14495, 7823, 9030, -14268, -1639, 15493, -6849, -10877, 14084, 3630, -15032, 5414, 11657, -12545, -4951, 14372, -3184, -11356, 10210, 7123, -12320, 485, 12330, -5888, -8762, 9313, 2879, -12359, 1735, 10212, -7003, -6524, 11188, 919, -11843, 5526, 8925, -11665, -3734, 12811, -4701, -11408]
1786a1408K2557n101j9040J6068R852k1810J822J9764j2678j2409J8326K031j8297
1799a0323Q346J3596j4576n875J6590l090j5478J0172J0119j5488j914J7176o585
1812B670j3820J4986O160j8349L681J6491j3839r716J9586j240j8717J2396J2369
1825A2658j8718j773J9578q562j4787J5356M939j7837M436J4740j1612p841J5704
1838F281o13j4565Q356J0562j4676l343J6090n735j3381J3569P199j7496K577
1851e175J6717j1404j0431J6724J209j8083Q803J2460j5709l449J7927n693j4231
1864a0335J3303O580j6711K180J4239j0192r071J4682P59j4479P589J1289j3029
1877c196m228J5688m974j3926J2837P122j6987J655J6360r762j0544J6121K040
$$ y = [-11408, 11149, 6048, -12992, 3076, 12928, -8882, -7060, 12704, 26, -12383, 5943, 7974, -10323, -1977, 11619, -2957, -8832, 7758, 4668, -10810, -638, 9481, -6007, -7921, 9255, 2670, -11150, 3836, 9996, -8353, -4672, 11819, -2020, -11736, 7850, 6610, -12107, 289, 12658, -6060, -7833, 11745, 3183, -11604, 3752, 8691, -9146, -4710, 10030, -1582, -9423, 6281, 5668, -8897, -541, 10021, -4655, -7998, 8092, 2357, -11024, 2545, 9744, -7752, -5175, 11542, 138, -10293, 6431, 7640, -10443, -1640, 10820, -4889, -8338, 9589, 3896, -10335, 2968, 9548, -7163, -4983, 9256, -936, -10007, 4675, 5434, -9045, -1456, 9833, -3196, -7424, 8264, 3290, -10636, 2201, 9323, -7664, -6009, 10351, 589, -9955, 6166, 8206]
1890H206j6971O599J2582j3662n041J6061m622j3346J1913O899j4925J504J4199
1903I396r256r340J3772J381j4527O081J1433j2303m858J5460k797j3524J0828
1916A746P777j5250k46J5183q544j0370J4116K749j4983N660J1735j1523n121
1929g071J3648k874j2564Q862O861j2567L51J2781o520r068J1326L630j3458L703
1943b960J1227r884o824J3305O6j2925P872R410j2723k349J3773n183j1271J0896
1957B430M865j4314K726J2407r096o681J3159o0j3085O462Q976j1487l213J3603
1971F692m028j1675R704O836j3187J072J3671p887j0235J2861K780j4354N086
1984b664J2433j2064n875J4907k305j3079J0707P391j5232K71J3753q861q697
$$ y = [8206, -8765, -2166, 10416, -3246, -8287, 7774, 3152, -10194, 1719, 8618, -6307, -4803, 9396, 140, -9200, 4572, 5953, -8574, -2493, 8940, -3363, -8221, 7239, 4442, -9082, 1746, 9523, -5727, -5973, 9210, 666, -9704, 4412, 7161, -7822, -2162, 9573, -1950, -7071, 6577, 3703, -8861, 1, 6862, -5705, -5354, 7427, 907, -8161, 3165, 6795, -6663, -2960, 8267, -1617, -8441, 4864, 4930, -7995, -123, 9287, -3436, -5785, 7988, 2805, -8466, 2430, 7295, -7019, -4293, 8114, -982, -7663, 5496, 5436, -7649, -1187, 7789, -3698, -6911, 6692, 2664, -9011, 693, 7529, -5658, -4586, 9085, 1198, -9037, 3824, 6604, -7750, -2664, 9769, -2295, -8170, 6737, 4432, -8647, 2060, 9451, -5781, -5510, 8243, -618, -9315]
1997i315J4193J994j5589O318J1681j2435m359J5270l179j4521R991P966j3708
2010e693J5J4819p509j0505J2775L171j4583N498J2254j2658n918J4591l155j2500
2024i398J1068P735j4912N34J3546q830q746J4169J259j4595N228J0703j1593
2037c832l460J4549k966j2037Q190O535j2067M04J2112o417q378J0251J483j0685
2051f318N529R359r765m094J0401k827j0148Q541O468j1184q25J0731n193q012
2065g337J0437L501j1469J921Q518p670m649J0747K06r525M746N954p899j544
2079d063R909k810q048O018K792q062J131Q899m632o206P953J012r413M085Q111
2094F676p786m791R142j040r387O125P855r150k125R769l950q154Q357M198r819
$$ y = [-9315, 4878, 6872, -8717, -2399, 9282, -3153, -7512, 7758, 4579, -9942, 49, 8015, -5693, -5678, 9141, 1632, -8873, 3902, 7073, -7510, -2012, 10242, -2416, -8334, 6257, 3102, -9398, 1670, 9405, -5507, -4973, 8573, -257, -9003, 5166, 6425, -8170, -2942, 7761, -3832, -7292, 7257, 4291, -7746, 444, 6979, -5088, -4684, 7428, 1011, -7367, 2884, 4367, -6318, -789, 8570, -1195, -5289, 5112, 2285, -7863, 678, 7146, -4038, -4863, 5868, 675, -7337, 3100, 6601, -4868, -2947, 5571, -2099, -6748, 3999, 4205, -5320, -574, 5380, -2519, -4063, 5846, 3036, -5012, 1006, 3798, -4264, -3133, 5766, 1134, -5072, 2881, 3893, -5520, -1435, 6676, -1110, -5901, 3241, 2201, -7186, -1061, 6794, -2356, -4481, 5288, 1338, -6816, 1541, 5739, -4080]
2109d080Q60Q833o818n010J0649R84j0374M765O700r783k190J1190l332r154P701
2124I41M357j0621J351J1291o128p870R835J542j1808M783R428r055m234J1400
2138E212k606r800Q831N600j1390P93J0164p495o252J1029N17j0694N478P572
2152F959r885j887J1010l685q986P727L879j0257J054R835n551n926Q414J265
2166C966r311L969P452p782l378R477k727q194P548M786r675J258Q921o364n297
2181e351R185Q0r038M441N548p849r88Q382k487o408N476K963p171Q31O085l545
2197A54m547N294J540n713J738O009m653l429O365m72o636M315M752p029j293
2212c605P692k925n915O740K333p446J649N683n465k729O408q16n390L440L403
$$ y = [-4080, -3220, 5613, -1205, -6215, 4434, 5418, -4956, -191, 6509, -3274, -5464, 5726, 2394, -6760, 941, 5298, -5323, -3972, 7319, 1191, -6679, 3156, 4698, -7110, -2327, 7101, -1954, -6188, 5212, 2606, -7194, 1637, 7237, -4153, -3360, 6804, -691, -6943, 4086, 4603, -6091, -613, 6959, -2926, -4813, 6197, 2512, -6474, 1253, 5132, -5125, -4071, 5764, 213, -5713, 2701, 3966, -5345, -1376, 6076, -1706, -5084, 4393, 1666, -6528, 1020, 5806, -3869, -2611, 6310, -54, -5351, 3834, 3914, -5124, -683, 4865, -2984, -3972, 4410, 1923, -4485, 991, 3954, -3217, -2386, 3699, 154, -4393, 901, 2441, -3272, -1534, 4475, -178, -3607, 2758, 2286, -4350, -35, 4717, -2312, -3605, 4087, 1162, -4753, 1987, 4320, -3126, -1477, 4206, -1259, -3988, 2420, 1604, -3786, -346, 3057]
2227C057m621n55N065j598m543L379K291m824l51N871k667m405N405K082o857
2242c271K234O165n812l715P674j227p040N143M604p546L68O775m161m053N701
2257A839N49n860K137M117m590r06N126j002m333L128L415n153j186N827j754
2272A354n663M823L445o770O96P002m372m467O941l6p152M061M307o725k40O673
2288C877l951l913O040P29n952K719L465m327j458M535j061l654K977K933l920
2303i61j204N006r10m533K831L174n396q16O216k685m661N675J448o230K440M778
2319D172n687j278N770k623m710N728J085n756K451M357m432j503M779j141l925
2334b713K168K660l047j140L760M8l851J973L502m192j324M738j606m615M287
$$ y = [3057, -1564, -2119, 2946, 1348, -3195, 184, 2475, -2349, -2700, 3171, 504, -3901, 1504, 3586, -3271, -1037, 5128, -684, -4399, 3275, 2048, -4992, 151, 4755, -2791, -2423, 4352, 191, -3862, 1839, 2388, -3472, -1335, 2782, -1808, -2714, 2412, 1410, -2923, 205, 3620, -1533, -2719, 3108, 1354, -4309, 514, 3959, -2811, -2115, 4887, 515, -3952, 2989, 2953, -4199, -138, 4169, -2556, -2796, 3877, -74, -3987, 2053, 2782, -3170, -451, 3014, -1313, -2771, 1764, 703, -2951, 26, 2959, -961, -2165, 2841, 1931, -2602, 229, 3403, -1993, -2809, 3407, 722, -3939, 1736, 3184, -3046, -606, 4172, -1515, -2793, 2977, 354, -4356, 1372, 2457, -3299, -848, 3509, -923, -2426, 2353, 1212, -2713, -545, 2115, -932, -2072, 1688, 1736, -2115, -142, 3360, -832, -2156, 2582, 976, -3639, 648]
2349F48K200o061J366N487m429k209N967j833m808M470J617n731J820M807m100
2364g89j988M847Qm350K113K709l077j535L255K53l301J023L554l214j523M338
2380B323n00m590L170K583n693M16N375l708l131N994k57n320L654L205n397n1
2396a927M648l038l028M682P63m305J551L369k384k308L128P69l600P30L130k412
2412b32k261L785M89m233K259L639m820r95N220k265m597M874J679n584J917M576
2428C451m324j541N137j159m012K876J943l904R5L371j512k472L253Q72l361L61
2444i26L222j788k836L218J076m690J133M240l419j675N066j016m915L503K612
2459B805n342N19M835l064k764M613J87m282K495L073l659j238L309j084k287
$$ y = [648, 2848, -3213, -1847, 3640, -789, -2998, 2969, 1136, -3672, 798, 2415, -3316, -1496, 3311, -789, -2777, 2070, 2078, -2272, -159, 2550, -527, -2062, 1193, 1446, -1855, -832, 2722, -492, -2015, 2323, 1823, -2767, 403, 2986, -2707, -2291, 3084, -624, -3755, 2239, 1982, -3338, 316, 3521, -1876, -1927, 2721, -317, -3345, 1337, 2100, -2205, -654, 2715, 331, -1977, 1151, 1920, -1680, -950, 2180, -232, -2493, 1292, 1781, -2452, -193, 3446, -1374, -2369, 2851, 586, -4011, 863, 2542, -3042, -1125, 3451, -873, -2414, 2723, 1564, -2448, 428, 2371, -1533, -1438, 1933, 421, -2051, 1202, 2074, -1287, -926, 2296, 508, -2328, 890, 1966, -2724, -1591, 2649, -770, -2445, 2621, 1605, -3310, 193, 2805, -2537, -2018, 2817, -247, -3011, 1602, 1789, -2493, 2, 3075, -584, -1822, 1487, 403, -1884]
2474a884K281J532k943j82L105j396k555K976J410m037QL708k743k180M501M41
2490B042m555J608L490l668o86M276j484l714L107R65l332J154L476k321j895
2505a537K737J78k941J433K185k518j496K677q7k835K113K743l370j210L898j551
2521D19l436L693J865m152m52L963k243k033M074L45l256J105J991k858o26L624
2537B023j212k773K503P95k977P39L726k299k454K817J62l321J322L356k805j651
2553b049L582n46l526K813K581l710p12L514j916k692L268J582l473J167K421
2568B304k694j040L251q69k790K155J382l503j20L942j518k663L114P44l602N83
2584a324L388k143j863L130m09k736J549K418k554o18L239j614k291K116J309
$$ y = [-1884, 397, 1929, -1014, -1196, 1909, 513, -2042, 934, 2344, -1693, -1685, 2023, -720, -2900, 1601, 2042, -2513, -905, 2585, -1083, -1769, 2507, 1023, -2691, 416, 1381, -1951, -797, 2679, 358, -1537, 1200, 1378, -1563, -130, 2055, -463, -1959, 718, 631, -2204, -91, 2652, -718, -1928, 1970, 419, -3017, 676, 2541, -1611, -2063, 1900, -343, -2376, 1698, 2043, -1213, -108, 1883, -975, -1601, 2023, 811, -1962, 541, 1336, -1641, -902, 2824, 525, -1929, 888, 1050, -2271, -949, 2407, -398, -2049, 1533, 987, -2539, 274, 2855, -855, -1567, 1947, 31, -2661, 607, 2189, -1284, -117, 2304, -390, -1430, 1821, 952, -1838, 317, 1699, -1804, -1924, 2018, 500, -2163, 951, 1695, -1907, -1324, 2064, -79, -1942, 1188, 779, -1957, -408, 2010, -544, -1162, 2077, 463, -1828, 288, 1597]
2599A597k908O73K599k265j333K578N26k592J229J762k102j524K848n87k474K052
2615G9J731k864l53L058j010k375K290J175l187j76K758j169j405K784J58k292
2631g98N43K201k277r60K231l4k716J407J872k546l79L704j478k743K566J032
2647A625l495P50L105k616j510L370m29k758K204K001l181j87K638j109k541K631
2663D98R96k630O23K453k069j590K976P21l525J296K237l448n72L682p07l434
2679b493K962J462l686N45L329k379j589K924m25l071K532J981k794N6K846j912
2695B88k062K751L87k597O47K112j705j861K815O69k710J109J955k114j586K889
2711I87k38k560J873J610l333K21L105j557j248K601k51l148J875J506k476n1
$$ y = [1597, -1311, -638, 1961, -304, -1637, 941, 1467, -1125, 104, 1866, -236, -1760, 1088, 501, -1973, 79, 1810, -1054, -1407, 1651, 641, -1734, 556, 1731, -1456, -1632, 1126, -43, -1448, 1336, 1494, -798, -255, 1946, -331, -1291, 940, 906, -1810, -403, 1469, -1077, -1456, 2248, 770, -1973, 593, 1625, -1870, -1120, 1985, -631, -2141, 1229, 800, -1958, 246, 2247, -934, -1121, 1517, 408, -2133, 498, 1494, -1136, -513, 1940, -129, -1719, 1257, 1978, -1547, -251, 1986, -1462, -2034, 1648, 941, -2493, 469, 1931, -1755, -1210, 2119, -260, -1849, 1075, 650, -2421, 111, 2092, -702, -646, 2200, 288, -1774, 977, 1364, -1233, -586, 1526, -179, -2040, 775, 1444, -1266, -157, 1798, -316, -1902, 987, 749, -1811, 62, 1672, -1661, -1440, 1665, 108, -1140, 1461, 1210, -1938, -63, 1443, -1033, -1084]
2727a084K822j362j980K059J190k296R7K440j814j849J666J292k379J65K563j327
2743B03j960K560M94k678J159J980l010l86K975j060k061K987M39l157J015K760
2759B260k549j300K976n03k656J559J514j953n68K817p52k142J009J737k162p70
2775a483K486o38k485K127J408k797P03K767k535j267L426j010l001K767J474
2790A942l547M21L343k087j839L250J86l245J164J958j985j160K542N0k411J272
2806a46J974k564n80K655p62k563J994J372l117N68L122k165j605L437j11l691
2822b182K477J980l578R1L122j844k201L059J026l183P17K738k181j653K755l12
2838H31k623J237J854j781r47L085r91k378K414J328l364n9L223j874k453L850
$$ y = [-1084, 1738, 376, -1604, 455, 1645, -651, -554, 1886, 72, -1777, -111, 1181, -1198, -1033, 1530, 203, -1757, 803, 1297, -1381, -222, 1758, -1252, -1638, 1337, 277, -1784, 1203, 1642, -1515, -500, 2260, -289, -1589, 1387, 884, -1772, -213, 1301, -652, -1220, 1597, 845, -1297, -288, 1449, -713, -1483, 1003, 365, -2120, 7, 1415, -1382, -679, 2088, -447, -1714, 1712, 702, -2299, 468, 1942, -1605, -1184, 2159, 72, -1767, 1483, 1669, -1576, -412, 1546, -439, -1599, 943, 993, -1418, -146, 1828, -736, -1316, 1339, 577, -1986, 8, 1380, -1737, -1169, 1953, -212, -1817, 1620, 1509, -2182, 295, 2275, -1303, -1212, 1910, 66, -2135, 924, 1950, -1233, -516, 2222, 41, -1612, 1143, 831, -1792, -555, 1299, -482, -1429, 1656, 665, -1713, 701, 2029, -1335, -1394, 1829, -45, -2498, 1352]
2854A352M08l670J880K845l495r08L662j431k935K894J035l184M57K994j880j787
2870a763K941K38l019P92K549k418j574L165L52l323J988K498l477m09L950j828
2886F62l202L342J253m077Q08L517k733j699M017l77l602K231J989l439k53L221
2902A658j621k137K890Q43l113P33L058k226k361L143Q53m001J554L177l023j550
2918b123L998n61l511K685K204m287J33L498k287k245L820M73l907K083K524l244
2934g47r06L290r10k896K281J586l321J24L460j521k619K973J306l822O08L438
2950B324k505k397L987K48l719J970K489l253n17L844j889k892L420O43l776J328
2966f95K957k726j665L700k53l553K019K440l069q62L065n11l351K847K049l966
$$ y = [1352, 1760, -1910, -30, 2815, -680, -1588, 2074, 643, -2292, 602, 1637, -1547, -1090, 1904, 24, -1763, 1178, 1416, -1603, -811, 1738, -680, -2254, 911, 1263, -2060, -72, 2426, -1051, -1460, 2490, 662, -2540, 802, 2055, -2022, -1214, 2303, -430, -2129, 1888, 1511, -2091, 140, 2129, -1310, -1563, 1658, 37, -2100, 790, 1633, -1480, -747, 2311, 85, -2276, 867, 1720, -2281, -727, 2450, -573, -2123, 1875, 1314, -2197, 488, 2692, -1595, -1462, 2036, -251, -2496, 1324, 1797, -2110, -27, 2497, -747, -1653, 1637, 727, -2169, 112, 1698, -1623, -1499, 1961, 440, -2179, 794, 2100, -1722, -1114, 2324, -181, -2578, 1409, 1657, -2062, -92, 2397, -856, -1373, 2471, 582, -2310, 1110, 1753, -2023, -695, 2262, -464, -2129, 1571, 1318, -2235, -216, 2224, -845, -1707, 1358, 847, -2504, 343, 2392, -1574]
2982a574J44L789j828k528L241O13m114J347L189k831j232L729q33l385K759J642
2998B128l963O13L516k606k432L711K74l441J854K974l089j539L551k50l477K043
3014a33K372l295l48L375j504k203K713J285l796O59L205k969j562L861n42l582
3030b464K363K078l214j8L372j545k811K984O72l254R44L085k478j747L093L72
3046A432l346J585K808k929j090K920o59k957K832J728l553L25K960k296k084
3061b324L785J73l636J398K503l147q06L850n40l150K195J382k905k7L191j722
3077B20k298K796O54l130R95L389k566j516K951k61l531K256K260l248o54L723
3093B040j919k350L225Q39l525R99K956k921j815L806j75l436K266K022k820o35
$$ y = [-1574, -1430, 2359, 531, -1997, 1244, 1857, -2257, -910, 2279, -552, -1784, 1945, 1112, -2273, 486, 2128, -1835, -1222, 2294, -312, -2744, 967, 1241, -2200, -346, 2628, -461, -2000, 1551, 1301, -2176, -133, 2239, -1056, -1404, 1971, 467, -1736, 977, 2262, -1534, -875, 2330, -639, -2201, 1660, 1118, -2464, -101, 1977, -1237, -1255, 2117, 572, -2239, 745, 1417, -1837, -893, 2192, -286, -2033, 1060, 1432, -1914, -329, 2479, -450, -1540, 1380, 721, -2236, 596, 2324, -1229, -904, 2056, -240, -2324, 1461, 1634, -2002, -604, 1899, -1248, -2054, 1796, 1256, -1894, 301, 1683, -1222, -1249, 1942, 220, -2078, 718, 1372, -1758, -763, 2626, 60, -1456, 1495, 1234, -2297, -41, 2219, -1029, -1683, 2040, 121, -2229, 996, 1835, -1690, -691, 2265, -656, -2471, 1335, 1160, -2276, -10, 2012, -808, -1443]
3109a443L442j005l058K892J048l856P78L306k199j772L616k78l703J932K805
3124B505l509o72L738j589l353L210J524l534J011K975k463j913L159L85l700
3139b226J833K487l165j023L900j105k567K933R71l593K91L570k538j801L376
3154A343j62l637K185K556l148r13L764j447k933K500J613l357M75L207k265j716
3170a935L159J00k912J511K358l114r24L721j395k784K678J702l575M59L040j896
3186A93k000K999K86l614J594K443k766j180L637n04l124K145J900l286j02L094
3202A715j729k148K933M19k802J244K592k646j114L346q35l240K473K006l385
3217a171k79L578j716k585L201Q95l391O16K897k479j652L141j68l138K108K112
$$ y = [-1443, 1999, 994, -2064, 828, 1876, -1980, -1202, 2104, -95, -1867, 1749, 1471, -2232, -300, 2505, -1004, -1676, 2062, 473, -2880, 330, 1854, -1680, -669, 2306, -157, -2070, 1089, 1474, -2226, -393, 2094, -1071, -2094, 1806, 701, -1866, 1067, 2038, -1555, -1264, 2306, -232, -2033, 1343, 1181, -2456, -271, 2285, -863, -1776, 1988, 541, -2392, 108, 1721, -1636, -1161, 2046, -219, -1935, 1224, 1324, -1588, -77, 2281, -833, -1757, 1964, 569, -2215, 463, 2165, -1410, -951, 2089, 193, -1807, 1192, 1478, -2136, -542, 1901, -865, -2045, 1592, 1088, -2036, 109, 2009, -1277, -1379, 1715, -14, -2162, 771, 1190, -1612, -368, 2224, -422, -1536, 1810, 975, -2265, 208, 2214, -1171, -1450, 2128, 412, -2173, 1028, 1923, -1468, -852, 2045, -434, -2086, 1055, 887, -2251, -143, 1969]
3233A969k987m65L437j400k540K598J041l625Q47L069k122j690L460J57l657K017
3249A09K273l441m83L467j323l223L131J328l413N29L362k205k129L087L57l317
3265a891J366K345k601j060L701r75l076K811J582l535J71L552k179k471L152
3280H92J105l854J239L121k898j498L680o30l575K625J585l546R9L746k011k191
3296b111L186P21l497J269K681k904j430L386l57l042J923K230l040k80L493j649
3312E79k629L036J080m047P28L594k623k102L718L57l738J956K398l601l70L578
3328A914j364l216L220J098l343O29L541k356k041L284J44l626J687K696l386
3343a119q53L824q99l127K654J813l647K6L420j991k704L545P50l523J197K951
$$ y = [1969, -1018, -1483, 1954, 554, -1986, 612, 1653, -1972, -1125, 1944, -178, -1868, 1592, 1749, -1908, 109, 2382, -1059, -1542, 1925, 602, -2621, 510, 1838, -1575, -1046, 2316, 111, -2018, 1069, 1426, -1891, -525, 1820, -781, -1841, 1860, 885, -2191, 620, 2202, -1333, -1162, 2390, 211, -2260, 892, 1997, -1857, -618, 2503, -395, -1893, 1787, 1157, -2418, 207, 1792, -1754, -1655, 2091, 80, -2111, 1075, 1796, -1701, -432, 2249, -655, -2085, 1301, 944, -2098, -175, 2055, -985, -1265, 2228, 579, -2050, 986, 2066, -1981, -1253, 2341, -282, -2384, 1334, 1691, -2047, -91, 2307, -1294, -1664, 1914, 550, -2666, 554, 1652, -1691, -1062, 2479, 123, -1918, 1366, 1510, -2116, -429, 2267, -1119, -1972, 1852, 953, -2174, 480, 2293, -1354, -1328, 2092, 101, -2603, 942, 1692, -1831, -634, 2317]
3359B317l059j157M158j472l186K735J666l491j2L701j970k314L207P76l436R80
3375e57K794k623j444L010j22l089J639K330l035l67L299j303k746K925J055l686
3391a920P60L454l014j404L698q2l659K345K079l273n37L666j415l035L125O03
3407A391k694M79K942j991j758K620K95l014J161K507k697r23L366j034k922K656
3423C84J591l584M68L113j725k498L334K56l598J592K835k472j355L263m68k716
3439a580J580J500k690K18K508j677j607K569P68l065R09K842k833j323L064j98
3455I85l140K110J849l064q4L295j239k649K709P53l259J161K634k599j288L258
3471A432j46k731J426J550k287o14L078j256k291K276J192l265Q73K697k052j626
$$ y = [2317, -742, -1899, 2259, 787, -2399, 336, 2002, -1489, -1501, 2200, 230, -2084, 1123, 1899, -1537, -557, 2237, -386, -1830, 1180, 1058, -2031, -392, 1938, -1097, -1464, 1835, 532, -2214, 711, 1766, -1920, -1160, 2294, -720, -2124, 1574, 1492, -2167, 178, 2257, -1016, -1553, 2113, 698, -2337, 788, 1391, -1303, -824, 2118, 127, -1631, 989, 1284, -1730, -569, 1938, -759, -1682, 1684, 650, -2272, 384, 1975, -1609, -1141, 1972, 247, -2251, 1083, 1339, -2259, -667, 2168, -304, -1659, 1604, 1136, -1580, 0, 1500, -1190, -972, 1536, -141, -1748, 821, 1589, -1476, -567, 2275, -558, -1881, 1183, 985, -2155, -45, 1804, -1260, -1344, 1951, 712, -1937, 772, 1525, -1734, -573, 2061, -538, -1826, 1432, 1286, -1445, -19, 1531, -756, -1370, 1708, 452, -1839, 437, 1629, -1636, -763, 1934, -118, -1744]
3487a744L176J3l374J634K398l449m47L395r78k569K508J559l555N48K841k255
3503b99j536K909l9k724J591K031k376o09K695j066k186K073R75k729L61K582
3519A653j878j607K754N90k854J049K206k581q93K967o10k667K026J221k578L31
3535h71K594j694j276K454j8k774J417J720k237p37K642l57k604K126J212k519
3551i22k24K695j323k120K360O68k277O38K334k252j291L014k67k735J795J642
3567A735k894Q4K549j209j897K454P29k775N74K324k033j038K510k91k507J489
3583a96J630k133o15K838p79k502K183J105k818K51K662j709j574K632K87k898
3599a636J643J765k499m68K854j249k336K105J551k841L93K650k166j306K472
$$ y = [-1744, 1432, 1445, -1929, -295, 2103, -1346, -1793, 1602, 624, -1945, 563, 2122, -1433, -885, 1956, -299, -1835, 1074, 1035, -1689, -98, 1933, -443, -1052, 1643, 577, -1609, 464, 1439, -1290, -929, 1653, -225, -1832, 922, 1512, -1342, -293, 1913, -668, -1561, 1406, 796, -1871, 155, 1376, -1202, -871, 1723, 29, -1247, 1207, 1189, -1585, -168, 1552, -685, -1422, 1220, 863, -1741, 385, 1597, -922, -1146, 1549, 226, -1894, 466, 1134, -1143, -505, 1829, -423, -1714, 1300, 1033, -1702, 93, 1735, -1159, -1075, 1474, 265, -1632, 822, 1551, -1224, -650, 1674, -359, -1397, 1113, 822, -1685, -196, 1434, -699, -1314, 1524, 745, -1757, 426, 1531, -1287, -1036, 1626, -83, -1657, 975, 1262, -1636, 7, 1772, -727, -1195, 1659, 410, -1926, 179, 1730, -1111, -718, 1932, -234, -1540, 932]
3614I32L82k840J141J740k113q07K715n11k660K256J397k473o7K377j471j778
3630a780K637M44k978J266K522k759o84K850p71k586K182J726l439K31K571j234
3646A98j825K287O45k542O60K457k279j063K485j34k708J892J607k658k8K827
3662A821j638k019K637Q95l320J002K555j977j585K948j13l041J940J714k669
3677h50m55K660r55k413K338R24k299K85K345j544j569K583q0k696J540J805k190
3694e71q34K805q51k400K120J618k828K53K404j848j836K816K96k735J251J740
3710A400j886r44K847p64k123J660R18k208l5K340j188j694K632M88k413N37K239
3727A806j917j281K896r00k297J589J758k674m7K780j363j963K362N40k719O95
$$ y = [932, 1314, -1526, -385, 1355, -758, -1565, 1150, 639, -2021, 235, 1632, -841, -908, 1469, -2, -1780, 857, 1301, -1677, -411, 2111, -648, -1332, 1518, 747, -1839, 343, 2069, -1370, -1139, 1432, 198, -1627, 660, 1305, -1237, -577, 1880, -399, -1462, 1023, 889, -1819, 73, 1680, -978, -1006, 1821, 183, -1836, 801, 1696, -1624, -622, 1933, -44, -1629, 1319, 1206, -1835, 105, 1819, -850, -1305, 1355, 400, -2013, 325, 1249, -1050, -765, 1580, 36, -1533, 1050, 970, -1726, -186, 1619, -571, -1405, 1400, 549, -1851, 269, 1887, -941, -688, 1716, -132, -1968, 848, 1144, -1591, -340, 1400, -486, -1430, 1417, 653, -1470, 190, 1108, -1100, -1135, 1205, 17, -1677, 955, 1443, -970, -433, 1806, -111, -1392, 1504, 604, -1693, -104, 1654, -1020, -1067, 1713, 350, -1613, 749, 1289, -1430, -735]
3743g35K014j773p40K015J93k435J551J367k161n69K464r86j855K048Q03k321
3759a120L11K432j527j404K310j2k284R32J887k069p28K435n23k406J913J328
3775A475k437J72K228j617j511K330K99k225O07K212j918p23K197k63k293J462
3791eJ685k512l96K728j268j868K163P47k570N47K481k049r89K137l13k181J675
3808A2J092k062M4K276q79k057K413K83k365N28K116j589j213K339K56k660J440
3825b6J879k204m84K263r23k063J784R53k403M85J958j231j300K119L2k044R55
3842b50J925k363m37K049p62j834J974J279k446K82K053j237j807K328J32j992
3858a106P38J794j633j001K167j49j844R85J271k028J12J542p18j337J844L18
$$ y = [-735, 1279, -494, -1234, 781, 974, -1461, 90, 1457, -704, -1273, 1191, 205, -1650, 398, 1201, -1120, -809, 1623, 96, -1308, 1002, 990, -1294, -362, 1525, -544, -1272, 1163, 640, -1766, 147, 1475, -962, -790, 1438, -179, -1690, 640, 939, -1286, -679, 1533, -385, -1108, 1089, 826, -1467, -5, 1680, -832, -1228, 1500, 232, -1636, 527, 1274, -1296, -749, 1732, -317, -1306, 831, 518, -1663, 12, 1104, -958, -914, 1362, 483, -1574, 839, 1122, -1243, -715, 1401, -188, -1401, 938, 1194, -1466, -26, 1853, -351, -835, 1428, 505, -1558, 226, 1179, -1224, -739, 1219, -12, -1312, 807, 839, -1205, -250, 1675, -688, -1125, 924, 162, -1672, 302, 1581, -865, -583, 1470, 233, -1574, 754, 886, -1106, -368, 1426, -207, -1208, 959, 810, -1034, -49, 1222, -806, -694, 848, 130, -1207, 637, 955]
3874I55j866P37J166j305q41J828N4k156J314J099j694j41K064p52j820J626R30
3891A198j966K36J690j202j107J873R1j852J033R15j312j45J479o16j465J257
3907A07O93j800K91J759r73j416K238q3j975R56J335j599o08J916m04j789J511
3924A59J115j854n0J847r14j584J997J45j981Q85J363j661m96J935n55j451J411
3941C11N44j692L54J535j189j178J627M67j792O37J830j431q76J810j57j747R79
3958C2R32j695J53J690r96j182J586M01k073P73J591j608o73J858k84j776J151
3975a20J306j633k93J800q72j397J217O86j277J05J716j367r24J924P4j764O46
3992a73J511j861n63K062p21j749J784P72j806K63J966j481j006J738m7j694N92
$$ y = [955, -911, -174, 992, -313, -1154, 674, 728, -1428, -114, 985, -709, -850, 1214, 462, -1358, 268, 1198, -768, -532, 1158, -44, -1151, 722, 813, -1039, -6, 909, -403, -548, 931, 315, -1150, 107, 800, -1000, -709, 1050, 77, -1339, 899, 816, -1159, -203, 1132, -467, -1075, 841, 437, -1352, 159, 1274, -580, -630, 1217, 303, -1281, 716, 861, -1120, -235, 1128, -533, -1029, 906, 351, -1100, 311, 855, -837, -483, 1052, -137, -1315, 312, 779, -1013, -376, 1454, 23, -853, 957, 800, -947, 32, 964, -731, -578, 1112, 116, -1066, 520, 921, -1152, -379, 1212, -396, -1069, 789, 505, -1271, -120, 1186, -447, -740, 1060, 188, -1209, 8, 694, -583, -478, 1238, -129, -1053, 871, 945, -819, -173, 1338, -523, -1086, 976, 255, -1494, 290, 1062, -744, -481, 1485, 4, -1002, 736, 689, -1005, -413]
4009d13J590j378n40J594j23j757J314P25j624J0J351o94j341J767P38k176Q32
4026a25J457j678n69K079p96j741J509N64j269j74J719o35j320J452M88j879N55
4043c63J514j516p50J656r6j390J046Q98j342j63J778r71j480J555M56j799M40
4060e27J699j100r23J573M9j707P42J321j515n33J773l72j487J172O18j342L06
4077b53J327j162p66J568j1j677M48J543j623k83J661j65j649J100J134j679l44
4094h31J953q61j382J415N82j800M12J655j231p75J558j04j607N07J239j347j32
4111g49J480k61j400J090P26j611L39J616j246j090J759m9k044J252J587j696
4127b97q50K267l55k186J584R21j693k63J977j192j037J736J76j610O52J219j631
$$ y = [-413, 1177, -201, -741, 853, 730, -1027, 287, 1012, -612, -602, 749, 55, -1286, 481, 1219, -957, -125, 1332, -346, -915, 1164, 368, -1373, 136, 700, -569, -743, 976, 341, -979, 473, 961, -918, -363, 1151, -365, -1115, 541, 445, -945, 101, 999, -343, -506, 1272, 301, -1179, 376, 832, -967, -527, 1172, 72, -851, 722, 771, -936, -194, 1127, -388, -921, 852, 480, -1007, 165, 783, -559, -253, 1074, -88, -854, 714, 703, -974, -526, 1017, -606, -889, 772, 607, -1042, 58, 1192, -487, -831, 1122, 261, -1121, 294, 876, -924, -512, 1143, -88, -863, 695, 591, -1016, -509, 730, -617, -749, 731, 470, -930, 160, 886, -725, -386, 1230, -16, -1106, 653, 604, -1440, -188, 1399, -297, -1147, 1120, 765, -1421, 163, 1084, -609, -872, 1105, -87, -1124, 612, 788, -822, -170, 1049, -582]
4144e82m52J890n11j332R69R43j640j30K180j277j167J527N43k138P52J615j466
4161b76j014K295l27j977J356J099j715k62J682p17j078J126O76j610N69J362
4177A189j301p55J599p3j672J018J063j323l69J645o60j390J514N23j744J19J661
4194A044r95j181J250M63j604R09J170j182o55J551l40j418J103P91j409OJ590
4211A093r89j113J491K47j333M93J146j565m43J861l48j605J106R27j574p2J508
4228H30l96j233J090L75j536L82J263q63r25J557J41j819R44J245j498k49J546
4245H54l63j840J538Q26j686K22J651r60j256J528J97j703O19J382j451k55J257
4262E60o0j359J091Q04j626J85J303r40j053J524K34j498M41J303j036q30K055
$$ y = [-582, -1034, 856, 345, -987, -18, 925, -715, -845, 1335, 58, -1109, 418, 961, -1177, -425, 1190, -276, -1290, 1005, 678, -1299, 57, 1156, -559, -821, 861, 144, -934, 192, 868, -742, -173, 1189, -112, -867, 732, 659, -1013, 5, 1068, -255, -624, 1021, 361, -1029, 485, 1008, -736, -617, 1044, 49, -1132, 118, 581, -1023, -114, 1056, -126, -781, 770, 430, -988, 115, 906, -503, -497, 1093, 104, -1009, 482, 729, -604, -111, 1035, -530, -973, 888, 540, -1065, 41, 968, -606, -678, 830, 434, -799, 291, 666, -870, -488, 775, -88, -1013, 544, 685, -1134, -190, 1055, -443, -692, 854, 491, -1349, 189, 1015, -671, -449, 1202, 242, -1014, 514, 711, -992, -373, 1009, -442, -697, 560, 500, -859, 232, 1036, -590, -405, 898, -42, -1095, 429, 663, -835, -394, 909, -127, -957, 1098]
4279A098k53j711R00J088j633k03J518n45j131J120N27j552P04J156j094r65J507
4296E31j88j234R02Q44j279k37J632p88j049J287M12j617L70J214q27r12J450
4313E11mj285N96J079q92r37J491k62j390J168O95j416K66J512j117q57J663j25
4331F96j387N59J112j518m03J803l84j411J249P24j377j81J299o74j125J079O12
4348F73j450M62J166r21p38J394J72j535R36Q12j815p3J565n51r97J085O55j657
4366h17O22J362j253r57J737l16j203O82J043j311j66J488m84j003O46P90j606
4383g46N43J178r85r31J572k00j388J119J035j533k55J569m90j538J079R63j593
4400f01nJ557r22p63J347l8j182K95J073j402j66J556o46j011J061P46j295r0
$$ y = [1098, 845, -866, 34, 1122, -511, -714, 804, 259, -872, 248, 775, -777, -73, 1083, -11, -976, 531, 343, -891, 11, 855, -424, -661, 971, 183, -866, 421, 833, -784, -414, 800, -27, -939, 511, 507, -778, -182, 897, 5, -932, 559, 297, -1093, 75, 770, -646, -380, 1132, 15, -842, 821, 696, -691, -132, 980, -538, -941, 862, 478, -933, 316, 1040, -337, -518, 781, 107, -1018, 61, 673, -777, -315, 851, -70, -808, 586, 758, -777, 159, 971, -844, -917, 648, 97, -900, 185, 840, -817, -195, 1167, -86, -1043, 694, 378, -825, -143, 900, -411, -577, 911, 427, -576, 70, 860, -746, -203, 975, -10, -941, 631, 431, -957, 162, 1197, -336, -591, 978, 488, -1050, 29, 992, -601, -606, 951, 29, -734, 613, 575, -607, -312, 761, -641, -807, 749, 103, -908, 153, 899, -396, -486]
4418d86J185o54q62J102L26j637Q64J127j283o30J513K8j457R56J143j687k67
4435g19J362l61j490J613K23j461O32J136q83p13J394m68j250O47J239j569k15
4452h83J889p91j167J141N92j635M69J118p51j139J616K95j877Q23J395j482m97
4469h84J952n34j353Q66R24j614n5J675j050o72J345J20j666O79J270j317q02
4486a116J873m62j386J058J084j484l09J524o23j133J241Q56k160N87J340r76
4502h6q10J650l50j478J310J006j804k39J668r42q75J409O49j878M50J431j474
4519c63p11J431L42j707O24J347j262p30J672m50j231J239P66j933L19J417q95
4536a25q29J432K49j652Q41J176j708j28J690q12j451J262Q83j747M39J213o22
$$ y = [-486, 699, 45, -817, 285, 611, -1026, -162, 965, -318, -948, 565, 593, -864, 92, 1235, -452, -719, 643, 282, -1208, 405, 628, -833, -201, 935, 52, -661, 733, 265, -985, -338, 901, -668, -883, 1006, 215, -952, 189, 781, -854, -385, 733, -18, -1157, 459, 754, -1123, -300, 1095, -387, -884, 1068, 534, -819, 47, 971, -643, -698, 977, -73, -745, 600, 720, -946, -267, 1003, -314, -1116, 757, 295, -1091, -33, 1051, -433, -742, 782, 159, -974, 267, 1123, -1037, -450, 890, -86, -896, 754, 404, -1074, 236, 1242, -562, -801, 867, -75, -950, 459, 1108, -770, -320, 1111, -363, -1074, 357, 699, -1008, -384, 963, -299, -1029, 643, 193, -1038, 201, 967, -966, -647, 770, -125, -954, 478, 727, -925, -84, 1092, -616, -744, 946, 134, -1317, -55, 828, -919, -480, 733, 111]
4553A11j285J553K84j339O09J070r33j048J566l6j603Q82J189j475K69J104p32
4570A86j091J375K85j626N60J158r87q67J855j77j442P32J219j745k83J659o53
4587A58j165J176Q05j513k88J799p48j103J164M44j514L28J531j210m22J292k65
4604D69j490J274Q20j619r6J605j227r34J577M73j964P20J470j389m67J656j12
4621G66j543P96Q68j539J12J723j028j173J560M79j938N02J523j075r80J632k52
4638D33j728J400J030j723P7J517p16j555J628N59j856K12J762j190r64J724M7
4655F57j528Q16J053j590j2J835j100j341J389Q23j758L57J565j141r63J573R8
4672G33j642O67J194j213o62J935o62j222J144N41j668L16J403r18r64J422K32
$$ y = [111, -1174, 379, 663, -676, -67, 1003, 70, -978, 588, 552, -1051, -169, 1020, -455, -186, 918, 186, -905, 470, 755, -871, -311, 847, -140, -1007, 848, 671, -771, -39, 1180, -565, -848, 811, 158, -1007, 169, 974, -539, -827, 972, 224, -879, 285, 729, -785, -457, 1074, -136, -558, 734, 469, -1021, 253, 1073, -546, -642, 963, -264, -1198, 379, 852, -1112, -392, 1078, -311, -778, 878, 766, -777, 19, 887, -652, -540, 1183, 155, -1018, 542, 1021, -917, -415, 1108, 33, -947, 685, 433, -1295, 105, 1135, -588, -511, 1006, 290, -1265, 363, 922, -934, -722, 1040, -150, -1114, 610, 657, -871, -55, 998, -592, -604, 1231, 131, -1210, 179, 1002, -756, -399, 1166, 25, -938, 635, 733, -909, -242, 952, -261, -923, 1012, 350, -872, 272, 813, -855, -539, 864, -54, -1018, 404, 636]
4689F36j702R12R39r70o32J472k04j212J054N43j821K37J735q11r66J316K66j446
4707f54L83J376j069r74J334j41j297R27R61j285P3J217n75j181J438K60j480
4724f87L09J264r29q14J460J95j575O45J593j723n68J627m19j497J379R03j808
4741f45K22J239p30q14J407K60j804P11Q86r02o93J517j24j031Q18P05j462k07
4759f47J580j031j018J715J18j575N69J196j002p31J641k33j532R18P56j263j47
4776f86J510r49r11J582K61j459L81J295j197p22J609k94j393J017Q16j347m8
4793e35J653j007j124J390O88j927K28J629j357p17J834l7j927J120J035j629
4809f83J20J269q44j045J256N81j407M93J460j563o04K010l88j480N78J038j248
$$ y = [636, -1066, -154, 785, -185, -817, 655, 451, -761, 293, 836, -985, -748, 987, 176, -790, 526, 792, -654, -271, 1105, 36, -938, 396, 255, -1042, -115, 846, -439, -366, 851, 276, -905, 533, 793, -687, -378, 886, -43, -857, 603, 798, -777, -132, 1461, -262, -830, 797, 378, -1119, 260, 1163, -645, -423, 816, 86, -728, 679, 939, -865, -154, 732, -170, -863, 654, 530, -501, 317, 1022, -440, -647, 933, -98, -1116, 599, 717, -858, -289, 907, -95, -826, 815, 582, -950, -32, 724, -539, -686, 824, -125, -1036, 546, 807, -652, -271, 1024, -173, -895, 714, 420, -973, 44, 860, -487, -535, 1118, 111, -1013, 377, 1065, -862, -634, 995, -362, -1079, 755, 718, -1209, -89, 946, -683, -563, 706, -138, -1183, 73, 654, -753, -260, 1200, -363, -967, 1043, 655, -825, -247, 791, -457]
4826d57l17J430k44j255R63R86j680J62J132p08j006J480N6j483R73J018j293
4843b43o57J781n21j337J115O66j434J55J449j130m87J259K0j352N11J205j341
4860c41l77J503m17j468J364P02j593J89J484q53j017J179L71j728M79J409j098
4877b12o29J606k78j181N88J247j570r6J177n75j018J316L83j759L78J623j162
4894a62p45J776j25j737J142R57j517o05J738l12j153J119M92j643K58J764j024
4911B23j343J511K45j670O87J367j493n36J815j57j660J104O80j552J04J533q77
4928a9q41J601J47j686N89J390j405q35J802p39j152J013J128j645K0J951r46
4945C73j422J501N65j897O50J329j453q34J886j42j384Q42R55j383j16J503p55
$$ y = [-457, -774, 656, 412, -843, 120, 1106, -574, -412, 720, 12, -994, 486, 542, -941, 32, 1050, -243, -900, 881, 360, -977, 138, 804, -630, -475, 974, -156, -643, 616, 636, -716, -205, 1000, -341, -718, 785, 368, -1100, 264, 966, -627, -438, 1046, 193, -824, 355, 726, -1002, -523, 886, -212, -841, 765, 487, -694, -106, 1141, -429, -525, 652, 77, -941, 375, 758, -1001, -623, 1000, -162, -907, 869, 744, -993, 149, 1106, -411, -1016, 722, 410, -743, 376, 868, -775, -517, 1247, 223, -1120, 391, 636, -1034, -347, 1020, -473, -1009, 806, 649, -1011, 93, 773, -779, -675, 858, -19, -860, 741, 888, -798, -209, 1181, -224, -1059, 743, 4, -1148, -135, 993, -652, -632, 1319, 373, -1049, 452, 1017, -880, -230, 1099, -354, -1188, 698, 556, -828, 14, 969, -414, -530, 973, 218]
4962B18j286J514M40j632N49J352j103r11J460J17j904R46J301j714l66J740m67
4979B54j339J318J023j962L93J420j009j137J593Q0j613O79J132j204j86J739
4995A181r67j118J273N71j860K48J640r93r36J505N91k014R64R91j377n72J601
5012G28j98j662J275P96j592Q3J572r09j016J201N75j883P82J354j487n03J408
5029E24Q4j644J022J108j629k67J535m51j454J331P92j675K28J279p75j071J577
5046E14L67j753P25J015j358q4J456o67j036Q55O65j239J23J457p42j275J477
5063E00p2j574R35J248j040j018J750k73j591J131O96j291k69J547o63r95J567
5080E88M1j273L33R86q81p79J727m21j322J134Q59j512M2J551o77j273J413M35
$$ y = [218, -1068, 446, 886, -746, -197, 1155, 52, -859, 601, 718, -1186, -240, 1061, -653, -1019, 721, 254, -1085, 233, 1256, -706, -313, 1107, 98, -1039, 554, 634, -979, -300, 832, -372, -558, 1181, 214, -904, 369, 940, -920, -672, 968, -25, -961, 544, 1135, -879, 85, 1076, -301, -873, 728, 530, -1132, 143, 939, -653, -570, 1002, 93, -923, 278, 853, -1030, -248, 1106, -381, -884, 524, 608, -1036, -14, 1094, -535, -802, 733, 282, -1172, 159, 951, -724, -496, 783, 8, -1063, 514, 881, -872, -147, 868, -490, -574, 882, 215, -821, 34, 699, -540, -417, 1040, 298, -977, 500, 428, -1146, -211, 1037, -3, -1021, 729, 456, -1135, -4, 692, -599, -868, 679, 16, -979, 588, 629, -644, -311, 675, -206, -985, 742, 321, -1001, 133, 992, -520, -478, 1073, 396, -877, 536, 971]
5098I71j802N39J095j130n81J537l27j434J175R75j472j2J367q87j001J324M27
5115G64j437N20R70j069m15J260j91j329Q51P71j313j90J239j94j192R60P00j287
5133e82K00J377r98q19J184l9j327O99J323j128m99J161k31j069Q90R38j543j10
5151e73J239n82q18R95O45j619M83J177j430l41J278k4j195Q68M07j326L33R97
5169E14l36r34R79N61j487L73J307j167o46J466m74j108P35J536j587l26J372
5186G78n41j024R13P25j763N13J078q33q26J300J70j304P16P06j164m5J386n07
5204B78j306J393K28j490R56J085j258r60J650Q6j668J179O15j179j08J441o73
5221B69j012R90N53j405K00J117q80q31J363R8j307Q33Q05j210j16J352n07j416
$$ y = [971, -831, -292, 803, -327, -908, 629, 302, -1132, 43, 1018, -454, -466, 901, 14, -987, 337, 764, -673, -153, 817, -252, -667, 593, 402, -927, -76, 695, -618, -808, 431, 237, -955, 5, 705, -582, -382, 995, -3, -822, 362, 323, -1004, -305, 1018, -110, -609, 552, 321, -748, 142, 1080, -463, -573, 666, 84, -734, 261, 906, -713, -230, 947, -483, -824, 454, 430, -765, 103, 510, -816, -483, 514, 178, -756, 223, 784, -703, -330, 977, -190, -836, 630, 156, -952, -217, 1319, -268, -594, 778, 237, -787, 126, 851, -912, -399, 679, -154, -980, 320, 490, -814, -98, 608, -556, -601, 785, 278, -1028, 365, 593, -897, 59, 1144, -114, -1074, 576, 662, -1006, 173, 788, -391, -499, 942, 269, -743, 247, 800, -605, -405, 712, -168, -999, 364, 462, -845, -12, 793, -417, -533, 819, 312, -1104]
5239a104J361L76j570P10J211j137q46J704Nj660P02J230j288m41J319k26j183
5256h37R09Q64j471O4J127n97q75J275L06j506J98J083p60k58J207k25j096N06
5274h6J095j561j06J313k77j315Q72O74j218L77J052q97n52J105k23j049M45J013
5292F62j151q9J284n83j054J183O26j600K35J199r67o83J368K78j767Q48R72j155
5310c94n03J674j95j617J116P14j436p2J611r01q08J273K27j666Q69J040j409
5327d77n12J514j90j262J208O28j410j03J394o72q64J067L12j625P94R70r08q04
5345i40J576q0j158N48R61j319m27J739p28r63J077L98j252L17J308j099p80J513
5363F91o2j682R59J072j276l53J327l83j291J198N47j027j4J007m98j327J578
$$ y = [-1104, 257, 633, -937, -227, 984, -153, -999, 705, 710, -950, -248, 982, -306, -747, 572, 346, -837, 72, 936, -535, -471, 656, 59, -816, 459, 765, -741, -543, 540, -220, -478, 729, 504, -592, -86, 1009, -552, -658, 655, 378, -937, -65, 609, -609, -232, 820, -77, -629, 476, 253, -796, -351, 662, -489, -578, 706, 123, -931, 252, 878, -722, -487, 712, -255, -938, 430, 708, -1059, -211, 761, -394, -897, 777, 582, -1035, 81, 795, -641, -713, 898, -3, -811, 462, 689, -977, -108, 932, -477, -989, 525, 335, -927, 281, 909, -501, -604, 790, 118, -746, 321, 633, -992, -198, 772, -136, -940, 636, 556, -602, -54, 907, -412, -839, 900, 172, -791, 286, 684, -568, -251, 1057, -42, -822, 691, 629, -1053, -94, 978, -298, -651, 676, 293, -998, 200, 747, -280, -294, 713, 215, -1112, 466]
5380D66J24j352N66J181j290l88J363l48j143M06J024j235n7J572q14o88J116
5397E03K55j393R9J547j042r05J594m01r21N84Q56j041l40J289l60j171J148J1
5415C12j307O78Q31n82q32J625l21j183Q81P60j205l68J452o75p80J118K99j177
5433d74N5J348q38q49J139K49j271M35R14q18m13P65J13j157R55O50j348o7J207
5452E95o28q05J338O7j286O09R96j152l78J222j39j443R67O61j180O5J126n80
5470E5q28J110L63j426O16P53p88n32J110q9j252P57Q88j321R2J159m87r81J037
5489B36N04j394L68R89r54o10J360K47j328L41J104j246pP33j47r66Q10M90j272
5508g42M43J219r05o77J188j39j101O58P74r43m75J455m43r84P30P50j256J9R58
$$ y = [466, 590, -762, -196, 985, -305, -693, 670, 322, -821, -415, 609, -626, -683, 889, 75, -613, 503, 758, -635, -536, 1011, -31, -936, 658, 257, -664, -80, 776, -265, -605, 684, 324, -847, 301, 312, -995, -317, 514, -68, -900, 725, 404, -779, 102, 862, -343, -711, 741, 66, -714, 404, 703, -474, -419, 929, 91, -758, 381, 630, -641, -206, 708, -110, -523, 242, 355, -802, 153, 803, -545, -612, 595, -33, -838, 500, 567, -719, -110, 886, -266, -644, 578, 439, -1004, -37, 624, -556, -491, 635, 55, -773, 337, 700, -726, -110, 643, -145, -677, 433, 344, -908, -151, 737, -584, -492, 667, 180, -801, 236, 740, -654, -286, 703, -251, -861, 499, 746, -582, -241, 863, -383, -390, 343, 196, -770, 40, 530, -742, -299, 920, 15, -662, 526, 387, -714, -56, 718, -225, -700, 755, 312, -672, 58, 808, -448, -429, 529]
5527E29m78r35J109K00j083N68R62r98l61J062j62p85N80K39p13j42J139p58p00
5546g27J124J67r22J86Q20o44q36J246l9j106N33P84o74l67J297p08r27R34M55
5565E96j131M46R70j094n15J194L9j025N79O40q53m37J144n42r91R95M83q51J47
5584b06J042q99m58Q89O2q76M03Q42j143l10J110j42j150J132M06j201J38Q52
5602D91l94n40P33P8r61M28R53j160j97Q19K60r13L44P83j061L0O57j19p95Q51
5622B87J28p59L05M80o45l57J063l04r54O65J040j077k36J232p13r46Q82K94j145
5641g60L72R22q36l45J092nr40M44O67j057M86N35l29j009P45L25p59L09Q01n01
5661A57q63J220m1r57M22O47q89j14R62l63j088J228J13o51l31J148n40n89O67
$$ y = [529, 51, -884, 225, 425, -658, -90, 872, -126, -487, 575, 413, -372, 208, 447, -266, -408, 731, -27, -727, 397, 564, -358, -172, 648, 4, -832, 414, 375, -731, -198, 586, -88, -455, 842, 134, -793, 141, 596, -535, -89, 881, -213, -728, 466, 505, -520, 59, 699, -154, -591, 553, 11, -980, 15, 498, -353, -206, 836, -63, -521, 368, 430, -446, -43, 799, -344, -654, 456, 314, -836, 296, 702, -499, -361, 491, 97, -443, 290, 368, -593, -165, 788, -372, -569, 250, 510, -403, -59, 724, -337, -307, 350, 231, -564, 287, 415, -344, -39, 441, -204, -561, 502, 198, -756, -91, 949, -128, -364, 868, 155, -791, 91, 385, -760, -388, 534, -302, -647, 445, 440, -500, -56, 611, -446, 40, 575, 246, -763, -18, 307, -452, -143, 658, 157, -706, 514, 473, -484, -62, 585, -304, -418, 544, 181, -907, 321, 434, -217, -548, 600, 60, -529, 138]
5680A38K1q28N10P56r75L5P60j65q00N64K64o90L58N95l80r43J031L85q88M8P55
5701E51m89m63N93J0p60K88Q19p98k5P04j53q41P34J75r54K03Q09n12m96J028
5721D23p1r06M00Q35q52j93Q73m94p76P96N76j238L25R08l09r75R52K58j134L55
5741b47J073r79n29J218j07j223P17R25j143O6P26m06p55J196j63j062L59J028
5759F94r39l34J058M4j118Q07L57j208K19J042o48p78J028J28q83L63P77o91n19
5778f01J032j24j054N02J051j116J8N97m01p36J129J80q12m1J032o77o49J022
5796C52O7r73L99N90o08j56Q26j77j146J021J11q23J49R66m95m10Q47l6j214M32
5816b78P50q02j40R79J20j198Q97L87j163K33Q77m74p50P74J51q54L95N82l88
$$ y = [138, 159, -669, -159, 597, -378, -343, 417, 252, -548, 16, 280, -410, -52, 543, 163, -780, 251, 636, -252, -204, 551, 62, -401, 192, 202, -558, -270, 549, -249, -274, 430, 277, -564, 170, 345, -609, -406, 403, -109, -605, 423, 352, -554, -154, 681, -171, -364, 509, 15, -761, 35, 611, -627, -302, 606, 297, -678, 274, 532, -602, -247, 826, -153, -682, 536, 429, -794, -77, 848, -295, -229, 497, 91, -664, 532, 369, -693, -334, 694, -245, -579, 479, 523, -595, 212, 569, -639, -420, 622, -26, -804, 224, 352, -531, -168, 609, -82, -601, 431, 307, -747, -245, 806, -310, -292, 305, -96, -832, 297, 477, -335, -376, 656, -21, -670, 352, 419, -554, -155, 435, -173, -329, 497, 320, -826, 195, 306, -517, -368, 598, 103, -307, 540, 504, -710, -278, 472, -330, -470, 509, 629, -569, 328, 715, -448, -215, 662, 188, -562, 212, 363, -491, -96, 486, 98]
5835I8o16O68L96j145M98M70p23j82J124k96j151R86M81p56j77R41m35q08J131
5854E04j57q71L78O76n79l61N77L21p96O73J44p99J65N55m35o83J038Op39L47
5874c6P21n67n52Q76J1r35M39P24q72m3P69m59n58N63O31r35j39R27o91k89P66
5895C51k16m47L49L99o98k03J191n96o55O29L69r11Q2Q45m04o04N30L11r20O49
5915E1N72p90k43P71q8r87J036K45q96J55P48n35n72P57L3o58L22L88m83l02R92
5936E16k60q61O47M62q10k77J243q22l48O56M43j043L39P02m95l92P09k0q83Q24
5956C30K14p60j26O01k20l99N64J57o72J47N48n81k73Q14j69n02J85Q76j137J68
5976b35O48p0p13L10P16j231K01J062m32p13Q73j73m31J52L16n16j86O94j68p48
$$ y = [98, -518, 150, 546, -599, -101, 369, -354, -536, 588, 292, -859, 127, 608, -148, -325, 616, 181, -627, 504, 347, -524, -146, 530, -49, -410, 167, 488, -308, 365, 509, -290, -125, 430, -5, -688, 350, 356, -383, -36, 685, 118, -434, 442, 453, -482, -43, 681, -191, -234, 535, 76, -482, 81, 712, -223, -362, 565, -126, -415, 351, 135, -312, 37, 436, -262, -465, 726, 130, -525, 104, 473, -438, -356, 489, 85, -519, 11, 322, -598, 51, 623, -167, -410, 361, 273, -714, 322, 567, -329, -174, 574, 39, -533, 224, 257, -401, -79, 309, -174, -476, 516, 256, -605, 42, 504, -306, -583, 660, -162, -510, 146, 589, -454, -115, 587, 92, -300, 409, 389, -494, 330, 544, -216, -342, 259, 39, -360, 204, 361, -311, -164, 384, -197, -470, 344, 175, -327, -142, 734, -403, -235, 413, 343, -370, -60, 656, -575, -374, 688, 256, -457, 416, 243, -188, -36, 280, -236, -422, 272, 104, -644]
5996f44N55M74q07L18M84r8q81Q25L37q85K24O56q76k19R29k18n42M27L12p75
6016d04m4R86k90q74P59K84q71L31Q03p20J4K88m6q03N14N70p65j72P79j70m70
6037c01O82J30n93j82P33l74n11P91l96n97P21L91p15m5Q43o51l81O36O4o58P0
6058c43O35k49m26O42O5m83J76O02p47k94P62k42o96P19K33p28K26N80m14m17
6078c99K85N55p70K12R00r65j49M63p9m71O53J14o75K1P72m30k95M51J33p62L73
6099f3N75p71k02N44p0l94L41L19n76k3Q24m38m49M69K87o48J16O80o45k89M14
6120AK18n16J59O45n93k77Q52k66o64M88J47l74j77P64m38n80Q68J04p64K22O11
6141D30l52m47P54k71n99K80O43p82J35O21m70j84N82K08p60m9Q02p09l04P03
$$ y = [-644, -89, 385, -422, -104, 380, 282, -599, 226, 563, -322, -98, 558, -318, -537, 392, 174, -368, 59, 371, -404, -448, 538, 248, -626, 133, 417, -454, -123, 680, -40, -26, 262, 216, -587, -73, 497, -268, -440, 339, 169, -301, 381, 511, -82, -264, 469, 95, -416, 375, -21, -618, 103, 494, -221, -266, 577, -74, -455, 181, 245, -413, -343, 292, 43, -383, 259, 324, -159, 17, 619, -128, -422, 340, 98, -598, 121, 354, -374, -148, 432, 18, -399, -114, 441, -329, -117, 783, -182, -331, 132, 53, -418, 235, 349, -326, -305, 467, 37, -258, 193, 326, -436, -63, 512, -259, -461, 83, 13, -381, -40, 279, -297, -320, 504, 66, -383, 86, 373, -275, -159, 521, -124, -413, 1, 219, -297, -138, 507, -86, -363, 489, 223, -441, 47, 194, -180, -357, 407, -31, -611, 257, 361, -403, -181, 430, 78, -369, 385, 114, -485, -205, 438, -344, -209, 412, -58, -242, 340, 548, -212, -261, 541, -168, -472, 231]
6161B31o6p40N69N46r45J9M52k2p30O49L82n73K7R22o40n36R72q7q31L21L98o72
6183c54j51J182o40o66Q34J75m19j01N99l93o63P31p0n28K63P07n66j83N04j39
6203A22n35M91M34j005M53N19l96p08J159k8q79L52L54k53o13Q16k19n70N46M54
6223D94o91j93Q26l92k59L80J44m87k8M97k84n07N50O1k18L15M00p66r3O61n3
6244C57q64N90J42o65K67Q16n61n81P81j02m45L64K75n49l89R08j66m72K17J33
6264E6l61l1Q87o43j73L82L69p92K01O94o66n61P88J2l96L33M48p56l18J031n50
6285d6j70L32L41p59j09P57m14l69Q27o4o00J3P97q63k42R93l38o11P52J86o01
6306a88k20P51l03m40M52J39l19K70L77o19r8O13j60n35K97J96n47P3O06k03o14
$$ y = [231, 165, -575, -6, 540, -405, -386, 66, 44, -686, -37, 345, -228, -201, 721, 81, -455, 517, 430, -401, -80, 318, -354, -505, 677, 37, -629, 205, 380, -39, -140, 459, 66, -597, 134, 64, -464, -201, 506, -60, -243, 261, 122, -413, 78, 512, -493, -40, 479, 83, -625, 534, 506, -373, -21, 333, 80, -533, 283, 64, -506, 40, 494, -197, -390, 436, 44, -215, 165, 309, -178, -206, 291, 7, -500, 50, 111, -107, 208, 608, -158, -251, 410, 357, -507, 83, 225, -440, -173, 643, 82, -499, 282, 180, -265, 99, 374, -175, -564, 344, 178, -294, -77, 56, -305, -336, 551, -92, -265, 117, 486, -306, -105, 589, -77, -638, 150, 162, -234, 99, 547, -209, -527, 504, -46, -216, 116, 457, -302, -411, 346, -68, -437, 390, 326, -274, -261, 536, -327, -569, 424, 86, -525, 227, 413, -188, -408, 343, 40, -400, 52, 191, -128, 142, 519, -100, -198, 415, 255, -280, 17, 213, -334, -261, 345, 142, -472]
6327d72Q80k54n76L31M84n35k74N81m2p73P20M71p27m5N54j35m76M91K58q91J79
6348b51N94m45l75P31j15l84M77K91p97LO28l70k16L02L4m85K97M60k39m46O46
6369C40J06p81M27L24n50k48P30k65k99N43J94o67j03L47k27m60O83J35p46N44
6389B7K22l47j99O12K5r21O13M75p71j94Q66j44q06O96K47q36L19P27q08k81M16
6410f2K79m38K21K86m63q9J068n46m92M44k6o49K13N24l79j13P99l14n93L96L35
6431D01n09p8M69m39k66L63M74n26L2N41o97k03Q43l55l58L36M57p81j9N54j23
6452A16k07R7L49m33P3L41n43l59N72N3l87K80M59l78l60P38j89o36L05M35o32
6473c06O1P09l86m00M05M90q47J34O47n15l37P32l26m61M91K11n08J22O42n50
$$ y = [-472, 408, 154, -422, -91, 393, -142, -416, 165, 123, -650, 70, 541, -186, -231, 323, 188, -288, 203, 461, -430, -251, 343, -102, -477, 254, 139, -245, 232, 523, -274, -271, 357, -13, -229, 73, 107, -378, -81, 379, 140, -306, 340, 446, -335, 92, 416, -134, -382, 348, 83, -216, 327, 521, -146, -249, 98, -129, -589, 94, 229, -517, 27, 249, -98, -297, 315, 340, -581, 32, 507, -264, -458, 408, 264, -542, 154, 401, -435, -116, 611, -197, -478, -62, 217, -221, 0, 286, -177, -266, 802, 256, -236, 208, 182, -467, -254, 270, -109, -222, 577, 263, -330, 66, 401, -108, -186, 283, -156, -422, -59, 415, -111, -79, 462, -235, -438, 405, 50, -308, 28, 485, -296, -315, 239, 116, -91, 6, 355, -78, -5, 336, -207, -566, 6, 59, -328, -48, 411, 33, -327, 411, 222, -414, -109, 326, -306, -245, 464, 78, -322, 83, 573, -274, -140, 507, -8, -345, 387, 61, -400, 91, 302, -206, -84, 558, 8]
6493Hl40L15K59m64N9L48k78k7L54j26k63L04J88o59n7O58k79l35K97L21m93l
6515b13N08m59lK90J13o74K13P03o15K9M31k31l37L39J41n26J56O17m34n81R45
6536D12j29p35K91N69n99L2M94k59o44O79K74q73J49O75m53n17P52P6p88O22L17
6557C45l34l14P06l04o15M66L92o81J59P67n09l80N45l6n99K59N82m58l09P25
6577D07l0q08N82L95q42q0M54Nl91M94J69q17J05P06n01j14N94qp40M04L57o69
6599c28J79M62j59o29P07N12r81j6R33q39k07N80J05n77J53O33n07k98M50J1o50
6620d66L53L24l80j28M37j94k31M32J04m45L9M58m16j09N01l0n55K05M96m94r9
6641a98N32k14m14L32M75q53KP57o73k11O32R7m86J07L85l58n4K75J6n28N81n8
$$ y = [8, -332, -17, 242, -222, -163, 185, -93, -120, 234, 108, -155, 149, 337, -322, -379, 279, 0, -335, -38, 283, -210, -213, 295, -164, -167, 123, 236, -438, -225, 478, -137, -108, 323, 92, -245, 94, 235, -291, -135, 482, 48, -533, 412, 283, -452, -161, 408, -191, -159, 335, 76, -568, 111, 385, -488, -339, 336, -117, -634, 118, 194, -594, 28, 345, 11, -303, 403, 99, -516, -50, 342, -339, -180, 587, 78, -302, 243, 207, -392, -133, 449, -9, -318, 407, 377, -431, 151, 546, -296, -376, 78, 83, -308, 186, 355, -462, -357, 349, -152, -266, 328, 320, -420, -16, 341, -328, -149, 313, 154, -475, 232, 744, -237, -253, 680, -159, -366, 214, 319, -258, -105, 528, 21, -277, 173, 184, -466, -113, 211, -169, -297, 140, -54, -285, 147, 251, -194, -155, 303, -113, -222, 279, 249, -306, -101, 395, -99, -198, 334, 120, -294, 38, 513, -340, -338, 419, -254, -465, 167, 264, -222, -115, 270, -88, -142, 133, 149, -379, 202, 144]
6663A44l78J07K42n3m04O57m6n57J53L62k91n62O50K85q76N38N21q60K3N89k11
6684C3m52N33R6m80J93N78o42j32O66j87n87K21M08l08n30Q86j96n16N48L10r97
6705e55L16J031n37o77M67J10p43L48N29m11j02P70o14k98N87J90p40J17Q47o57
6725b2m68R44n9q27M70K02j76n00R43o04k74M22J52m68l0N40n25RQ03p3p70N8
6747b53L33n11L42L69r2o48P01Q1n26pN09k35l34O28k90m52R6P29m18j17K01p8
6769B8l33M53k2k11N4K51j46l05L35r4j35k78N71k49j56K92j9l18R2L09o7k72
6791b20O01m08m72P85M3n36NN84l68k91L29K04o31L33M79k99l82M58P1p79N07
6812A3L08n67q2O23k48l22N88M1o19J60M26l15j96L15J96o76L23M55n08j7J58
$$ y = [144, -234, -127, 115, 62, -342, 315, 269, -288, -135, 227, -64, -626, 24, 309, -567, -29, 492, -368, -345, 244, 33, -419, 114, 210, -270, -77, 501, -141, -273, 393, 206, -381, -160, 248, -60, -590, 296, 100, -416, 132, 442, -555, -239, 792, 255, -422, 45, 155, -588, -240, 289, -122, -224, 546, -68, -366, 221, 411, -329, -212, 635, -22, -490, 454, 395, -432, 38, 240, 64, -436, 507, -97, -371, 51, 203, -265, -295, 245, -280, -271, 532, 459, -311, -253, 80, -431, -89, 280, 188, -460, 241, 322, -204, -211, 298, 63, -271, 357, 67, -385, -289, 440, 22, -95, 106, 28, -305, 148, 126, -85, -31, 220, 74, -231, 104, 10, -125, -403, 168, -81, -237, 55, 36, -282, -190, 119, 52, -220, 381, -27, -499, 286, 329, -207, -202, 382, 14, -277, 52, 256, -375, -42, 437, 138, -244, 214, 285, -494, 13, 321, -246, -328, 295, 47, -275, 313, 354, -265, -105, 321, 6, -190, 125, 321, -355, -32, 423, -85, -102, 56]
6833E6j5l56M73j52l16m4N81n1n30O25j83m37K64L17l12j68M01j39l01M04K76
6854C93o03L57K79m45l36N72J8l52O5N40n52j19N18l38l26N11K42n50O4K61j63
6875C6k55M43O1n94L45M41n54j96O42l75p27N58N45o91K89P45n55m19O36j18m98
6896b41K09K69j84l58M71j21l11M43K64r08K20M72k29k32K75K90p54M83L17o26
6916b51j68L65K76k60j45L66j94o3N17l87n49N85K52p28K86J29j17j04N31j37
6936B04n73K64M40o82J47J53j4k51N60J89q59K43M97k28n17O11M1o47M33L18l04
6957B5l05N14Q8n26L31R9l43j46M10n7m13M03J06m96J81M77m76m23N68J20l82
6978b45N23j05k20j64R7L00m18J31O83r10J55M39l15j35L18J90n38J02L62j72
$$ y = [56, 41, -315, 158, 6, -310, -354, 227, 176, -354, 271, 88, -349, -85, 232, -80, -248, 153, 14, -287, 117, 393, -210, 147, 426, -19, -355, 217, 235, -117, -52, 488, -64, -183, 335, -3, -329, 182, 424, -126, -62, 199, 36, -219, 224, 285, -309, 36, 477, -77, -273, 369, -6, -733, -175, 370, -321, -32, 713, 158, -261, 375, 257, -241, -32, 237, 53, -305, 166, 45, -266, 177, 441, -467, -247, 225, -4, -236, 39, 329, -425, 58, 375, -251, -419, -54, 222, -38, -183, 183, -11, -74, 443, 56, -493, 92, 344, -384, -98, 31, -86, -190, 341, 204, -369, -105, 335, -347, -200, -47, -61, -312, 248, 437, -422, -179, 318, 90, -427, 184, 225, -422, 11, 329, 25, -280, 234, 322, -204, 127, 226, -117, -263, 147, 90, -323, 80, 186, -310, -129, 348, -128, -551, 17, 137, -245, 278, 173, -47, -211, -114, 186, -232, -101, 582, -328, -173, 266, -49, -184, 134, 324, -214, -112, 250, 78]
6998G8n10P95l66m33L47L38m98L13J77j95k22K29m1k97j46Q97n46o1N10k52m10
7019b93N10K36n52j55N66j91m94M84N5o36L25Q15p50j38M55r7m71M51P2n35J03
7040b40N73k60m96K76O82m73M7K82m09j89L42k2o22M92K00k97k30P30l12m92Q81
7061D63k76j59p7M50m83k32M59l6j55Q8kj82Q3O9J75n73L37N80o32pN28m00j6
7084BM05j72n74L98K10l38k26L86N3l81K18K00k54j85M57r2n38M99Qm93K13M02
7106A98j57j20K52K21p01J05N90n89R1J88r1l33N67J95m70o6M50j21m25M25Q1
7127B90m12M29Q5n14j48N21J43n58L98r7m93J16M47j80k77M92J81n76P4N01n21
7148i9KK71k33k18K66M63n91j41N79k90l37M00M0k02J4N38o50k27O46p1m10P8
$$ y = [78, -432, 363, -3, -436, -89, 249, -249, 64, 241, 46, -176, 53, 12, -285, -431, 466, -80, -141, 369, 117, -293, 217, 453, -99, -254, 312, 121, -373, 111, 166, -470, -145, 670, -80, -218, 237, 140, -331, 120, 192, -343, -240, 333, 73, -423, -147, 535, 62, 109, 391, -18, -207, 135, 113, -509, -17, 183, -114, -344, 386, 74, -418, 463, 187, 28, -49, 401, -82, -314, 145, 109, -46, 42, 40, -142, -59, 10, 185, -388, -51, 529, -103, -110, 418, 18, 2, 407, 235, -339, 59, 269, -69, -295, 91, 144, -237, -19, 181, -73, -258, 199, 107, -431, 68, 76, -417, -204, 198, 41, -79, 173, 394, -307, -202, 388, -201, -110, 78, -13, -346, 221, 416, -54, -120, 330, 209, -216, 209, 290, -122, 307, 392, -122, -270, 251, 394, -164, 234, 137, -356, -240, 207, 27, -250, 242, 423, -153, -79, 422, -99, -97, 174, -59, -277, -11, 452, -139, -280, 299, 9, -328, 72, 112, -90, -76, 462, -188, -415, 231, 160, -250, -172]
7170a72N28n23j54M09j86rPL69p18L57J13M2k09L31K14m10K7N08l85m05N29l49
7192h6N1N8J66k88j5O10o08k95K61M18n87K18K31r9j02M37j7q37O48K55m58m7
7214h6K21k65k14M11Lm11J82N94n21k71Q46m74l52L39K14l72mM39l59j16K36M01
7236D41m10p3J45o5k38J87L49p49N61K46m28l0K69o9o39O11J34m12J00L08k87
7257d9k00P39k95m23L11J06l61l42O64j06j76L04j35k51J38L18j09k15L67q4o82
7278d81O70L7m62K08M80m40l83N38J67n01j76M16j98l46O20O3m89J78L72k79k93
7299b99M65j43l09L14J49l61J29J38K20n40L00J61n29M05K70m37j17K61K62m52
7319a13j20N19m68j81O44m12j03L68J10k88l8L77o04J13K93r6R1k64N38n67L9
$$ y = [-172, 356, -167, -321, 88, -98, -107, -100, 269, -449, -92, 21, 63, -146, 185, 399, -11, 16, 524, 139, -266, 263, -86, -35, 23, 189, -99, -114, 496, -112, -407, -146, 272, -315, -97, 134, 35, -67, 370, 353, -484, 164, 419, -39, -86, 135, -130, -344, 67, 70, -341, -159, 435, -86, -357, 489, 15, -337, 2, 216, -156, -160, 279, -80, -196, 40, 441, 31, -42, 103, 38, -200, -13, 336, -413, 148, 394, -34, -64, 205, 136, -503, 108, 242, -170, -70, 238, -49, -249, 490, 195, -228, 83, 189, -172, -514, 150, 44, -132, 172, 37, -214, -76, 242, 133, -82, 285, 201, -481, 189, 226, -236, -28, 452, 12, -371, 167, 334, -167, -343, 73, -125, -471, 149, 212, -277, -99, 273, -6, -299, 166, 23, -286, 28, 177, -184, -55, 83, 303, -237, 63, 224, -305, 100, 370, -67, -184, 77, 339, -113, -233, 286, -182, -363, 281, -131, -234, 134, 244, -44, -82, 295, -309, -196, 97, 1, 92, -172, 366, -201, -162]
7340a62J52ql58J66L14m14K06L78k50k04M50l61n1J99J58l84q0M33j15j65J80
7361H4J22l81m4M53m11J28Q4J25n11K77K63l45p0P32l09m47L15L38o02R3N60l72
7383H2n34M74L48n94J25M12m77m47N53K97p51L64M04l12j83N91l70k70L48J71
7403B31l01qM41l47l22J29K65l42J39M74l65k15L46L7m68L32K80m14qN52l53j37
7425e4J13L7m56L62M03n47k6L14K1l11K21K10l39j45M79j85l76M53K2k91J33L92
7447D30m47k73Q42m24m77M66nj95j55N88l31k18L92J04k82m2L56m96RK80L79o59
7469a58J10N82o58p4O81l27o29O96r0o80J98K55J9k54L60L68o29L10K19m60j72
7490c33O32l18l85L17N08m37K4J38j24o9R8L11o85N28J1l68Q3J90j8l16j8L19
$$ y = [-162, -10, -18, -376, -210, 104, -310, -104, 274, 24, -180, 270, -91, -142, 57, 215, -169, -249, 184, 69, -96, 84, 206, -175, -219, 234, -177, -49, 35, 160, -351, -74, 189, -156, -226, 506, 197, -250, 65, 403, -199, -106, 454, 82, -452, 22, 370, -224, -99, 313, -164, -611, -58, 239, -512, -148, 256, -56, -239, 352, -18, -288, 60, 231, -70, -78, 363, 16, -306, -177, 88, -254, -115, 359, -6, -221, 125, 162, -306, 26, 306, -108, -116, 436, 83, -54, 59, 96, -360, 2, 405, -142, -168, 146, 167, -144, 77, 287, -52, -197, 282, 97, -279, 174, 196, -95, 38, 430, -17, -290, 552, 128, -349, 117, 112, -83, -238, 350, 19, -199, 193, 297, 15, -27, 329, -167, -158, 122, 501, -158, -48, 534, -124, -198, 483, 156, -473, 223, 133, -547, -349, -94, -75, -329, 31, 399, -230, 80, 299, -161, -333, 299, -19, -404, -87, 421, -16, 8, 146, 22, -47, 51, 362, -323, 205, 216, -152, -69, 121, 103, -213, -231, 88]
7512H8j64j11N22j78k89J64n8l56K11M07l15l36Q12l94k07K72L1j13k81O89n39
7533a45j24K30K41l55J55M42m94j61N48qn23J42L97l56k00M88k06m23N95Kn31
7554b86K01K07P8n52M05J64k09RL01n61J63L54Q6n97K81K56m97J03M78k80l51
7575b47L60n8k41J28K20l29K60j0P4m75L09J20k37j05J18J75j41o6K78j77j6K59
7597A99k62l91O63l17k09K53L09k52k07N70q1k65j6L27j78k24J30k22m2M54k04
7618C5k12Q5K49l93J64L49j12j71L81j5n18rK92n2k67K14J79l80O9L02l03L2L09
7641B28k58j91L22n0k54R1K52j74j73J08M1r4J43N9j34j74M81l37K4k2M49l01
7663C6k14N54k32m99K92L7mk00K98j93K0K34J23m47O3J61K9k41K99J1m06L89J00
$$ y = [88, -76, -187, 335, 157, -132, 32, -26, -382, -171, 236, -79, -415, 397, 3, -204, 68, 99, -14, -295, 394, -145, -269, -39, 202, -153, 2, 444, -50, -211, 337, 329, -194, -52, 345, -11, -211, 277, 71, -352, 243, 245, -286, -85, 122, 200, -352, 53, 217, 8, 17, 318, -243, -80, 274, 360, -237, 44, 300, -197, -94, 384, 104, -247, 113, 55, -186, -58, 162, -167, 93, 83, 157, -318, -9, 111, -126, -231, -113, 62, -79, -145, 133, -44, -60, 199, -63, -454, 209, -108, -317, -64, 245, -7, -214, 356, 275, 10, -6, 321, 143, -81, 49, -173, -215, 239, 35, -177, -92, 157, -236, -72, 277, 165, -6, 375, 360, -158, -167, 125, 73, -194, 20, 199, -181, -112, 190, -113, -81, 228, -30, -221, 101, 51, -203, -112, 140, -34, -207, -99, -58, -152, -9, 50, -84, -258, 223, -114, -90, -112, 337, 36, -178, 376, 144, -355, -63, -26, -30, -230, 68, -125, -105, 129, 252, -195, -132, 29, 58, -183, 116, 127, -279, 110, 210]
7686B10m47K8L46k02j10L17K24m81J64L57n57J7J74J68k80K24K45m68k27O55l47
7707A0k09L52j21r5m7L37m05j41N40j00k72L16q5k54l4L83l77KK11J57m50L0M55
7730B03j6l13M68J8m37J60J93k16j85K36j31l78M44l5k95J43M7K41k80K46J54
7751B67j65J12J7n00m2M97p2m14L78J30j91k43M52l98N9J58J94l42l1J69l11O8
7773b08K92J22l49N67l94k59J09L51k17l25N76m1j99n3L42m44R9K50k25l48O75
7794C21j19k41j8K98j20m77L86J86l36oK76j91j82J82K0K0k53P48n52j76M21j75
7816A2k50M46k65j20J72M07m26j74N89l73o1j84N48l07m12N19j02l77K44K86k82
7837a10q2L21j00l73Q37m51j37j7M49m88K1K64j84j22K35L71o25m0M94l62q3K97
$$ y = [210, -237, -209, 137, -65, -175, 142, 366, -115, 49, 406, -151, -134, 40, 208, -72, 152, 397, -71, -298, 357, 10, -199, 153, 32, -63, -110, 227, -178, -319, 221, 121, -151, 165, 80, -174, -208, 175, -202, -200, 11, 168, -282, -252, 203, 187, -126, 342, 360, -77, 83, 276, 60, -125, 111, -20, -398, 46, 11, -284, -141, -94, 147, -133, 113, 267, 102, 214, 231, -269, -311, 186, 114, -300, 78, 208, 17, -226, 226, -172, -113, 45, 239, -103, -134, 35, -276, -208, 84, 206, -143, 424, 30, -229, -120, 231, 14, -311, 265, 224, 25, -28, 314, -130, -31, 219, -6, -354, 321, 202, -39, -57, 241, 121, -356, 30, 216, -120, -126, 150, -41, -223, -41, -21, -1, -254, 494, -58, -234, 187, 12, -238, 208, -57, -177, -5, 402, -24, -198, 391, 18, -43, -227, 321, 14, -398, 121, 19, -358, -114, 172, -110, -192, 129, 29, -344, 493, 42, -95, -112, 337, -151, -130, 134, -50, -172, 63, 434, -191, -231, 263, -99, -182, 115]
7859A15j75j69Q2M92n16j0J61j9p6P8L9j82p0N21j46l24K75K30m28qK74j19m01
7882c76L87J17l86J91M52m12J4J13J96o13K02K67m17J61Q9K32m04L94K07l82k74
7903b42N31o95P2K84O9k44J50j0j31L78O6k53k19N02j08k86j89N98l16j67K74
7924F4N3k66L81n2k2l7Mj4l01L66j54k40O2M90l81R3j07K81n59RN85l99R7L64
7948C17k31l20M46k3p0j88K59j89p7J5K06l47K17K43l54j55M60J04l21J40l1k99
7970a98o6M06k16R4N6J16j70j64K16N6k80M03j00m42J16J33m7j6L06k24q0Q5l
7993a9N4j21L2r3j19L34J25n02M86n8k32J61J91k70l03K16J79j44J6K98k26j56
8015a51L66j38o1q6O2J89m80L18k25J26L87j12j07L9j8j30l62L95m6l10J10M03
$$ y = [115, -60, -229, -147, 345, -171, -181, -20, -39, -115, -37, 2, -180, -250, 271, 125, -199, 76, 306, -122, -130, 144, 25, -376, 11, 128, -258, -67, 385, -27, -13, 100, 296, -317, -115, 152, -265, -104, -15, 217, -187, 207, 414, 32, -242, 289, -406, -334, -50, 19, -225, -75, -85, -216, 162, 228, -25, -244, 258, 150, -136, -325, 273, -43, -210, 64, 117, -149, 232, 180, 158, 121, 125, 111, -190, 176, 22, -218, -156, 334, -47, 46, -61, 220, -339, -330, 255, -144, -47, 317, 86, -234, 212, 189, 119, -69, 190, 1, -76, -61, 145, -202, 15, 258, -96, -251, 209, 313, -8, 132, 101, -198, -264, 142, -74, 20, 76, 192, 22, -142, 74, 130, -150, 253, 153, -289, -173, -40, -87, -103, 203, -21, -101, -16, -19, 35, -86, -54, -147, -266, 68, 193, -309, 177, 119, -113, 48, 239, -31, -334, -118, 61, -83, -67, 231, 5, -151, 215, 77, 16, -70, -8, 181, -299, 19, -206, -80, 307, 195, 88, 127, 109, -21, -383, 12, -34, -344, -234, 169]
8037A69jk65L00q2k59K66N4l35J61l8k35j7J80J97l77K03M29k69j68K04J50o21
8059c54M38K13j55j86J00L3l12L88k74o4K8M28k44j06pk26L04O1J15j01m16K59
8081g8R9k06K74r2k78J01L43p0k45M28k24r5j24K67j07j56K31J1m28M66j27o5
8103g5J35M1j82o7J95M7j52m0J42J46j41j22J23k32J38J83k27j47K71j27Q5K1
8125A5J5k18K40K72l16k11N36l23j40K02J89l76m6L52nm35M80L1n12M55m3k45
8147h3j02K32j2k48J76J68k94K43J55j39k58J86P2k07J3M25k70l34K96p1j30K2
8169a60K62j98K5K19q1q8n3K47k04k13L17j67j51L47k20l4M5M13l30k17K33J67
$$ y = [169, 168, -97, 203, 121, -138, 128, 182, -153, 8, -30, -265, -282, -102, 95, -282, -79, 350, 81, -87, 117, 267, -354, 84, 297, 142, -44, 56, 89, -223, 165, -109, -173, -145, 283, 39, -67, -74, -300, 4, 65, 180, 79, -337, -78, 21, -185, 89, -3, -281, -180, 163, 93, -152, 276, 52, -43, -167, 100, -7, -163, 68, 79, -349, 117, -10, -75, 60, 101, -81, -148, 47, 94, -58, -98, 44, 190, 49, -73, 50, -182, -44, 139, -88, -235, 36, -91, -6, 15, 30, -188, 52, 324, 8, -203, 333, 10, -130, 72, 261, -115, -161, 191, 186, -249, 231, 262, -250, 205, 162, -83, -185, 47, 35, -213, -37, 131, -163, 80, 235, 96, -162, 24, 96, -111, -98, 327, 57, -277, 19, -52, -182, -160, 102, -96, -71, 148, 67, -21, -74, 173, -31, -244, 73, -94, -245, 102, -118, -152, -107, 306, -24, -241, -8, 159]
8191A59
$$ Imaginary data points
##PAGE= N=2
##DATA TABLE= (X++(I..I)), XYDATA
0@%%%%%%%qJ6j6J6k4M0n6P2q8J05j30J62j96K36k89L45m02M73n55O51p58Q71j001
30e36J147j309J492j692J910k155K428k724L046l399L789m216M680n186N738o343
46c330P006p730Q518r382J0334j1385J2551j3841J5279j6897J8729k0823K3240
59A2269k6066K9425l3497L8551m5020N3630o5720Q4045j15374J82866n69074N12825
71E8860O90365j335323N64215Q18733j086187m10840J173223k89381o64696O97552
81B16521K24467q59334J52264O21060k83907l16617M38554L4744n49801N5725
91b66324N87671j85869l74910M45780P0602p51258K17480O76430m82082k04676
101b67156P45740l40871p15521O51453K68764p16150L41081N30736p09058j56025
$$ y = [0, 0, 0, 0, 0, 0, 0, 0, -8, 8, -8, 8, -16, 24, -32, 40, -48, 57, -73, 89, -107, 129, -160, 185, -217, 256, -299, 352, -406, 465, -536, 611, -698, 794, -898, 1012, -1143, 1285, -1439, 1607, -1792, 1997, -2219, 2461, -2725, 3013, -3330, 3676, -4054, 4464, -4918, 5416, -5969, 6582, -7259, 8020, -8877, 9852, -10971, 12269, -13797, 15628, -17869, 20682, -24338, 29292, -36428, 47617, -67757, 115109, -453965, 58860, 749225, -586098, -21883, 796850, -289337, -700177, 473046, 183665, -481031, 216521, 440988, -418346, -266082, 354978, 71071, -245546, 193008, 227752, -322049, -266324, 321347, 135478, -239432, 206348, 276950, -474308, -256828, 419602, -62480, -267156, 478584, 137713, -577808, 73645, 342409, -373741, -32660, 498076, -210982, -367007]
111c67007O78722k57456l39655N23653k2829n18239K07770K60624k37301K9407
121d2311K30673j17363k13043J9748J58512J7320j16739J38028J29187l37983
131a33971q9947L83126j21207k59093L90581L7207m86608K10568L22548l81314
141a28110O440M02486k88526k62502L61974P830k60408K21001J31332k71299l4456
152a14238J60972l9534o1381Q6037P6416j00997j37458J21841J05406j96194M8778
163e0352K64256k40395j99126L70859l3540l62935L18430J88514m86908Q8356
173a42841M19308l50404j45873M85696j59027l99554L56759J30129m10033J50434
183f5406L24429l02434j44223L15281m2789k55770J69161J80783k24005r9520
$$ y = [-367007, 311715, 54259, -285396, 238257, 215428, -302811, -95041, 165583, -71718, -42311, 188362, 70999, -142044, -122296, 36216, 53536, -63203, 74825, 204012, -133971, -223918, 159208, 38001, -221092, 169489, 206696, -279912, -69344, 253204, -128110, -121670, 280816, -7710, -270212, 91762, 99592, -160816, 60185, 191517, -79782, -114238, 46734, 7200, -54181, 31856, 108272, 7275, -130183, -8342, 97064, -99130, -50352, 213904, -26491, -225617, 145242, 111702, -251233, 67197, 255711, -231197, -142841, 276467, -73937, -219810, 265886, 106859, -292695, 64064, 194193, -215840, -65406, 259023, -43411, -187634, 127647, 84858, -170912, -1751, 179032, -44973, -144493]
193a44493K42560j3779k53044J51684K19505k83975r4505L56648j14920l09451
203b43770L34323J34680m42917J19778L62468l58751j31535M61706j42341l61756
213b68115L53110J21638m15873J36973L18306l06046j24423L37414p6802k64671
223a88489K06750J45208k45813k0763K28891q4141j86358J63742J16990k25964
233h9947j6196K47599j17443j99626K50519P7114l11456J02660K61162k70825
243f6439j07961L43098r4518k81969K60395J18022l20679P7220K60387k17780
253c0224j16171K61906m0774k19559J47202J20549j92021j8831J84632o1410j42715
264a07416J25416Q8383j67710j7405J78651p8131j53360J70018P4596k20031N3468
$$ y = [-144493, 98067, 84288, -168756, -17072, 202433, -81542, -176047, 180601, 65681, -243770, 90553, 225233, -217684, -97906, 264562, -94189, -225724, 235982, 93641, -268115, 84995, 206633, -209240, -72267, 246039, -60007, -184430, 152984, 76182, -188489, 18261, 163469, -82344, -103107, 125784, 41643, -144715, 19027, 136017, -89947, -106143, 141456, 24013, -175613, 74906, 152020, -159436, -56776, 204386, -66439, -174400, 168698, 74180, -207789, 52606, 170628, -150051, -72831, 187556, -30224, -146395, 115511, 74737, -144822, 2380, 122929, -69092, -87923, 96709, 35299, -107416, 18000, 106383, -61327, -78732, 99919, 21788, -131572, 38446, 113042, -106989, -53521]
275e3521K06756j77486j13526K49108l2531k36224J70058J36548k45356P387K30965
286A42178j38895j41154K10308J8449k04515R4873J41161j66610n1441J79930
296H4284m5685j54136J23361R7986j65725j1258J78876q0376j47723J55526O5631
307A00761j99564M2153J85501j42051j05013K06878j0761k03806J23915J30251
317A28264j96649j8042K02216r6033j44008J70830M2824j88713O2049J50506j38412
328b5168o9041J74801k6284j62560J07054J01248j64080j4512J77959p2232j35612
339a08427J49062N8505j83606L4900J59980j25496r1811J76513k344j69657R8482
350c899J13630j61910k6116J72697o9353j33868J42496N6517j73444L4763J51173
$$ y = [-53521, 153235, -24251, -137777, 111331, 78800, -157424, 12634, 149182, -96174, -88787, 142178, 3283, -137871, 72437, 90886, -113629, -18756, 122405, -44205, -95646, 84284, 38599, -115537, 7824, 105810, -59915, -71173, 107703, 27327, -120396, 35130, 100761, -98803, -56650, 128851, -13200, -118213, 88665, 77904, -125902, -1987, 128264, -68385, -86427, 115789, 19756, -124252, 46578, 89402, -99311, -37262, 113244, -25168, -94209, 80592, 54308, -108252, -1198, 100050, -64030, -78542, 99417, 27185, -108427, 40635, 99140, -84466, -49566, 110414, -15082, -106893, 69620, 67276, -102381, -3899, 109731, -52179, -78295, 94402, 25049, -108819, 33677, 90194, -83250, -48487, 102686]
361A02686j17956q8368J68017J904j64338R2367J16790j59633l4342J73069o6055
372B4141j38125J44922O2979j71082L8458J49513j20972q4216J56874r339j48964
383i5811R1056R8537j38493k0889J46345n8543j15665J18250N4809j46783K1562
394d5625J37293r5194r0963J43771J3230j54434P2485J19490j34419l6905J60549
405H9278n6826j33501J25358N2869j55931M1694J35611j10379o5516J40265j8513
416D4409j24769Q1687P3079j14512j2623J09491m2620q0412Q3278M2590j00949
427d1351N28R6215m8551p2487R4285L3884j16662J8636J00412q0182n3720J24137
439E5144n033j17064O9514O5690j14629K456J15905o5366p6456R8936J1981r9890
$$ y = [102686, -15270, -103638, 64379, 66283, -98055, -5688, 111102, -48531, -82873, 90196, 24141, -113984, 30938, 93917, -77165, -38707, 110806, -10166, -94382, 62492, 53153, -95811, -4755, 93782, -44711, -65600, 80745, 22202, -93463, 24787, 79596, -67187, -45625, 91668, -3526, -94489, 49282, 62512, -91922, -19437, 100053, -34366, -71271, 89278, 32452, -101049, 24309, 77178, -78753, -37059, 98552, -11827, -77343, 62922, 44409, -80360, 1327, 74406, -40106, -52729, 56762, 14142, -66270, 17008, 59598, -41351, -40823, 55392, 6841, -65646, 28639, 62523, -54139, -35503, 64909, -15273, -68993, 55144, 50111, -66953, 2561, 68251, -46378, -43922, 71983, 6617, -69839, 29097, 41078, -58812]
451e8812M9310Q0752p9961m2638Q0945q186p7454M8795O9561p0629m3541Q2446
463C0588o260q8772O5690P9846j05441l0727J16280n2408r8381J24950M4373j48226
475f8488L9085J13891j19290l9536J60002m0974j32164J03002M6961j43744L9459
486d1796J39096r2783p8012J19210n491j26458P1872J05667j05445m9928J16486
497E2418k9867j14481R8455Q7878j31169j4147J30880q3090r9084J56100L2317
508H6210j67208O3160J13438j57557k8908J92367n8536j37717J37016L2155j79135
519a04715O3657J47574j23562n5822J44356m7201j29091J12078P8235j21877L073
530c3295J04502p9139p8340J12926L3822j03273L2245P6539r5195m3440J21678
$$ y = [-58812, -9502, 71250, -8711, -51349, 29596, 21410, -56044, -7249, 62312, -8317, -51858, 30588, 24328, -64444, 1246, 81092, -24349, -55076, 61204, 8796, -89585, 35365, 79738, -68488, -29403, 84488, -34802, -74338, 85664, 44690, -87474, 15528, 62489, -81255, -41796, 97300, 4517, -73495, 45715, 40224, -86234, -14362, 91305, -14140, -64068, 52418, 22551, -91930, 6525, 94403, -36766, -50913, 79967, -3123, -102207, 53893, 86210, -80998, -17838, 95600, -61957, -90865, 101502, 42966, -94751, 42265, 74420, -104715, -41058, 106516, -17046, -72868, 71488, 24287, -104804, 7274, 85509, -36368, -33295, 71207, -7932, -86272, 26654, 60476, -42797, -10552, 65987, -29208, -72648, 49030]
541D9030k749r7756O7473M8366j22036j300J20811m8164o5954R2437o92j07534
553f8068M7599P4752o6071r565O6459m6535n4825N8119K1638l8941K3189K4654
565C2405m4279j8164L3931Q565j3382R894Q058k6034j8879K4118J9009j3543M863
578F562J5695k9637k2773L3366J1864k3705J4176J3857l6759j2039L6381N601
590A2589j6609J4487O684l2003j0237L0935N909j9382J4909J2404l9869p686M9494
603B1625n989l4927L9524J0859p0316J1224O5955m0214k9375O9159j5624p6351
615e4450N0189M7895o7716P679O8257n8054n0767P7008O333o8041M7941M7277
627E3551q1293j2731Q0687k9951n2716P0559J4267q9591K3102P0184o0766k4899
$$ y = [49030, 46281, -51475, 15998, 64364, -57672, -58972, 61839, 13675, -52279, 40158, 39466, -68068, -20469, 54283, -11788, -21353, 45106, -1429, -56254, 1865, 23503, -15438, 7751, 32405, -11874, -30038, 3893, 12458, -924, 8970, 17028, -9006, -27885, -3767, 15242, 1699, 6562, 22257, -7380, -30153, 3213, 15077, -8628, 5548, 19405, -17354, -29393, 6988, 12589, -4020, 10467, 17151, -14852, -25089, 5846, 11755, -7627, 7282, 19686, -20183, -27869, 21625, 15636, -19291, 20233, 31092, -39224, -28000, 37955, -2259, -31634, 37525, 21901, -54450, -4261, 43634, -24082, -16403, 51854, -6200, -56967, 20041, 26374, -41667, 6274, 53551, -27742, -40473, 40214, 10263, -42453, 28106, 42373, -47218, -24116, 46068, -14698, -39597]
639c9597Q9912k2466q6399O1611M6496q7807J0739Q9059o3441o0944Q9044N641
651C1848q5095N5698N9856r0656j4281Q9464m1771o1126Q4114J8878r5440K7061
663b1450P3203o5716k9922Q8774j2760q0750M8451M4075p3783O46P5678m0867
675E579n1850O5206J0688o8477L3980N1880o1896j9504O3704k2292m8867N2601
687A0752K1759n8533J1539M5706l7191k1332M9516k987m4593K2255K7010l6927
699a3026p500M1611r051l3205K3685J9581l2735j979L2841j6205k4948K5534O521
712A1124k9640J3352K5002k4576q868K8812r090k5172K0003J3557k5011j127K3477
725A1843p947j7558J4964J3167j7380n856K0194l679k1933J3259J6240k3670n031
$$ y = [-39597, 50315, 27849, -58550, 3061, 49557, -38250, -27511, 61548, -1893, -62837, 26207, 31848, -53247, 2451, 62307, -28349, -42630, 46834, 5063, -56063, 28051, 46929, -48511, -21450, 51753, -13963, -43885, 44889, 32129, -48621, -170, 43905, -29878, -29232, 46446, 5579, -46271, 18935, 29623, -38854, -4874, 47006, -14890, -34394, 29310, 7018, -41849, 10752, 32511, -26022, -14483, 31223, -5968, -27300, 22216, 19229, -25364, -3109, 23901, -13026, -20526, 21085, 12034, -21171, 2514, 22095, -10640, -12619, 20222, 4017, -20931, 4603, 11124, -18516, -5164, 19838, -4738, -13606, 15206, 6116, -19056, 947, 14504, -10507, -11634, 11843, 3896, -13662, 1302, 14469, -2911, -8767, 11427, 7748, -14185, -926, 15314, -8356, -13387]
738a3387K9126j1237k3891K7372J0141l3498J0030K5958k9479j1056L4616j0492
750D203k6616K9417J1084l4244Q889K8787k3996j6039L0140P68l0405J1676K4795
763A8459k0918j3118K7945J378k8830J2807K2078k6366q050L0941j2487k7160
775b3321K9417J0615l6317J4408L1198l3746j2059L9069j2645l2501L0844J3041
787A8003l6699R156L0081k2963j3012K9552k693k5533J2729J5344j9401n983K0863
800I444k794j8496J1239J3625j7312l678K0734r120j8466J8685O412k6407R297
813f837K3522k2655r404L0439o751k5719K1299J1465k6916K526K1402j4066r783
826a1478J8643k14j3968Q559P946j1944j502J0306m082r721O849O780j0706k328
$$ y = [-13387, 15739, 4502, -19389, 7983, 18124, -15374, -5344, 20614, -8865, -19921, 14695, 4203, -22413, 7004, 18088, -16156, -7267, 21520, -2476, -18515, 11625, 12393, -18012, -6336, 18459, -2459, -15577, 12368, 13746, -15084, -2277, 19801, -6565, -14615, 16326, 3839, -23321, 6096, 16711, -19606, -5198, 26000, -7746, -19805, 19264, 6619, -25882, 4962, 18003, -18696, -9540, 20541, -2422, -15434, 14118, 11425, -14108, -1379, 13965, -5436, -11419, 9444, 6650, -11846, -607, 13018, -4294, -7972, 12762, 3642, -14824, 3861, 10273, -16134, -6837, 16685, -5970, -15374, 15065, 8314, -17405, 3894, 15359, -11557, -9031, 12371, -1695, -11478, 7165, 6951, -7017, 1542, 9488, -2456, -3958, 6348, 2266, -7455, -606, 6174, -4532, -6860]
840f860J4043l071j2668J0411P883j6849K73J5846j1103j0284J7615M70j6241
853a0535J1121J0737j5144n51J3565q542p961J0636j81q777N798M820o618M99
867a133N906k887m638L868K012o126j957O201J39o875L438P241n708l770Q382
882D093p17q210L627M267o799K34O634k961k648O038j75m500K772K335n194j063
898b267L646k101k230L308J799k715q2K761j289k578J817J418l873j847M627j59
914B35l859L610M401m399k222N103r29m497L133J282m326J846J979l604L009M960
930E722o046j264O819n092o209Q539M12r023N031M569q178K699Q403p365j723
945b706P966o714o093J0259o57q911Q025M568j0773K961J0181p138m719R301j622
$$ y = [-6860, 7183, 4112, -8556, 1855, 9738, -7111, -6838, 9008, -2095, -12379, 5236, 5706, -10535, 586, 11323, -3821, -4372, 9193, 651, -7310, 3326, 3145, -5632, 166, 4986, -1632, -1133, 4773, 1886, -2752, 1116, 3128, -2998, -4955, 1246, 1385, -5490, -2052, 5189, -519, -4289, 4093, 3376, -4834, -1207, 3060, -3739, -3505, 3129, 168, -2480, 3558, 3383, -1117, 1655, 3990, -1204, -2267, 1379, -722, -2952, 356, 2155, -560, -642, 2119, 830, -1748, 69, 1487, -2386, -4233, 394, 235, -3624, -14, 4387, -12, -2234, 2869, 1940, -2557, 576, 1858, -2468, -622, 1357, -2247, 762, 5722, -324, -1588, 5231, 139, -6070, 2469, 2881, -6142, -1111, 3458, -4720, -2021, 6382, -983, -2706, 5260, -1454, -7547, 2712, 2055, -6856, 1169, 5737, -5036, -2075, 8106, 968, -3751, 5550, 3928]
960C928j0988L963R453p221m994J0946R13j3130M793J2301j1518o161J5407o165
974A527j6004J6599O271k0743J1062J7768k4764l667K9046j5371j9978K9588J257
987A2591l2740J7790K0812k8524Q53K9217j8145j7205K4997j284k2338J4651J2286
1000A2961k1136j330J8374p883j1198J5264N805j8450P19J6299j0647j3152K1460
1013G086L908k6811J0901K3589k5892p337L5290j3150k9609K9968P974l6677J7348
1026c412K6286l3562k771L3887k1394j7858L4567m441l0929K1520J2101k9290
1038a5296O824K3129j6302r094J7709k454j2035P300O964o861n387N278L658q252
1052d819J06J3663n643j1455J3694K860j8295R682J2409j9373n04J8059j4464
$$ y = [3928, -7060, -3097, 6356, -865, -5859, 5087, 6000, -7130, -2337, 9964, -1554, -7715, 7692, 1527, -14477, 2122, 8393, -12350, -1288, 16480, -8284, -11951, 17095, 1724, -18254, 11334, 12591, -20149, -2359, 18453, -10071, -9218, 19999, 1854, -15351, 9646, 8362, -13976, 675, 12961, -8175, -9505, 8869, 986, -10212, 5052, 10857, -7593, -6874, 9425, -1222, -14374, 7086, 10994, -15817, -4916, 18673, -7219, -14556, 20734, 7584, -22025, 7943, 15917, -20760, -3412, 22874, -10688, -13459, 20428, -966, -18824, 15743, 11302, -19627, 1893, 13994, -15296, -8472, 14657, -1645, -10739, 6970, 4516, -7519, -219, 6745, -116, -5503, -225, 3433, -4819, -4713, 8950, 3307, -8148, 5546, 8406, -9889, -207, 12202, -7171, -7675, 10384, -4080]
1065d080o085K1268p878j3329J6944j763j5786J3140L678j4324Q787L134j2958
1078i252J0813N670j5372J0797R266k1488N416J8189k0846k937K3538j5162j2296
$$ y = [-4080, -10165, 11103, 3225, -10104, 6840, 5077, -10709, 2431, 6109, -8215, 572, 3706, -9252, 1561, 7231, -8141, 2656, 11922, -9566, -4150, 14039, -6807, -9744, 13794, -1368, -13664]
$$ [...]
8191C2
##END NTUPLES=NMR FID
##END=
