##TITLE=1H_B3d2301
 200.13MHz, CDCl3,
 8 sc
 
 24.1.2025
##JCAMPDX= 6.0         $$ Bruker NMR JCAMP-DX V2.0
##DATA TYPE= NMR FID
##DATA CLASS= NTUPLES
##ORIGIN= UXNMR, Bruker Analytische Messtechnik GmbH
##OWNER= pz
$$ XWIN-NMR		Version 3.5
$$ Fri Jan 24 14:05:40 2025 Russian Standard Time (UT+4h)  she@DPX200
##.OBSERVE FREQUENCY= 200.1313
##.OBSERVE NUCLEUS= ^1H
##.DELAY= (6, 6)
##.ACQUISITION MODE= SIMULTANEOUS
##.ACQUISITION SCHEME= undefined
##.AVERAGES= 8
##.DIGITISER RES= 18
##SPECTROMETER/DATA SYSTEM= spect
##.PULSE SEQUENCE= zg30
##.SOLVENT NAME= CDCl3
##.SHIFT REFERENCE= (INTERNAL, CDCl3, 0, 14.3821)
##AUDIT TRAIL= $$ (NUMBER, WHEN, WHO, WHERE, WHAT)
$$ ##TITLE= Audit trail, XWIN-NMR		Version 3.5
$$ ##JCAMPDX= 5.01
$$ ##ORIGIN= Bruker BioSpin GmbH
$$ ##OWNER= she
$$ F:/spectra/data/she/nmr/H-C/1/audita.txt
$$ ##AUDIT TRAIL=  $$ (NUMBER, WHEN, WHO, WHERE, WHAT)
(   1,<2025-01-24 14:04:19.35 +0400>,<she>,<DPX200>,
      <created by zg, POWCHK disabled, PULCHK disabled
       configuration hash MD5:
       00 E9 B6 7A A2 85 ED C7 34 08 36 98 17 FE 4E 26
       data hash MD5: 16K
       53 60 2C 01 F8 34 5D A4 1D EF 2D 1B CD 8A BF B3>)
$$ ##END=
$$ 
$$ hash MD5
$$ 0D 3E D7 27 02 09 63 DA 1F 2D 69 B3 F7 B0 4D 1A
##$RELAX= 
##$RELAX= 
##$RELAX= 
##$RELAX= 
##$RELAX= 
##$RELAX= 
$$ Bruker specific parameters
$$ --------------------------
##$DU= <F:/spectra>
##$EXPNO= 1
##$NAME= <H-C>
##$PROCNO= 1
##$TYPE= <nmr>
##$USER= <she>
##$AMP= (0..31)
100 100 100 100 100 100 100 100 100 100 100 100 100 100 100 100 100 100 
100 100 100 100 100 100 100 100 100 100 100 100 100 100 
##$AQSEQ= 0
##$AQ_mod= 1
##$AUNM= <au_zg>
##$AUTOPOS= <>
##$BF1= 200.13
##$BF2= 200.13
##$BF3= 200.13
##$BF4= 200.13
##$BF5= 200.13
##$BF6= 200.13
##$BF7= 200.13
##$BF8= 200.13
##$BYTORDA= 1
##$CFDGTYP= 0
##$CFRGTYP= 5
##$CHEMSTR= <none>
##$CNST= (0..31)
1 1 145 1 1 1 1 1 1 1 1 1 1 1 1 1 1 1 1 1 1 1 1 1 1 1 1 1 1 1 1 1 
##$CPDPRG= <>
##$CPDPRG1= <>
##$CPDPRG2= <>
##$CPDPRG3= <>
##$CPDPRG4= <mlev>
##$CPDPRG5= <mlev>
##$CPDPRG6= <mlev>
##$CPDPRG7= <mlev>
##$CPDPRG8= <mlev>
##$CPDPRGB= <>
##$CPDPRGT= <>
##$D= (0..31)
0 0.7 0 0 0 0 0 0 0 0 0 0.03 0 0 0 0 0 0 0 0 0 0 0 0 0 0 0 0 0 0 0 0 
##$DATE= 1737713058
##$DBL= (0..7)
120 120 120 120 120 120 120 120 
##$DBP= (0..7)
150 150 150 150 150 150 150 150 
##$DBP07= 0
##$DBPNAM0= <>
##$DBPNAM1= <>
##$DBPNAM2= <>
##$DBPNAM3= <>
##$DBPNAM4= <>
##$DBPNAM5= <>
##$DBPNAM6= <>
##$DBPNAM7= <>
##$DBPOAL= (0..7)
0.5 0.5 0.5 0.5 0.5 0.5 0.5 0.5 
##$DBPOFFS= (0..7)
0 0 0 0 0 0 0 0 
##$DE= 6
##$DECBNUC= <off>
##$DECIM= 32
##$DECNUC= <off>
##$DECSTAT= 4
##$DIGMOD= 1
##$DIGTYP= 9
##$DL= (0..7)
0 120 120 120 120 120 120 120 
##$DP= (0..7)
150 150 150 150 150 150 150 150 
##$DP07= 0
##$DPNAME0= <>
##$DPNAME1= <>
##$DPNAME2= <>
##$DPNAME3= <>
##$DPNAME4= <>
##$DPNAME5= <>
##$DPNAME6= <>
##$DPNAME7= <>
##$DPOAL= (0..7)
0.5 0.5 0.5 0.5 0.5 0.5 0.5 0.5 
##$DPOFFS= (0..7)
0 0 0 0 0 0 0 0 
##$DQDMODE= 0
##$DR= 18
##$DS= 0
##$DSLIST= <SSSSSSSSSSSSSSS>
$$ [...]
##$SUBNAM0= <"">
##$SUBNAM1= <"">
##$SUBNAM2= <"">
##$SUBNAM3= <"">
##$SUBNAM4= <"">
##$SUBNAM5= <"">
##$SUBNAM6= <"">
##$SUBNAM7= <"">
##$SUBNAM8= <"">
##$SUBNAM9= <"">
##$SW= 18.0517328524113
##$SWIBOX= (0..15)
0 0 2 0 0 0 0 0 0 0 0 0 0 0 0 0 
##$SW_h= 3612.71676300578
##$TD= 16384
##$TD0= 1
##$TE= 0
##$TE2= 300
##$TE3= 300
##$TEG= 300
##$TL= (0..7)
0 120 120 120 120 120 120 120 
##$TP= (0..7)
150 150 150 150 150 150 150 150 
##$TP07= 0
##$TPNAME0= <>
##$TPNAME1= <>
##$TPNAME2= <>
##$TPNAME3= <>
##$TPNAME4= <>
##$TPNAME5= <>
##$TPNAME6= <>
##$TPNAME7= <>
##$TPOAL= (0..7)
0.5 0.5 0.5 0.5 0.5 0.5 0.5 0.5 
##$TPOFFS= (0..7)
0 0 0 0 0 0 0 0 
##$TUNHIN= 0
##$TUNHOUT= 0
##$TUNXOUT= 0
##$USERA1= <user>
##$USERA2= <user>
##$USERA3= <user>
##$USERA4= <user>
##$USERA5= <user>
##$V9= 5
##$VALIST= <valist>
##$VCLIST= <CCCCCCCCCCCCCCC>
##$VD= 0
##$VDLIST= <DDDDDDDDDDDDDDD>
##$VPLIST= <PPPPPPPPPPPPPPP>
##$VTLIST= <TTTTTTTTTTTTTTT>
##$WBST= 1024
##$WBSW= 4
##$XGAIN= (0..3)
0 0 0 0 
##$XL= 0
##$YL= 0
##$YMAX_a= 475550
##$YMIN_a= -600818
##$ZGOPTNS= <>
##$ZL1= 120
##$ZL2= 120
##$ZL3= 120
##$ZL4= 120
##$ABSF1= 10
##$ABSF2= 0
##$ABSG= 5
##$ABSL= 3
##$ALPHA= 0
##$AQORDER= 0
##$ASSFAC= 0
##$ASSFACI= 0
##$ASSFACX= 0
##$ASSWID= 0
##$AUNMP= <proc_1d>
##$AZFE= 0.1
##$AZFW= 0.1
##$BCFW= 1
##$BC_mod= 2
##$BYTORDP= 1
##$COROFFS= 0
##$CY= -3
##$DATMOD= 1
##$DC= 2
##$DFILT= <>
##$DTYPP= 0
##$F1P= 0
##$F2P= 0
##$FCOR= 0.5
##$FTSIZE= 0
##$FT_mod= 4
##$GAMMA= 1
##$GB= 0.15
##$INTBC= 1
##$INTSCL= 1
##$ISEN= 128
##$LB= 0.25
##$LEV0= 0
##$LPBIN= 0
##$MAXI= 10000
##$MC2= 0
##$MEAN= 0
##$ME_mod= 0
##$MI= 1.114404
##$NCOEF= 0
##$NC_proc= 0
##$NLEV= 6
##$NOISF1= 3.799351
##$NOISF2= 2.8
##$NSP= 1
##$NTH_PI= 0
##$NZP= 0
##$OFFSET= 14.38212
##$PC= 1
##$PHC0= 253.3114
##$PHC1= 9.992201
##$PH_mod= 1
##$PKNL= yes
##$PPARMOD= 0
##$PSCAL= 0
##$PSIGN= 0
##$REVERSE= no
##$SF= 200.129724274929
##$SI= 16384
##$SIGF1= 3
##$SIGF2= 2
##$SINO= 400
##$SIOLD= 16384
##$SREGLST= <1H.CDCl3>
##$SSB= 0
##$STSI= 0
##$STSR= 0
##$SW_p= 3205.1282051282
##$SYMM= 0
##$S_DEV= 0
##$TDeff= 0
##$TDoff= 0
##$TI= <>
##$TILT= no
##$TM1= 0
##$TM2= 0
##$TOPLEV= 0
##$USERP1= <user>
##$USERP2= <user>
##$USERP3= <user>
##$USERP4= <user>
##$USERP5= <user>
##$WDW= 1
##$XDIM= 8192
##$YMAX_p= 0
##$YMIN_p= 0
$$ End of Bruker specific parameters
$$ ---------------------------------
##NTUPLES= NMR FID
##VAR_NAME=  TIME,          FID/REAL,        FID/IMAG
##SYMBOL=    X,             R,               I
##VAR_TYPE=  INDEPENDENT,   DEPENDENT,       DEPENDENT
##VAR_FORM=  AFFN,          ASDF,            ASDF
##VAR_DIM=   8192,          8192,            8192
##UNITS=     SECONDS,       ARBITRARY UNITS, ARBITRARY UNITS
##FACTOR=    0.0002768,     1,               1
##FIRST=     0,             0,               0
##LAST=      2.2672688,     0,               0
##MIN=       0,             -600818,         0
##MAX=       2.2672688,     475550,          0
$$ Real data points
##PAGE= N=1
##DATA TABLE= (X++(R..R)), XYDATA
$$ [...]
$$ plain form
1740 -3382 305 2519 -116 -1050 1754 284 -3412 -348 4071 608 -3339 338 1222 -3293 -953
1755 -953 4859 1356 -3263 279 2320 -1871 -468 4258 1094 -3998 -1274 1256 -1916 -1216 2596
1770 2596 641 -3371 -1121 1928 531 -113 2521 1555 -2702 -2070 2392 1234 -2121 525 1944 -2876
1786 -2876 -3444 2714 3088 -2211 -378 2641 -1617 -3065 2658 2977 -2221 -1369 1635 -1405 -2251 2689
1802 2689 2935 -1786 -1366 1697 9 -1471 1695 2571 -1553 -3146 -76 872 -1688 -28 2672 -794
1818 -794 -3292 1071 3234 -478 -423 3117 71 -4090 213 3429 -1174 -2375 1577 -441 -3417 447
1834 447 3383 -25 -1455 1278 259 -2401 439 3059 -131 -2677 -9 882 -1397 -272 2746
1849 2746 1326 -2523 -1050 2234 -280 -1164 2258 939 -3790 -1832 2158 -160 -1876 1783 1859 -3025
$$ packed form
1740c382L687K214k635r34K804j470l696L064M419l463l947L677Q84m515K340
1755i53N812l503m619L542K041m191J403M726l164n092K724K530l172P00L812
1770B596j955m012K250L049j397o44K634r66m257O32M462j158l355K646J419m820
1786b876n68O158L74n299J833L019m258j448N723L19n198Q52L004l040q46M940
1802B689K46m721M20L063j688j480L166Q76m124j593L070R48k560J660K700l466
1818g94k498M363K163l712N5L540l046m161M303L216m603j201L952k018k976L864
1834D47K936l408j430K733j019k660K840K620l190k546K668Q91k279J125L018
1849B746j420l849J473L284k514q84L422j319m729J958L990k318j716L659P6m884
$$ plain form
1865 -3025 -1271 3552 1306 -1232 1297 1262 -2308 -1359 2094 700 -1825 -580 526 -2041 -1592 2322
1881 2322 2009 -1246 -756 988 -197 -1353 1080 2258 -1454 -2118 1089 110 -1724 1452 2591 -1384
1897 -1384 -2070 1718 1022 -1899 539 2241 -1872 -2879 809 1137 -1195 87 1476 -465 -949 1244
1913 1244 1845 -307 -161 1219 -684 -2081 67 1433 -917 -1658 580 315 -1760 82 2511 36
1929 36 -1562 1054 1122 -1784 -372 1912 -286 -2380 434 1371 -1225 -569 1998 251 -1449 361
1945 361 979 -803 -565 580 -236 -1688 -89 1012 -612 -776 1279 1188 -944 264 2282 229 -1586
1962 -1586 280 1263 -1202 -1511 1013 -87 -2186 -58 1407 -728 -536 1422 661 -1476 243 1721
1978 1721 -417 -879 615 98 -1443 -134 1109 -143 -907 589 570 -1225 -10 1985 21 -1808
$$ packed form
1865c025J754M823k246k538K529l5l570R49L453j394k525J245J106k567M49L914
1881B322l13l255M90J744j185j156K433J178l712o64L207r79j834L176J139l975
1897a384o86L788o96k921K438J702m113j007L688L28k332J282J389j941m84K193
1913A244O01k152J46J380j903j397K148J366k350p41K238k65k075J842K429k475
1929C6j598K616O8k906J412K284k198k094K814R37k596O56K567j747j700J810
1945C61O18j782K38J145q16j452J599J101j624j64K055r1k132J208K018k053j815
1962a586J866R83k465l09K524j100k099K128J465k135J92J958p61k137J719J478
1978A721k138m62J494n17j541J309J243j252p64J496j9j795J215J995j964j829
$$ plain form
1994 -1808 -93 764 -1136 -1076 1311 757 -1470 -389 1759 301 -396 1498 730 -1555 -585 1035 -295
2011 -295 -1209 479 215 -2146 -1002 1857 384 -756 1000 959 -1108 -555 1686 829 -1287 -165 784
2028 784 -1423 -1282 1608 1042 -1412 -550 1207 -162 -919 1203 1390 -1354 -1462 612 -237 -914 841
2045 841 1280 -1126 -969 1295 1090 -607 998 1629 -1464 -1858 1054 931 -1517 -406 1102 -1314 -1830
2062 -1830 1165 2045 -681 -220 1423 -422 -1735 1180 1985 -776 -1211 196 -214 -1529 487 2057
2078 2057 -201 -1410 489 400 -1001 377 2047 -311 -2398 -235 1072 -1001 -564 2354 226 -2553
2094 -2553 205 2135 111 -318 1522 215 -2631 -822 1614 -208 -1140 660 -28 -2322 -364 2395
2110 2395 1092 -640 496 890 -1163 -757 1904 1071 -1634 -744 287 -1231 -1176 1999 1492 -1768 -1112
$$ packed form
1994a808J715Q57j900O0K387n54k227J081K148j458o97J894p68k285R70J620j330
2011b95r14J688k64k361J144K859j473j140J756m1k067N53K241q57k116J122R49
2028G84k207J41K890n66k454Q62J757j369p57K122J87k744j08K074q49o77J755
2045H41M39k406J57K264k05j697J605O31l093l94K912j23k448J111J508k416n16
2062a830K995Q80k726M61J643j845j313K915Q05k761m35J407m10j315K016J570
2078B057k258j209J899q9j401J378J670k358k087K163J307k073M37K918k128k779
2094b553K758J930k024m29J840j307k846J809K436j822r32J800o88k294J958K759
2110B395j303j732J136L94k053M06K661q33k705Q90J031j518N5L175n07l260O56
$$ plain form
2127 -1112 1252 -442 -1273 1886 1843 -2183 -1798 1094 236 -1129 1352 1601 -1252 -1320 1323 1018 -548
2144 -548 725 1072 -1508 -2125 379 1017 -766 -731 887 -403 -1765 879 2407 168 -462 997 82
2161 82 -1915 467 2364 -747 -2076 746 -44 -2237 247 2578 -28 -1821 407 807 -941 195
2177 195 1917 -165 -1810 -411 722 -286 35 1436 575 -1641 -721 1643 618 -975 959 544
2193 544 -2108 -1572 1531 396 -1190 570 1050 -1667 -903 2432 1277 -1319 517 942 -1373 -1119
2209 -1119 1267 727 -1410 -946 452 -429 -734 1029 1066 -530 -783 515 348 -793 400 1258 -723
2226 -723 -1592 745 882 -1023 318 1678 -413 -1543 936 1041 -973 -271 982 -1096 -1879 584
2242 584 1212 -778 -307 1026 50 -761 742 1457 265 -414 269 -46 -758 -372 510 -244 -977 -364 504
$$ packed form
2127a112K364j694q31L159m3m026L85K892q58j365K481K49k853o8K643l05j566
2144e48J273L47k580o17K504O38j783L5J618j290j362K644J528k239o30J459r15
2161H2j997K382J897l111j329K822p90k193K484K331k606j793K228M00j748J136
2177A95J722k082j645J399J133j008L21J401q61k216R20K364j025j593J934m15
2193E44k652N36L103j135j586J760M80k717P64L335j155k596J836M25k315K54
2209a119K386n40k137M64J398q81l05J763L7j596k53J298j67j141J193Q58j981
2226g23q69K337J37j905J341J360k091j130K479J05k014P02J253k078p83K463
2242E84O28j990M71J333r76q11J503P15j192o79O83l15p12L86Q82p54p33O13Q68
$$ plain form
2261 504 -547 -65 1535 478 -1126 210 1137 -645 -530 1093 98 -1614 -115 895 -425 -306
2277 -306 1121 418 -825 35 1026 -383 -465 -56 115 -696 -680 417 254 -146 234 753 75 -20 840 422
2297 422 -681 -132 814 -643 -1179 478 357 -1209 -306 1110 -152 -578 653 853 -501 0 712
2314 712 -128 -481 74 122 -555 60 420 3 -379 32 477 32 -61 462 166 -573 -544 290 -107 -561 520
2335 520 363 -789 -326 1312 502 -419 720 783 -792 -537 704 -14 -648 -62 -20 -728 -195 732 405
2354 405 -117 367 311 -222 -3 570 529 -534 -462 100 -86 -368 374 648 -456 -578 441 124 -397 534
2374 534 712 -889 -907 446 177 -594 297 528 -590 -373 690 739 29 487 152 -732 -821 491 56
2393 56 -406 -385 -58 -480 -632 294 1262 166 -489 297 241 -321 414 1022 -147 -1134 -402 170 -541 234
$$ packed form
2261E04j051M82J600j057j604J336R27j782J15J623r95j712J499J010j320J19
2277c06J427p03j243Q60R91j409q2M09J71q11J6J097j63m00L80N19o78r5Q60m18
2297D22j103N49R46j457n36J657j21j566R03J416j262m26J231K00j354N01P12
2314G12q40l53N55M8o77O15L60m17l82M11M45m45r3N23k96p39K9Q34l97m54J081
2335E20j57j152M63J638q10r21J139O3j575K55J241p18o34N86M2p08N33R27l27
2354D05n22M84n6n33K19N73m1j063P2N62j86k82P42K74j104j22J019l17n21R31
2374E34J78j601j8J353k69p71Q91K31j118K17J063M9p10M58l35q84q9J312m35
2393E6m62K1L27m22j52R26R68j096o55P86n6n62P35O08j169r87P32N72p11P75
$$ plain form
2413 234 1251 -259 -1119 329 568 -95 369 793 -510 -1274 -344 505 -30 114 437 -335 -733 152 1250
2432 1250 678 76 174 -263 -1171 -631 879 195 -704 -213 -45 -905 -79 1354 702 -579 6 367 -486
2451 -486 -162 1349 595 -1320 -922 21 -336 -11 881 364 -885 -728 185 207 278 825 298 -1144 -870
2470 -870 372 446 -23 532 640 -900 -852 918 1061 -132 158 236 -1018 -1128 446 935 -467 -640 12
2489 12 -467 -832 709 1351 264 -404 110 -50 -449 410 989 -252 -1120 -360 -138 -413 453 1092 -54
2508 -54 -1084 36 706 -141 -35 929 -91 -1517 -312 681 342 75 737 120 -786 -114 716 468 -220
2527 -220 313 -125 -1127 -390 639 267 -376 -257 129 -450 -113 1178 846 -257 -124 167 -559 -381 718
2546 718 625 -834 -669 473 -57 -460 625 776 -588 -514 221 384 -10 -35 223 -655 -644 322 419 50
$$ packed form
2413B34J017j510q60J448K39o63M64M24j303p64R30Q49n35J44L23p72l98Q85J098
2432A250n72o02R8m37r08N40J510o84q99M91J68q60Q26J433o52j281N85L61q53
2451d86L24J511p54j915L98R43l57L25Q92n17j249J57R13K2P1N47n27j442K74
2470h70J242P4m69N55J08j540M8J770J43j193K90P8j254j10J574M89j402j73O52
2489A2m79l65J541O42j087o68N14j60l99Q59N79j241q68P60K22k75Q66O39j146
2508e4j030J120O70q47J06R64j020j426J205R93l39k67O62o17r06O72Q30k48o88
2527b20N33m38j002P37J029l72o43J19L86n79L37J291l32j103J33K91p26J78J099
2546G18r3j459J65J142n30m03J085J51j364P4P35J63l94k5K58q78J1R66R7l69
$$ plain form
2566 50 269 726 -231 -565 502 573 -129 -376 39 -313 -906 169 620 -206 -196 209 255 -168 236 853 -27
2587 -27 -342 -28 264 -377 -324 283 -145 -498 -267 247 106 -75 505 45 -472 178 430 -171 -215 220 26
2608 26 -569 -32 406 168 -290 271 271 -304 -68 330 199 -441 -156 12 -521 -309 248 250 -22 101 396 68
2630 68 144 357 304 -214 -205 -45 -157 -550 -18 -86 -343 -177 411 71 -297 162 345 0 -230 294 205 -240
2652 -240 -109 94 79 -115 97 62 -172 105 377 2 -240 28 30 -347 -173 97 -2 -168 -60 140 91 191
2674 191 385 263 168 -99 59 -183 -47 115 -45 -366 -595 -93 -83 -38 162 195 -41 65 199 215 295 331
2696 331 85 -347 -463 97 -116 29 213 149 -183 -108 195 96 208 123 -211 -257 -330 76 104 57 113 -52 -310
2719 -310 -26 565 509 14 -23 25 -170 -414 109 234 -164 -428 -348 -218 -74 303 287 221 -275 95 64 93 333
$$ packed form
2566E0K19M57r57l34J067P1p02k47M15l52n93J075M51q26J0M05M6m23M04O17q80
2587b7l15L14K92o41N3O07m28l53K31N14j41j81N80m60n17O50K52o01m4M35j94
2608B6n95N37M38k38m58N61%n75K36L98j31o40K85J68n33K12N57Kk72J23K95l28
2630F8P6K13n3n18RJ60j12l93N32o8k57J66N88l40l68M59J83l45k30N24q9m45
2652b40J31K03j5j94K12l5k34K77K72l75k42K68Kl77J74K70r9j66J08K00m9J00
2674A91J94j22r5k67J58k42J36J62j60l21k29N02J0M5K00L3k36J06J34J6Q0L6
2696C31k46m32j16N60k13J45J84o4l32P5L03r9J12q5l34m6p3M06K8m7N6j65k58
2719c10K84N91n6m95l7M8j95k44N23J25l98k64Q0J30J44L77j6o6m96L70l1K9K40
$$ plain form
2742 333 336 -117 -217 -89 -97 115 207 200 -129 -306 45 -17 -91 160 141 -52 -534 -263 286 109 -17 70 125 -33
2766 -33 -19 419 464 -47 -54 -370 -287 -213 182 -146 -257 -131 -321 -211 185 683 239 -132 -6 117 -154 -90 295
2789 295 -40 -366 -349 99 90 -96 180 112 -274 -136 282 296 122 -114 -110 -369 -190 116 -38 -141 222 186 -383
2812 -383 -59 502 164 -151 14 30 -363 -230 56 194 -169 -212 27 36 190 405 394 -100 -84 148 0 -33
2834 -33 51 121 -355 -440 -174 151 -154 98 393 3 -306 70 191 -93 97 287 -234 -403 -36 147 119 119
2856 119 166 123 -245 47 272 405 -31 -307 -299 -300 -149 136 44 -140 -35 -41 12 95 601 310 -103 58 39 -85
2880 -85 -141 252 164 -362 -352 233 -46 87 361 196 -357 -154 192 -63 -14 22 -165 -207 -374 -34 152 12
2902 12 237 -61 -195 -125 4 372 35 -104 76 -237 -282 -38 361 -149 -122 109 -180 -166 211 227 -4 -100
$$ packed form
2742C33Lm53j00J28qK12R2pl29j77L51o2p4K51j9j93m82K71N49j77j26Q7N5j58
2766c3J4M38M5n11pl16Q3P4L95l28j11J26j90J10L96M98m44l71J26J23k71O4L85
2789B95l35l26J7M48rj86K76o8l86J38M18J4j74k36Mk59J79L06j54j03L63l6n69
2812c83L24N61l38l15J65J6l93J33K86J38l63m3K39RJ54K15j1m94J6K32j48l3
2834c3Q4P0m76q5K66L25l05K52K95l90l09L76J21k84J90J90n21j69L67J83k8%
2856A19M7m3l68K92K25J33m36k76QjJ51K85r2j84J05oN3Q3N06k91m13J61j9j24
2880h5n6L93q8n26J0N85k79J33K74j65n53K03L46k55M9L6j87m2j67L40J86j40
2902A2K25k98j34P0J29L68l37j39J80l13m5K44L99n10K7K31k89J4L77J6k31r6
$$ plain form
2924 -100 -235 -43 -131 -71 110 -66 -354 -293 62 -60 62 264 177 23 -173 121 111 -137 -91 -24 -284 -85
2946 -85 90 10 117 102 178 -198 -92 89 100 -122 -157 -140 -82 -315 55 41 -28 99 71 27 15 32 66 48 -69
2971 -69 -145 83 -253 -123 -257 45 -270 43 56 -141 66 219 69 22 46 -154 -100 -373 -27 13 -42 14 14 -76
2995 -76 -1 27 180 -65 -119 25 40 -161 -79 -81 -230 -130 -172 141 191 153 192 -63 8 20 58 2 52 -48 -200 -169
3021 -169 -289 -115 133 85 13 14 -35 180 98 -12 -77 38 -137 -200 -49 40 63 224 -148 -81 28 -136 88 281
3045 281 -102 -167 -140 -111 146 66 183 -66 -21 -33 5 255 121 43 166 -112 -229 -87 174 164 -108 -216 -230
3068 -230 -167 21 171 3 249 123 -126 36 234 226 154 -66 -98 -60 -102 40 252 184 -81 -228 -230 176 -120
3091 -120 99 -9 -378 -338 -68 137 -22 101 10 120 23 153 261 136 201 -120 -207 -275 42 13 7 -194 -71
$$ packed form
2924a00j35J92q8O0J81j76k88O1L55j22J22K02q7j54j96K94j0k48M6O7k60J99
2946h5J75q0J07j5P6l76J06J81J1k22l5J7N8k33L70j4o9J27k8m4j2J7L4j8j17
2971f9p6K28l36J30j34L02l15L13J3j97K07J53j50m7K4k00N4k73L46M0n5N6%r0
2995g6P5K8J53k45n4J44J5k01Q2kj49J00m2L13N0l8L9k55P1J2L8n6N0j00j52L1
3021a69j20J74K48m8p2Jm9K15q2j10o5J15j75o3J51Q9K3J61l72O7J09j64K24J93
3045B81l83o5K7K9K57q0J17k49M5j2L8K50j34p8J23k78j17J42K61j0k72j08j4
3068b30O3J88J50j68K46j26k49J62J98qp2k20l2L8m2J42K12o8k65j47kM06k96
3091a20K19j08l69M0K70K05j59J23r1J10r7J30J08j25O5l21q7o8L17k9ok01J23
$$ plain form
3114 -71 -116 -271 255 569 129 -10 1 25 -101 68 304 56 -234 -234 -3 -66 83 92 213 -190 -290 206 -24
3137 -24 -111 184 -55 -363 -224 159 283 194 177 -89 -235 -166 317 89 -150 0 -25 -263 -238 331 92 -57
3159 -57 -32 64 -30 -122 434 403 148 -20 -70 -69 15 185 158 -65 -459 -104 99 -111 39 156 -212 -410 63 326
3183 326 -1 102 60 73 -504 -100 199 264 36 53 -17 -172 199 259 186 -186 -144 -227 -194 -131 205 205 -132 -195 -171
3208 -171 -71 -24 188 363 -52 15 -50 -144 121 283 -17 -236 -262 8 -27 156 230 37 -101 -132 155 46 160
3231 160 167 136 -145 -183 173 288 -77 178 33 -80 -147 3 256 80 -195 -212 -117 -208 -85 163 15 37 42 -38
3255 -38 6 238 143 187 -57 50 74 -143 71 43 -75 -274 -204 -103 -75 -80 209 -4 -128 -102 80 198 -21 0
3279 0 22 -94 -232 102 255 -71 -221 -23 -55 -96 176 -165 18 34 19 -267 -138 166 0 -15 40 -11 38 152
$$ packed form
3114g1m5j55N26L14m40j39J1K4j26J69K36k48k90%K31o3J49RJ21m03j00M96k30
3137b4q7K95k39l08J39L83J24q9j7k66j46O9M83k28k39J50k5k38K5N69k39j49
3159e7K5R6r4r2N56l1k55j68n0JQ4J70k7k23l94L55K03k10J50J17l68j98M73K63
3183C26l27J03m2J3n77M04K99O5k28J7p0j55L71O0p3l72M2q3L3O3L36%l37o3K4
3208a71J00M7K12J75m15O7o5r4K65J62l00k19k6K70l5J83P4j93j38l1K87j09J14
3231A60Pl1k81l8L56J15l65K55j45j13o7J50K53j76k75j7R5r1J23K48j48K2Nq0
3255c8M4K32r5M4k44J07K4k17K14k8j18j99P0J01K8nK89k13j24K6J82J18k19K1
3279@K2j16j38L34J53l26j50J98l2m1K72l41J83J6j5k86J29L04j66j5N5n1M9J14
$$ plain form
3303 152 133 32 96 -181 -212 -170 -77 -184 103 -68 -205 123 -10 -4 63 102 13 -115 17 17 170 91 -44 -117 34
3328 34 55 -87 -47 -104 81 -50 -50 10 158 -83 -87 152 -149 113 -139 13 133 22 158 -53 39 67 61 55 21
3353 21 -55 -189 -175 -146 -177 -73 -74 89 -169 -88 -3 171 -91 -5 208 0 55 192 139 129 32 65 55 144 -126 52
3379 52 111 -8 -8 -142 -176 -91 179 36 -85 19 -49 -152 61 308 179 -106 -65 42 -110 -53 265 168 -164
3402 -164 8 -13 -129 -72 375 76 -194 -296 136 72 105 101 59 -297 -267 -54 165 -20 74 -143 -284 -27 183
3425 183 89 -123 32 82 -255 -257 195 256 -65 -197 85 140 68 187 276 -166 -139 -121 -320 -33 129 177 157 -276
3449 -276 -168 -98 77 17 143 -195 -256 -27 7 57 61 231 -46 -454 -41 314 5 -65 230 -25 -374 -223 293
3472 293 413 -67 -23 -78 -189 -91 314 -8 -20 -9 -55 -143 70 352 207 -196 37 -36 -53 -176 184 109 -284
$$ packed form
3303A52j9j01O4k77l1M2R3j07K87j71j37L28j33OO7L9q9j28J32%J53p9j35p3J51
3328C4K1j42M0n7J85j31%O0J48k41mK39l01K62k52J52J20j11J36k11R2K8ool4
3353B1p6j34J4K9l1J04jJ63k58Q1Q5J74k62Q6K13k08N5J37n3j0r7L3j0Q9k70J78
3379E2N9j19%j34l4Q5K70j43j21J04o8j03K13K47j29k85M1J07j52N7L18r7l32
3402a64J72k1j16N7M47k99k70j02M32o4L3mm2l56L0K13K19j85R4k17j41K57K10
3425A83r4k12J55N0l37kM52O1l21j32K82N5p2J19Q9m42K7J8j99K87J62M8k0m33
3449b76J08P0J75o0J26l38o1K29L4N0MJ70k77m08M13L55l09p0K95k55l49J51N16
3472B93J20m80M4n5j11R8M05l22j2J1m6q8K13K82j45m03K33p3j7j23L60p5l93
$$ plain form
3495 -284 -177 32 -236 -187 393 263 -269 -220 368 38 69 278 246 -68 -365 -244 209 28 -64 130 -72 -162
3517 -162 -125 332 128 142 165 -130 -154 -116 391 18 -118 188 -22 -358 87 245 -103 -26 64 39 -237 -239 251
3540 251 3 -197 27 166 -44 22 432 223 -180 84 239 39 -59 68 97 -277 -245 76 86 -139 84 207
3562 207 73 -183 165 80 -197 142 134 -193 -116 327 127 -132 -82 148 -161 -34 204 224 -286 -60 75 80 -232
3585 -232 -137 267 -127 -136 40 117 -24 61 111 219 -338 176 49 1 -107 -22 -198 -231 -79 76 170 -69 -13 40
3609 40 -310 -86 224 64 -27 154 77 -259 -2 160 132 -272 -137 131 -20 -119 118 -81 -132 19 -3 -48 -45
3632 -45 140 64 -213 76 -174 9 -106 213 172 -100 54 -49 -100 -266 66 32 -35 -303 122 -16 -126 200
3654 200 208 -21 -89 144 156 -190 27 268 -52 -32 77 -116 13 173 152 -169 -46 50 133 -200 116 214 -186
$$ packed form
3495b84J07K09k68M9N80j30n32M9N88l30L1K09l2l14k97J21M53j81r2J94k02r0
3517a62L7M57k04J4K3k95k4L8N07l73j36L06k10l36M45J58l48P7R0k5k76kM90
3540B51k48k00K24J39k10O6M10k09m03K64J55k00r8J27K9l74L2L21J0k25K23J23
3562B07j34k56L48q5k77L39ql27P7M43k00k59N0K30l09J27K38K0n10K26J35Nl12
3585b32R5M04l94rJ76P7j41Q5N0J08n57N14j27m8j08Q5j76l3J52J55R4k39N6N3
3609D0l50K24L10j60r1J81p7l36K57J62k8m04J35K68j51r9K37j99n1J51k2m5L
3632d5J85p6k77K89k50J83j15L19m1k72J54j03n1j66L32l4o7k68M25j38j10L26
3654B00Qk29o8K33J2l46K17K41l20K0J09j93J29J60k1l21J23R6Q3l33L16R8m00
$$ plain form
3677 -186 -295 -74 102 -154 -64 173 -56 -242 58 147 -27 -22 117 -46 -219 -79 -122 -3 -73 196 5 -43
3699 -43 83 40 -71 -42 112 -79 -126 185 100 -68 -125 89 -48 -53 -19 10 60 -247 63 21 -12 -98 78 -11 -32
3724 -32 -121 -6 81 36 115 127 -132 -87 150 -28 75 16 14 -244 -190 200 106 -103 -72 5 -179 134 170 72 -28
3749 -28 40 197 -161 -94 -29 104 -148 -39 294 -71 -216 201 104 -75 -9 6 -77 -219 303 169 -246 -214 121
3772 121 -124 -56 29 209 -21 -160 331 84 -199 -19 127 -168 -170 71 172 -36 -52 304 21 -313 343 351
3794 351 -18 -23 30 107 -241 10 265 -47 -309 13 -62 -143 224 134 14 -93 24 48 -19 -71 159 -103 -315
3817 -315 -112 286 -62 -113 -64 177 -485 -180 171 25 -137 -18 57 -150 -203 -53 325 -80 304 162 -66
3838 -66 -61 327 20 -171 41 26 -256 -263 143 116 -254 -174 215 -182 -38 143 288 -111 -104 214 88 -274 -55
$$ packed form
3677a86j09K21J76k56R0K37k29j86L00Q9j74NJ39j63j73J40m3J19p0K69j91m8
3699d3J26m3j11K9J54j91m7L11q5j68n7K14j37nL4K9N0l07L10m2l3q6J76q9k1
3724c2q9J15Q7m5P9J2k59M5K37j78J03n9kk58N4L90r4k09L1P7j84L13L6r8j00
3749b8O8J57l58O7O5J33k52J09L33l65j45M17r7j79O6J5q3j42N22j34m15L2L35
3772A21k45O8Q5J80k30j39M91k47k83J80J46k95kK41J01k08j6L56k83l34O56Q
3794C51l69nN3P7l48K51K55l12k62L22p5q1L67r0j20j07J17K4o7n2K30k62k12
3817c15K03L98l48n1M9K41o62L05L51j46j62J19P5k07n3J50L78m05L84j42k28
3838f6NL88l07j91K12j5k82pM06k7l70Q0L89l97J44J81J45l99PL18j26l62K19
$$ plain form
3861 -55 -14 -153 -224 286 201 -120 143 111 -167 -32 149 174 -21 27 233 -117 -216 -96 5 -74 -11 273 0
3884 0 -216 110 225 -78 -271 -59 151 -182 -77 172 -135 -316 -76 199 -63 -238 326 -6 -136 143 211
3905 211 -132 -17 377 21 -102 -6 246 -109 -305 221 120 -262 -102 72 -128 -287 29 141 -238 -106
3925 -106 115 95 -313 -80 228 -49 -41 -37 58 -257 -72 179 -162 -115 48 -36 -249 -199 241 212 -221 39 99 -30
3949 -30 -25 101 -9 -127 -8 130 -23 -157 123 146 -239 -134 261 -46 -348 113 0 -139 17 28 297 19
3971 19 68 77 -76 39 161 27 -106 58 234 -94 -188 104 -211 -175 -150 3 65 -250 147 39 -58 -119 147
3994 147 85 -240 2 50 -70 -105 -11 66 15 -126 57 -48 -79 104 207 -58 -60 -61 -69 116 102 137 -89 3 174
4019 174 6 59 211 243 91 -367 114 85 -177 -119 82 -158 -128 -103 77 117 34 49 109 72 -46 152 131 9
$$ packed form
3861e5M1j39p1N10q5l21K63l2k78J35J81K5j95M8K06l50r9J20J01p9O3K84k73
3884@k16L26J15l03j93K12K10l33J05K49l07j81K40K75k62j75N64l32j30K79O8
3905B11l43J15L94l56j23R6K52l55j96N26j01l82J60J74k00j59L16J12l79J32
3925a06K21k0m08K33L08k77QMR5l15J85K51l41M7J63q4k13N0M40k9m33K60O0j29
3949c0NJ26j10j18J19J38j53j34K80K3l85J05L95l07l02M61j13j39J56J1K69k78
3971A9M9Rj53J15J22j34j33J64J76l28r4K92l15L6K5J53O2l15L97j08r7o1K66
3994A47o2l25K42M8j20l5R4P7n1j41J83j05l1J83J03k65kjqJ85j4L5k26R2J71
4019A74j68N3J52L2j52m58M81k9k62N8K01k40L0K5J80M0q3J5O0l7j18J98k1j22
$$ plain form
4043 9 -188 -56 -206 70 17 -155 144 13 25 55 75 258 -71 262 -72 -20 3 47 -3 36 -159 98 -63 110
4067 110 199 193 147 -200 -71 -25 -162 41 -39 -250 -278 -98 73 93 97 110 -56 -118 150 93 6 -21 -166 30 -226
4092 -226 -64 76 10 11 3 103 -132 -166 170 81 -108 -250 -117 39 68 33 27 6 27 -4 54 110 286 -61 -210
4117 -210 -148 8 69 69 -78 -22 -174 -124 106 64 209 117 191 -33 -9 51 147 -75 -38 20 -216 -196 109 72 -21 -90
4143 -90 47 71 -36 112 245 -272 55 104 -277 -132 78 147 -38 -76 17 -43 215 184 91 -188 -195 -69 26 -162
4167 -162 -144 -24 -38 -32 131 245 13 141 450 -197 -77 149 38 31 -228 105 -186 -176 -44 218 -46 -8 239
4190 239 89 -279 -61 300 -45 -162 57 203 64 90 218 324 -181 14 179 62 -65 -5 35 -162 -166 -26
4212 -26 -105 -250 140 70 -139 -54 70 167 -123 91 229 -19 -140 81 -40 -267 -48 271 -130 -121 395 56
$$ packed form
4043Ij97J32j50K76n3j72K99j31J2L0K0J83l29L33l34N2K3M4n0L9j95K57j61J73
4067A10Q9om6l47J29M6j37K03q0k11k8J80J71K0MJ3j66o2K68n7q7k7j45J96k56
4092b26J62J40o6JqJ00k35l4L36q9j89j42J33J56K9l5ok1K1l1N8N6J76l47j49
4117b10O2J56O1%j47N6j52N0K30m2J45r2P4k24K4O0R6k22L7N8k36K0L05l7r3o9
4143i0J37K4j07J48J33n17L27M9l81J45K10O9j85l8R3o0K58l1r3k79pJ26R5j88
4167a62J8J20j4OJ63J14k32J28L09o47J20K26j11pk59L33k91J0J32K62k64L8K47
4190B39j50l68K18L61l45j17K19J46j39K6J28J06n05J95J65j17j27O0M0j97mJ40
4212b6p9j45L90p0k09Q5J24R7k90K14J38k48j21K21j21k27K19L19m01RN16l39
$$ plain form
4234 56 88 -263 207 -20 -69 190 88 -132 -239 88 106 -59 59 91 -96 -112 327 44 -135 114 -4 -71
4256 -71 -110 -71 78 -73 -220 3 15 -46 133 264 -36 -164 161 157 -29 11 192 -37 -317 -91 145 34 -29
4279 -29 150 -4 -238 53 198 -73 126 -32 60 -100 -93 247 1 -100 136 45 -62 -6 252 65 -149 137
4301 137 20 -155 12 183 204 -381 53 219 -39 -25 96 -17 -60 26 74 92 -61 -6 -80 -380 -108 135 98
4324 98 -63 -9 127 49 -86 157 27 -104 1 130 -185 -125 128 190 -81 39 197 -38 20 -85 227 -272
4346 -272 -103 5 -145 -126 -92 229 -33 -54 -94 189 8 76 119 -14 4 34 -6 -222 -119 -190 -208 -13 44 110
4370 110 -73 -30 235 64 34 85 156 -108 -278 -9 49 -182 81 157 -29 -91 50 -29 -102 188 -46 44 -159
4393 -159 -70 -61 -196 129 187 -30 26 -70 -53 53 26 -48 -39 -216 -84 -92 -184 -25 111 -40 57 61 65 107 -45 163 104
$$ packed form
4234E6L2l51M70k27m9K59j02k20j07L27J8j65J18L2j87j6M39k83j79K49j18o7
4256g1l9L9J49j51j47K23J2o1J79J31l00j28L25mj86M0J81k29k80K26K36j11o3
4279b9J79j54k34K91J45k71J99j58R2j60PL40k46j01K36r1j07N6K58j87k14K86
4301A37j17j75J67J71K1n85M34J66k58J4J21j13m3Q6M8J8j53N5p4l00K72K43l7
4324I8j61N4J36p8j35K43j30j31J05J29l15O0K53O2k71J20J58k35N8j05L12m99
4346b72J69J08j50J9L4L21k62k1m0K83j81O8M3j33J8L0m0k16J03p1j8J95N7O6
4370A10j83M3K65j71l0N1P1k64j70K69N8k31K63P6j86o2J41p9p3K90k34R0k03
4393a59Q9Rj35L25N8k17N6r6J7J06k7p4Rj77J32qr2J59J36j51R7MMM2j52K08n9
$$ plain form
4420 104 -74 -47 -26 52 -58 86 -63 8 131 -150 79 154 94 -2 -50 -85 62 -122 -6 142 -20 -130 29
4443 29 53 189 30 134 207 65 227 -86 -89 -90 -216 -181 -139 -196 -117 -8 45 -86 125 17 185 124 21 49 -41
4468 -41 -67 -73 -71 4 1 -64 -72 17 -41 103 -227 145 190 -37 -37 -35 49 -95 111 -161 15 165 -8 25 -29 45 142 -73
4496 -73 17 -120 -55 -41 154 -17 -110 -39 142 -33 52 -8 142 -77 28 -145 21 -171 -14 -193 -26 -95 -2
4519 -2 28 -45 67 -196 -6 -55 6 80 -8 272 22 -90 -72 -81 134 38 -125 -5 41 -130 41 -8 26 -38 -19 -208
4545 -208 -51 -49 130 -119 -129 159 61 -57 40 162 317 11 -84 0 -3 -191 19 -53 -34 -126 -98 -130 -18 191 122
4570 122 -86 33 73 66 20 326 2 -88 -87 59 249 -123 5 197 -91 14 85 -106 -56 -38 44 -72 -117 115
4594 115 -1 -116 -107 339 -7 67 67 209 0 193 148 -2 -291 -28 -35 -247 -104 275 52 -16 159 50 43 -169
$$ packed form
4420A04j78K7K1P8j10J44j49P1J23k81K29P5o0r6m8l5J47j84J16J48j62j10J59
4443B9K4J36j59J04P3j42J62l13ljj26L5M2n7P9J09N3j31K11j08J68o1j03K8r0
4468d1k6oKP5lo5qQ9n8J44l30L72M5k27%KQ4j44K06k72J76J50j73L3n4P4R7k15
4496g3R0j37O5J4J95j71r3P1J81j75Q5o0J50k19J05j73J66j92J57j79J67o9R3
4519bL0p3J12k63J90m9O1P4q8K80k50j12J8rK15r6j63J20M6j71J71m9L4o4J9j89
4545b08J57KJ79k49j0K88r8j18R7J22J55l06r5Q4lj88K10p2J9r2K8l2J12K09o9
4570A22k08J19M0pm6L06l24r0JJ46J90l72J28J92k88J05P1j91N0J8Q2j16m5K32
4594A15j16j15RM46l46P4%J42k09J93m5j50k89K63pk12J43L79k23o8J75j09pk12
$$ plain form
4618 -169 171 25 2 -21 113 -49 -68 -41 3 -25 -137 -18 -16 -29 126 -97 -113 -249 138 -152 -154 5 72 46 -71
4643 -71 123 177 -72 -25 148 179 -111 82 -60 -180 -201 -39 67 -206 -83 -16 -30 -121 192 200 -116 -22 52 -56
4667 -56 -34 -72 -14 -202 -15 126 -86 -178 7 -27 -124 -6 135 44 -148 -22 30 -98 3 84 111 24 -121 174
4691 174 -112 54 -8 3 -195 -218 44 -6 -360 -74 51 -91 -108 108 183 -13 -6 125 25 -147 65 -81 -21
4714 -21 40 -12 -84 -156 43 288 -117 -140 -13 14 -39 -10 -2 26 -219 96 98 27 -93 71 210 23 23 96 12 -50 -60
4741 -60 -44 -181 -34 59 119 79 -123 -82 51 -55 130 13 1 160 97 -110 9 -23 38 -167 77 -149 13
4764 13 -38 46 -23 27 -128 134 -101 -92 -17 -31 -41 72 97 -8 4 144 152 5 71 113 51 -69 -19 -127 -102 85
4790 85 24 -14 6 -238 -35 13 72 143 67 128 -39 -50 182 -74 3 -59 -97 -140 -81 23 185 103 -24 17 -56 -41
$$ packed form
4618a69L40j46k3k3J34j62j9K7M4k8j12J19Kj3J55k23j6j36L87k90kJ59O7k6j17
4643g1J94N4k49M7J73L1k90J93j42j20k1J62J06k73J23O7j4r1L13Ql16R4P4j08
4667e6K2l8N8j88J87J41k12r2J85l4r7J18J41r1j92J26N2j28J01Q1K7q7j45K95
4691A74k86J66o2J1j98k3K62n0l54K86J25j42j7K16P5j96PJ31j00j72K12j46O0
4714b1O1n2p2p2J99K45m05k3J27K7n3K9QK8k45L15Kp1j20J64J39j87%P3q4o2j0
4741f0J6j37J47R3O0m0k02M1J33j06J85j17j2J59o3k07J19l2O1k05K44k26J62
4764A3n1Q4o9N0j55K62k35RP5j4j0J13K5j05J2J40Qj47O6M2o2j20N0j08K5J87
4790H5o1l8K0k44K03M8N9P1p6O1j67j1K32k56P7o2l8m3N9J04J62q2j27M1p3J5
$$ plain form
4816 -41 9 -84 -95 -63 -102 77 33 29 91 94 -256 105 115 57 109 -17 -39 -112 -26 84 121 123 -74 -62 72 -33 87
4843 87 140 134 -22 -42 168 -63 -23 -98 -34 8 -37 53 92 -7 144 -93 -105 4 21 -79 -86 39 15 -167 65 34
4869 34 108 238 45 18 -68 -50 252 75 -96 59 -62 -266 -59 11 52 62 24 129 -75 119 94 240 21
4892 21 -108 -47 -348 -58 -45 54 -100 -102 -6 73 43 129 108 -39 -31 127 34 -43 -16 45 109 -32 170 69 121 152 140
4919 140 39 -111 16 81 33 25 -21 -61 -27 -24 34 294 -156 50 32 10 286 73 95 -51 -206 -138 -31 -20 -59
4944 -59 -131 -26 -15 -1 29 117 272 160 -69 -212 -10 -69 85 -30 -15 -11 164 -26 192 -35 141 147 123 -62
4968 -62 121 119 178 -216 -138 27 -32 47 -139 114 24 112 140 17 160 140 -113 -160 -3 72 -23 -44 6 -103 -92 9
4994 9 97 55 65 121 -109 -41 18 30 -18 -63 -30 -47 -58 43 -32 154 46 -23 37 137 90 129 31 -220 -9 21 -110
$$ packed form
4816d1N0r3j1L2l9J79m4mO2Ll50L61J0n8N2j26k2p3Q6J10L7Kj97J2J34j05J20
4843H7N3oj56k0K10k31M0p5O4M2m5R0L9r9J51k37j2J09J7j00pJ25k4j82K32l1
4869C4P4J30j93k7q6J8L02j77j71J55j21k04K07P0M1J0l8J05k04J94k5J46k19
4892B1j29O1l01K90J3R9j54kR6P9l0Q6k1j47QJ58r3p7K7O1O4j41K02j01N2L1j2
4919A40j01j50J27O5m8qm6m0L4LN8K60m50K06j8k2K76k13K2j46j55O8J07J1l9
4944e9p2J05J1J4L0Q8J55j12k29j43K02n9J54j15J5MJ75j90K18k27J76Ok4j85
4968f2J83kN9l94P8J65n9P9j86K53r0Q8K8j23J43k0k53m7J57P5r5k1N0j09J1J01
4994IQ8m2J0N6k30O8N9J2m8m5L3j7j1J01p5J86j08o9O0J00m7L9r8k51K11L0j31
$$ plain form
5021 -110 -131 75 -42 106 51 340 25 -61 -113 -105 -180 -177 -3 3 -121 -4 249 159 40 55 40 82 12 16 -29 -97 -169
5048 -169 73 -83 173 71 -4 -9 114 181 -28 -37 81 -51 -78 -160 -90 -154 -11 -8 210 9 85 18 27 29 103 74 -5
5075 -5 -173 34 107 71 -84 -43 -72 -198 -40 -45 70 -22 82 104 -92 196 50 4 -217 -73 87 -17 75 16
5099 16 62 14 44 45 -15 -19 125 -137 -31 -75 -1 31 -130 78 284 -88 22 -119 -20 31 8 97 43 -77 15 229
5125 229 88 9 128 -171 4 24 311 189 -47 4 50 -90 -22 54 -133 50 -100 114 139 15 32 98 -47
5148 -47 -62 -103 78 75 -84 -19 -325 -160 -128 84 109 59 -5 52 -131 48 105 72 57 -157 132 -128 108 -10 -26
5173 -26 82 37 76 -77 236 239 53 20 -73 -43 47 -123 87 -73 -273 36 -22 -78 -77 193 -14 -187 -233 32 114
5198 114 -85 -55 -90 -68 -73 -107 160 39 -49 2 124 38 -23 182 -95 20 -20 -192 -28 -193 17 -44 72 177
$$ packed form
5021a10k1K06j17J48n5K89l15q6n2Qp5LJ74Oj24J17K53r0j19J5j5M2p0Mm5o8p2
5048a69K42j56K56j02p5nJ23O7k09rJ18j32k7q2P0o4J43LK18k01P6o7RKP4k9p9
5075ej68K07P3l6j55M1k9j26J58nJ15r2J04K2j96K88j46m6k21J44J60j04R2n9
5099A6M6m8L0Jo0mJ44k62J06m4P4L2j61K08K06l72J10j41R9N1k3Q9n4j20R2K14
5125B29j41p9J19k99J75K0K87j22k36N1M6j40O8P6j87J83j50K14K5j24J7O6j45
5148d7j5m1J81lj59O5l06J65L2K12K5n0o4N7j83J79N7l3j5k14K89k60K36j18j6
5173b6J08m5L9j53L13Lj86l3r3L0R0j70K10j60k00L09n8n6JK70k07j73m6K65Q2
5198A14j99L0l5K2nl4K67j21q8N1J22q6o1K05k77J15m0j72J64j65K10o1J16J05
$$ plain form
5222 177 29 29 115 75 37 -201 -11 -46 72 103 67 94 -35 15 125 -43 164 -11 31 -59 -164 130 64 -148
5246 -148 -28 93 -105 4 164 167 38 91 -28 -123 -20 -53 17 -209 -4 -118 -43 64 110 -103 -231 -32 105
5269 105 -133 27 115 56 -59 -203 105 -2 -123 45 14 62 59 130 101 -64 -42 164 -77 -44 24 70 -53 -34
5293 -34 62 67 161 30 -25 203 13 -172 116 -190 -193 -216 79 -60 28 -129 -120 -132 31 259 -155 -229 137 5 110
5318 110 -95 43 33 -132 224 4 -117 72 41 -40 24 -57 39 -57 -6 -37 61 50 110 11 -40 15 -15 79 24 -122
5344 -122 93 -94 158 132 -15 0 -76 -32 -22 4 -169 -58 -43 -174 104 33 149 -44 140 -116 -46 -43 34 -185
5368 -185 32 12 -8 -105 -80 -108 72 -92 99 56 75 98 -40 15 -11 -37 21 13 -50 12 47 91 27 8 62 134 -75
5395 -75 80 -77 42 35 -77 -49 -105 146 51 35 55 4 109 -177 -216 9 -57 -87 5 -82 -149 -63 -3 -57 240 91
$$ packed form
5222A77j48%Q6m0l8k38J90l5J18L1l6K7j29N0J10j68K07j75M2r0j05K94o6k12
5246a48J20J21j98J09J60Lj29N3j19r5J03l3P0k26K05j14P5J07M6k13j28J99J37
5269A05k38J60Q8n9j15j44L08j07j21J68l1M8lP1k9j65K2K06k41L3O8M6j23J9
5293c4R6NR4j31n5K28j90j85K88l06lk3K95j39Q8j57Rj2J63K28m14p4L66j32J05
5318A10k05J38j0j65L56k20j21J89l1q1O4q1R6r6N1l1R8j1O0r9n1N5l0R4n5j46
5344a22K15j87K52k6j47J5p6M4J0K6j73J11J5j31K78p1J16j93J84k56P0LP7k19
5368a85K17k0k0r7K5k8J80j64J91m3J9K3j38N5k6k6N8qo3O2L5M4o4j9N4P2k09
5395g5J55j57J19pj12K8n6K51r5j6K0n1J05k86l9K25o6l0R2q7o7Q6O0n4K97j49
$$ plain form
5421 91 95 122 -86 -37 181 54 -50 -61 -105 -198 4 47 54 -6 90 63 154 -85 87 -86 -18 -35 -32 185 -241 180
5447 180 50 -89 188 3 -4 152 164 45 -172 77 7 -96 -172 46 -5 153 26 -116 -36 79 174 55 47
5470 47 18 5 -72 146 -127 -12 59 85 2 95 33 27 -22 -12 70 28 -15 -50 -35 82 53 5 126 78 -16 -67 48 81
5498 81 99 99 -96 -64 -75 46 39 91 4 -76 92 -37 8 112 211 185 99 -125 -110 -53 82 -133 -118 103 4 -154
5524 -154 105 -168 -47 112 -26 -115 -8 -87 -8 19 -53 33 66 145 -76 152 -83 146 30 -31 9 97 -41 -93
5548 -93 -60 -42 128 -21 49 -82 7 110 21 64 8 133 -46 85 -32 2 90 -11 161 -14 -52 -81 32 -103
5572 -103 122 132 -87 50 -96 -49 27 -124 7 -130 7 -160 -127 63 89 101 137 -37 -59 -69 -78 89 -86 32
5596 32 -110 -124 -13 13 133 107 -7 -31 -40 74 23 -30 16 -65 -101 -89 -24 -78 -7 -131 -61 185 72 76 105 3 50
$$ packed form
5421I1MK7k08M9K18j27j04j1m4r3K02M3Po0R6k7R1k39J72j73O8j7LK17m26M21
5447A80j30j39K77j85pJ56J2j19k17K49p0j03p6K18n1J58j27j42Q0J15R5j19q
5470D7k9j3p7K18k73J15P1K6q3R3o2om9J0Q2m2m3l5J5J17k9m8J21m8r4n1J15L3
5498H1J8%j95L2j1J21pN2q7q0J68j29M5J04R9k6q6k24J5N7J35k15J5K21r9j58
5524a54K59k73J21J59j38q9J07p9P9K7p2Q6L3P9k21K28k35K29j16o1M0Q8j38n2
5548i3L3J8J70j49P0j31Q9J03q9M3n6J25j79J31j17L4Q8j01J72j75l8k9J13j35
5572a03K25J0k19J37j46M7P6j51J31j37J37j67L3J90K6J2L6j74k2j0rJ67j75J18
5596C2j42j4J11K6J20k6j14k4rJ14n1n3M6q1l6J2O5n4P1j24P0K46j13MK9j02M7
$$ plain form
5623 50 5 29 -33 7 -58 -150 -118 74 -5 110 -65 205 -5 66 -26 -137 10 -17 -56 -22 -137 -72 -54 -171 75
5648 75 59 188 -61 -46 -123 -107 -173 -94 -203 -221 -81 50 194 -74 -55 55 59 14 -68 67 -264 -14 -171 28
5672 28 22 -38 -20 90 72 -1 -55 80 177 -215 -120 -6 -60 -142 -168 -38 -24 -16 -50 45 -35 -111 -100 251 -78 131 -46
5699 -46 25 -45 9 89 -206 214 -148 7 -10 -101 212 -22 135 169 -42 107 107 -104 13 -98 -113 85 129 95
5723 95 -7 36 -88 -12 30 57 3 71 -100 -64 59 -68 -142 29 55 -13 186 53 31 31 -74 -65 -26 -27 -82 -145 -51
5750 -51 -35 2 -37 187 71 56 23 23 6 29 75 -30 49 -171 -13 -44 52 -62 -17 -53 26 78 -142 -9 2 -70 -158
5777 -158 189 148 70 -9 -163 -150 45 125 -47 5 89 -22 -36 -42 -36 51 117 172 32 -74 -37 -26 -86 -50 49 -9 146
5804 146 7 113 7 76 97 -26 -225 -14 -106 -30 19 -125 129 -177 -48 -6 60 -109 -1 4 25 72 -185 70
$$ packed form
5623E0m5K4o2M0o5r2L2J92p9J15j75K70k10P1r2j11J47k7l9L4j15O5J8j17K46
5648G5j6J29k49J5p7J6o6P9j09j8J40J31J44k68J9J10Mm5q2J35l31K50j57J99
5672B8oo0J8J10j8p3n4J35R7l92R5J14n4q2k6J30J4Ql4R5q0p6J1L51l29K09j77
5699d6P1p0N4Q0k95M20l62J55j7r1L13k34J57L4k11J49%k11J17j11j5J98M4l4
5723I5j02M3j24P6M2K7n4O8j71L6J23j27p4J71K6o8J99j33k2%j05RL9jn5o3R4
5750e1J6L7l9K24j16j5l3%j7K3M6j05P9k20J58l1R6j14M5l6P9N2k20J33J1p2q8
5777a58L47m1p8p9j54J3J95Q0j72N2Q4j11j4oOQ7O6N5j40j06L7J1o0L6R9n8J55
5804A46j39J06j06O9K1j23j99K11r2P6M9j44K54l06J29M2O6j69J08NK1M7k57K55
$$ plain form
5828 70 58 -85 122 -97 -8 80 5 97 85 -107 18 -158 -46 -34 -103 125 31 59 -123 -132 117 -94 21 -124
5852 -124 114 -64 -47 -194 -52 -151 -67 142 -156 -100 123 -114 -77 214 129 84 -4 -58 88 -105 -258 9 17 -147
5876 -147 147 19 57 140 68 -92 -44 249 73 -182 -42 -59 -172 -1 36 112 -17 -43 -4 28 28 -17 -127 -88 -109
5901 -109 27 -13 -52 61 -31 -97 14 110 -22 -10 36 70 -77 -110 -123 41 -46 -149 173 50 19 -24 44 -64 44
5926 44 137 44 -34 94 73 7 -206 128 77 -119 50 -10 72 104 -54 -60 -83 -64 121 -171 -183 -96 126 96 -20 55
5952 55 -2 -118 -76 84 55 -126 34 174 -256 -183 82 10 50 -12 105 132 46 63 -82 1 116 48 41 -28 -107 -94
5978 -94 -24 -46 -13 -64 22 -105 161 -29 -69 71 60 11 41 7 21 -186 -45 20 -6 72 2 97 -44 49 66 25 -47
6005 -47 37 0 -116 20 82 70 22 -29 -58 -242 21 120 -8 -10 -71 -13 -141 108 -208 39 -140 -122 28 48 68
$$ packed form
5828G0j2j43K07k19Q9Q8p5R2j2j92J25j76J12J2o9K28r4K8j82rK49k11J15j45
5852a24K38j78J7j47J42r9Q4K09k98N6K23k37L7K91q5m5q8n4J46j93j53K67Qj64
5876a47K94j28L8Q3p2j60M8K93j76k55J40j7j13J71L7P6j29k6L9L2%m5j10L9k1
5901a09J36m0l9J13r2o6J11R6j32J2M6L4j47l3j3J64q7j03L22j23l1m3O8j08J08
5926D4R3r3p8J28k1o6k13L34n1j96J69o0Q2L2j58ok3J9J85k92j2Q7K22l0j16P5
5952E5n7j16M2J60k9j81J60J40m30P3K65p2M0o2J17K7q6J7j45Q3J15o8po9p9J3
5978i4P0k2L3n1Q6j27K66j90m0J40j1m9L0l4J4k07J41O5k6P8p0R5j41R3J7m1p2
6005d7Q4l7j16J36O2j2m8n1k9j84K63R9j28ko1N8j28K49l16K47j79J8J50K0K0
$$ plain form
6030 68 150 98 115 49 91 111 -10 49 -60 -25 42 89 12 -148 20 -68 21 -24 163 -73 128 71 8 -86 38 2
6056 2 -72 -82 -171 26 -65 -67 -78 153 12 8 153 37 -116 4 -62 -118 29 -103 33 -12 160 -31 2 12 -89
6081 -89 81 -44 -40 -88 -122 64 79 -125 20 26 50 -18 12 21 -64 -106 -55 -47 74 -46 -88 -99 24 81 -48 -84 -109 -81
6109 -81 -46 45 22 21 -2 47 -199 -45 32 -49 2 2 17 -134 -34 146 28 102 -68 56 -70 -75 238 43 -180 -14
6135 -14 190 -37 -59 -19 90 -36 29 -126 -254 -33 -3 -64 96 74 -99 107 -198 76 15 -81 80 100 -17
6158 -17 0 47 -2 27 -132 -90 35 -81 -23 173 72 -115 63 25 -11 0 -105 46 -135 39 159 -86 106
6181 106 33 -115 -22 -37 152 94 20 -219 -47 -102 -76 45 -90 53 238 -19 -32 251 -55 -194 36 8 -64
6204 -64 -96 44 104 -182 -34 -46 -194 11 26 -109 -119 -34 64 -18 135 -28 113 66 105 -53 -50 -42 -3 19 -112 11
$$ packed form
6030F8Q2n2J7o6M2K0j21N9j09L5O7M7p7j60J68q8Q9m5J87k36K01n7o3r4J24l6
6056Bp4j0q9J97r1kj1K31j41mJ45j16j53J20o6n6J47j32J36m5J72j91L3J0j01
6081h9J70j25Mm8l4J86J5k04J45OK4o8L0Rq5m2N1QJ21j20m2j1J23N7j29l6k5K8
6109h1L5R1k3jk3M9k46J54P7q1N1%J5j51J00J80j18P4j70J24j26nL13j95k23J66
6135a4K04k27k2M0J09j26O5j55j28K21L0o1J60k2j73K06l05K74o1r6J61K0j17
6158a7J7M7m9K9j59M2J25j16N8J96j01j87J78l8l6J1j05J51j81J74J20k45J92
6181A06p3j48R3j5J89n8p4k39J72n5K6J21j35J43J85k57j3K83l06j39K30k8p2
6204f4l2J40O0k86J48j2j48K05J5j35j0Q5R8q2J53j63J41m7L9j58LQL9K2j31J23
$$ plain form
6230 11 39 -101 -23 -10 267 33 158 85 4 -51 44 -102 73 -114 1 15 -88 163 -106 21 -139 167 169 -50
6254 -50 -61 -10 -114 31 24 63 -28 -140 -93 -29 27 72 51 -82 -105 -78 33 -7 -97 152 150 -4 96 -192 53 21
6280 21 84 85 -79 132 -15 153 -113 -51 187 -46 64 125 10 -27 -64 119 -81 -100 -112 68 101 -220 33 25
6304 25 125 44 127 -71 -74 -30 164 -26 -84 125 -53 -133 -50 98 -207 54 225 24 -141 10 -4 -29 -5 95
6328 95 61 -89 -257 142 -35 45 -18 62 102 -39 151 -89 -47 -103 90 -96 170 138 61 -159 -52 38 -42 72
6352 72 97 0 -261 19 156 130 -304 143 155 16 0 -90 -40 -26 107 10 136 -49 255 62 -1 83 -25 1
6376 1 19 -27 -75 -79 20 84 92 -132 84 68 99 0 -7 -23 -176 -7 -7 -58 35 -20 -2 21 -35 18 8 6 10 -48 -111 24 -38
6407 -38 98 -69 -31 73 -230 -85 54 113 -37 55 81 13 -131 30 116 55 1 52 -20 -106 16 71 116 4 183
$$ packed form
6230A1K8j40P8J3K77k34J25p3q1n5R5j46J75j87J15J4j03K51k69J27j60L06Kk19
6254e0j1N1j04J45pL9r1j12M7O4N6M5k1j33k3K7J11m0r0K49kj54J00k88K45l2
6280B1O3Jj64K11j47J68k66O2K38k33J10O1j15l7l7J83k00j9j2J80L3l21K53q
6304B5J00q1Q3j98lM4J94j90n8K09j78q0Q3J48l05K61J71k01j65J51j4k5K4J00
6328I5l4j50j68L99j77Q0o3Q0M0j41J90k40M2n6J93j86K66l2p7k20J07R0q0J14
6352G2K5r7k61K80J37k6m34M47J2j39j6r0N0J4J33r7J26j85L04j93o3Q4j08K6
6376AJ8m6m8mR9O4Qk24K16j6L1r9pj6j53J69%n1R3n5J8K3n6N3j0kMn8o3J35o2
6407c8J36j67L8J04l03J45J39N9j50R2K6o8j44J61Q6o1n4N1p2q6J22N5M5j12J79
$$ plain form
6432 183 63 76 47 118 -55 15 42 158 -69 -227 -14 -67 -137 -116 12 4 -92 -107 7 -115 64 121 36 -202 12
6457 12 182 -99 35 -1 87 -73 68 110 -84 -2 -82 -111 -85 -50 -25 -62 -15 79 188 -114 76 192 -16 -119
6481 -119 -86 63 -85 140 4 -85 -108 52 -16 50 -1 141 -31 -15 147 31 54 -10 -64 112 3 4 -51 -165
6505 -165 14 -29 84 148 65 29 -68 49 -199 -5 -46 -161 -46 11 1 24 93 25 139 64 95 -22 105 -6
6529 -6 -45 -5 -123 48 149 59 70 147 -215 16 117 15 40 -79 -1 -137 -92 129 -3 105 -48 -66 2 26
6553 26 108 153 53 39 117 6 12 -20 -41 111 77 -9 2 -68 92 5 -111 64 33 -26 131 -12 -201 31 -197
6578 -197 78 -43 63 44 -23 71 -8 -55 98 26 -65 -57 -19 -77 -39 -26 1 140 -76 7 55 115 47 83 -30 -157
6604 -157 -172 -95 -15 3 -148 103 -1 86 -136 79 107 -56 -41 -63 165 -145 -6 180 -96 1 -183 156 -10
$$ packed form
6432A83j20J3k9P1j73P0K7J16k27j58K13n3p0K1J28qr6j5J14j22J79N7q5k38K14
6457A2J70k81J34l6Q8j60J41M2j94Q2q0k9K6L5K5l7M7R4J09l02J90J16k08j03
6481a19L3J49j48K25j36q9k3J60o8O6n1J42j72J6J62j16K3o4n4J76j09Jn5j14
6505a65J79m3J13O4q3l6r7J17k48J94m1j15J15N7j0K3O9o8J14p5L1j17J27j11
6529fl9M0j18J71J01r0J1P7l62K31J01j02K5j19P8j36M5K21j32J08j53j8O8K4
6553B6Q2M5j00j4P8j11Ol2k1J52l4q6J1p0J60q7j16J75l1n9J57j43j89K32k28
6578a97K75j21J06j9o7R4p9m7J53p2r1QL8n8L8J3K7J39k16Q3M8O0o8L6j13j27
6604a57j5P7Q0J8j51K51j04Q7k22K15K8j63J5k2K28l10J39J86k76R7j84L39j66
$$ plain form
6627 -10 -120 77 78 83 103 -102 -33 13 104 81 -43 -112 108 -43 -101 -49 21 -75 26 122 4 201 -175 22 -112
6652 -112 67 38 9 15 39 31 25 90 -57 200 98 56 87 7 -128 65 -140 46 -8 -89 -22 -61 101 168 117 -3
6678 -3 105 -88 -101 72 -99 -160 -175 127 -113 -177 87 276 -35 -51 88 56 46 -12 -88 -49 -160 0 -208 -196
6702 -196 -23 -30 -66 52 22 71 48 -1 114 -65 122 -70 143 -3 -53 20 20 24 403 99 260 -32 64 58 -136
6727 -136 -45 -45 -52 3 92 -10 -18 -142 106 75 -186 -9 31 40 34 309 102 -139 53 9 230 -115 109 84 144 31
6753 31 129 73 -81 25 67 -172 -149 -54 -39 20 -94 111 48 112 -4 -35 -16 1 188 -77 -163 34 55 -64 124
6778 124 -3 218 61 81 193 154 -37 -24 99 -49 -34 -64 21 -37 10 -58 57 -98 -15 108 36 -5 -21 95
6802 95 -71 -93 -84 -133 -42 -7 -23 -85 -19 57 90 -72 -34 80 -108 -65 -15 -58 -60 24 50 -32 -251 4 -74 2 94 234
$$ packed form
6627a0j10J97JNK0k05O9M6R1k3j24o9K20j51n8N2P0r6J01R6j18J97l76J97j34
6652a12J79k9k9OK4qoO5j47K57j02m2L1q0j35J93k05J86n4q1O7l9J62O7n1j20
6678cJ08j93j3J73j71o1j5L02k40o4K64J89l11j6J39l2j0n8p6L9j11J60k08J2
6702a96J73pl6J18l0M9k3m9J15j79J87j92K13j46n0P3%ML79l04J61k92R6oj94
6727a36R1%pN5Q9j02qj24K48l1k61J77M0RoK75k07k41J92m4K21l45K24k5O0j13
6753C1R8n6j54J06M2k39K3R5J5N9j14K05o3O4j16l1J9J7J87k65q6J97K1j19J88
6778A24j27K21j57K0J12l9j91J3J23j48J5l0Q5n8M7o8J15j55Q3J23p2m1j6J16
6802I5j66k2Rm9R1L5j6o2O6P6L3j62L8J14j88M3N0m3kQ4K6q2k19K55p8P6R2J40
$$ plain form
6830 234 -26 30 104 -27 -19 12 -227 -225 -176 -139 -101 72 70 33 139 161 65 126 72 -153 101 23 9 -13 -22 -23 21 -111
6858 -111 154 146 -132 89 -24 9 -109 29 12 -80 -21 197 -56 13 28 179 54 5 48 140 38 1 26 -65 -65
6883 -65 41 16 -93 165 4 109 -23 -45 -127 -11 -19 -53 -12 -111 -95 11 -126 80 51 -139 56 -162 -76 -54
6907 -54 -76 -26 -99 9 48 18 23 -37 -13 -122 53 -10 45 -31 -64 82 43 -63 -75 134 -61 -75 13 -104 16 -42
6933 -42 24 15 46 -94 56 -86 -123 -37 -161 -105 -109 -22 110 -122 -21 151 27 -7 46 -134 70 -95 86 39 17
6958 17 154 -85 -84 126 -12 -59 87 8 -81 -77 -31 132 -153 -77 -12 223 -87 10 -177 152 17 52 35 -2 130
6983 130 -46 89 7 -57 -42 14 -37 30 179 17 -6 192 -65 99 -69 -161 152 -20 104 -47 42 134 8
7006 8 99 -90 -54 -14 139 -81 -194 43 -49 93 -135 41 -41 -72 37 58 -41 -70 33 99 68 10 -17 -35 -11 -89
$$ packed form
6830B34k60N6P4j31QL1k39KM9L7L8J73kl7J06K2r6O1n4k25K54p8j4k2rjM4j32
6858a11K65qk78K21j13L3j18J38j7r2N9K18k53O9J5J51j25m9M3R2j02l7K5r1%
6883f5J06k5j09K58j61J05j32k2q2J16ql4M1r9J6J06j37K06k9j90J95k18Q6K2
6907e4k2N0p3J08L9l0No0K4j09J75o3N5p6l3J46l9j06j2K09j95j4Q8j17J20n8
6933d2O6rL1j40J50j42l7Q6j24N6mQ7J32k32J01J72j24l4N3j80K04j65J81m7k2
6958A7J37k39JK10j38m7J46p9q9MM6J63k85P6O5K35l10R7j87L29j35L5j7l7J32
6983A30j76J35q2o4J5N6n1O7J49j62k3J98k57J64j68r2L13j72J24j51Q9R2j26
7006HR1j89L6M0J53k20j13K37r2J42k28J76q2l1J09K1r9k9J03O6l1n8k7j8K4p8
$$ plain form
7032 -89 -99 51 -10 62 -99 111 -35 -163 -16 -43 -125 -12 81 -48 -10 -125 1 94 -128 -29 27 -155 -9 57
7056 57 -4 30 68 80 -39 -12 25 54 90 -64 -70 21 27 -39 -35 -81 127 -87 -126 172 -1 -24 11 -148 74 -71 37
7083 37 -146 -151 97 27 32 -24 67 -76 -3 -110 -70 -75 128 46 -287 -30 85 39 -174 216 66 51 65 -13 -113 -143
7109 -143 -163 -97 242 -24 63 3 43 52 56 171 -185 69 106 -103 27 10 217 -107 -31 58 21 73 3 -12 87 11
7135 11 -82 -27 14 121 46 -64 23 -68 -95 111 -129 -31 -121 57 -72 218 134 -91 25 -56 84 -53 10 -39 -136
7160 -136 -23 164 30 117 -108 203 171 212 68 221 23 -22 45 182 4 -136 149 -177 -55 -133 -95 -70 28
7183 28 54 93 -97 -117 -164 -31 -62 52 -32 13 -22 10 -47 14 -57 -116 -173 -13 20 102 -56 55 -58 -118 49 11
7209 11 376 58 -51 3 -2 -77 75 9 8 -194 -119 199 -73 208 72 -65 23 116 61 14 172 98 -63 -101 -98 81
$$ packed form
7032h9j0J50o1P2j61K10j46j28J47k7q2J13R3j29L8j15J26R3k22R9N6j82J46O6
7056E7o1L4L8J2j19K7L7K9L6j54oR1Oo6Mm6K08k14l9K98j73k3L5j59K22j45J08
7083C7j83nK48p0Nn6R1j43P3j07M0nK03q2l33K57J15m6k13L90j50j5J4p8j00l0
7109a43k0O6L39k66Q7o0M0RMJ15l56K54L7k09J30j7K07l24P6Q9l7N2p0j5R9p6
7135A1r3N5M1J07p5j10Q7r1k7K06k40R8r0J78j29K90q4k25J16q1J40j37O3m9r7
7160a36J13J87j34Q7k25L11l2M1j44J53j98m5O7J37j78j40K85l26J22p8L8K5R8
7183B8K6L9j90k0m7J33l1J14q4M5l5L2n7O1p1n9n7J60L3Q2j58J11j13o0J67l8
7209A1L65l18j09N4np5J52o6jk02P5L18k72K81j36j37Q8R3n5m7J58p4j61l8LJ79
$$ plain form
7235 81 40 1 123 -41 26 -66 -92 15 21 1 -66 -24 -73 -110 79 -167 39 -152 17 181 164 99 5 23 -13 4
7261 4 -91 -45 -123 -29 104 -127 31 -209 68 49 -85 -91 -242 29 -207 -94 65 10 3 74 104 -11 -49 -105 29
7286 29 -7 109 -16 -37 72 -29 -220 -18 31 -76 142 15 41 -166 117 18 110 109 -161 73 101 -19 -116 38
7310 38 6 54 94 -162 -169 9 62 -74 -136 -50 235 14 -14 76 73 153 -80 -146 97 -135 26 -11 -69 -86 20 -134
7336 -134 26 64 -95 -84 24 23 47 119 172 100 98 -11 -65 229 -114 -113 -63 118 85 -41 -117 -101 -23 99 287 20
7362 20 107 -17 116 123 105 72 42 59 -55 -69 63 -9 -102 32 -50 -65 2 -41 -84 -108 169 -83 -153 16 170 22
7388 22 72 -29 -40 115 -14 95 -16 184 -55 -37 35 25 36 -21 -94 67 134 21 -48 271 -24 -5 55 36 32
7413 32 -96 -105 -88 37 -108 -3 80 128 89 -80 134 17 0 -66 -19 11 -56 74 -61 66 23 51 -81 62 94
$$ packed form
7235H1m1l9J22j64O7r2k6J07Ok0o7M2m9l7J89k46K06j91J69J64j7o5r4J8l6J7
7261Dr5M6p8R4J33k31J58k40K77j9j34oj51K71k36J13J59n5pP1L0j15l8n6J34
7286B9l6J16j25k1J09j01j91K02M9j07K18j27K6k07K83r9R2jk70K34K8j20r7J54
7310C8l2M8M0k56pJ78N3j36o2Q6K85k21k8R0lQ0k33o6K43k32J61l7n8j7J06j54
7336a34J60L8j59J1J08jK4P2N3p2kj09n4K94l43JN0J81l3j26p6J6P8J22J88k67
7362B0Q7j24J33Pj8l3l0J7j14j4J32p2r3J34q2j5O7m3m3k4K77k52p0J69J54j48
7388B2N0j01j1J55j29J09j11K00k39J8P2j0J1n7p3J61O7j13o9L19k95J9O0j9m
7413C2j28rJ7J25j45J05Q3M8l9j69K14j17j7o6M7L0o7J30j35J27m3K8j32J43L2
$$ plain form
7438 94 -6 48 54 -103 1 -122 -93 46 -28 62 111 -73 -45 52 -63 6 -16 75 173 23 -238 25 -139 -192 92
7463 92 -46 58 37 -142 -32 -79 46 58 -11 -64 64 -90 -9 -65 -50 -105 -12 128 108 11 -200 -114 65 23 139
7488 139 -184 -18 12 -64 25 -51 70 117 -86 -76 16 -38 4 -126 13 -73 247 -69 69 -50 -37 -123 4 73
7512 73 -13 -54 24 134 -64 -42 -64 133 -97 -79 15 -31 -70 -17 -112 11 90 53 -156 -94 -67 -74 -37 -79 -41 121 191
7539 191 45 -89 115 -35 44 55 13 -112 37 35 -142 -74 -53 -27 112 8 99 131 -3 -72 -27 -85 -77 -103 123
7564 123 -24 -81 -151 -15 -40 -95 29 124 51 -138 75 -128 36 125 92 126 -15 -67 -20 -42 63 121 26 57 -32
7589 -32 -2 119 117 20 82 -84 123 -68 -43 -84 51 56 82 -9 65 8 -65 162 77 181 38 258 -131 -159 30 -128
7615 -128 158 58 67 -17 -95 -56 6 -143 29 15 -86 -51 -50 9 5 34 143 70 -20 -42 134 -90 -159 -30 1 -148
$$ packed form
7438I4j00N4Oj57J04j23K9J39p4R0M9j84K8R7j15O9k2R1R8j50k61K63j64n3K84
7463I2j38J04k1j79J10m7J25J2o9n3J28j54Q1n6J5n5R3J40k0r7k11Q6J79m2J16
7488A39l23J66L0p6Q9p6J21M7k03J0R2n4M2j30J39q6L20l16J38j19J3q6J27O9
7512G3q6m1P8J10j98K2k2J97k30J8R4m6l9N3r5J23P9l7k09O2K7pL7m2L8J62P0
7539A91j46j34K04j50P9J1m2j25J49kj77O8K1K6J39j04R1L2j34o9M5n8Qk6K26
7564A23j47n7p0J36k5n5J24R5p3j89K13k03J64Q9l3L4j41n2M7k2J05N8r5L1q9
7589c2L0J21kr7O2j66K07j91K5m1J35NK6r1P4n7p3K27q5J04j43K20l89k8J89j58
7615a28K86j00Rq4p8L9O2j49J72j4j01L5JN9mK9J09p3r0k2J76k24o9J29L1j49
$$ plain form
7641 -148 -98 87 -46 94 -18 -79 -122 -7 -20 -68 35 9 123 -244 -90 25 2 -133 13 -77 66 70 24 141
7665 141 -154 -25 84 -81 84 228 15 -16 -76 -6 33 62 -188 -7 -111 105 36 217 100 8 -52 -125 56
7688 56 -46 116 -10 -11 170 -189 -123 144 76 273 -106 -66 -30 -40 108 9 -76 -37 -126 -9 -51 -134 88 102 -16
7713 -16 -4 -91 307 -91 32 -29 1 9 -5 42 -78 -170 -70 -47 -40 -17 78 -72 36 96 115 -80 -44 -108 -55 21 57
7740 57 -139 -215 65 -30 -38 -116 5 13 -39 -150 -17 51 -41 -74 40 36 -32 -66 22 -16 64 97 -37 -101 -24 40 -21 -104
7768 -104 93 1 -145 53 -45 -65 -107 30 67 -34 71 186 -197 15 -118 -154 24 -207 -23 46 -96 5
7790 5 27 10 72 9 -109 -156 -19 -41 52 38 7 48 -73 28 141 165 -83 21 68 -16 121 1 -119 -1 25
7815 25 4 36 5 21 23 31 -29 -119 -98 35 173 178 -108 -79 -16 60 -63 -47 -125 -162 -64 276 85 -178 120 72 -169
$$ packed form
7641a48N0J85j33J40j12o1m3J15j3m8J03k6J14l67J54J15k3j35J46r0J43Mm6J17
7665A41k95J29J09j65J65J44k13l1o0P0L9K9k50J81j04K16o9J81j17r2o0p3J81
7688E6j02J62j26jJ81l59O6K67o8J97l79M0L6j0J48r9q5L9q9J17m2q3K22J4j18
7713a6J2q7L98l98J23o1L0Qj4M7j20r2J00K3PK3R5j50J08O0J9j95L6o4N3P6L6
7740E7j96p6K80r5qp8J21Qn2j11J33O8r2l3J14mo8l4Q8l8Q0L3j34o4P7O4o1q3
7768a04J97r2j46J98r8k0m2J37L7j01J05J15l83K12j33l6J78k31J84O9j42J01
7790EK2j7O2o3j18m7J37k2R3j4l1M1j21J01J13K4k48J04M7q4J37j20j20J18K6
7815B5k1L2l1J6KQo0r0K1J33J38Nk86K9O3P6j23J6p8l7R8L40j91k63K98m8k41
$$ plain form
7842 -169 -49 -40 58 -49 -3 81 -36 -36 62 62 -68 2 -114 -115 23 -66 100 75 40 157 173 66 66 46 61 -12 132
7869 132 -113 -93 192 81 -144 -49 -19 -32 88 169 212 81 30 -8 -243 70 33 -30 5 32 -121 7 -27 -5 72
7894 72 12 -14 -80 82 -27 -16 -49 -34 -91 51 60 -13 66 -52 61 72 -112 84 78 -56 -129 40 11 4 114 156 36
7921 36 -85 8 61 -112 162 140 -16 90 -183 13 110 -142 33 102 107 -31 -150 176 59 124 129 -92 -132 -219
7945 -219 153 82 -66 105 -98 8 68 -111 -17 -70 -58 89 35 -85 -132 27 58 -36 -214 -66 -72 78 5 -33
7969 -33 118 -54 23 170 97 6 -86 -16 36 128 47 -48 -124 -17 -24 -3 23 -55 35 37 -35 32 -9 189 73 -31 -143
7996 -143 -158 3 -190 -34 98 -223 8 33 59 -8 161 -149 10 -99 6 -38 -32 -33 31 77 -43 -11 180 -54
8020 -54 66 -68 123 47 -217 80 58 83 23 -129 -211 -48 -42 88 67 81 21 -10 -122 50 7 -100 -47 -2 -134
$$ packed form
7842a69J20RR8j07M6Q4j17%R8%j30P0j16jJ38q9J66k5l5J17J6j07%k0J5p3J44
7869A32k45K0K85j11k25R5L0j3J20Q1M3j31n1l8k35L13l7o3L5K7j53J28l4K2P7
7894G2o0k6o6J62j09J1l3J5n7J42Rp3P9j18J13J1j84J96oj34p3J69k9pJ10M2j20
7921C6j21R3N3j73K74k2j56J06k73J96R7k52J75O9Nj38j19L26j17O5Nk21m0q7
7945b19L72p1j48J71k03J06O0j79R4n3J2J47n4j20m7J59L1r4j78J48oJ50p3l8
7969c3J51j72P7J47p3r1r2P0N2R2q1r5p6J07pK1K6p8R0Kp2O7m1J98j16j04j12
7996a43j5J61j93J56J32l21K31K5K6o7J69l10J59j09J05m4OjO4M6j20L2J91k34
8020e4J20j34J91p6k64K97k2K5o0j52q2J63OJ30k1J4o0l1j12J72m3j07N3M5j32
$$ plain form
8045 -134 39 36 133 -62 -103 -68 -124 -66 -139 -109 -44 -48 -60 73 -44 -105 -23 12 -43 -113 279 60 -81 -30 60 -7 17
8072 17 -54 -73 -174 72 -195 -229 41 110 -19 -116 -23 -51 64 -94 -87 -22 -3 -49 16 -158 -30 53 -1 150 33
8097 33 126 189 -120 -121 58 13 -33 -18 -52 -43 177 167 60 -197 47 -88 -41 80 -188 -81 -75 71 124 -49 -92 19
8123 19 -71 -192 194 128 -87 92 71 -29 -44 -91 -13 33 -59 55 -6 -123 -22 -90 65 -80 152 -62 -67 -212
8147 -212 50 -30 -201 -237 42 -24 -122 54 -50 17 2 -95 60 63 27 13 9 9 -121 60 -93 -109 68 -25 -55 -4
8173 -4 -66 161 59 6 -121 -158 59 -61 -183 -168 -110 -103 -131 -137 74 -189 100 81
$$ packed form
8045a34J73lR7j95m1L5n6N8p3L0O5mj2J33j17o1Q2L5n5p0L92k19j41N1R0o7K4
8072A7p1j9j01K46k67l4K70O9j29r7R3k8J15j58PO5J9m6O5j74J28Q3n4J51j17
8097C3R3O3l09jJ79m5m6J5l4RK20j0j07k57K44j35M7J21k68J07OJ46N3j73m3J11
8123A9r0j21L86o6k15J79k1j00j5m7P8M6r2J14o1j17J01o8J55j45K32k14nj45
8147b12K62q0j71l6K79o6r8J76j04O7j5r7J55Ll6j4m%j30J81j53j6J77r3l0N1
8173do2K27j02n3j27l7K17j20j22J5N8Pk8oK11k63K89j9
8191H1
$$ Imaginary data points
##PAGE= N=2
##DATA TABLE= (X++(I..I)), XYDATA
$$ plain form
0 0 0 0 0 0 0 0 0 -8 8 -8 8 -8 16 -16 24 -32 40 -48 56 -64 80 -96 112 -134 156 -184 209 -245 281 -325
30 -325 369 -422 480 -543 615 -690 775 -869 972 -1083 1206 -1340 1486 -1647 1822 -2011
46 -2011 2219 -2447 2697 -2974 3272 -3606 3975 -4385 4845 -5366 5953 -6631 7418 -8343
60 -8343 9454 -10813 12522 -14746 17771 -22141 29039 -41579 71640 -297137 -60846 475550
72 475550 -178653 -69460 358476 -56291 -464820 78898 284761 -33880 -34081 107119 -132712
83 -132712 -197161 24140 170334 120208 -28365 -138688 -29212 -29943 -105043 146535 276247
94 276247 -146763 -239542 135177 31949 -191903 199548 259576 -296364 -235009 226390 10458
105 10458 -144149 278966 193233 -307670 -136508 180620 -20690 -47496 186045 17981
$$ packed form
0@%%%%%%%qJ6j6J6j6K4l2M0n6P2q8J04j20J44j76K08k46K90l40L93m54N26o06
30c25O94p91R02j023J158j305J465j644J841k055K289k546K826l133L469l833
46b011M230m666N144n671O246o878P581q360R230j0211J1319j2584J4049j5761
60h343J7797k0267K3335k7268L2517l9912N1180p0618J13219l68777K36291N36396
72D75550o54203J09193M27936m14767m08529N43718K05863l18641k01J41200k39831
83a32712o4449K21301J46194n0126j48573j10323J09476p31p5100K51578J29712
94B76247m23010r2779L74719j03228k23852L91451O0028n55940O1355M61399k15932
105A0458j54607M23115q5733n00903J71162L17128k01310k6806K33541j68064
$$ plain form
115 17981 -223755 -69250 83906 49173 66387 63900 -29963 -93465 -100401 22373 186342
126 186342 65957 -105168 26468 19349 -200170 -83 274295 -19765 -204882 85430
136 85430 48292 -196660 75084 272027 -86015 -179184 91823 -7625 -152526 107540 165947
147 165947 -104093 -103125 45486 -9973 -16917 93078 59257 -50898 -74334 -41009 24418 51022
159 51022 3828 15065 16637 -113678 -90447 118942 67977 -93972 43158 84455 -144202
170 -144202 -61776 189811 32308 -127663 58353 40987 -168836 -15306 170718 -21355
180 -21355 -99999 72326 15526 -115364 27213 117510 -15753 -59273 6152 -1531 -25331
191 -25331 5104 43658 33965 -39591 -60277 29211 39784 -40285 21638 89879 -55526 -99154
$$ packed form
115A7981k41736J54505J53156l4733J7214k487r3863o3502o936J22774J63969
126A86342j20385j71125J31636p119k19519K00087K74378k94060j85117K90312
136H5430l7138k44952K71744J96943l58042r3169K71007r9448j44901K60066N8407
147A65947k70040R68J48611n5459o944J09995l3821j10155k3436L3325O5427K6604
159E1022m7194J1237J572j30315K3231K09389n0965j61949J37130M1297k28657
170a44202Q2426K51587j57503j59971J86016j7366k09823J53530J86024j92073
180b1355p8644J72325n6800j30890J42577R0297j33263m3520O5425p683k3800
191b5331L0435L8554r693p3556k0686Q9488J0573q0069O1923O8241j45405m3628
$$ plain form
203 -99154 77521 52220 -99472 14536 94066 -89258 -87440 103839 36971 -84267 44293
214 44293 78727 -79778 -45534 92199 15066 -68125 20077 38011 -47778 -35631 32422 25480
226 25480 -20208 -23679 18648 20385 -29039 -6416 53276 -3483 -56390 27916 40884 -63984
238 -63984 -20995 80006 -18131 -76782 61827 58146 -81921 -13023 88067 -25233 -67136
249 -67136 54894 32604 -75434 -14931 56182 -17668 -39525 36538 24792 -38634 -10511 40020
261 40020 19612 -14956 -164 18970 -16821 -39922 17244 37046 -29780 -26486 33095 -10789
273 -10789 -51408 40385 66109 -43387 -39519 53120 -3308 -65306 39668 69402 -49553 -49571
285 -49571 38222 1253 -39625 35675 52160 -35015 -39741 25402 10196 -22376 22636 35563
$$ packed form
203i9154J76675k5301j51692J14008P9530j83324J818J91279o6868j21238J28560
214D4293L4434j58505L4244J37733p7133q3191Q8202J7934q5789J2147O8053o942
226B5480m5688l471M2327J737m9424K2623N9692n6759n2907Q4306J2968j04868
238f3984M2989J01001r8137n8651J38609l681j40067O8898J01090j13300m1903
249f7136J22030k2290j08038O0503P1113p3850k1857P6063j1746o3426K8123N0531
261D0020k0408l4568J4792J9134l5791k3101N7166J9802o6826L294N9581m3884
273a0789m0619R1793K5724j09496L868R2639n6428o1998J04974K9734j18955j8
285d9571Q7793l6969m0878P5300J6485q7175m726O5143j5206l2572M5012J2927
$$ plain form
297 35563 -36110 -56721 8723 31029 -8976 3009 41740 -9392 -59336 12961 61396 -6092
309 -6092 -20721 32479 -12400 -73991 5249 71600 -6074 -42391 21488 476 -60805 8129
321 8129 76987 8689 -38675 6911 3186 -39048 7593 60991 140 -54399 -5458 13442
333 13442 -27456 8037 69200 11652 -64111 -18200 31869 -11879 -14528 48731 13862 -71719
345 -71719 -29558 45238 11204 -12542 38313 18345 -61768 -30811 55453 30270 -21243 14232
357 14232 13307 -59637 -39897 49183 33544 -29222 -4357 15365 -40766 -26939 66431 49209
369 49209 -38094 -17509 21417 -33560 -35503 55523 51347 -43306 -40052 21709 -2358 -23205 41683
382 41683 48370 -36412 -48334 13335 12971 -13611 24830 39131 -35030 -60694 15009 36989 -11248
$$ packed form
297C5563p1673k0611O5444K2306m0005J1985L8731n1132m9944P2297M8435o7488
309f092j4629N3200m4879o1591P9240O6351p7674l6317O3879k1012o1281O8934
321H129O8858o8298m7364M5586l725m2234M6641N3398o0851n4539M8941J8900
333A3442m0898L5493O1163n7548p5763M5911N0069m3748k649O3259l4869q5581
345g1719M2161P4796l4034k3746N0855j9968q0113L0957Q6264k5183n1513L5475
357A4232r25p2944J9740Q9080j5639o2766K4865J9722n6131J3827R3370j7222
369D9209q7303K0585L8926n4977j943R1026m176r4653L254O1761k4067k0847O4888
382D1683O687q4782j1922O1669l64k6582L8441J4301p4161k5664P5703K1980m8237
$$ plain form
395 -11248 9135 44496 -20927 -60831 19775 56490 -10368 -16481 27362 -24840 -70097 16109
407 16109 62951 -10997 -25637 25940 -8005 -50972 18309 67535 226 -38678 3912 528
419 528 -34899 7646 53592 2753 -45496 -10417 12046 -18151 175 53292 13908 -56229
431 -56229 -17730 33298 -8965 -18878 39525 14252 -62020 -24755 45512 9760 -15284 37032
443 37032 17064 -56918 -20224 47172 8691 -25017 16586 8790 -51138 -26080 44289 25358
455 25358 -23019 121 15392 -26135 -21060 41453 38760 -21145 -18736 15570 -15099 -33495 29563
468 29563 43445 -30516 -33966 25407 4851 -29413 25730 46819 -27231 -39876 22377 10389
480 10389 -28913 16218 37389 -28086 -37294 25562 23999 -17814 6302 33446 -14280 -41315
$$ packed form
395a1248K0383L5361o5423l9904Q0606L6715o6858o113M3843n2202m5257Q6206
407A6109M6842p3948j4640N1577l3945m2967O9281M9226o7309l8904M2590l384
419E28l5427M2545M5946n0839m8249L5079K2463l0197J8326N3117l9384p0137
431e6229L8499N1028m2263r913N8403k5273p6272L7265P0267l5752k5044N2316
443C7032j9968p3982L6694O7396l8481l3708M1603p796n9928K5058P0369j8931
455B5358m8377K3140J5271m1527N075O2513k693n9905K409L4306l0669j8396O3058
468B9563J3882p3961l450N9373k0556l4264N5143K1089p4050j2645O2253j1988
480A0389l9302M5131K1171o5475r208O2856j563m1813K4116K7144m7726k7035
$$ plain form
492 -41315 12037 34611 -9608 -16299 15225 -5852 -39507 -1318 38880 3143 -20951 15923
504 15923 11221 -31825 -712 45689 2910 -32830 6708 11828 -32711 -11412 38400 5297
516 5297 -33920 4204 20319 -20414 -9039 34521 7700 -33305 -4099 22468 -10309 -18936
528 -18936 21184 15612 -28160 -13456 25283 6992 -14824 11362 17028 -18967 -16517 18607 5512
541 5512 -21382 2950 13833 -21898 -17585 24263 14529 -16969 3061 22105 -8388 -17958 17595
554 17595 17596 -16791 -8663 13218 -7190 -19318 8344 14773 -11555 -9217 14896 3845 -14436
567 -14436 6405 17257 -8692 -11050 10741 1518 -14847 3262 13174 -9358 -8878 16659 6032
580 6032 -16497 4752 19734 -9496 -16404 11824 7525 -19923 -8211 15639 -898 -16019 7189
$$ packed form
492d1315N3352K2574m4219o691L1524k1077l3655L8189M0198l5737k4094L6874
504A5923m702m3046L1113M6401m2779l5740L9538N120m4539K1299M9812l3103
516E297l9217L8124J6115m0733J1375M3560k6821m1005K9206K6567l2777q627
528a8936M0120n572m3772J4704L8739j8291k1816K6186N666l5995K450L5124j3095
541E512k6894K4332J0883l5731M313M1848r734l1498K0030J9044l0493r570L5553
554A7595Jl4387Q128K1881k0408j2128K7662O429k6328K338K4113j1051j8281
567a4436K0841J0852k5949k358K1791r223j6365J8109R912k2532M80K5537j0627
580F032k2529K1249J4982k9230o908K8228m299k7448J1712K3850j6537j5121K3208
$$ plain form
593 7189 14054 -9804 -4406 19078 5851 -13009 4024 12173 -13062 -14551 14099 6643 -19956
606 -19956 -3834 14668 -7907 -12518 16515 13590 -13996 -4806 15270 -3865 -15186 12545 14683
619 14683 -17693 -13095 14529 3212 -13801 8000 19400 -8598 -16747 10149 9471 -12029 558
632 558 13146 -12939 -20364 9329 11342 -10940 1516 19626 -6354 -20281 13657 21961 -9797
645 -9797 -6899 14310 -6432 -24374 4021 18793 -7049 -13153 8290 821 -17483 4787 25506
658 25506 626 -15668 3927 6215 -13448 -3365 20738 3044 -21637 -2869 10441 -7693
670 -7693 -1296 22152 3819 -22050 -2804 12919 -7292 -7280 17839 3012 -26934 -7651 17494
683 17494 1468 -5195 14000 7356 -16788 -6644 17532 8009 -7106 3635 2561 -20343 -13347
$$ packed form
593G189O865k3858N398K3484j3227j8860J7033Q149k5235j489K8650p456k6599
606a9956J6122J8502k2575m611K9033k925k7586R190K0076j9135j1321K7731K138
619A4683l2376M598K7624j1317j7013K1801J1400k7998q149K6896o78k1500J2587
632E58J2588k6085p425K9693K013k2282J2456J8110k5980j3927L3938Q304l1758
645i797K898K1209k0742j7942K8395J4772k5842o104K1443p469j8304K2270K0719
658B5506k4880j6294J9595K288j9663J0083K4103j7694k4681J8768J3310j8134
670g693O397K3448j8333k5869J9246J5723k0211J2K5119j4827k9946J9283K5145
683A7494j6026o663J9195o644k4144J0144K4176r523j5115J0741j074k2904O996
$$ plain form
696 -13347 15968 10367 -11821 -2574 8814 -10474 -11795 20277 19870 -11965 -7803 8930 -8944
709 -8944 -13054 16948 15506 -16310 -11712 10268 -2453 -10504 16190 18163 -14960 -16143 7826
722 7826 3426 -8071 6278 12008 -12046 -19308 5711 12951 -3308 3517 15768 -6102 -20039
735 -20039 7179 20052 -4623 -9571 8617 -5858 -25220 2695 23027 -3033 -11124 8678
747 8678 -1652 -16921 8937 25576 -1356 -14086 4650 152 -16650 2637 21667 -493
759 -493 -18424 -2550 6556 -4978 119 17603 5497 -18795 -7992 10235 -1651 -6233 12443
772 12443 5177 -21163 -9816 17535 7075 -7091 10703 9155 -18548 -9738 17887 6728 -10137
785 -10137 2156 975 -19176 -9355 17212 9417 -9426 593 6443 -9851 -6560 17215 15236
$$ packed form
696a3347K9315n601k2188R247J1388j9288j321L2072m07l1835M162J6733j7874
709h944m110L0002j442l1816M598K1980j2721q051K6694J973l3123j183K3969
722G826m400j1497J4349N730k4054p262K5019P240j6259O825J2251k1870j3937
735b0039K7218J2873k4675m948J8188j4475j9362K7915K0332k6060q091J9802
747H678j0330j5269K5858J6639k6932j2730J8736m498j6802J9287J9030k2160
759d93j7931J5874R106j1534N097J7484j2106k4292J0803J8227j1886m582J8676
772A2443p266k6340J1347K7351j0460j4166J7794j548k7703Q810K7625j1159j6865
785a0137J2293j181k0151R821K6567p795j8843J0019N850j6294L291K3775j979
$$ plain form
798 15236 -8428 -10270 2424 -3419 -9803 8627 14711 -8996 -14467 4764 3228 -6579 9438
811 9438 16250 -9483 -17514 5385 6273 -8653 4492 13495 -9897 -15770 7485 10202 -2839 4785
825 4785 11257 -7195 -15202 5103 11463 -4848 -5339 4799 -4914 -15307 213 15454 4148
838 4148 -6771 2778 3904 -7828 828 15357 2890 -10525 -1008 848 -10358 -1507 14155
851 14155 1222 -13327 269 6971 -6018 -1001 14343 2643 -12803 -3087 5656 -3494 -3390
864 -3390 8716 3499 -10747 -3817 9005 2621 -2625 5906 5158 -8032 -7660 4911 3115 -6219
878 -6219 -1098 2587 -7532 -5771 7762 5266 -3645 3035 7437 -4478 -5728 8626 6569 -8498
892 -8498 -4004 5588 -4313 -8894 4260 6595 -4955 -3628 5523 550 -5207 4401 6536 -5034
$$ packed form
798A5236k3664j842J2694n843o384J8430O084k3707n471J9231j536r807J6017
811I438O812k5733q031K2899Q88j4926J3145R003k3392n873K3255K717j3041P624
825D785O472j8452q007K0305O360j6311m91J0138r713j0393J5520J5241j1306
838D148j0919R549J126j1732Q656J4529j2467j3415R517J856j1206Q851J5662
851A4155j2933j4549J3596O702j2989N017J5344j1700j5446R716Q743r150J04
864c390J2106n217j4246O930J2822o384n246Q531p48j3190L72J2571j796r334
878f219N121L685j0119J761J3533k496q911O680M402j1915j250J4354k057j5067
892h498M494R592r901m581J3154K335j1550J327R151m973n757R608K135j1570
$$ plain form
906 -5034 -4725 4733 -379 -6423 1900 6007 -2774 -4084 5199 3545 -4223 1257 6069 -2938 -5817
921 -5817 2769 1413 -7346 -3026 5683 -330 -7242 2811 8150 -2661 -2901 8303 4254 -5533 130
936 130 5065 -4029 -5623 4106 1024 -8130 -497 5626 -3960 -3556 7578 3518 -5586 -346 5287
951 5287 -1341 -3980 3379 2424 -5094 -2757 3422 813 -1903 2826 4597 -2016 -4515 3309 3935 -5031
967 -5031 -2859 4056 -3514 -8220 2899 5549 -3511 -520 6704 -1289 -4824 7497 7074 -5446 -1118
982 -1118 5041 -5366 -7616 4593 3826 -5548 -3027 2095 -1503 -2283 4652 5598 -1058 -2660 577
997 577 38 -2234 793 5348 -841 -8334 -86 6136 -2657 -1327 9401 858 -10619 597 7462
1012 7462 -4238 -3578 6975 -2647 -12482 2365 8492 -3928 -147 8968 -1525 -7973 4078 8385
$$ packed form
906e034L09R458n112o044Q323M107q781j310R283j654p768N480M812r007k879
921e817Q586j356q759M320Q709o013o912J0053N339j0811k40J1204m049r787N663
936A30M935r094j594R729l082r154P633O123r586M04J1134m060r104N240N633
951E287o628k639P359r55p518K337O179k609k716M729J771o613k499P824O26q966
967e031K172O915p570m706J1119K650r060K991P224p993l535J2321m23j2520M328
982a118O159j0407k250J2209p67r374K521N122l598p80O935R46o656j602L237
997E77n39k272L027M555o189p493Q248O222q793J330J0728q543j1477J1216O865
1012G462j1700O60J0553r622r835J4847O127j2420L781R115j0493o448J2051M307
$$ plain form
1026 8385 -426 -2325 1354 -2991 -7698 -1317 5752 1749 -4721 -1837 2584 -3074 -3062 10400 8860
1041 8860 -8649 -5391 7058 -3050 -7442 9393 7264 -11455 -5268 6989 -2293 -3883 11403
1054 11403 4867 -11942 -3350 6653 -3045 -3227 7084 1940 -9207 -5741 3928 4958 835 1880
1068 1880 4421 -1882 -7061 2195 9626 -545 -6405 2816 -1872 -13401 962 13478 -2954 -8219
1082 -8219 6610 704 -9731 5969 13696 -3691 -6553 4688 -2648 -8675 6170 9025 -5713
1095 -5713 -6199 2208 -311 -2443 3579 6557 957 -7117 -5050 3769 2242 -3360 2776 4161 -8496
1110 -8496 -7043 8871 5301 -4955 5642 6831 -11046 -5248 11809 1054 -8510 4302 1468
1123 1468 -12810 -2971 9949 408 -4238 4626 1325 -6589 1287 8417 2574 -2244 -1913 -960 -1261
$$ packed form
1026H385q811j899L679m345m707O381P069m003o470K884M421n658J2J3462j540
1041H860j7509L258J2449j0108m392J6835k129j8719O187J2257r282j590J5286
1054A1403o536j6809Q592J0003r698j82J0311n144j1147L466R669J030m123J045
1068A880K541o303n179R256P431j0171n860R221m688j1529J4363J2516j6432n265
1082h219J4829n906j0435J5700P727j7387k862J1241p336o027J4845K855j4738
1095e713m86Q407k519k132O022K978n600q074K067Q819j527n602O136J385j2657
1110h496J453J5914l570j0256J0597J189j7877N798J7057j0755r564J2812k834
1123A468j4278R839J2920r541m646Q864l301p914P876P130n843m818L31R53l01
$$ plain form
1138 -1261 -2914 1038 6475 -1519 -8312 1196 5077 -3494 935 8990 -3158 -9833 4316 3937 -7577
1153 -7577 2290 9250 -7721 -8077 8893 3943 -5432 4894 6607 -6652 -4806 4953 1134 -3343
1167 -3343 741 -277 -4911 -3150 661 3587 2692 -2077 -385 4105 -1802 -2531 7766 3691 -8430
1182 -8430 -1659 4662 -5600 -3754 8688 595 -9460 2591 5768 -6509 -222 10439 -1882
1195 -1882 -8382 3071 2803 -4839 436 4707 -1693 -3220 1348 1562 1237 1812 741 154 -1076 -3161
1211 -3161 741 3273 -3882 -3980 3563 -1768 -6348 4821 6530 -4404 -630 6593 -2034 -4279 6590
1226 6590 3160 -7095 70 3817 -6078 -3490 5952 347 -4489 1481 1779 -1878 659 2403 170
1241 170 -483 -868 -1321 175 373 -901 1517 1391 -3242 214 5031 -1488 -2610 4898 383 -6529
$$ packed form
1138a261j653L952N437p994o793R508L881q571M429Q055j2148o675J4149l79j1514
1153g577R867O960j6971l56J6970m950r375J0326J713j3259J846R759l819m477
1167c343M084j018m634J761L811K926q95m769J692M490n907p29J0297m075j2121
1182h430O771O321j0262J846J2442q093j0055J2051L177j2277O287J0661j2321
1195a882o500J1453k68p642N275M271o400j527M568K14l25N75j071n87j230k085
1211c161L902K532p155r8P543n331m580J1169J709j0934L774P223q627k245J0869
1226F590l430j0255P165L747r895K588R442n605m836N970K98l657K537J744k233
1241A70o53l85m53J496J98j274K418j26m633L456M817o519j122P508m515o912
$$ plain form
1257 -6529 751 3226 -4777 -2304 4360 -1925 -4659 4348 3427 -3897 2096 6080 -2178 -2664 3640
1272 3640 572 -3167 -109 442 -1921 -1455 -422 133 710 32 161 1773 -118 -1684 2100 1962 -3274
1289 -3274 -518 3433 -2965 -3670 4367 1879 -3928 2089 3792 -3767 -1477 5035 -315 -4758 1988
1304 1988 1865 -5875 -1886 4351 -44 -2824 1747 2189 -622 215 2612 2363 -360 -1349 -154 -538
1320 -538 -2405 -40 1686 -1881 -3619 1686 1798 -2894 1463 5570 -1884 -4208 3688 2211 -3945
1335 -3945 808 4087 -3471 -4392 3379 2310 -2994 1063 4264 -2167 -3776 1943 2536 -1371 -1650 471
1351 471 -897 -3467 -285 3487 850 -1573 1691 1549 -2336 765 5556 157 -4450 601 1707
1366 1707 -5052 -1867 5371 -433 -5829 560 3342 -2126 -45 5497 1021 -4540 295 3227 -1571
$$ packed form
1257f529P280K475q003K473O664o285k734R007r21p324N993L984q258m86O304
1272C640l068l739L058N51k363M66J033N55N77o78J29J612j891j566L784j38n236
1289c274K756L951o398p05Q037k488n807O017J703p559K290O512n350m443O746
1304A988j23p740L989O237m395k780M571M42k811Q37K397k49k723r89J195l84
1320e38j867K365J726l567j738N305J12m692M357M107p454k324P896j477o156
1335c945M753L279p558r21P771j069n304M057L201o431j609N719N93l907k79K121
1351D71j368k570L182L772k637k423L264j42l885L101M791n399m607N051J106
1366A707o759L185P238n804n396O389K782n468K081N542m476n561M835K932m798
$$ plain form
1381 -1571 -1561 3240 511 -4773 -1521 3314 1287 -1455 1652 2154 -3523 -2605 3361 1379 -3093 542
1397 542 1686 -4073 -2920 5022 3049 -3404 618 4121 -2025 -3136 4830 3595 -3801 -2435 1536
1412 1536 -2097 -3612 2249 2986 -3393 -2799 3107 938 -2018 3059 4424 -2270 -3887 2072 1978 -2645
1428 -2645 84 3592 -2403 -4771 2213 2935 -2148 296 4072 -1550 -5099 1808 4088 -2761 -2811 3142
1444 3142 -17 -4754 665 5202 -119 -2638 2453 2468 -3093 -122 4920 -643 -4798 416 1408 -4118
1460 -4118 -1606 4286 455 -4603 611 4355 -1232 -1314 4711 1461 -4453 -540 3171 -1559 -2726
1475 -2726 2643 1691 -4654 -1456 4537 664 -3435 1591 3535 -3075 -3269 3307 1775 -3849 -661
1490 -661 3265 -1882 -2666 3933 2804 -3215 -20 4132 -964 -3101 2454 2120 -4304 -2741 2582 -579
$$ packed form
1381a571J0M801k729n284L252M835k027k742L107N02n677R18N966j982m472L635
1397E42J144n759J153P942j973o453M022L503o146j111P966j235p396J366L971
1412A536l633j515N861P37o379N94N906k169k956N077J365o694j617N959r4m623
1428b645K729L508n995k368O984P22n083K444L776n622l549O907K280o849n0N953
1444C142l159m737N419M537n321k519N091J5n561K971N042n563m155N214R92n526
1460d118K512N892l831n058N214L744n587q2O025l250n914L913L711m730j167
1475b726N369r52o345L198N993l873m099N026J944o610j94O576j532n624L188
1490f61L926n147p84O599j129o019L195M152n096k137N555l34o424J563N323l161
$$ plain form
1506 -579 -3554 1468 2832 -2276 -1749 3556 2043 -2138 797 3719 -1672 -3818 2037 2357 -3232 -2021
1522 -2021 2548 -72 -3529 1102 3433 -1511 -1726 2660 243 -2970 1324 2511 -2411 -2273 2451
1537 2451 758 -2852 749 3757 -755 -2470 2189 1796 -2386 -754 1840 -1106 -3450 -59 1714
1552 1714 -1901 -1598 2596 1124 -2132 1013 3640 60 -1673 1614 1231 -2668 -904 2075 -1326
1567 -1326 -2412 1246 584 -2624 126 2921 -352 -2068 1745 1978 -2107 -1354 2455 -13 -2747 456
1583 456 1812 -747 -962 1777 1358 -1503 111 2319 -919 -2390 1201 854 -2722 -1318 1869 -330
1599 -330 -2285 1191 2346 -1065 -226 2825 346 -2169 1220 1856 -2491 -1625 1833 -357 -3171 -98
1615 -98 2502 -831 -1709 2018 1447 -1554 -98 1985 -234 -1691 605 848 -1656 -606 2006 155
$$ packed form
1506e79k975N022J364n108N27N305j513m181K935K922n391k146N855L20n589J211
1522b021M569k620l457M631K331m944k15M386k417l213M294J187m922J38M724
1537B451j693l610L601L008m512j715M659l93m182J632K594k946k344L391J773
1552A714l615L03M194j472l256L145K627l580j733L287l83l899J764K979l401
1567a326j086L658o62l208K750K795l273j716L813K33m085P53L809k468k734L203
1583D56J356k559k15K739m19k861J614K208l238j471L591l47l576J404L187k199
1599c30j955L476J155l411Q39L051k479k515L389O36m347Q66L458k190k814L073
1615i8K600l333q78L727n71l001J456K083k219j457K296K43k504J050K612j851
$$ plain form
1631 155 -2017 891 2084 -810 -1147 1894 722 -2642 -686 1620 -1294 -2203 1623 772 -2421 393
1647 393 3474 -20 -1468 2444 1794 -2284 -559 2639 -376 -2715 223 586 -1804 -928 1957 338
1663 338 -1499 428 1768 -536 -626 2205 804 -2357 -841 1845 -243 -1752 1226 1640 -2166 -1336
1679 -1336 2815 710 -1865 1091 1336 -3288 -2045 2804 484 -2891 196 2279 -2034 -1515 3479
1694 3479 2257 -1407 177 1449 -1089 -1394 1842 1178 -2291 -1769 596 -847 -1835 1660 2683 -1512
1710 -1512 -2073 1633 1610 -1502 993 3229 -1946 -3830 1539 1909 -2170 274 3176 -1589 -3854 1843
1726 1843 3463 -1358 -662 2373 -1626 -3895 845 2482 -815 -808 956 -582 -2082 1402 3680 458
1742 458 -1554 1121 343 -2757 -417 3443 189 -4318 -745 1922 -1907 -1167 4353 1531 -3875 -319
$$ packed form
1631A55k172K908J193k894l37L041j172l364J956K306k914r09L826q51l193K814
1647C93L081l494j448L912o50m078J725L198l015k339K938L63k390Q76K885j619
1663C38j837J927J340k304r0K831j401l161J516K686k088j509K978M14l806Q30
1679a336M151k105k575K956K45m624J243M849k320l375L087K083m313N19M994
1694C479j222l664J584J272k538l05L236o64l469N22K365j443r88L495J023m195
1710a512n61L706k3l112K495K236n175j884N369L70m079K444K902m765k265N697
1726A843J620m821O96L035l999k269M740J637l297PJ764j538j500L484K278l222
1742D58k012K675p78l100K340L860l254m507L573K667l829P40N520k822n406L556
$$ plain form
1758 -319 3067 -867 -991 3632 662 -4534 -1466 2775 -218 -1048 2502 825 -3508 -1011 2662 1015
1774 1015 -835 868 409 -3162 -2125 2608 1841 -1842 -137 2122 -1538 -2274 3401 3805 -2138 -1922
1790 -1922 2220 -853 -3334 1930 2667 -2993 -2518 1602 -249 -1573 2416 3157 -2052 -2186 2103 1172
1806 1172 -1382 1070 1973 -2004 -3240 556 1985 -799 -567 2224 -479 -3306 918 3641 -686
1821 -686 -1973 1744 27 -3940 -28 4077 -251 -2858 1492 1110 -2481 1030 3791 -152 -2718
1836 -2718 529 571 -2209 -289 2636 -758 -3448 -264 1779 -202 -73 2339 1283 -2330 -922 2517
1852 2517 574 -1709 1228 652 -3356 -1817 2914 867 -2077 945 1630 -2560 -1578 3605 1503 -2454
1868 -2454 -181 1021 -2312 -1137 2567 1260 -1779 -439 1403 -560 -474 2405 1770 -2029 -1749 587
$$ packed form
1758c19L386l934j24M623k970n196L068M241k993q30L550j677m333K497L673j647
1774A015j850J703m59l571J037M733p67l683J705K259l660p36N675M04n943K16
1790a922M142l073k481N264P37n660M75M120j851j324L989P41n209j34M289r31
1806A172k554K452R03l977j236L796J429k784K32K791k703k827M224K723m327
1821f86j287L717j717l967L912M105m328k607M350l82l591L511K761l943k566
1836b718L247M2k780J920K925l394k690L184K043j981J29K412j056l613J408L439
1852B517j943k283K937n76m008J539M731k047k944L022O85m190R82N183k102l957
1868b454K273J202l333J175L704j307l039J340J842j963Q6K879o35l799K80K336
$$ plain form
1884 587 -16 -1678 586 1625 -1575 -2442 1303 1505 -814 1169 2547 -1152 -2149 1822 1656 -1671
1900 -1671 -528 1657 -1444 -2997 1117 1801 -972 -368 1429 -544 -1248 1025 1583 -744 -979 552
1916 552 -452 -1606 542 1822 -336 -1395 822 1191 -1050 -165 2155 -83 -2591 -8 892 -1689
1932 -1689 -1077 1548 -84 -2047 601 2195 -438 -702 2125 797 -1682 212 1287 -716 -1097 317
1948 317 -127 -1503 -278 1102 -479 -971 922 1072 -945 -145 1639 173 -1826 -198 1589 -710
1964 -710 -1486 1367 661 -1575 46 1819 -299 -985 1029 428 -1657 -572 1258 -664 -1587 483
1980 483 469 -1141 201 1811 308 -746 706 957 -783 -332 1547 -161 -2237 -330 872 -826
1996 -826 -1187 1236 1005 -1476 -317 1793 701 -892 844 593 -1584 -536 1337 159 -1134 444
$$ packed form
1884E87o03j662K264J039l200q67L745K02k319J983J378l699r97L971j66l327
1900a671J143K185l101j553M114O84k773O04J797j973p04K273N58k327k35J531
1916E52j004j154K148J280k158j059K217L69k241Q85K320k238k508K583R00k581
1932a689O12K625j632j963K648J594k633k64K827j328k479J894J075k003l81J414
1948C17m44j376J225J380j581m92J893J50k017Q00J784j466j999J628J787k299
1964g10p76K853p06k236J621J773k118o86K014o01k085J085J830j922r23K070
1980D83j4j610J342J610j503j054J452K51j740M51J879j708k076J907J202j698
1996h26l61K423k31k481J159K110j092j593J736k51k177J048J873j178j293J578
$$ plain form
2012 444 754 -1272 -534 1984 729 -1296 61 762 -1353 -992 1350 411 -1797 -522 1075 -418
2028 -418 -532 1909 1645 -1340 -524 1408 186 -1013 754 824 -1810 -2024 678 384 -890 464 1130
2045 1130 -1210 -936 1560 1199 -574 132 1254 -1393 -2024 1182 1745 -1358 -710 1075 -383 -1410
2061 -1410 1219 2136 -933 -1266 757 -326 -1886 630 1851 -1009 -1624 628 965 -586 792 2512
2077 2512 -142 -1802 385 921 -581 -135 1062 -852 -2688 -278 1776 -482 -768 1727 294 -2448
2093 -2448 182 2690 445 -1033 914 -3 -2377 -515 2252 243 -1380 570 467 -1769 -3
2108 -3 2339 701 -1580 -633 470 -1192 -876 1738 993 -1903 -961 1111 171 -277 1991 1446 -1588
2125 -1588 -1346 1487 199 -1459 1016 1256 -2458 -2278 1450 1104 -901 774 1599 -1272 -1532 1768
$$ packed form
2012D44L10k026P38K518j255k025J357P01k115L61K342r39k208J275J597j493
2028d18j14K441k64k985Q16J932j222j199J767P0k634k14K702k94j274J354O66
2045A130k340K74K496l61j773P06J122k647o31L206N63l103O48J785j458j027
2061a410K629R17l069l33K023j083j560K516J221k860o15K252L37j551J378J720
2077B512k654j660K187N36j502M46J197j914j836K410K054k258k86K495j433k742
2093b448K630K508k245j478J947r17k374J862K767k009j623J950j03k236J766
2108cK342j638k281R47J103j662L16K614p45k896R42K072r40m48K268n45l034
2125a588K42K833j288j658K475K40l714J80L728l46k005J675Q25k871k60L300
$$ plain form
2141 1768 1632 -601 -56 646 -1444 -1835 746 1634 -387 -1064 457 -47 -1355 655 2351 -278 -1574
2158 -1574 77 166 -1600 240 2453 -646 -2221 932 1100 -1192 583 2630 -325 -2383 -38 1042
2174 1042 -831 -503 1131 -234 -2254 -403 1497 112 38 1181 640 -1342 -578 1899 808 -1151
2190 -1151 -87 486 -1709 -1286 1812 970 -1351 -134 1034 -973 -886 2241 960 -1799 -432 999
2206 999 -962 -1029 1535 1138 -1539 -780 1116 438 -436 1091 1113 -1067 -1316 200 388 -771 -92 813
2224 813 -849 -1581 736 1681 -552 131 1488 -395 -1308 880 1524 -1008 -717 961 -719 -1774 759
2241 759 1438 -746 -704 782 100 -693 400 1309 -24 -1024 -126 94 -606 88 796 257 -615 -101 886
2260 886 -176 -294 975 173 -1590 -226 887 -873 -1057 865 276 -1363 -57 1375 58 -401
$$ packed form
2141A768j36k233N45P02k090l91K581Q88k021o77J521n04j308K010J696k629j296
2158a574J651Q9j766J840K213l099j575L153J68k292J775K047k955k058K345J080
2174A042j873L28J634j365k020J851J900j385p4J143n41j982P64K477j091j959
2190a151J064N73k195M23L098q42k321J217J168k007Q7L127j281k759J367J431
2206I99j961o7K564l97k677P59J896o78q74J527K2k180k49J516J88j159O79R05
2224H13j662p32K317R45k233O83J357j883r13K188O44k532K91J678j680j055K533
2241G59O79k184M2J486o82p93J093R09j333j000Q98K20p00O94P08n39q72N14R87
2260H86j062j18J269q02j763J364J113j760j84J922n89j639J306J432j317m59
$$ plain form
2276 -401 1202 549 -1026 -104 825 -270 -774 -22 -135 -565 -377 403 417 -239 -35 464 28 -356 411
2295 411 392 -802 -454 742 -262 -1015 689 852 -990 -272 1467 287 -986 358 639 -776 -621
2312 -621 585 -194 -828 106 191 -498 158 540 300 -66 95 587 146 -258 -13 -17 -839 -600 484 55
2332 55 -512 239 680 -397 -114 1127 582 -692 194 820 -679 -844 812 333 -849 -61 514 -297
2350 -297 -35 810 247 -554 -113 9 -532 59 432 -40 -708 -642 390 599 135 502 741 -325 -233 485
2370 485 559 -488 -74 343 -890 -1271 612 610 -487 268 574 -483 -482 1056 769 -335 -229 25 -514
2389 -514 -524 601 409 -380 -112 283 -104 -80 496 817 -209 -906 76 447 -399 27 702 -474 -1139 1
2409 1 768 -68 353 1015 -57 -1180 515 962 -386 -297 335 -875 -1503 -17 924 203 -268 413 -228
$$ packed form
2276d01J603o53j575R22R29j095n04P52j13m30J88P80J4o56K04M99m36l84P67
2295D11j9j194L48J196j004p53J704J63j842P18J739j180j273J344K81j415J55
2312f21J206p79o34R34Q5o89O56L82k40l66J61M92m41m04K45mq22K39J084m29
2332E5n67P51M41j077K83J241n45j274Q86O26j499j65J656m79j182P88N75q11
2350b97K62Q45n63q01M41J22n41N91L73m72o68O6J032K09m64L67K39j066R2P18
2370D85P4j047M14M17j233l81J883kj097P55L06j057JJ538k87j104J06K54n39
2389e14j0J125j92p89K68L95l87K4N76L21j026o97R82L71q46M26O75j176o65J140
2409AP67q36M21O62j072j123J695M47j348Q9O32j210o28J486R41p21m71O81o41
$$ plain form
2428 -228 -650 337 1273 322 -649 -227 -202 -751 -113 1235 330 -910 -318 147 -386 191 1213 386 -1222
2447 -1222 -741 321 -385 -183 966 302 -1304 -495 746 447 346 976 229 -1058 -799 483 148 -184
2465 -184 132 -335 -1101 -859 639 844 -27 228 303 -687 -751 1074 1417 -494 -535 -46 -578 -805 749 958
2485 958 -456 -762 147 -140 -420 641 1317 -293 -1021 -411 -68 -167 263 759 -251 -886 -99 660 142
2504 142 538 1042 -242 -1122 50 689 -84 -662 314 -372 -1283 -143 1144 572 -161 393 135 -792 -25
2523 -25 1088 420 -672 -185 -8 -705 -113 882 319 -642 -226 105 -192 8 800 435 -843 -573 220
2542 220 -107 -267 570 456 -877 -457 805 408 -218 443 585 -687 -895 275 419 -219 -86 -27 -753
2561 -753 -497 460 844 -65 134 454 -100 -420 317 613 -246 -661 156 -263 -738 279 839 -260 -546
$$ packed form
2428b28m22R87R36r51r71M22K5n49O38J348r05j240N92M65n33N77J022q27j608
2447a222M81J062p06K02J149o64j606Q09J241k99j01O30p47j287K59J282l35l32
2465a84L16m67p66K42J498K05q71K55P5r90o4J825L43j911m1M89n32k27J554K09
2485I58j414l06R09k87k80J061O76j610p28O10L43r9M30M96j010o35P87P59n18
2504A42L96N04j284q80J172O39p73n78R76o86r11J140J287n72p33N54k58r27P67
2523b5J113o68j092M87J77o97N92R95n63r61M16L31k97K00P92l65j278K70P93
2542B20l27j60Q37j14j333M20J262l97o26O61J42j272k08J170J44o38J33N9p26
2561g53K56R57L84r09J99L20n54l20P37K96q59m15Q17m19m75J017N60j099k86
$$ plain form
2580 -546 261 312 -387 53 839 -210 -970 -63 448 -350 -18 418 226 -502 73 649 239 -42 208 -61
2600 -61 -536 -259 337 -276 -426 218 43 -489 113 874 577 -269 226 546 -246 -100 262 64 -616 -361
2620 -361 101 -115 -377 187 361 -180 60 220 62 -159 -6 44 -327 -310 100 11 -183 -10 324 -1 -23
2641 -23 470 138 -527 -24 232 -138 -429 -58 197 -365 -150 253 71 23 193 300 352 132 337 211 -261
2662 -261 -147 -60 -343 -33 82 -80 -240 -93 52 171 136 183 265 -119 -140 -48 -91 28 225 130 -212 -198 193
2685 193 61 139 132 159 -248 -213 -77 9 -170 -23 -128 -447 -305 166 355 111 343 68 -78 -27 233 354
2707 354 25 -190 -209 -557 -211 46 172 -23 140 -41 -259 66 430 409 -36 -244 16 11 -147 221 268 -172
2729 -172 -331 18 302 331 248 335 -327 -412 -235 57 -7 -62 2 -174 -363 37 336 257 375 166 49 -179 223
$$ packed form
2580e46Q07N1o99M40P86j049p60R07N11p98L32M36j92p28N75N76m10k81K50k69
2600f1m75K77N96o13j50O44j75n32O02P61k97q46M95L20p92J46L62j98o80K55
2620c61M62k16k62N64J74n41K40J60j58k21J53N0l71J7M10q9j94J73L34l25k2
2641b3M93l32o65N03K56l70k91L71K55n62K15M03j82m8J70J07N2k20K05j26m72
2662b61J14Q7k83L10J15j62j60J47J45J19l5M7Q2l84k1R2m3J19J97r5l42J4L91
2685A93j32P8pK7m07L5J36Q6j79J47j05l19J42M71J89k44K32k75j46N1K60J21
2707C54l29k15j9l48L46K57J26j95J63j81k18L25L64k1m45k08K60nj58L68M7m40
2729a72j59L49K84K9q3Q7o62q5J77K92o4n5O4j76j89M00K99p9J18k09j17k28M02
$$ plain form
2752 223 122 29 98 -106 -349 -628 -71 340 98 -204 -3 180 -137 -21 344 132 8 -290 -38 -172 69
2773 69 284 -35 -235 -46 141 -131 162 376 -158 -525 -178 110 -61 -174 101 -7 -160 142 105 213 288
2794 288 376 231 -263 -175 250 70 -331 -334 -119 -456 -155 179 105 102 24 245 -172 9 545 346 -313 -242 116
2817 116 -18 -158 165 227 -355 -165 -114 240 -103 194 345 -261 -470 121 16 -6 160 143 -52 -195 118
2838 118 444 44 245 223 -22 -188 15 157 -113 -321 33 -308 -415 -16 343 18 132 80 194 86 181
2859 181 398 262 -238 -153 -192 -3 112 280 145 -197 -121 -17 10 83 251 32 -542 -428 80 122 -32 251
2881 251 139 -306 -48 102 366 90 98 -18 -356 -259 -46 -183 -140 10 -72 -211 -183 48 466 320 87 -35
2903 -35 105 -41 160 485 -155 -290 -114 -254 -231 -33 394 66 -15 198 104 82 113 176 23 -188 -132 55 -218
$$ packed form
2752B23j01r3O9k04k43k79N57M11k42l02K01J83l17J16L65k12j24k98K52j34K41
2773F9K15l19k00J89J87k72K93K14n34l67L47K88j71j13K75j08j53L02l7J08P5
2794B88Q8j45m94Q8M25j80m01lK15l37L01L34p4lp8K21m17J81N36j99o59P1L58
2817A16j34j40L23O2n82J90N1L54l43K97J51o06k09N91j05k2J66j7j95j43L13
2838A18L26m00K01k2k45j66K03J42k70k08L54l41j07L99L59l25J14n2J14j08R5
2859A81K17j36n00Q5l9J89J15J68j35l42P6J04K7P3J68k19n74J14N08M2j54K83
2881B51j12m45K58J50K64k76Qj16l38R7K13j37M3J50q2j39K8K31M18j46k33j22
2903c5J40j46K01L25o40j35J76j40K3J98M27l28q1K13r4k2L1O3j53k11N6J87k73
$$ plain form
2926 -218 112 187 91 -177 90 181 209 -51 -95 5 -352 -354 -8 174 -153 -27 33 79 -215 172 303 10 0
2949 0 137 -24 -234 115 95 -90 -40 -237 -51 20 40 87 -52 -33 6 -170 -139 -15 77 -187 -200 -159 -182 3 -126
2974 -126 245 159 107 -94 84 88 -221 -146 -37 -129 -58 -157 6 81 130 -93 -98 126 225 338 155 -148 73 -63
2998 -63 -270 -34 -138 -50 -102 -59 43 -97 62 209 164 -43 183 84 -192 -87 63 122 17 17 74 81 15 21 97
3023 97 227 -56 -176 -137 -163 -2 -165 -52 -173 -202 52 -77 114 258 82 -150 65 248 9 91 128 -5
3045 -5 -104 -158 -133 23 124 72 -42 -126 37 127 260 188 51 99 -37 -48 -51 323 158 -276 -255 -43 167 -6 233
3070 233 -45 -141 -152 -270 -219 50 215 -151 -366 -184 51 149 72 202 223 -129 140 180 165 55 -26 -115 -320
3093 -320 -166 84 205 -55 48 20 -117 -32 326 297 40 -80 -192 -28 -94 78 186 63 -266 -177 -16 -61
$$ packed form
2926b18L30P5r6k68K67R1K8k60m4J00l57kL46J82l27J26O0M6k94L87J31k93j0
2949@J37j61k10L49k0j85N0j97J86P1K0M7j39J9L9j76L1J24R2k64j3M1k3J85j29
2974a26L71q6n2k01J78Ml09P5J09r2P1r9J63P5M9k23nK24R9J13j83l03K21j36
2998f3k07K36j04Q8n2M3J02j40J59J47m5k07K26r9k76J05J50N9j05%N7Po6OP6
3023I7J30k83j20L9k6J61j63J13j21k9K54j29J91J44j76k32K15J83k39Q2L7j33
3045er9n4K5J56J01n2j14q4J63R0J33p2j37M8j36j1lL74j65m34K1K12K10j73K39
3070B33k78r6j1j18N1K69J65l66k15J82K35R8p7J30K1l52K69M0j5j10q1q9k05
3093c20J54K50J21k60J03k8j37Q5L58k9k57j20j12J64o6J72J08j23l29Q9J61m5
$$ plain form
3115 -61 255 266 -105 -232 -181 -57 26 -52 128 -48 -124 -109 194 139 0 243 42 -184 -125 136 52 48 -162 -182
3139 -182 -445 -145 53 262 20 92 96 -113 79 234 199 -142 -141 -69 -16 -188 293 245 -69 -144 27 37 -49 48
3163 48 179 -167 -384 -97 -22 -17 77 220 -41 -258 -39 219 75 95 99 -123 -108 -145 26 -145 -90 28 -121 -233
3187 -233 60 257 384 -133 171 -42 -120 196 246 118 -206 -38 31 -59 10 288 42 -146 -71 40 51 75 3
3210 3 156 -307 -318 70 -33 104 217 27 -109 -384 204 206 172 -58 72 -109 -279 77 144 -34 -193 -150 -221
3233 -221 -178 258 322 62 -36 112 116 -105 60 133 35 -183 -224 -17 64 88 58 137 -170 -53 23 -70 242 133 -3
3258 -3 -73 -154 77 73 -87 -48 23 -109 37 207 -4 107 1 -10 -215 -236 239 -144 -195 -101 -76 -112 -92 136 409
3283 409 121 -64 4 6 187 135 4 -37 -69 -131 -166 -140 -11 -74 -103 83 1 22 -18 -58 118 -14 -58 -70 180 76
$$ packed form
3115f1L16J1l71j27N1J24Q3p8J80j76p6J5L03n5j39K43k01k26N9K61q4mk10k0
3139a82k63L00J98K09k42P2Mk09J92J55l5l41JP2N3j72M81m8l14p5J71J0q6R7
3163D8J31l46k17K87P5NR4J43k61k17K19K58j44K0Mk22J5l7J71j71N5J18j49j12
3187b33K93J97J27n17L04k13p8L16N0j28l24J68O9r0O9K78k46j88P5J11J1K4p2
3210CJ53m63j1L88j03J37J13j90j36k75N88Kl4k30J30j81j70L56O7j78j59M3p1
3233b21M3M36O4k60r8J48Mk21J65P3r8k18m1K07Q1K4l0P9l07J17P6r3L12j09j36
3258cp0q1K31mj60L9P1j32J46J70k11J11j06j1k05k1M75l83n1R4K5l6K0K28K73
3283D09k88j85O8KJ81n2j31m1l2o2l5K6J29o3k9J86q2K1m0m0J76j32m4j2K50j04
$$ plain form
3309 76 85 -61 -33 18 92 263 91 31 63 -8 -207 -113 146 30 -38 1 -12 -69 147 19 10 243 210 -67 49 -108
3335 -108 -34 22 -142 18 -74 -218 140 -32 -46 148 298 70 129 -10 112 120 -41 -84 -20 -88 73 97 55 33
3359 33 150 -119 -64 94 -81 -116 37 -13 -215 -175 -12 201 157 -87 17 134 46 121 66 248 53 -50 -28
3382 -28 -45 -175 32 -17 -232 -41 -18 -149 120 216 70 -75 71 140 41 24 186 -41 -227 -26 -25 133 68 435
3406 435 94 -382 -194 24 205 -29 44 63 -124 -113 117 161 128 110 29 -130 -145 90 181 -8 -270 93 -184
3429 -184 -211 4 242 -107 -71 -6 0 -101 -36 316 -232 -106 29 26 139 207 55 -132 -204 -62 242 -59 -13 177
3453 177 -139 -127 -28 317 38 -142 178 -47 -190 55 255 -37 -21 42 161 -234 -50 351 30 -209 38
3474 38 -38 -311 -87 219 117 -96 -189 152 68 177 203 333 -52 -212 83 -16 -94 191 138 -210 -178 -51 -37
$$ packed form
3309G6Rj46K8N1P4J71j72o0L2p1j99R4K59j16o8L9j3n7K16j28rK33l3k77J16j57
3335a08P4N6j64J60r2j44L58j72j4J94J50k28N9j39J22Qj61m3O4o8J61K4m2k2
3359C3J17k69N5J58j75l5J53n0k02M0J63K13m4k44J04J17q8P5n5J82j95j03K2
3382b8j7j30K07m9k15J91K3j31K69R6j46j45J46O9r9j7J62k27j86K01JJ58o5L67
3406D35l41m76J88K18J81k34P3J9j87J1K30M4l3j8q1j59j5K35R1j89k62L63k77
3429a84k7K15K38l49L6O5Oj01O5L52n48J26J35lJ13O8j52j87p2J42L04l01M6J90
3453A77l16J2R9L45k79j80L20k25j43K45K00k92J6O3J19l95J84M01l21k39K47
3474C8p6k73K24L06j02k13r3L41q4J09K6J30l85j60K95r9p8K85n3l48L2J27J4
$$ plain form
3497 -37 -65 274 138 -400 -287 126 207 -246 67 189 -83 -308 70 291 -39 -17 149 -92 -41 -89 151 -146
3519 -146 -276 -229 -47 -332 -25 352 136 -290 -9 186 -96 -71 361 83 -254 37 180 -187 -63 234 15
3540 15 -340 -120 258 -69 -162 165 71 -382 -284 193 1 -2 139 31 -99 60 302 -15 -186 64 122 21
3562 21 -88 320 -59 -203 -135 18 -76 -124 208 13 -41 -21 211 178 -104 275 168 -253 -200 75 214 -158 -25
3585 -25 179 64 -54 220 145 -33 49 222 42 -170 92 128 -303 137 137 -70 -142 209 214 -23 -110 161 94 -354
3609 -354 3 126 14 -84 -19 -48 39 -171 110 115 -3 183 67 31 -57 214 -213 -41 4 -145 -30 -157 126
3632 126 94 7 126 45 40 -129 164 161 -226 154 191 -198 -214 -42 -1 -171 -75 99 70 -15 -80 185 -143 -132 23
3657 23 18 -200 -33 -144 -82 -167 105 89 -4 147 334 -33 23 -26 -15 -255 -58 11 -299 -289 -3 95 -4 14 -125
$$ packed form
3497c7k8L39j36n38J13M13Q1m53L13J22k72k25L78K21l30K2J66k41N1m8K40k97
3519a46j30M7J82k85L07L77k16m26K81J95k82K5M32k78l37K91J43l67J24K97k19
3540A5l55K20L78l27r3L27r4m53R8M77j92lJ41j08j30J59K42l17j71K50N8j01
3562B1j09M08l79j44O8J53r4m8L32j95n4K0K32l3k82L79j07m21N3K75J39l72J33
3585b5K04j15j18K74p5j78Q2J73j80k12K62L6m31M40%k07p2L51Nk37q7K71o7m48
3609c54L57J23j12r8O5k9Q7k10K81Nj18J86j16l6q8K71m27J72M5j49J15j27K83
3632A26l2q7J19q1nj69K93ll87L80L7l89j6J72M1j70R6J74k9q5o5K65l28J1J55
3657B3nk18J67j11O2q5K72j6r3J51J87l67N6m9J1k40J97O9l10J0K86R8r9J8j39
$$ plain form
3682 -125 97 -44 141 169 72 -158 -47 -114 -248 -77 92 179 -110 90 37 -62 -64 154 -56 -100 -66 -1 -77 109
3706 109 30 -134 -157 202 244 90 31 315 -130 -68 -26 54 99 -160 29 -93 -255 -46 -17 -42 -76 133 29 -80
3730 -80 111 120 -43 -17 -125 38 -166 -220 159 104 -179 175 124 -73 -73 224 129 -92 6 58 -98 -233 155 17
3754 17 -264 -113 142 28 -19 179 250 47 -108 -1 -25 -193 69 67 -300 -179 152 162 28 177 102 -115 -214
3777 -214 284 173 -151 -128 -45 -104 -156 74 140 -178 -80 229 60 -345 111 74 -178 -157 -65 -76 -78 66 160 -122
3801 -122 -206 227 189 15 35 299 46 -350 -80 -7 -182 -42 10 -55 -218 29 318 38 -149 86 92 -156 -74
3824 -74 244 151 -280 -54 157 -163 -81 274 349 -302 185 141 -195 -37 331 113 -239 -36 92 -98 -92 150
3846 150 170 -203 -108 249 133 -92 23 174 -360 -380 53 181 -199 -186 87 -20 -218 228 189 -70 -33 265
$$ packed form
3682a25K22j41J85K8r7k30J11o7j34J71J69Q7k89K00n3r9kK18k10m4L4O5p6J86
3706A09p9j64k3L59M2j54n9K84m45O2M2Q0M5k59J89j22j62K09K9k5l4K09j04j09
3730h0J91Rj63K6j08J63k04n4L79n5k83L54n1j97%K97r5k21R8N2j56j35L88j38
3754A7k81J51K55j14m7J98P1k03j55J07k4j68K62kl67J21L31J0j34J49p5k17r9
3777b14M98j11l24K3Q3n9n2K30O6l18R8L09j69m05M56l7k52K1R2j1kJ44R4k82
3801a22q4M33l8j74K0K64k53l96K70P3j75J40N2o5j63K47K89k80j87K35Ok48Q2
3824g4L18r3m31K26K11l20Q2L55P5o51M87m4l36J58L68k18l52K03J28j90OK42
3846A50K0l73R5L57j16k25J15J51n34k0M33J28l80J3K73j07j98M46l9k59L7K98
$$ plain form
3868 265 -177 -270 131 217 -166 -162 283 -3 -306 73 24 -206 -101 180 113 -161 124 207 -43 -90 185 -18 -65
3891 -65 94 126 -42 -53 17 343 -3 -109 320 69 -274 81 -33 -6 52 52 -33 -254 98 308 101 -121 237
3914 237 133 -111 -138 6 -169 -244 -249 202 -71 -394 188 104 -139 99 146 65 -261 70 191 -250 -91 112
3936 112 -35 -173 167 51 -207 -169 113 68 -298 -195 224 -53 -282 147 134 -183 -134 362 65 -242 75
3957 75 283 -133 -166 94 -30 -285 -30 -28 -162 -6 162 110 -166 -32 120 -13 -27 118 209 -79 -147 135 -68
3980 -68 -80 -43 172 -306 -39 189 137 -143 211 33 -122 -128 -49 -87 -60 -55 218 8 -203 323 153 -157 -21 303
4004 303 -19 -93 -128 154 -39 -250 55 -58 -164 23 73 104 1 109 -46 163 100 153 191 -22 -43 -22 -79
4027 -79 162 -58 39 -16 -45 327 61 -72 159 -70 -175 -77 13 -167 -204 48 8 -57 140 149 -6 -121 -68 144
$$ packed form
3868B65m42r3M01Q6l83MM45k86l03L79m9k30J05K81o7k74K85Q3k50m7K75k03m7
3891f5J59L2j68j1P0L26l46j06M29k51l43L55j14K7N8%q5k21L52K10k07k22L58
3914B37j04k44k7J44j75p5nM51k73l23N82q4k43K38M7q1l26L31J21m41J59K03
3936A12j47j38L40j16k58L8K82m5l66J03M19k77k29M29j3l17M9M96k97l07L17
3957G5K08m16l3K60j24k55K55Kj34J56J68n2k76J34J52j33j4J45R1k88o8K82k03
3980f8j2L7K15m78K67K28n2k80L54j78j55oP9l8K7NK73k10k11N26j70l10J36L24
4004C03l22p4l5K82j93k11L05j13j06J87N0L1j03J08j55K09o3N3L8k13k1K1n7
4027g9K41k20R7n5k9L72k66j33K31k29j05R8R0j80l7K52m0o5J97Rj55j15N3K12
$$ plain form
4051 144 -76 -9 4 -104 -92 -36 -50 -171 -38 206 -66 -106 -103 189 155 -47 25 -14 -224 -57 91 53 -125 41
4075 41 97 -146 154 -33 -60 -46 73 10 -10 -8 -18 -43 -88 -116 -65 21 188 149 67 -38 42 88 2 8 170 -135 -224
4102 -224 -66 -30 -4 145 81 121 -112 -12 5 113 65 27 222 -196 -65 138 52 -43 -23 95 -209 -134 113 122
4126 122 -39 17 197 -171 -257 51 170 -84 -31 105 -29 -89 160 313 89 7 19 8 21 -47 -79 -83 -215 -16
4150 -16 -12 -20 279 243 78 -64 112 12 -21 32 49 -202 -261 -58 73 -52 -39 98 -160 -83 114 193 -10 -68 -179
4175 -179 -26 -184 7 231 -165 -27 13 128 -2 128 255 93 -141 34 63 -280 8 -13 -48 -237 -10
4196 -10 289 35 -91 234 123 -119 -18 286 -55 -112 68 117 -173 -82 36 268 -198 -9 190 -189 -107 220
4218 220 125 -266 -32 76 -126 -212 125 38 -263 -87 28 -232 -72 73 63 -226 -141 79 65 -49 38 -25 -258
$$ packed form
4051A44k20O7J3j08J2N6j4j21J33K44k72m0LK92l4k02P2l9k10J67J48l8j78J66
4075D1N6k43L00j87k7J4J19o3k0Kj0k5m5k8N1Q6J67l9q2j05Q0M6q6OJ62l05q9
4102b24J58L6K6J49o4M0k33J00J7J08m8l8J95m18J31K03q6r5K0J18l04P5K47R
4126A22j61N6J80l68q6L08J19k54N3J36j34o0K49J53k24q2J2j1J3o8l2mj32J99
4150a6MqK99l6j65j42J76j00l3N3J7k51n9K03J31j25J3J37k58P7J97P9k03n8j11
4175a79J53j58J91K24l96J38M0J15j30J30J27j62k34J75K9l43K88k1l5j89K27
4196a0K99k54j26L25j11k42J01L04l41n7J80M9k90R1J18K32m66J89J99l79Q2L27
4218B20r5l91K34J08k02q6L37q7l01J76J15k60J60J45j0k89Q5K20j4j14Q7o3k33
$$ plain form
4241 -258 -189 274 29 76 115 138 -99 -73 185 98 1 -135 89 38 -181 167 109 -89 -101 109 68 -157 170 162
4265 162 -227 -157 31 -5 -19 -73 210 29 -164 117 163 -98 -37 138 -71 -71 -16 260 29 -87 -154 27 -269
4288 -269 220 389 18 -77 3 200 -234 129 173 49 -140 53 9 -291 -85 131 -75 10 -71 37 61 -47
4310 -47 -14 103 -208 -212 189 65 -41 -15 144 -124 26 76 124 -11 29 -3 -148 -63 38 135 -176 -126 79 -87
4334 -87 -174 93 183 -116 -11 112 -99 -30 191 -54 -140 -249 -71 -87 -98 -59 176 -46 -180 65 -48 -107 68
4357 68 54 85 -52 142 -106 -108 131 62 5 13 104 200 -2 -42 30 92 -172 83 72 89 -34 88 149 9 1 89 -73
4384 -73 -146 90 81 -14 -115 56 -239 -132 -111 36 -7 81 332 101 -97 68 -7 76 -123 2 6 47 21 90 188
4409 188 -5 48 18 29 79 205 125 -107 -30 -47 -119 -121 256 -112 39 -30 -59 46 144 47 -15 26 144 117 -119 -131
$$ packed form
4241b58O9M63k45M7L9K3k37K6K58q7r7j36K24n1k19L48n8j98j2K10m1k25L27q
4265A62l89P0J88l6j4n4K83j81j93K81M6k61O1J75k09%N5K76k31j16o7J81k96
4288b69M89J69l71r5Q0J97m34L63M4j24j89J93m4l00K06K16k06Q5q1J08K4j08
4310d7L3J17l11mM01j24j06K6J59k68J50N0M8j35M0l2j45Q5J01R7l11N0K05j66
4334h7q7K67R0k99J05J23k11O9K21k45q6j09J78j6j1L9K35k22j34K45j13n9J75
4357F8j4L1j37J94k48kK39o9n7QR1R6k02m0P2O2k64K55j1J7j23J22O1j40qQ8j62
4384g3p3K36rr5j01J71k95J07K1J47m3Q8K51k31j98J65p5Q3j99J25MM1k6O9R8
4409A88j93N3l0J1N0J26q0k32P7j7p2kL77l68J51o9k9J05R8r7o2M1J18k7k36j2
$$ plain form
4435 -131 -5 -175 -164 76 -87 -40 132 92 112 68 83 -85 49 -57 -38 -10 41 -12 48 -71 -31 -15 86 227
4459 227 12 -11 68 -254 12 -79 -26 -294 24 -156 -84 197 276 27 75 35 -103 -55 193 28 -18 -151 -51
4482 -51 160 165 -44 -83 136 -79 130 34 66 132 167 51 -93 -45 -85 -281 -52 298 -55 -94 25 -43 -3 63 -112
4507 -112 81 -108 -217 -107 -142 -100 65 -48 5 16 98 5 -6 2 -134 -92 -190 -57 112 11 -167 -33 -53 -124
4531 -124 123 14 -78 196 186 71 -72 134 36 1 -185 -83 -92 -12 -13 89 -5 -37 -50 78 55 -83 86 -46
4555 -46 -120 148 225 -56 -103 9 12 19 -1 203 -53 -192 143 7 -178 -91 84 -130 -254 -63 -34 24 -47 243
4579 243 45 -58 92 280 -23 -236 219 43 -166 5 -69 -187 91 180 153 -4 -25 286 21 -157 -99 67
4601 67 4 -21 160 -133 -153 31 101 8 -22 105 61 -95 268 45 -258 -110 3 -109 -99 -269 -54 -19 -20 -41
$$ packed form
4435a31J26j70J1K40j63M7J72m0K0m4J5j68J34j06J9K8N1n3O0j19M0J6J01J41
4459B27k15k3P9l22K66r1N3k68L18j80P2K81P9k49M8m0j38M8K48j65m6j33J00
4482e1K11Nk09l9K19k15K09r6L2O6L5j16j44M8m0j96K29L50l53l9J19o8M0O6j75
4507a12J93j89j09J10l5M2J65j13N3J1Q2r3j1Qj36M2r8J33J69j01j78J34k0p1
4531a24K47j09r2K74j0j15j43K06r8l5j86J02rQ0jJ02r4l2j3J28k3j38J69j32
4555d6p4K68P7k81m7J12LPk0K04k56j39L35j36j85Q7J75k14j24J91K9N8p1K90
4579B43j98j03J50J88l03k13M55j76k09J71p4j18K78Q9k7j57k1L11k65j78N8J66
4601F7o3k5J81k93k0J84P0r3l0J27m4j56L63k23l03J48J13j12J0j70K15L5jk1
$$ plain form
4625 -41 251 -48 26 239 112 -102 22 -21 -89 -199 178 -7 -297 60 101 40 -25 151 60 -231 -40 117 -80
4648 -80 -267 64 -29 -50 -14 121 52 46 -143 243 196 -45 -28 33 -129 -115 -158 -49 -261 8 20 91 -68 122 41
4673 41 -125 13 60 -13 -48 -15 189 -177 -170 93 -92 -235 95 71 -22 33 111 -42 -118 -28 65 87 -109 -53 192
4698 192 16 95 27 166 -81 -156 48 38 -57 7 91 -114 59 40 -106 -32 108 0 -21 -37 81 1 -125 -82
4722 -82 35 -283 -155 19 -33 -88 33 228 187 83 255 98 -64 -19 51 -23 -139 -101 9 -37 66 38 -75
4745 -75 -70 25 119 -113 -105 103 42 -248 -137 127 -244 -51 -6 -133 -16 127 47 199 -87 -88 54 11 -170 125
4769 125 75 -40 24 11 -111 36 -22 60 73 -20 0 -52 -96 163 31 -81 -97 -19 -99 74 -97 -97 -50 -36 96 -38
4795 -38 -54 109 -89 -145 -129 -110 63 96 -7 -121 -43 80 151 236 76 30 -113 -88 -4 -105 86 36 -219 -119
$$ packed form
4625d1K92k99P4K13j27k14J24m3o8j10L77j85k90L57M1o1o5J76r1k91J91J57j97
4648h0j87L31r3k1L6J35o9oj89L86m7k41J7O1j62J4m3J09k12K69J2P1j59J90q1
4673D1j66J38M7p3l5L3K04l66PK63j85j43L30k4r3N5P8j53p6R0R3K2j96N6K45
4698A92j76P9o8J39k47p5K04j0r5O4Q4k05J73j9j46P4J40j08k1j6J18q0j26M3
4722h2J17l18J28J74n2n5J21J95m1j04J72j57j62M5P0p4j16L8J10m6J03k8j13
4745g5NR5R4k32QK08o1k90J11K64l71J93M5j27J17J43q0J52k86jJ42m3j81K95
4769A25n0j15O4j3j22J47n8Q2J3r3K0n2m4K59j32j12j6P8q0J73j71%M7J4J32j34
4795c8j6J63j98n6J6J9J73L3j03j14P8J23P1Q5j60m6j43K5Q4j01J91n0k55J00
$$ plain form
4819 -119 162 10 72 26 137 -75 2 16 28 96 103 -102 29 79 -45 -144 29 66 -110 -11 -99 -67 141 -12 87
4844 87 -158 -61 -125 55 -58 55 29 -40 77 84 192 28 20 -4 -101 -9 92 37 -87 -100 -84 -189 -139 64 9 188
4870 188 -62 73 -22 165 31 -197 -106 -175 -75 8 130 63 74 -34 -161 72 -6 30 38 -96 -150 -27 -57 20
4894 20 8 66 270 -8 -166 -73 150 99 194 -69 -142 -81 -137 116 146 55 -95 -25 -101 160 87 98 -169 78 90
4919 90 -74 -27 67 79 -305 -162 -128 -128 64 167 156 -11 -29 -87 23 15 114 -119 -63 -266 -105 81 -207 -54 53
4944 53 21 -65 137 122 -9 -58 52 -216 -79 -33 102 81 6 102 -140 54 224 40 -80 -89 -10 -44 -157 111
4968 111 113 -91 -129 -9 18 -46 162 63 -147 96 -77 96 49 -112 -53 31 -15 235 66 78 -31 -12 43 -54 -45
4993 -45 38 -13 -150 195 14 -240 82 200 64 20 53 136 -62 -78 194 174 -37 -134 -12 -58 -115 107 -26 -2
$$ packed form
4819a19K81j52O2m6J11k12P7J4J2O8Pk05J31N0j24r9J73L7j76R9q8L2K08j53R9
4844H7k45R7o4J80j13J13k6o9J17PJ08j64qk4r7R2J01n5j24j3J6j05N0K03n5J79
4870A88k50J35r5J87j34k28R1o9J00Q3J22o7J1j08j27K33p8L6Qj34n4J23l0P7
4894B0j2N8K04k78j58R3K23n1R5k63p3O1n6K53L0r1j50P0p6K61p3J1k67K47J2
4919I0j64M7R4J2l84J43L4%J92J03j1j67j8n8J10qR9k33N6k03J61J86k88J53J07
4944E3l2q6K02j5j31m9J10k68J37M6J35k1p5R6k42J94J70j84j20rP9l4j13K68
4968A11Kk04l8J20K7o4K08r9k10K43j73J73m7j61N9Q4m6K50j69J2j09J9N5r7R
4993d5Q3n1j37L45j81k54L22J18j36m4L3Q3j98j6K72k0k11r7J22m6n7K22j33K4
$$ plain form
5017 -2 -119 52 -75 -6 -73 40 -227 60 149 89 8 -139 80 -195 -105 -45 80 -30 -1 104 92 79 48 -18 41
5042 41 -4 -182 -88 -104 -135 1 49 -151 61 19 -63 203 -91 -33 -149 -38 -96 -201 -55 -28 -22 4 91 227 -7
5067 -7 107 180 -158 -49 -30 69 -115 -139 84 173 6 82 86 -7 -220 -148 -1 65 126 -136 -63 -22 -113 -83 -25 69 -93
5094 -93 36 -1 36 203 -141 24 4 8 168 -56 3 26 -162 -10 -51 -78 25 100 99 210 115 64 108 121 -27 8
5120 8 -52 86 109 72 15 61 71 -154 -51 20 -67 -150 116 30 75 -131 -216 215 183 -141 47 48 30 48 150 -51
5146 -51 -109 -89 -78 8 -76 -58 76 22 -112 139 90 130 104 -21 303 15 130 22 137 3 -37 37 -54 -38 48
5171 48 -75 -94 66 204 -226 20 27 -54 -239 -75 14 -45 61 216 23 -88 192 112 86 96 -46 -126 -129 -128 37
5196 37 5 -116 -145 -148 2 95 89 -58 191 135 162 62 133 29 64 -25 -140 5 -72 -97 164 -66 94 120 -65
$$ packed form
5017bj17J71j27O9o7J13k67K87Q9o0q1j47K19k75R0O0J25j10K9J05j2j3l1o6N9
5042D1m5j78R4j6l1J36M8k00K12m2q2K66k94N8j16J11n8j05J46K7OK6Q7J36k34
5067gJ14P3l38J09J9R9j84k4K23Q9j67P6Mr3k13P2J47O6O1k62P3M1r1L0N8R4j62
5094i3J29l7L7J67l44J65k0MJ60k24N9K3j88J52m1k7J03P5jJ11r5n1M4J3j48L5
5120Ho0J38K3l7n7M6J0k25J03P1q7q3K66q6M5k06q5M31l2l24J88Jj8J8J02k01
5146e1n8K0J1Q6q4J8J34n4j34K51m9M0k6j25L24k88J15j08J15j34m0P4r1J6Q6
5171D8j23j9J60J38m30K46Pq1j85J64Q9n9J06J55j93j11K80q0k6J0j42q0lJJ65
5196C7l2j21k9lJ50R3oj47K49n6K7j00P1j04L5q9j15J45p7k5K61k30J60K6j85
$$ plain form
5221 -65 149 41 -21 189 -184 -41 93 -62 97 -53 54 66 67 -43 225 54 17 -33 1 38 139 52 14 -40
5245 -40 -75 195 -4 129 173 -99 83 20 38 116 35 74 -49 -167 -190 -133 154 29 13 -2 105 -169 -42 78
5269 78 -82 -30 -25 -185 -27 -164 108 31 -276 -92 21 -16 112 85 -87 13 32 -82 19 18 95 12 -102 179
$$ packed form
5221f5K14j08o2K10l73J43J34j55J59j50J07J2Jj10K68j71l7n0L4L7J01q7l8n4
5245d0l5K70j99J33M4k72J82o3J8P8q1L9j23j18k3N7K87j25j6j5J07k74J27J20
5269G8j60N2Nj60J58j37K72p7l07J84J13l7J28k7j72J00J9j14J01jP7q3j14K81
$$ [...]
8191F5
##END NTUPLES=NMR FID
##END=
