##TITLE=1H_B3C2410
 CDCl3
 8 sc, 
 25.10.2023
##JCAMPDX= 6.0         $$ Bruker NMR JCAMP-DX V2.0
##DATA TYPE= NMR FID
##DATA CLASS= NTUPLES
##ORIGIN= UXNMR, Bruker Analytische Messtechnik GmbH
##OWNER= root
$$ XWIN-NMR		Version 3.5
$$ Wed Oct 25 13:54:30 2023 Russian Standard Time (UT+4h)  she@DPX200
##.OBSERVE FREQUENCY= 200.13135
##.OBSERVE NUCLEUS= ^1H
##.DELAY= (6, 6)
##.ACQUISITION MODE= SIMULTANEOUS
##.ACQUISITION SCHEME= undefined
##.AVERAGES= 8
##.DIGITISER RES= 18
##SPECTROMETER/DATA SYSTEM= spect
##.PULSE SEQUENCE= zg30
##.SOLVENT NAME= D2O
##.SHIFT REFERENCE= (INTERNAL, D2O, 0, 15.7039)
##AUDIT TRAIL= $$ (NUMBER, WHEN, WHO, WHERE, WHAT)
$$ ##TITLE= Audit trail, XWIN-NMR		Version 3.5
$$ ##JCAMPDX= 5.01
$$ ##ORIGIN= Bruker BioSpin GmbH
$$ ##OWNER= she
$$ F:/spectra/data/she/nmr/H-F/1/audita.txt
$$ ##AUDIT TRAIL=  $$ (NUMBER, WHEN, WHO, WHERE, WHAT)
(   1,<2023-10-25 13:53:29.68 +0400>,<she>,<DPX200>,
      <created by zg, POWCHK disabled, PULCHK disabled
       configuration hash MD5:
       00 E9 B6 7A A2 85 ED C7 34 08 36 98 17 FE 4E 26
       data hash MD5: 16K
       00 F9 26 F8 D0 07 DA E2 7E 7E 8F 9E 81 5D FA 10>)
$$ ##END=
$$ 
$$ hash MD5
$$ ED 81 A4 82 B9 B8 CC 0D E8 4B 31 B6 8C 9C A5 5E
##$RELAX= 
##$RELAX= 
##$RELAX= 
##$RELAX= 
##$RELAX= 
##$RELAX= 
$$ Bruker specific parameters
$$ --------------------------
##$DU= <F:/spectra>
##$EXPNO= 1
##$NAME= <H-F>
##$PROCNO= 1
##$TYPE= <nmr>
##$USER= <she>
##$AMP= (0..31)
100 100 100 100 100 100 100 100 100 100 100 100 100 100 100 100 100 100 
100 100 100 100 100 100 100 100 100 100 100 100 100 100 
##$AQSEQ= 0
##$AQ_mod= 1
##$AUNM= <au_zg>
##$AUTOPOS= <>
##$BF1= 200.13
##$BF2= 200.13
##$BF3= 200.13
##$BF4= 200.13
##$BF5= 200.13
##$BF6= 200.13
##$BF7= 200.13
##$BF8= 200.13
##$BYTORDA= 1
##$CFDGTYP= 0
##$CFRGTYP= 5
##$CHEMSTR= <none>
##$CNST= (0..31)
1 1 145 1 1 1 1 1 1 1 1 1 1 1 1 1 1 1 1 1 1 1 1 1 1 1 1 1 1 1 1 1 
##$CPDPRG= <>
##$CPDPRG1= <>
##$CPDPRG2= <>
##$CPDPRG3= <>
##$CPDPRG4= <mlev>
##$CPDPRG5= <mlev>
##$CPDPRG6= <mlev>
##$CPDPRG7= <mlev>
##$CPDPRG8= <mlev>
##$CPDPRGB= <>
##$CPDPRGT= <>
##$D= (0..31)
0 1.2 0 0 0 0 0 0 0 0.06 0 0.03 0 0 0 0 0.0002 0 0 0 0 0 0 0 0 0 0 0 0 
0 0 0 
##$DATE= 1698227608
##$DBL= (0..7)
120 120 120 120 120 120 120 120 
##$DBP= (0..7)
150 150 150 150 150 150 150 150 
##$DBP07= 0
##$DBPNAM0= <>
##$DBPNAM1= <>
##$DBPNAM2= <>
##$DBPNAM3= <>
##$DBPNAM4= <>
##$DBPNAM5= <>
##$DBPNAM6= <>
##$DBPNAM7= <>
##$DBPOAL= (0..7)
0.5 0.5 0.5 0.5 0.5 0.5 0.5 0.5 
##$DBPOFFS= (0..7)
0 0 0 0 0 0 0 0 
##$DE= 6
##$DECBNUC= <off>
##$DECIM= 32
##$DECNUC= <off>
##$DECSTAT= 4
##$DIGMOD= 1
##$DIGTYP= 9
##$DL= (0..7)
0 120 120 120 120 120 120 120 
##$DP= (0..7)
150 150 150 150 150 150 150 150 
##$DP07= 0
##$DPNAME0= <>
##$DPNAME1= <>
##$DPNAME2= <>
##$DPNAME3= <>
##$DPNAME4= <>
##$DPNAME5= <>
##$DPNAME6= <>
##$DPNAME7= <>
##$DPOAL= (0..7)
0.5 0.5 0.5 0.5 0.5 0.5 0.5 0.5 
##$DPOFFS= (0..7)
0 0 0 0 0 0 0 0 
##$DQDMODE= 0
##$DR= 18
##$DS= 0
##$DSLIST= <SSSSSSSSSSSSSSS>
$$ [...]
##$SUBNAM2= <"">
##$SUBNAM3= <"">
##$SUBNAM4= <"">
##$SUBNAM5= <"">
##$SUBNAM6= <"">
##$SUBNAM7= <"">
##$SUBNAM8= <"">
##$SUBNAM9= <"">
##$SW= 18.05172834244
##$SWIBOX= (0..15)
0 0 2 0 0 0 0 0 0 0 0 0 0 0 0 0 
##$SW_h= 3612.71676300578
##$TD= 16384
##$TD0= 1
##$TE= 0
##$TE2= 300
##$TE3= 300
##$TEG= 300
##$TL= (0..7)
0 120 120 120 120 120 120 120 
##$TP= (0..7)
150 150 150 150 150 150 150 150 
##$TP07= 0
##$TPNAME0= <>
##$TPNAME1= <>
##$TPNAME2= <>
##$TPNAME3= <>
##$TPNAME4= <>
##$TPNAME5= <>
##$TPNAME6= <>
##$TPNAME7= <>
##$TPOAL= (0..7)
0.5 0.5 0.5 0.5 0.5 0.5 0.5 0.5 
##$TPOFFS= (0..7)
0 0 0 0 0 0 0 0 
##$TUNHIN= 0
##$TUNHOUT= 0
##$TUNXOUT= 0
##$USERA1= <user>
##$USERA2= <user>
##$USERA3= <user>
##$USERA4= <user>
##$USERA5= <user>
##$V9= 5
##$VALIST= <valist>
##$VCLIST= <CCCCCCCCCCCCCCC>
##$VD= 0
##$VDLIST= <DDDDDDDDDDDDDDD>
##$VPLIST= <PPPPPPPPPPPPPPP>
##$VTLIST= <TTTTTTTTTTTTTTT>
##$WBST= 1024
##$WBSW= 4
##$XGAIN= (0..3)
0 0 0 0 
##$XL= 0
##$YL= 0
##$YMAX_a= 658354
##$YMIN_a= -761850
##$ZGOPTNS= <>
##$ZL1= 120
##$ZL2= 120
##$ZL3= 120
##$ZL4= 120
##$ABSF1= 10
##$ABSF2= 0
##$ABSG= 5
##$ABSL= 3
##$ALPHA= 0
##$AQORDER= 0
##$ASSFAC= 0
##$ASSFACI= 0
##$ASSFACX= 0
##$ASSWID= 0
##$AUNMP= <proc_1d>
##$AZFE= 0.1
##$AZFW= 0.1
##$BCFW= 1
##$BC_mod= 2
##$BYTORDP= 1
##$COROFFS= 0
##$CY= 11.3945322036743
##$DATMOD= 1
##$DC= 2
##$DFILT= <>
##$DTYPP= 0
##$F1P= 15.7292609196834
##$F2P= 12.9074282941183
##$FCOR= 0.5
##$FTSIZE= 0
##$FT_mod= 4
##$GAMMA= 1
##$GB= 0.15
##$INTBC= 1
##$INTSCL= 1
##$ISEN= 128
##$LB= 0.24
##$LEV0= 0
##$LPBIN= 0
##$MAXI= 10000
##$MC2= 0
##$MEAN= 0
##$ME_mod= 0
##$MI= 1.114404
##$NCOEF= 0
##$NC_proc= 0
##$NLEV= 6
##$NOISF1= 3.799351
##$NOISF2= 2.8
##$NSP= 1
##$NTH_PI= 0
##$NZP= 0
##$OFFSET= 15.70392
##$PC= 1
##$PHC0= -23511.54
##$PHC1= 15.2527
##$PH_mod= 1
##$PKNL= yes
##$PPARMOD= 0
##$PSCAL= 0
##$PSIGN= 0
##$REVERSE= no
##$SF= 200.130013532006
##$SI= 16384
##$SIGF1= 3
##$SIGF2= 2
##$SINO= 400
##$SIOLD= 16384
##$SREGLST= <1H.CDCl3>
##$SSB= 0
##$STSI= 0
##$STSR= 0
##$SW_p= 3612.71676300578
##$SYMM= 0
##$S_DEV= 0
##$TDeff= 0
##$TDoff= 0
##$TI= <>
##$TILT= no
##$TM1= 0
##$TM2= 0
##$TOPLEV= 0
##$USERP1= <user>
##$USERP2= <user>
##$USERP3= <user>
##$USERP4= <user>
##$USERP5= <user>
##$WDW= 1
##$XDIM= 8192
##$YMAX_p= 0
##$YMIN_p= 0
$$ End of Bruker specific parameters
$$ ---------------------------------
##NTUPLES= NMR FID
##VAR_NAME=  TIME,          FID/REAL,        FID/IMAG
##SYMBOL=    X,             R,               I
##VAR_TYPE=  INDEPENDENT,   DEPENDENT,       DEPENDENT
##VAR_FORM=  AFFN,          ASDF,            ASDF
##VAR_DIM=   8192,          8192,            8192
##UNITS=     SECONDS,       ARBITRARY UNITS, ARBITRARY UNITS
##FACTOR=    0.0002768,     1,               1
##FIRST=     0,             0,               0
##LAST=      2.2672688,     0,               0
##MIN=       0,             -761850,         0
##MAX=       2.2672688,     658354,          0
$$ Real data points
##PAGE= N=1
##DATA TABLE= (X++(R..R)), XYDATA
$$ [...]
$$ plain form
2645 -71 1091 -735 -942 425 -185 -1286 -48 1469 -15 -1021 638 749 -1430 -323 1517 -808
2661 -808 -989 1006 400 -1582 890 2115 -670 -813 1215 -60 -1378 316 807 -1024 -752 707
2677 707 -667 -481 742 506 -887 -40 613 -988 -1020 1295 802 -1151 255 1866 -968 -1030 2095
2694 2095 1196 -1934 382 1417 -1837 -1057 2203 237 -1285 1696 648 -2095 244 1770 -1195
2709 -1195 -1008 1738 -731 -2279 1307 1314 -1212 386 1746 -1229 -1653 1720 895 -1344 297 1317
2725 1317 -1271 -1307 1935 1147 -1303 685 1047 -1493 -717 1854 123 -1448 1247 77 -2136 685
2741 685 2001 -1112 -1015 1778 -851 -2397 1476 1445 -1947 -470 1642 -1518 -1086 1811 980 -1070 433
2758 433 715 -1277 -587 1505 23 -819 734 308 -992 -118 1383 -203 -643 359 -78 -1284 -3
$$ packed form
2645g1J162j826k07J367o10j101J238J517j484j006J659J11k179J107J840k325
2661h08j81J995o06j982K472J225k785j43K028j275j318J694M91j831K72J459
2677G07j374J86J223k36j393Q47O53j601l2K315m93j953J406J611k834o2L125
2694B095q99l130K316J035l254P80L260j966j522K981j048k743K339J526k965
2709a195J87K746k469j548L586Pk526J598J360k975m24L373q25k239J641J020
2725A317k588l6L242p88k450J988L62k540P76K571j731j571K695j170k213K821
2741F85J316l113R7K793k629j546L873l1l392J477K112l160M32K897q31k050J503
2758D33K82j992O90K092j482q42J553m26j300Q74J501j586m40J002m37j206J281
$$ plain form
2775 -3 1176 -539 -842 1069 56 -1285 569 1209 -1040 -990 1251 -167 -1223 1115 1049 -951 -224
2792 -224 1274 -92 -680 1048 345 -1153 192 682 -877 -445 1364 -199 -1105 815 864 -1129 -193
2809 -193 1020 -516 -1232 617 437 -1165 -73 1293 -213 -668 1056 506 -1030 6 914 -530
2825 -530 -453 1059 301 -934 821 980 -902 -190 1409 -593 -980 1131 99 -1446 349 1378 -1098
2842 -1098 -683 1747 -45 -1678 700 870 -1307 -356 1039 -262 -979 960 588 -601 483 1161
2858 1161 -479 -610 868 -15 -1100 583 1273 -1014 -596 1396 -77 -1139 798 836 -1648 -363
2874 -363 1433 -824 -1044 1331 481 -1728 456 1305 -996 -393 1181 -93 -1142 667 762 -934 243
2891 243 1150 -572 -763 1219 457 -1334 151 987 -833 -1136 1011 247 -1373 276 1259 -1010 -562
$$ packed form
2775cJ179j715l03J911j013j341J854O40k249N0K241j418j056K338o6k000P27
2792b24J498j366n88J728p03j498J345M90j559M32J809j563r06J920M9j993R36
2809a93J213j536p16J849j80j602J092J366j506m55J724n50j536J036R08j444
2825e30P7J512p58j235J755J59j882P12J599k002l87K111j032j545J795J029k476
2842a098M15K430j792j633K378J70k177R51J395j301p17J939l72j189J084O78
2858A161j640j31J478q83j085J683O90k287M18J992j473j062J937L8k484J285
2874c63J796k257k20K375q50k209K184Q49k301O03J574j274j049J809R5j696J177
2891B43R07j722j91J982p62j791J485Q36j820l03K147p64j620J649R83k269M48
$$ plain form
2908 -562 1147 -192 -1445 645 525 -1139 -33 1327 -411 -894 1319 492 -1045 421 752 -1012
2924 -1012 -235 1161 -289 -1178 1125 872 -1120 -147 1237 -547 -852 702 502 -1121 -55 1116
2940 1116 -697 -903 986 417 -957 315 1166 -773 -568 889 35 -1076 736 1150 -902 260
2956 260 1480 -302 -756 1037 507 -1624 55 1487 -847 -1057 1511 539 -1378 585 1116 -1157
2972 -1157 -649 1254 -344 -1379 541 568 -1229 53 1608 -258 -835 1132 600 -1503 772 1078
2988 1078 -1157 -514 1681 -420 -1439 1328 1210 -1391 -439 1389 -889 -1667 1260 732 -1331 -154
3004 -154 863 -553 -822 1641 5 -1207 611 652 -1482 -207 1399 -630 -951 1252 461 -1361
3020 -1361 505 1648 -852 -779 1167 -130 -1198 642 950 -900 -150 1061 -540 -767 668 358
$$ packed form
2908e62J709j339j253K090j20j664J106J360j738m83K213q27j537J466L31j764
2924a012P77J396j450q89K303k53j992R73J384j784l05J554k00j623J066J171
2940A116j813k06J889n69j374J272Q51j939K05J457q54j111J812M14k052J162
2956B60J220j782m54J793n30k131J679J432k334k10K568r72j917J963N31k273
2972a157N08J903j598j035J920K7j797J282J555j866n77J967n32k103K275L06
2988A078k235O43K195k101j019K767j18k601R52J828k278p78K927n28k063J177
3004a54J017j416k69K463j636j212J818M1k134J275J606k029l21K203p91j822
3020a361J866J143k500P3J946j297j068J840L08j850P50J211j601k27J435l10
$$ plain form
3036 358 -990 -237 469 -494 -754 574 289 -502 524 602 -485 -171 645 -81 -661 282 438 -1095 -100
3055 -100 1408 111 -808 382 364 -993 -429 558 -476 -826 101 171 -580 -244 626 7 -172 345 356
3074 356 -699 137 405 -353 -513 682 500 -564 125 1047 -511 -795 1264 39 -1439 436 1062
3091 1062 -1275 -623 1666 -344 -1480 1433 516 -1827 254 1228 -1215 -808 1404 -140 -1094 1086
3107 1086 433 -1142 454 1283 -1078 -736 1481 252 -1282 373 1351 -943 -586 1560 91 -1132
3123 -1132 791 927 -1309 -291 1460 -555 -975 1130 329 -1664 294 1204 -1257 -372 1523 -840
3139 -840 -1432 1170 755 -1643 636 1521 -1268 -529 1574 -212 -1202 1196 660 -1190 -336 681 -311
3156 -311 -108 733 40 -756 54 405 -440 -77 596 -472 -1022 232 603 -490 33 1176 -318 -1128
$$ packed form
3036C58j348P53P06r63k60J328k85p91J026P8j087L14Q16p26n80R43J56j533R95
3055a00J508j297r19J190j8j357N64R87j034l50R27P0p51L36Q70o19j79N17J1
3074C56j055Q36K68p58j60J195j82j064O89R22j558k84K059j225j478J875O26
3091A062k337O52K289k010j136K913r17k343K081R74k443M07K212j544r54K180
3107A086o53j575J596Q29k361L42K217j229j534J655R78k294L57K146j469j223
3123a132J923J36k236J018J751k015m20K105q01j993J958R10k461Q85J895k363
3139h40n92K602m15k398K279Q85k789P39K103j786r90K398n36j850Q54J017r92
3156c11K03Q41o93p96Q10L51q45L63O73j068n50J254L71j093N23J143j494q10
$$ plain form
3174 -1128 742 449 -663 48 1103 -320 -757 653 181 -355 568 160 -688 -128 106 -166 -81 356
3192 356 -149 -351 105 -182 162 335 146 -185 -181 -528 -36 66 -472 325 875 -480 -301 1091 187 -941
3212 -941 782 685 -1199 -90 1068 -428 -338 1049 9 -837 530 248 -500 416 531 -909 -731 660
3230 660 -85 -451 440 384 -489 -531 619 31 -919 416 760 -624 -596 840 480 -565 656 829 -852
3249 -852 -489 1047 -467 -873 945 -7 -1177 451 805 -1031 -276 1294 -637 -1287 835 264 -1229
3266 -1229 476 1092 -1088 -677 1180 143 -889 947 965 -801 -114 344 -459 -413 637 317 -696
3283 -696 375 756 -583 -630 863 106 -957 209 689 -923 -492 1362 -211 -988 821 546 -1199
3300 -1199 -254 1149 -668 -660 903 199 -797 436 1015 -593 -178 1022 -386 -974 692 231 -750 -55
$$ packed form
3174a128J870k93j112P11J055j423m37J410m72n36R23m08q48N60K34k72Q5M37
3192C56n05k02M56k87L44J73j89l31Ml47M92J02n38P97N50j355J79J392r04j128
3212i41J723r7j884J109J158j496R0J387j040q46J367k82p48R16J15j440J78J391
3230F60p45l66Q91n6q73m2J150n88r50J335L44j384K8J436l60j045J221J73j681
3249h52L63J536j514m06J818r52j170J628L54j836P55J570j931o50K122n71j493
3266a229J705O16k180M11J857j037j032J836J8j766O87M58q03M6J050l20j013
3283f96J071L81j339m7J493p57j063J166M80j612M31J854j573p77J809k75j745
3300a199R45J403j817QJ563p04r96J233N79j608M15J200j408n88J666m61r81O95
$$ plain form
3318 -55 417 -379 -391 775 229 -846 170 888 -812 -514 705 77 -860 92 926 -573 -589 1126 2
3337 2 -870 745 797 -639 -8 952 -488 -500 1105 316 -753 469 1006 -1005 -421 975 -69 -811
3355 -811 510 224 -1208 -130 1103 -278 -883 634 290 -980 -110 976 -793 -529 695 382 -646
3372 -646 359 1081 -510 -472 1083 -209 -914 900 462 -1331 52 1309 -624 -533 1048 214 -1321
3389 -1321 180 786 -1242 -417 810 -162 -882 481 789 -865 -99 928 -338 -956 757 275 -1013
3406 -1013 -109 860 -472 -402 1227 376 -936 215 630 -1085 -368 1010 -179 -1036 696 673 -1094
3423 -1094 -86 1181 -483 -1088 904 306 -1044 60 813 -585 -248 646 -103 -830 539 704 -894
3440 -894 -92 906 -148 -1014 768 369 -855 394 936 -674 -932 1194 17 -1034 274 766 -907
$$ packed form
3318e5M72p96j2J166n46j075J016P18j700K98J219o28r37R52Q34j499j6J715j124
3337Bq72J615N2j436O31R60j440j2J605p89j069J222N37k011N84J396j044p42
3355h11J321k86j432J078J233j381o05J517l44j270Q70J086j769K64J224l13j028
3372f46J005P22j591L8J555j292p05J814m38j793J383J257j933R1J581q34j535
3389a321J501O06k028Q25J227r72p20J363L08j654P66J027j266o18J713m82j288
3406a013R04R69j332P0J629q51j312J151M15j715P17J378j189q57J732k3j767
3423a094J008J267j664o05J992n98j350J104P53j398L37Q94p49p27J369J65j598
3440h94Q02R98j054q66J782l99j224J249N42j610k58K126j177j051J308M92j673
$$ plain form
3457 -907 -571 1248 -76 -856 645 471 -1154 9 1018 -553 -766 961 84 -929 532 993 -478
3474 -478 -298 1232 -194 -1055 993 726 -1184 -312 1078 -394 -1067 797 501 -1204 -203 926 -502
3491 -502 -717 810 160 -1082 344 488 -839 -223 1083 -191 -852 564 458 -1119 214 968 -665
3508 -665 -730 867 328 -838 554 935 -1077 -715 881 -11 -1126 357 665 -1233 -249 1064 -137
3525 -137 -652 838 156 -906 86 826 -804 -235 1185 -127 -746 555 740 -883 -144 1268 -466
3542 -466 -1050 588 976 -567 4 1048 -420 -694 814 130 -625 116 703 -743 -458 812 -160 -770
3560 -770 547 723 -814 -69 1320 -630 -716 868 439 -881 403 870 -546 -360 931 147 -1019
3577 -1019 443 609 -805 -441 660 -329 -738 509 397 -696 45 764 -509 -370 786 -21 -1105
$$ packed form
3457i07L36J819j324p80J501j74j625J163J009j571k13J727q77j013J461M61j471
3474d78J80J530j426q61K048k67j910Q72J390j472o73J864k96j705J001J129j428
3491e02k15J527o50j242J426J44j327O16J306j274o61J416j06j577J333P54j633
3508f65o5J597n39j166J392L81k012L62J596q92j115J483L08j898R84J313j201
3525a37n15J490o82j062R92P40j630N69J420j312o19J301J85j623P39J412j734
3542d66n84J638L88j543N71J044j468k74J508o84p55P41N87j446K85J270r72o10
3560g70J317J76j537P45J389j950q6J584m29j320J284M67j416J86J291p84j166
3577a019J462J66j414L64J101r89m09J247j12j093P41P19j273J39J156q07j084
$$ plain form
3594 -1105 559 656 -928 -240 1231 111 -880 724 607 -947 -27 1073 -526 -801 692 275 -865
3611 -865 333 760 -453 -295 594 -25 -1038 459 654 -939 -70 690 -574 -810 788 430 -998
3628 -998 331 635 -732 -440 963 41 -852 374 936 -673 -123 978 -103 -907 542 126 -999
3645 -999 72 927 -683 -265 619 -242 -957 738 527 -901 -270 747 -600 -653 900 614 -482 272
3663 272 586 -672 -666 889 659 -774 340 445 -633 -385 1086 -99 -493 421 279 -1083 62 764
3681 764 -57 -617 576 -239 -1137 539 1189 -724 -445 606 -434 -919 699 849 -871 -111 671 -186
3699 -186 -805 592 529 -294 89 192 -672 -361 841 -16 -659 413 67 -803 27 1008 44 -671 356
3718 356 383 -1157 -112 1213 -410 -787 567 202 -1115 549 714 -638 -264 668 -57 -733 389
$$ packed form
3594a105J664R7j584O88J471j120r91J604j17j554R20J100j599k75J493m17j140
3611h65J198M27j213J58Q89o19j013J497J95j593Q69P60j264k36J598l58j428
3628i98J329L04j367K92J403r22q93J226N62j609N50J101j081q04J449m16j125
3645i99J071Q55j610M18Q84q61p15J695k11j428O31J017j347n3J553k86j096P54
3663B72L14j258OJ555k30j433J114J05j078K48J471j185l94R14j42j362J145P02
3681G64q21n60J193q15q98J676O50j913K79J051j040m85J618J50j720P60P82q57
3699a86o19J397o3q23L83J03q64L11J202q57o43J072l46q70Q30R81r64p15J027
3718C56K7j540J045J325j623l77J354l65j317J664J65j352L74R32p25o76J122
$$ plain form
3735 389 330 -566 -216 767 -486 -800 842 294 -791 242 394 -925 -490 813 32 -781 300 698
3753 698 -961 -490 1152 -180 -577 781 476 -912 -207 1101 -427 -519 1208 88 -1140 739 654
3770 654 -796 -335 1050 -224 -1089 885 493 -922 142 891 -595 -966 832 385 -1044 465 946
3787 946 -769 -363 1141 76 -986 616 632 -1222 -166 902 -409 -609 1048 327 -1011 363
3803 363 839 -743 -709 1056 -170 -1163 546 814 -1113 -347 1063 -241 -794 694 587 -1373 21
3820 21 830 -375 -496 706 132 -911 390 805 -751 -279 757 -200 -951 593 599 -1102 264 895
3838 895 -589 -654 898 273 -1162 275 868 -925 -754 1156 -93 -1131 557 816 -726 -402 705
3855 705 -247 -723 908 298 -1016 143 851 -720 -498 867 160 -974 248 1021 -932 -470 1024
$$ packed form
3735C89n9q96L50R83j253l14J642n48j085J033J52j319M35J303p81q13J081L98
3753F98j659M71J642j332l97J358l05j388P05J308j528r2J727j120j228J879q5
3770F54j450M61J385j274q65J974l92j415J064P49j486l71J798m47j429J509M81
3787I46j715M06J504j065j062J602J6j854J056J068j311k00J657p21j338J374
3803C63M76j582L4J765j226r93J709K68j927P66J410j304n53J488j07j960J394
3820B1Q09j205j21J202n74j043J301M15j556M72J036r57p51J544Oj701J366O31
3838H95j484o5J552o25j435J437N93j793J71J910j249j038J688K59j542L24J107
3855G05r52m76J631o10j314J159P08j571K22J365p07j134J222P73j953M62J494
$$ plain form
3872 1024 -237 -1123 546 652 -732 -112 1435 -302 -604 903 367 -836 26 808 -714 -520 1071
3889 1071 -11 -827 388 448 -880 -5 1021 -362 -814 807 408 -1033 364 1110 -494 -655 1067
3906 1067 157 -1271 373 854 -936 -574 1150 -60 -825 790 622 -901 7 886 -643 -729 983
3923 983 334 -863 461 849 -490 -416 1054 -52 -1221 602 541 -1228 -253 987 -380 -430 754
3940 754 610 -869 55 615 -730 -557 605 400 -844 303 823 -980 -48 1070 -4 -908 628
3957 628 364 -1119 226 861 -732 -588 815 233 -1089 659 793 -622 -471 941 -156 -777 382
3974 382 500 -834 -251 845 -444 -746 819 471 -889 84 819 -739 -567 1226 113 -987 492
3991 492 741 -753 -126 1156 -337 -930 850 132 -963 263 968 -674 -437 719 146 -781 355
$$ packed form
3872A024j261q86J669J06j384O20J547j737l02J507n36j203Q62P82j522J94J591
3889A071j082q16J215O0j328Q75J026j383m52J621l99j441J397P46j604j61J722
3906A067r10j428J644M81j790L62J724j210p65J615j68j523R08Q79j529q6J712
3923I83o49j197J324L88j339P4J470j106j169J823o1j769R75J240j367n0J184
3940G54j44j479R24N60j345J73J162k05j244J147N20j803R32J118j074r04J536
3957F28k64j483J345O35j593J44J403n82j322J748J34j415J51J412j097o21J159
3974C82J18j334N83J096j289l02J565l48j360R73P35j558J72J793j113j100J479
3991D92K49j494O27J282j493n93J780p18j095J226P05j642K37J156n73r27J136
$$ plain form
4008 355 491 -767 -347 821 -178 -835 744 250 -835 103 1112 -661 -533 742 168 -795 282
4025 282 864 -609 -279 806 -42 -679 346 500 -794 -441 682 -354 -774 698 206 -763 137 639
4043 639 -781 -295 915 -9 -760 402 530 -393 131 1026 -331 -663 706 447 -773 154 813 -581
4061 -581 -709 796 287 -961 573 678 -429 -291 621 -213 -757 349 190 -905 156 599 -425
4078 -425 -450 653 384 -757 497 637 -707 -529 587 83 -873 549 608 -737 -72 896 -155 -944
4096 -944 774 263 -1156 70 867 -474 -429 815 -75 -957 537 614 -396 -143 656 -594 -829 859
4114 859 600 -751 146 976 -610 -688 1111 115 -642 375 814 -888 -412 895 -123 -538 711 287
4132 287 -1061 19 631 -364 -619 722 -265 -1231 350 793 -640 9 975 -347 -970 815 481 -512
$$ packed form
4008C55J36j258M20J168r99o57J579m94j085R38J009j773J28J275n74r63J077
4025B82N82j473L30J085q48o37J025J54j294L53J123j036m20J472m92r69R00N02
4043F39j420M86J210r24p51J162J28r23N24Q95j357l32J369k59j220R27O59j394
4061e81j28J505n09j248J534J05j107J38R12q34n44J106j59j095J061M43j024
4078d25k5J103k69j141J254J40j344J78J116n04r56J422N9j345O65R68j051p89
4096i44J718n11j419J226P97j341M5J244q90q82J494P7j010K53P99j250k35J688
4114H59k59j351Q97Q30j586p8J799r96p57J017M39j702M76J307j018m15J249m24
4132B87j348J080O12r95k55J341r87r66J581M43j433O49R66j322o23J785l34r93
$$ plain form
4150 -512 191 834 -485 -758 664 364 -678 407 562 -883 -592 837 -1 -513 678 348 -1053
4167 -1053 -302 778 -463 -494 866 344 -1286 -52 759 -515 -115 990 169 -783 183 582 -585
4184 -585 -128 645 -167 -764 284 456 -729 337 910 -551 -492 677 240 -697 368 638 -728 -455
4202 -455 617 136 -396 594 766 -924 -307 469 -232 -680 641 442 -842 -49 882 -301 -355 897
4220 897 122 -1040 300 571 -765 -136 981 -601 -927 801 397 -1015 -149 852 -469 -891 522
4237 522 202 -1109 397 936 -714 -627 911 81 -602 580 637 -814 -308 694 -328 -689 896 353
4255 353 -890 172 805 -541 -354 1100 -127 -1102 549 567 -974 -65 1135 -135 -880 832 521
4272 521 -833 144 946 -539 -787 870 73 -887 532 868 -682 -209 820 -441 -598 562 430
$$ packed form
4150e12P03O43j319k73J422l00j042J085J55j445K91J429q38n12J191l30j401
4167a053P51J080j241l1J360n22j630J234Q11j274M00J105q21r52R66L99j167
4184e85M57P73q12n97J048J72j185J066N73j461N9J169m37r37J065K70j366K73
4202d55J072m81n32R90J72j690O17P76p01m48J321j99j284P93R31j183n4J252
4220H97p75j162J340K71j336O29J117j582l26J728m04j412Q66J001j321m22J413
4237E22l20j311J506N39j650Q7J538q30o83J182N7j451N06J002j022l61J585n43
4255C53j243J062O33j346J87J454j227r75J651J8j541R09J200j270p45J712l11
4272E21j354R77Q02j485k48J657p97r60J419L36j550M73J029j261j57J160j32
$$ plain form
4289 430 -997 -155 1061 -240 -664 946 519 -1047 43 813 -714 -565 923 166 -801 447 755
4306 755 -726 -8 1116 -495 -743 675 34 -909 235 894 -591 -294 770 -221 -997 677 650 -790
4324 -790 -375 686 -105 -865 649 577 -705 -275 888 -490 -660 709 322 -770 136 1018 -827 -297
4342 -297 998 -69 -722 628 581 -948 -196 1156 -507 -809 800 175 -836 82 966 -506 -410 727
4360 727 -48 -814 158 631 -791 -347 597 -203 -618 817 697 -846 -144 953 -598 -573 842 28
4378 28 -814 474 780 -970 -331 791 80 -730 366 453 -1044 -182 871 -365 -496 959 470 -907
4396 -907 206 636 -608 -444 668 -201 -811 405 694 -569 -110 957 -311 -433 718 401 -787
4413 -787 155 885 -491 -423 700 247 -1023 364 580 -682 -173 563 -292 -728 294 423 -625 301
$$ packed form
4289D30j427Q42J216j301m24J610m27j566J090P70j527J49J488p57r67J248L08
4306G55j481P18J124j611k48J418o41r43J144O59j485K97J064r91p76J674k7j440
4324g90M15J061p91p60J514p2j282M30J163j378j70J369l87j092R06Q82j845N30
4342b97J295j067o53J350m7j529P52J352j663l02J609o25j011R18Q84j472R6J137
4360G27p75p66R72M73j422M44R44q00m15J435j20j543P02J097j551K5J415q14
4378B8q42J288L06j750O39J122p11q10J096Q7j497Q62J053j236j31J455m89j377
4396i07J113M30j244J64J112q69o10J216K89j263M59J067j268j22J151l17j188
4413g87R42P30j376O8J123m53j270J387K16j262N09P36q55m36J022J29j048R26
$$ plain form
4431 301 868 -672 -552 613 170 -1261 301 491 -617 -291 859 -261 -756 703 533 -559 -175
4448 -175 802 -352 -531 652 272 -636 54 813 -236 -553 583 -79 -663 138 507 -476 -230 857
4466 857 -295 -553 530 291 -934 131 761 -479 -274 743 240 -856 250 601 -640 -277 838
4483 838 -168 -526 348 661 -874 -44 469 -342 -575 546 -22 -936 665 716 -508 -426 677 -254 -713
4502 -713 503 431 -768 -164 756 -257 -552 664 372 -777 -12 711 -450 -445 782 -8 -1039 461
4520 461 402 -676 245 781 -387 -482 582 222 -727 300 664 -614 -393 744 178 -843 436 559
4538 559 -814 -303 762 -284 -625 304 313 -492 26 617 -340 -498 745 218 -955 151 592 -700
4556 -700 -158 613 -169 -542 602 746 -679 -64 1104 -161 -839 780 439 -667 266 737 -745 -668
$$ packed form
4431C01N67j540J20J165m43j431J562J90j108L26J150j120m95J459j70j092L84
4448a75R77j154j79J183l80r08O90P59j049l17J136o62n84Q01L69r83K46J087
4466H57j152k58J083k39j225J065O30j240K05J017n03j096J106L51j241L63J115
4483H38j006l58Q74L13j535Q30N13q11k33J121n68r14J601N1j224Q2J103r31m59
4502g13J216p2j199O04R20j013k95J216k92j149P65P23j161NJ227p90j031J500
4520D61n9j078R21N36j168r5J064l60r49J027L64j278K21J137n66j021J279J23
4538E59j373N11J065j046l41R29Rq05N18N91r57j58J243n27j173J106M41j292
4556g00N42P71p82l73J144J44j425O15J168j265o78J619l41j106R33M71j482P7
$$ plain form
4574 -668 734 162 -901 88 309 -652 -161 790 -160 -461 351 387 -739 -117 892 -631 -592 851 -153
4593 -153 -662 305 738 -780 -239 863 -273 -761 562 736 -750 -191 899 -234 -739 492 367
4610 367 -673 -37 568 -594 -519 810 -171 -870 281 670 -757 -182 601 -203 -857 780 386 -889
4628 -889 247 651 -468 -421 868 212 -930 159 599 -586 -218 869 -262 -583 294 -19 -656 168
4646 168 983 -529 -671 611 26 -1016 449 653 -455 -286 757 -194 -635 688 593 -496 86 761
4664 761 -221 -457 827 252 -808 340 517 -723 -282 814 247 -624 411 626 -833 -128 898
4681 898 -124 -427 432 103 -761 -151 733 -375 -498 720 271 -745 178 673 -521 -308 810 -227
4699 -227 -489 343 433 -797 -207 540 -664 -531 601 253 -654 336 635 -845 -323 785 -23 -848 315
$$ packed form
4574f68J402n72j063R89K21r61M91R51r50l01Q12L6j126O22J009j523L9J443j004
4593a53n09R67M33j518N41J102j136m88J323J74j486N59J090j133n05J231j25
4610C67j040O36O05j162P5J329r81o99J151L89j427N75P83q04o54J637l94j275
4628h89J136M04j119M7J289o56j142J089M40j185L68J087j131l21Q77l13o37Q24
4646A68Q15j512j42J282n85j042J465K04j108J69J043r51m41J323r5j089N82O75
4664G61r82k36J284n75j060J148J77j240M41J096n67q71J035K15j459P05J026
4681H98j022l03Q59l29q64O10Q84j108j23J218m49j016R23M95j194K13J118j037
4699b27k62Q32R0j230N90P47j204J33J132l48r07R90K99j480N22J108q08q25J163
$$ plain form
4718 315 337 -545 -181 736 -35 -545 332 236 -747 -164 716 -267 -459 638 118 -495 395 603 -362 -251
4738 -251 553 -482 -890 407 323 -904 48 793 -524 -855 641 -31 -753 180 761 -422 -392 743
4756 743 238 -606 675 579 -369 -61 762 -115 -562 453 176 -881 24 742 -380 -383 764 135 -867
4775 -867 393 508 -543 -90 717 -213 -889 253 301 -745 -11 515 -338 -414 754 238 -782 -13 752
4794 752 -555 -279 806 -110 -448 461 264 -374 -137 465 -265 -485 680 145 -959 -101 690 -300 -654
4813 -654 676 61 -765 412 381 -574 81 776 -304 -300 538 449 -543 -148 771 -545 -367 644 -240 -609
4833 -609 317 473 -638 -368 567 -123 -623 213 422 -699 -175 867 -634 -409 499 125 -645 215 571
4852 571 -554 -131 714 194 -678 370 595 -317 -92 683 -119 -650 599 341 -870 2 641 -485
$$ packed form
4718C15K2q82L64R17p71n10Q77r6r83N83Q80r83j92J097n20o13Q90K08r65J11
4738b51Q04j035m08J297q4j227R52P45j317l31J496o72p22R33N81j183L0J135
4756G43n05q44J281r6r48L08Q23q77m47J015k77j057R05P18j122lJ147o29j002
4775h67J260J15j051M53Q07r30o76J142M8j046P34N26q53p6J168n16j020P69P65
4794G52j307K76J085r16l38R09j97o38K37O02p30k20J165n35j104Q58P91r90l54
4813f54J330o15q26J177l1r55O55O95j080MQ38q9r92L95R19j316J78J011q84l69
4833f09R26J56j111K70R35o90n00Q36K09j121N24J042j501K25R08l74p70Q60L56
4852E71j125M23Q45n20q72J048K25r12K25P75q02n31J249k58j211Q72O39j126
$$ plain form
4870 -485 -368 562 41 -532 364 432 -411 -166 559 -206 -388 475 150 -541 -2 859 -310 -376 688 50
4890 50 -697 226 541 -423 -146 704 -36 -772 495 397 -294 -23 654 -345 -345 619 237 -548 -65 549 -465
4911 -465 -417 453 111 -451 403 535 -588 -320 411 -307 -628 705 170 -653 305 722 -371 -401 516 317
4931 317 -685 231 546 -405 -93 733 183 -359 420 358 -420 10 747 -392 -654 526 80 -637 99
4950 99 441 -236 -249 557 16 -574 219 360 -459 -53 624 -244 -486 434 411 -643 -70 364 -568 -574 407
4971 407 -45 -626 510 316 -555 -280 644 -278 -258 590 233 -708 13 457 -276 -473 601 238 -621 353
4991 353 590 -387 -266 591 187 -821 621 278 -367 103 830 -291 -559 419 52 -558 283 459 -462
5010 -462 -134 565 -108 -540 152 352 -667 -106 683 -156 -375 625 463 -556 312 680 -523 -437 820
$$ packed form
4870d85J17R30n21n73Q96O8q43K45P25p65j82Q63l25o91N39Q61j169o6J064o38
4890E0p47R23L15r64K77Q50p40p36J267r8o91K71O77r99%R64l82p85M83O14j014
4911d65M8Q70l42n62Q54J32j123K68P31p18l21J333n35q23R58M17j093l0R17j99
4931C17j002R16L15r51L12Q26n50n42P79o2p78M30P37j139k62J180m46p17P36
4950I9L42o77j3Q06n41n90P93J41q19M06O77q68k42R20k3j054N73M34r32oR81
4971D07m52n81J136j94q71K75R24r22K0Q48l57r41P21M44p33j97J074l63q59R74
4991C53K37r77J21Q57m04j008J442l43o45M70P27j121k68R78l67o10Q41J76r21
5010d62L28O99o73m32O92K00j019N61P89q39k19J000j62j019Q68L68j203Q6J257
$$ plain form
5029 820 -45 -924 231 314 -566 -248 528 -389 -623 348 347 -668 -47 698 -426 -667 439 88 -670 171
5049 171 363 -414 -296 482 -153 -560 594 727 -579 -143 550 -143 -514 461 303 -649 342 442 -456
5068 -456 -274 525 4 -829 454 257 -709 9 549 -574 -737 680 194 -718 221 506 -639 -382 535
5087 535 112 -551 439 359 -445 -133 687 -174 -600 351 358 -741 155 684 -404 -557 755 -4 -564 223
5107 223 565 -552 -179 882 120 -592 361 465 -543 -244 632 -245 -426 517 269 -814 -64 470 -398
5126 -398 -479 564 -140 -701 167 567 -292 -5 858 -35 -421 643 354 -742 -113 856 -98 -401 505
5145 505 -29 -743 2 731 -672 -141 627 -19 -717 408 282 -593 -6 711 -420 -414 572 195 -703 171
5165 171 722 -338 -306 833 -147 -647 161 469 -737 -246 714 -254 -414 410 375 -818 211 616 -244
$$ packed form
5029H20q65q79J155Q3q80L18P76r17k34R71jj015O21P45j124k41J106l51p58Q41
5049A71J92p77J18P78o35m07J154J33j306M36O93o93l71R75j58r52R91J00q98
5068d56J82P99n21q33J283j97r66P18N40j123j63J417m86r12R39K85j145K57R17
5087E35m23o63R90q0q04L12Q20q61m26R51Pj099Q96N29j088j53J312p59n60P87
5107B23L42j117L73J061p62p12R53J04j008K99Q76q77j81R43k48j083P50N34q68
5126c98q1J043p04n61Q68M00q59K87Q63q93l86J064k89j096O29R69r54l03R06
5145E05n34p14P45P29j403N31P68o46o98J125j26q75N87P17j131OR86l77q98Q74
5165A71N51j060L2J139r80n00Q08L08j206M91R60r68j60Q24l5j193J029M05q60
$$ plain form
5184 -244 -296 614 291 -308 413 429 -360 -56 591 -197 -743 324 381 -595 62 750 -126 -653 653 157
5204 157 -549 126 516 -487 -160 548 89 -471 386 437 -509 -8 625 -202 -484 604 142 -463 287 565
5224 565 -406 -330 783 -27 -400 241 442 -692 -281 517 41 -419 61 337 -440 -6 253 -252 -416 470
5244 470 23 -637 485 365 -223 20 762 -170 -646 296 499 -602 -179 541 -198 -717 681 257 -593
5263 -593 73 654 -442 -197 565 38 -541 121 483 -365 -179 611 11 -526 533 377 -423 22 730
5282 730 -411 -166 526 222 -586 225 495 -504 -360 566 328 -416 319 244 -671 -8 417 -458 -301 468
5302 468 187 -420 378 425 -422 -112 868 -16 -552 445 415 -758 161 735 -114 -363 526 179 -417 -177
5322 -177 337 -336 -140 624 -47 -327 344 623 -292 -96 570 -200 -727 338 223 -550 85 675 -503
$$ packed form
5184b44n2R10l23n99P21J6p89L04O47p88n46J067N7r76O57O88q76n27J306m96
5204A57p06O75L90j003L27P08m59n60Q57N1r46N01O33q27k82J088m62o05P50K78
5224E65r71P6J113q10l73O41K01j134M11P98m76m60M80K76p77M34K59n05j64Q86
5244D70m47o60J122j20n88K43P42r32m76R42K03j101M23P20p39n19J398m24q50
5263e93O66N81j096K45P62n27n79O62L62q48J86P90o00n37J059j56q00M45P08
5282G30j141K45O92l04q08Q11K70r99J44R26k38p44P35p5r15O63M25q75J57P69
5302D68k81o07P98M7q47L10R80q84n36R97l0j173R19N74q49k49Q89l47n96K40
5322a77N14o73J96P64o71k80O71K79r15J96O66p70n27J065j15p73O35N90j178
$$ plain form
5341 -503 -441 501 132 -402 276 217 -423 -269 448 -132 -354 406 101 -487 -22 597 -172 -377 310 357 -605
5362 -605 218 489 -294 -189 385 107 -598 471 332 -339 -132 665 -251 -264 307 286 -575 63 450 -418
5382 -418 -535 551 24 -579 105 294 -443 -133 688 -44 -330 312 216 -525 -71 325 -363 -380 497 184
5402 184 -299 -39 446 -397 -86 748 -98 -622 382 189 -395 -138 520 -345 -249 308 26 -897 -15 471
5422 471 -428 -300 593 155 -701 509 184 -549 -98 540 -52 -545 523 233 -719 -54 354 -408 -240
5441 -240 485 -8 -232 60 711 -373 -355 718 -117 -562 371 505 -569 -57 593 17 -404 531 37
5460 37 -755 220 732 -450 -336 745 -102 -738 273 461 -380 -163 537 -263 -395 515 330 -546 -101
5479 -101 662 -324 -281 677 257 -675 349 367 -563 -324 519 -162 -423 416 433 -305 142 615 -384 -422 509
$$ packed form
5341e03O2R42l69n34O78n9o40J54P17n80k22P60l05n88M65O19p69k05O87M7r62
5362f05Q23K71p83J05N74k78p05J069j39o71K07P97r16j3N71k1q61O38L87q68
5382d18j17J086n27o03O84J89p37L10Q21p32k86O42r6p41M54L96o88j7Q77l13
5402A84m83K60M85q43L11Q34q46n24J004j93n84K57O58q65R6N57k82r23Q82M86
5422D71q99J28Q93m38q56J210l25p33M51O38n92m93J068k90r52O65M08p62J68
5441b40P25m93k24K92O51j084J8J073q35m45R33J34j074N12O50n76m21R35m94
5460C7p92R75N12j182J14J081q47o36J011J88q41K17P00q00j32R10j85q76M45
5479a01P63r86M3R58m20r32J024J8r30K39Q43o81k61Q39J7p38M47M73r99l8R31
$$ plain form
5500 509 156 -683 215 583 -382 -353 605 89 -585 560 285 -473 -271 345 -231 -336 378 108 -460 131
5520 131 505 -127 -178 543 57 -679 315 443 -632 -204 537 -111 -465 239 392 -628 -195 496 -143 -565
5540 -565 155 165 -511 154 478 -22 -396 528 71 -632 138 396 -396 -42 526 -134 -490 377 234 -582
5560 -582 260 437 -336 -260 570 103 -580 96 775 -454 -248 482 -192 -547 461 195 -537 37 476 -268
5580 -268 -530 679 179 -502 203 442 -536 -311 479 -132 -1063 528 396 -634 -58 800 -291 -265 561
5599 561 -96 -388 72 490 -316 -198 747 21 -376 263 382 -637 -108 516 -303 -229 418 428 -394 -209
5619 -209 341 -281 -470 426 -202 -488 227 304 -397 -225 547 94 -219 164 274 -337 -68 406 -306 -276 329
5640 329 297 -558 69 355 -342 -237 630 82 -266 235 293 -489 -332 698 71 -453 443 277 -676 -15
$$ packed form
5500E09l53q39Q98L68r65K9R58n16o74J145k75p58K02O16n76j05P14k70n68N91
5520A31L74o32n1P21m86p36R94J28j075M28P41o48l54P04J53j020M33O91o39m22
5540e65P20J0o76O65L24n00l74R24m57p03P70K58p92L54N68o60l56Q67j43q16
5560e82Q42J77p73P6Q30m67o83O76O79j229K06P30o74l55J008k66p32N74M39p44
5580b68k62J209n00o81P05K39r78K25P90o11r31J591j32j030N76Q58j091K6Q26
5599E61o57k92M60M18q06J18R45p26l97O39J19j019N29O24q19P4O47J0q22J85
5619b09N50o22j89Q96o28k86P15P7p01J72P72m53l13L83J10o11K69M74p12L0O05
5640C29l2q55O27K86o97J05Q67n48l48N01N8p82J57J030o27n24Q96j66r53O61
$$ plain form
5660 -15 383 -371 -298 234 210 -384 253 348 -114 -112 439 -18 -307 260 214 -265 23 537 -341 -371 415 138 -597
5683 -597 -78 608 -375 -352 415 270 -725 145 649 -351 -219 699 -122 -637 449 267 -621 -48 560 -263
5703 -263 -296 477 28 -593 338 459 -758 -139 603 -555 -456 399 278 -455 -38 625 -336 -348 566 -33
5723 -33 -541 368 278 -479 -15 244 -36 -267 409 223 -471 -51 376 -217 -493 779 -72 -652 152 167 -344
5744 -344 -161 440 -126 -563 417 348 -264 -119 569 -170 -496 438 -151 -590 287 388 -229 -223 505 -105 -320
5765 -320 287 135 -508 -43 585 -189 -366 590 447 -298 24 291 -234 -376 315 210 -299 11 226 -57
5785 -57 63 499 167 -550 196 279 -275 7 447 -294 -460 339 251 -461 293 589 -123 -346 323 163 -630
5806 -630 180 416 -445 -167 296 -38 -293 137 230 -479 -124 196 -242 -253 375 -46 -663 204 489 -441 -201
$$ packed form
5660a5L98p54P3N32k4n94O37R5m62KN51m57k89N67m6m79K88N14q78l0P86k77p35
5683e97N19O86r83K3P67j45r95Q70N04j000J32R18q21n15J086j82q88N73O08q23
5703b63l3P73m49o21R31J21j217O19P42j158R9Q55j21p33M17O63r61j2R14n99
5723c3n08R09r0p57M64K59k80k31O76j86o94M20M27n93k76J272q51n80Q04J5n11
5744c44J83O01n66m37R80o9o12J45O88p39l26R34n89m39Q77J01o17OP28o10k15
5765c20O07j52o43M65O28p74j77R56j43p45L22K67n25j42O91j05n09L10K15k83
5785e7J20M36l32p17P46Q3n54K82M40p41j66P99q8p12P54K96p12k23O69j60p93
5806f30Q10K36q61K78M63l34k55M30R3p09L55L20m38j1O28m21o17Q67K85r30K40
$$ plain form
5827 -201 725 -104 -524 227 194 -559 57 581 -139 -487 335 74 -479 275 338 -504 -352 590 -112 -453 373
5848 373 164 -663 -39 574 -226 -356 493 80 -648 154 360 -226 -237 431 -19 -496 234 434 -557 -185
5868 -185 405 -248 -536 482 117 -631 145 483 -109 -135 590 -183 -300 133 492 -350 -156 420 81 -438
5888 -438 466 398 -529 -152 576 -209 -375 331 203 -406 129 258 -443 -279 460 -146 -490 46 286 -431
5908 -431 147 489 -160 -180 239 24 -514 -62 707 -225 -68 501 160 -613 179 619 -233 -300 442 -204 -522
5929 -522 335 240 -338 -178 486 -310 -462 294 188 -424 -23 238 -189 -218 432 53 -546 348 463 -433 50
5950 50 635 5 -337 362 349 -676 -142 393 -286 -388 573 212 -453 58 440 -147 -273 288 34 -414
5970 -414 194 299 -283 169 341 -323 -615 395 -60 -297 -97 398 -443 -466 286 8 -439 222 2 -390
$$ packed form
5827b01R26q29m20P51l3p53O16N24p20l48Q22k61n53P54O3q42J52R42p02l41Q26
5848C73k09q27O24O13q00j30Q49m13p28Q02K06n86j1O68m50m77P30K00r91L72
5868a85N90o53k88J018l65p48P76L38n92k6P25p73j17M33L59q42J94N76l39n19
5888d38R04o8r27L77P28p85j66P06j28o09N35J29p01J64P39o06l44N36K40p17
5908d31N78L42o49k0M19k15n38M52P69r32J57N69l41p73P92M40q52o7P42o46l18
5929e22Q57r5n78J60O64p96j52P56j06o12M01K61m27k9O50l79n99Q94J15q96M83
5950E0N85o30l42O99j3j025N34N35o79j02R61l61o65N11L82n87j26N61k54m48
5970d14O08J05n82M52J72o64k92J010m55k37K00M95q41k3P52k78m47O61k20l92
$$ plain form
5990 -390 -38 570 -307 -37 358 285 -735 1 410 -222 -371 451 153 -590 188 219 -401 -144 681 -326
6010 -326 -342 70 427 -483 118 633 -34 -393 552 55 -601 50 504 -276 -342 366 -84 -456 10 481 -552
6031 -552 -144 502 -243 -318 260 195 -511 -120 465 -350 -254 274 -72 -527 19 386 -346 105 699 -352 -561
6052 -561 249 305 -429 123 425 -188 -20 156 17 -340 188 371 -331 -446 257 -201 -297 151 331 -616 -56
6073 -56 736 -90 -287 259 -20 -520 -162 243 -114 -155 389 140 -337 172 245 -388 -145 389 -124 -383 103
6094 103 274 -585 224 337 -263 -532 292 20 -416 105 493 -407 -149 253 -56 -313 144 344 -76 60
6114 60 316 -244 -400 535 507 -606 53 420 -149 -76 234 35 -699 283 469 -360 110 247 -234 -509 467
6135 467 4 -395 269 209 -214 -70 299 -214 -491 161 200 -68 161 329 -160 -346 504 74 -198 38 401
$$ packed form
5990c90L52O08q77K70L95p3j020P36M09o32j49Q22k98p43P78L1o20K57Q25j007
6010c26j6M12L57r10O01N15o67l59R45m97o56O51M54p80o6P08m50l72M66M71j033
6031e52M08O46p45p5N78o5p06L91N85q15R6N28l46m55N46L67p32M51N94j051k09
6052e61Q10N6p34N52L02o13J68J76j39l57N28J83p02j15P03m58r6M48J80r47N60
6073e6P92q26j97N46k79n00L58M05l57m1N44k49m77N09P3o33K43N34n13k59M86
6094A03J71q59Q09J13o00k69Q24k72m36N21L88r00K58M02l09k57M57K00m20J36
6114F0K56n60j56R35k8j113O59L67n69P3L10j99p34R82J86q29M70J37m81k75R76
6135D67m63l99O64o0m23J44L69n13k77O52L9k68K29J68m89j86Q50m30k72K36L63
$$ plain form
6156 401 -254 -102 456 32 -404 283 294 -326 -30 290 10 -608 95 65 -478 -121 374 60 -348 255 -50
6177 -50 -402 153 350 -75 -203 107 -128 -225 179 370 -345 -22 616 -240 -216 420 215 -338 51 279 -121
6198 -121 -520 332 138 -455 13 267 -167 -152 369 -98 -216 298 246 -343 -76 280 -243 -289 296 128 -400
6219 -400 -142 384 -355 -178 653 254 -415 465 365 -335 -91 440 -38 -456 345 215 -426 38 375 -271
6239 -271 -199 351 -18 -351 272 287 -474 1 527 -198 -517 370 167 -577 100 351 -195 -172 354 1 -446
6260 -446 185 454 -389 45 270 -93 -363 231 197 -464 -14 486 -121 -160 430 365 -112 248 483 -285 -138
6281 -138 652 -159 -398 221 266 -151 -29 708 -426 -135 400 62 -416 166 355 -367 -208 351 18 -259
6301 -259 77 375 -479 -53 375 -117 -379 115 412 -539 153 177 -207 -275 367 154 -563 35 376 -201 -52
$$ packed form
6156D01o55J52N58m24m36O87J1o20K96L20k80o18P03l0n43L57M95l14m08O03l05
6177e0l52N55J97m25j28L10k35r7M04J91p15L23O38q56K4O36k05n53L89K28m00
6198a21l99Q52j94n93M68K54m34J5N21m67j18N14n2n89K67L56n23m6N85j68n28
6219d00K58N26p39J77Q31l99o69Q80j00p00K44N31m78m18Q01j30o41M64L37o46
6239b71P2N50l69l33O23J5p61M75N26p25l19Q87k03p44O77K51n46K3N26l53m47
6260d46O31K69q43M34K25l63k70N94l4o61M50N00o07l9N90o5m77L60K35p68J47
6281a38P90q11k39O19M5m17J22P37j134K91N35l38m78N82J89p22J59N59l33k77
6301b59L36K98q54M26M28m92k62M94K97r51O92K4l84o8O42k13p17N98L41n77J49
$$ plain form
6322 -52 383 -24 -404 3 298 -425 -33 203 -64 -534 220 284 -356 53 350 -71 -486 506 155 -541 254
6343 254 399 76 23 304 -36 -534 381 348 -325 -25 395 -244 -275 261 232 -462 120 448 -351 -351 512 -118
6365 -118 -583 294 264 -413 32 233 -348 -373 508 376 -604 121 438 -140 -319 662 131 -356 55 424 -271
6386 -271 -12 467 -288 -244 242 254 -426 12 319 -203 -196 448 83 -511 195 370 -282 -242 317 -73 -367 144
6408 144 68 -317 -290 267 -275 -449 437 229 -453 58 529 -128 -126 238 114 -369 -44 90 -370 -147 271
6429 271 -25 -386 499 348 -513 -84 171 -172 -133 501 149 -411 59 390 -222 -75 363 -62 -232 353
6449 353 247 -319 159 294 -72 -460 175 -45 -429 -66 235 -197 -287 391 46 -278 247 280 -322 -113 289
6470 289 -93 -466 526 260 -413 10 118 -141 -174 298 23 -409 -104 110 -562 -39 517 -71 -290 406
$$ packed form
6322e2M35m07l80M07K95p23L92K36k67m70P54O4o40M09K97m21m15R92l51o96P95
6343B54J45l23n3K81l40m98R15l3o73L00M20o39l1N36k9o94N82L28p99%Q63o30
6365a18m65Q77l0o77M45K01n81k5Q81j32r80P25L17n78j79R81n31m87M11L69o95
6386b71K59M79p55M4M86J2o80M38L07n22PO44l65n94P06J75o52M0N59l90k94N11
6408A44p6l85K7N57n42j74Q86k08o82N11M71o57KL64j24m83L25J34m60K23M18
6429B71k96l61Q85j51q61M29K55l43L9O34l52n60M70L31o12J47M38m25j70N85
6449C53j06n66M78J35l66l88O35k20l84L63L01m32r0O78l45l24N25L3o02K09M02
6470B89l82l73R92k66o73M23J08k59l3M72k75m32L05K14o72N23N56n88k19O96
$$ plain form
6490 406 438 -309 -2 303 -238 -460 268 129 -223 237 458 -153 -163 563 -114 -405 271 281 -402 -15 36
6511 36 -172 -319 247 43 -462 43 279 -125 -119 217 -133 -276 222 245 -365 63 343 -144 -517 105 192 -353
6533 -353 -54 420 -205 -171 149 382 -91 155 420 -319 85 381 222 -467 293 8 -364 -85 392 -160
6553 -160 -324 432 283 -476 298 107 -277 186 369 -182 -195 373 46 -286 180 268 -238 -125 98 -83 -263
6574 -263 31 111 -129 -162 511 66 -296 85 238 -257 -214 199 -88 -299 154 164 -111 -126 297 -65 -239 207
6596 207 -90 -245 139 229 -183 -51 324 66 -435 158 129 -134 117 417 45 -380 345 149 -201 121 513
6617 513 -89 -101 145 1 -193 115 284 -409 -168 269 239 -270 198 174 -241 42 224 -132 -159 383 -231
6638 -231 -207 20 301 -242 -197 392 -26 -556 209 218 -247 88 451 -129 -240 503 143 -547 230 248 -245 -342
$$ packed form
6490D06L2p47L07L05n41k22P28j39l52M60K21o11j0P26o77k91O76J0o83L87N1
6511C6k08j47N66k04n05N05K36m04OL36l50j43M98K3o10M28K80m87l73O22Q7n45
6533c53K99M74o25L4L20K33m73K46K65p39M04K96j59o89P60k85l72K79M77n52
6553a60j64P56j49p59P74j91l84M63J83n51j3N68l27l32M66Q8n06J13K23j81j80
6574b63K94Q0k40l3O73m45l62L81J53m95M3M13k87k11M53J0k75j5M23l62j74M46
6596B07k97j55L84R0m12J32L75k58n01N93k9k63K51L00l72m25P25j96l50L22L92
6617E13o02j2K46j44j94L08J69o93K41M37l0n09M68k4m15K83J82l56k7N42o14
6638b31K4K27K81n43M5N89m18n30P65Rm65L35L63n80j11P43l60o90P77J8m93r7
$$ plain form
6660 -342 395 -117 -297 117 167 -372 -20 549 -109 -389 332 134 -219 40 170 -295 -276 454 15 -483 311
6681 311 115 -510 -212 533 -114 -306 258 200 -301 -42 178 -101 36 123 74 -489 200 388 -335 -138 560
6702 560 44 -170 292 319 -343 -105 309 -165 -172 486 39 -285 -112 355 53 42 184 10 -219 77 219
6723 219 -187 -80 219 -318 -73 356 -108 -122 150 268 -170 -320 133 91 -426 150 358 -74 6 318 -164
6744 -164 -353 153 116 -191 108 248 -172 -309 267 -8 -317 -9 417 -157 -341 493 -50 -128 -150 200 -217
6765 -217 -35 224 -74 -285 209 344 -228 -56 411 -165 -305 240 0 -498 209 261 -295 -204 134 88 -169
6786 -169 289 9 -401 279 463 -339 -125 289 -69 -323 -85 270 -205 -87 384 -252 -312 346 395 -292 181
6807 181 388 -74 -383 184 -20 -390 96 384 -189 -208 429 75 -558 212 -21 -440 -150 370 127 -366
$$ packed form
6660c42P37n12j80M14N0n39L52N69o58k80P21j98l53K59J30m65J9P30m39m98P94
6681C11j96o25K98P45o47j92N64n8n01K59K20k79J37Q7m9n63O89J88p23J97O98
6702E60n16k14M62K7o62K38M14m74pO58m47l24J73M67l02j1J42j74k29K96J42
6723B19m06J07K99n37K45M29m64j4K72J18m38j50M53m2n17N76K08m32Q0L12m82
6744a64j89N06l7l07K99J40m20j37N76k75l09L08M26n74j84Q34n43p8k2L50m17
6765b17J82K59k98k11M94J35n72J72M67n76j40N45k40m98P07N2n56R1L38m6k57
6786a69M58k80m10O80J84q02K14M14l58k54K38L55m75J18M71o36o0O58M9o87M73
6807A81K07m62l09N67k04l70M86K88n73j9O37l54o33P70k33m19K90N20k43m93
$$ plain form
6827 -366 242 -49 -467 -198 373 -93 -7 329 -121 -289 127 232 -327 -22 347 -35 -576 251 2 -186
6847 -186 42 319 -216 -170 502 -141 -599 383 257 -88 24 214 15 -317 -40 456 -258 -59 305 -90
6867 -90 -490 302 240 -22 -54 174 -169 -88 70 -14 -449 223 509 -307 -220 400 102 -380 146 76 -745 -183
6889 -183 258 -210 -229 425 -129 -427 154 -16 -162 -43 220 -143 -303 311 308 -234 -248 216 68 -154 253
6910 253 -68 -331 7 307 -273 -176 245 -95 -90 121 -45 -386 -175 406 37 -198 181 178 -100 -296 423 -242
6932 -242 -361 258 138 -114 80 416 -608 -182 247 -217 -262 242 345 -325 15 460 125 -398 217 196
6952 196 -351 -184 422 -158 -328 172 -311 -59 113 117 -243 -349 152 -109 -404 350 102 -393 126 192 -243
6973 -243 -115 157 68 -277 8 -2 -419 28 235 -280 -84 10 228 -340 -119 167 -324 -217 -15 363 -364
$$ packed form
6827c66O08k91m18K69N71m66Q6L36m50j68M16J05n59L05L69l82n41Q27k49j88
6847a86K28K77n35M6O72o43m58R82j26l45J12J90j99l32K77M96p14J99L64l95
6867i0m00P92o2k62l2K28l43Q1J58q4m35O72K86q16Q7O20k98m82N26p0q21N62
6889a83M41m68j9O54n54k98N81j70j46J19K63l63j60O14ln42j4M64j48k22M07
6910B53l21k63L38L00n80R7M21l40NK11j66l41K11N81l69k35L79lk78j96P19o65
6932b42j19O19j20k52J94L36j024M26M29m64m5N04J03o70L40M45l35n23O15k1
6952A96n47J67O06n80j70N00m83K52J72Ml60j06N01k61k95P54k48m95N19O6m35
6973b43J28K72q9l45K85j0m17M47K07n15J96R4K18n68K21K86m91J07K02L78p27
$$ plain form
6994 -364 32 20 -31 -51 118 59 -470 252 67 -167 -73 385 32 -328 178 271 -281 -65 437 -208 -215 234 -5
7017 -5 -375 220 238 -315 -181 276 -92 -353 200 -13 -322 -41 276 -218 -98 434 140 -147 5 -5 -125
7038 -125 -190 279 -99 -385 126 230 -163 37 325 -175 -208 331 -63 -272 -150 88 -330 -310 153 -69 -203
7059 -203 247 227 -201 198 438 -137 -212 226 -94 -295 73 84 -57 -149 258 68 -551 159 184 -176 -268 296
7081 296 107 -199 283 48 -310 39 174 14 -158 211 107 -221 207 192 -22 160 261 -277 -294 150 -157
7102 -157 -361 -41 140 -345 -327 325 -51 -144 23 4 -154 -160 324 20 -354 78 362 -161 228 171 -328 -201
7124 -201 567 95 -232 112 47 -214 -166 132 3 -312 66 76 33 -287 475 -342 -419 -50 155 -236 -42 20
7146 20 -15 -286 352 114 -141 -131 190 -75 -145 306 -159 -295 235 184 -102 -192 288 -66 -130 172 118 -325 15
$$ packed form
6994c64L96j2n1k0J69n9n29P22j85k34R4M58l53l60N06R3n52K16N02o45pM49k39
7017el70N95J8n53J34M57l68k61N53k13l09K81L17m94J20N32k94k87J52j0j20
7038a25o5M69l78k86N11J04l93K00K88n00l3N39l94k09J22K38m18K0M63k22j34
7059b03M50k0m28L99K40n75p5M38l20k01L68J1j41r2M07j90o19P10K5l60r2N64
7081B96j89l06M82k35l58L49J35j60j72L69j04l28M28j5k14J82J01n38j7M44l07
7102a57k04L20J81m85J8O52l76r3J67j9j58oM84l04l74M32K84n23L89n7m99J27
7124b01P68m72l27L44o5k61M8K98j29l15L78J0m3l20P62q17p7L69K05l91J94O2
7146B0l5k71O38k38k55J0L21k65p0M51m65j36N30n1k86r0M80l54o4L02n4m43L40
$$ plain form
7169 15 59 -108 -117 256 27 -176 19 255 -319 -82 364 270 -227 -176 248 -333 -24 389 -188 -247 423 118
7191 118 -684 -106 376 -209 -61 265 -190 -242 104 172 -156 -56 -35 -228 -184 199 -94 -120 303 313 -107 -193
7213 -193 102 -197 -388 64 100 -366 -227 136 -117 -169 293 145 -152 -246 267 -337 -14 69 -188 -576 120
7234 120 206 -69 -54 97 10 -241 403 120 -592 -27 -11 -391 -54 147 68 -312 348 295 -348 -146 319 143
7256 143 -370 109 143 -40 -244 479 -18 -164 105 113 -229 136 50 -259 -178 210 148 -425 67 258 -229 -428
7278 -428 163 -18 -448 298 308 -426 -135 -12 -61 -194 136 30 -253 23 82 -207 -76 232 -25 -182 122
7299 122 184 -99 -104 191 -99 -259 201 501 -305 7 42 -226 -316 333 39 -236 107 135 -287 -42 189 204
7321 204 -300 53 -12 -137 -119 150 -224 -316 174 -25 -35 105 250 -265 -26 229 55 -305 291 218 -54 -139
$$ packed form
7169A5M4j67rL73k29k03J95K36n74K37M46r4m97N1M24n81L09M13n77n9O70l05
7191A18q02N78M82n85J48L26m55n2L46O8l28J00K1j93M4L83k93k6M23J0m20q6
7213a93K95k99j91M52L6m66J39L63k53n2M62j48k97r4N13o04L23Q3k57l88O96
7234A20Q6k75J5J51q7k51O44k83p12N65J6l80L37K01p9l80O60n3o43K02M65j76
7256A43n13M79L4j83k04P23m97j46K69Ql42L65q6l09Q1L88o2n73M92J91m87j99
7278d28N91j81m30P46J0p34K91J23m9j33L30j06k83K76N9k89J31L08k57j57L04
7299A22O2k83nK95k90j60M60L00q06L12L5k68r0O49k94k75L43K8m22K45K31J5
7321B04n04L53o5j25J8K69l74r2M90j99j0J40J45n15K39K55j74l60N96p3k72q5
$$ plain form
7343 -139 144 -92 -276 399 242 44 1 276 -60 -86 298 64 -263 15 264 -367 -115 159 -172 -103 212
7364 212 77 -350 -104 316 -266 -207 290 19 -523 144 207 -143 -71 265 52 -189 241 140 -363 -27 367
7385 367 -229 -319 422 -16 12 191 324 -275 -203 259 230 -162 305 87 -415 153 202 -403 -362 96 -23 -318
7407 -318 -25 -45 53 -166 163 -54 -259 -269 186 -285 -177 199 -146 -57 199 128 -227 -171 293 -426 -278 330
7429 330 16 -146 -54 227 -316 -116 59 -159 -357 -95 -93 -219 -23 193 -296 -326 344 14 -7 -32 280 -158
7451 -158 -81 148 -188 -250 73 39 -357 116 238 7 -134 98 208 -275 -250 159 -112 -274 160 25 -325
7472 -325 352 247 -413 -103 307 -16 -196 43 -14 -316 168 79 -276 -112 115 51 -194 114 549 -39 -94
7493 -94 215 95 -421 341 124 -191 36 267 -39 -182 370 127 -263 -90 310 -297 33 207 -45 -246
$$ packed form
7343a39K83k36j84O75j57j98m3K75l36k6L84k34l27K78K49o31K52K74l31O9L15
7364B12j35m27K46M20n82N9M97k71n42O67O3l50P2L36k13k41M30j01n03L36L94
7385C67n96r0P41m38K8J79J33n99P2M62k9l92M67k18n02N68M9o05M1M58j19k95
7407c18K93k0R8k19L29k17k05j0M55m71J08L76l45Q9K56p1l55N6M64p19J48O08
7429C30l14j62R2K81n43K00J75k18j98K62Kj26J96K16m89l0O70l30k1k5L12m38
7451a58P7K29l36o2L23l4l96M73J22k31j41K32J10m83K5M09k71j62M34j35l50
7472c25O77j05o60L10M10l23j80K39n7l02M84q9l55J64K27o4k45L08M35n88n5
7493i4L09j20n16P62k17l15K27K31l06j43N52k43l90J73M00o07L30J74k52k01
$$ plain form
7513 -246 324 352 -118 -155 82 -29 -179 84 5 -242 36 19 -101 -126 407 -5 -330 -84 110 -322 -457 154
7535 154 -86 -264 196 62 -173 68 292 302 -227 150 154 -297 -32 353 -245 -133 362 6 1 -100 211 -77
7557 -77 -93 152 124 -304 242 97 -42 153 97 -98 -214 349 90 -52 211 40 -337 -155 345 -33 -228
7578 -228 -23 105 -281 -95 197 -63 -225 84 117 -340 -43 148 -184 -46 541 -196 -329 132 304 -215
7598 -215 74 -26 -116 11 -155 -122 -223 -165 305 35 -253 207 -73 -409 41 326 -290 -161 238 -52 -151
7619 -151 255 148 -475 -131 188 -9 -148 208 -25 -223 -169 249 -261 -176 -2 69 -6 251 177 -243 -57 292
7641 292 -209 -263 285 159 -425 -59 384 -232 -71 260 94 -201 -52 68 -179 -146 188 -6 -30 142 -64
7662 -64 -203 -9 180 -462 -66 316 149 -332 120 84 -190 1 104 133 -432 -51 424 -260 -88 81 -263
$$ packed form
7513b46N70K8m70l7K37j11j50K63p9k47K78j7j20k5N33m12l25K46J94m32j35O11
7535A54k40j78M60j34k35K41K24J0n29L77Mm51K65L85n98J12M95l56nj01L11k88
7557g7j6K45k8m28N46j45j39J95n6j95j16N63k59j42K63j71l77J82N00l78j95
7578b28K05J28l86J86K92k60j62L09L3m57K97J91l32J38N87p37j33M61J72n19
7598b15K89j00r0J27j66L3j01N8M70k70k88M60k80l36M50K85o16J29L99k90r9
7619a51M06j07o23L44L19j97j39L56k33j98N4M18n10Q5J74P1p5K57p4m20J86L49
7641B92n01n4N48j26n84L66M43o16J61L31j66k95J49J20k47L3L34j94k4J72k06
7662f4j39J94J89o42L96L82j67m81M52l6k74J91J03K9n65L81M75o84J72J69l44
$$ plain form
7683 -263 -166 127 111 -196 -165 3 23 -122 274 191 -339 30 88 -353 -120 163 104 -196 114 154 -339 -89 106
7706 106 -276 -149 103 -84 -410 105 209 -220 48 285 -151 -352 246 365 -277 4 340 -226 -16 36
7726 36 148 168 251 70 -109 15 240 -131 -236 -136 315 -359 -44 463 15 -4 186 -85 -110 -251 144 -31
7748 -31 -216 66 -43 -162 105 211 -348 113 265 2 -32 93 -56 -359 -228 238 -10 119 98 87 -105
7769 -105 91 12 0 -121 120 -17 -156 238 71 -348 50 12 -145 -153 15 74 -304 -36 42 -92 -160 187 -96
7792 -96 -46 196 -5 -123 90 327 -88 -270 192 1 -146 87 267 -101 -338 203 81 -200 -16 364 -240
7813 -240 23 324 95 -10 321 -195 -65 43 62 -174 -191 200 114 -66 -103 364 -192 -97 237 -163 -175 73
7835 73 -181 -165 -310 271 114 -291 121 -52 -114 -164 179 -268 -149 131 -242 -174 10 151 -179 21 189 33
$$ packed form
7683b63R7K93j6l07L1J68K0j45L96q3n30L69N8m41K33K83n9l00L10M0m93K50J95
7706A06l82J27K52j87l26N15J04m29K68K37m36k01N98J19o42K81L36n66K10N2
7726C6J12K0Q3j81j79J24K25l71j05J00M51o74L15N07m48j9J90k71k5j41L95j75
7748c1j85K82j09j19K67J06n59M61J52k63l4J25j49l03J31M66k48J29k1j1j92
7769a05J96p9j2j21K41j37j39L94j67m19L98l8j57qJ68N9l78K68P8j34o8L47k83
7792i6N0K42k01j18K13K37m15j82M62j91j47K33J80l68k37N41j22k81J84L80o04
7813b40K63L01k29j05L31n16J30J08J9k36j7L91q6j80l7M67n56R5L34m00j2K48
7835G3k54J6j45N81j57m05M12j73o2n0L43m47J19K80l73O8J84J41l30K00J68j56
$$ plain form
7857 33 -381 173 174 -113 -126 10 -5 9 355 25 72 84 -46 -83 55 13 -150 -202 209 -11 -209 121 80 85 -274
7882 -274 269 -163 -112 86 217 -139 -137 222 -129 -137 68 218 -249 55 248 -132 -163 -31 -64 -80 -13 42 -80
7905 -80 -109 -2 303 46 11 -185 -58 14 199 -191 -89 224 73 -270 -112 210 -79 190 250 -17 -163 119
7927 119 173 -271 -27 81 59 -240 330 126 81 -208 271 17 -291 -80 276 -214 -75 145 -61 79 123
7948 123 44 -201 -53 177 2 -315 270 17 -191 129 68 -130 -156 78 -251 -16 238 -80 -249 177 406
7969 406 -327 137 317 -182 -175 -226 -72 -283 -18 407 -40 -134 170 92 -154 62 287 -323 91 296 123 -338
7991 -338 215 255 -27 33 226 53 -75 -18 84 -96 115 146 36 -85 23 74 -172 91 43 58 -68 217
8013 217 50 -218 -76 18 -163 -59 220 20 167 264 23 -82 58 356 -405 12 120 -177 -259 385 182
$$ packed form
7857C3m14N54Jk87j3J36j5J4L46l30M7J2j30l7J38m2j63n2M11k20j98L30m1Nl59
7882b74N43m32N1J98J31l56KL59l51qK05J50m67L04J93l80l1J32l3j6O7N5j22
7905h0k9J07L05k57l5j96J27P2J85l90J02L13j51l43J58L22k89K69O0k67j46K82
7927A19N4m44K44J08k2k99N70k04m5k89M79k54l08K11L56m90J39K20k06J40M4
7948A23p9k45J48K30j75l17N85k53k08L20o1j98k6K34l29K35K54l18j69M26K29
7969D06p33M64J80m99Pn1J54k11K65M25m47r4L04p8k46K16K25o10M14K05j73m61
7991c38N53M0k82O0J93j73j28N7J02j80K11L1j10j21J08N1k46K63m8J5j26K85
8013B17j67k68J42R4j81J04K79k00J47R7k41j05J40K98p61M17J08k97q2O44k03
$$ plain form
8034 182 -199 -221 390 -43 -258 211 -71 -45 50 132 -97 5 282 -96 -148 -86 -48 -229 -160 346 -90 -339 149
8057 149 -4 -330 141 354 -137 -265 354 -196 -216 68 87 -113 -12 178 191 -255 -31 -84 -241 28 112 -202
8079 -202 -79 -65 -30 -98 -26 151 -317 -49 134 -250 -232 -97 51 -213 -354 120 142 -229 175 98 -301 93
8101 93 76 29 18 55 22 -137 83 227 -179 58 524 155 -229 243 21 -168 36 162 -32 -146 230 157
8123 157 -140 85 116 -271 -160 252 -57 -221 158 108 -277 -49 109 -14 -139 178 -38 -17 127 157 33
8144 33 -89 157 -323 -101 -18 89 -353 -18 130 -25 -277 292 68 -63 -14 207 152 -219 140 -123 -287
8165 -287 136 35 57 -43 -67 -58 -216 112 128 -170 -2 -32 -374 -194 218 111 -234 -210 90 -185 -137 408 152
8188 152 -79 67 128
$$ packed form
8034A82l81k2O11m33k15M69k82K6R5Q2k29J02K77l78n2O2L8j81O9N06m36k49M88
8057A49j53l26M71K13m91j28O19n50k0K84J9k00J01J90J3m46K24n3j57K69Q4l14
8079b02J23J4L5o8P2J77m68K68J83l84J8J35J48k64j41M74K2l71M04p7l99L94
8101I3j7m7j1L7l3j59K20J44m06K37M66l69l84M72k22j89K04J26j94j14L76p3
8123A57k97K25L1l87J11M12l09j64L79n0l85K28J58j23j25L17k16K1J44L0j24
8144C3j22K46m80K22Q3J07m42L35J48j55k52N69k24j31M9K21n5l71L59k63j64
8165b87M23j01K2j00k4Rj58L28J6k98J68l0l42J80M12j07l45K4L00k75M8N45k56
8188A52k31J46O1
8191A28
$$ Imaginary data points
##PAGE= N=2
##DATA TABLE= (X++(I..I)), XYDATA
$$ plain form
0 0 0 0 0 0 0 0 0 -8 8 -8 8 -16 24 -24 32 -40 48 -64 72 -88 104 -128 152 -177 209 -242 286 -329 377 -433
30 -433 497 -569 647 -730 826 -930 1047 -1174 1310 -1461 1625 -1808 2005 -2221 2454 -2713
46 -2713 2997 -3303 3638 -4007 4415 -4864 5363 -5915 6534 -7234 8029 -8938 9995 -11243
60 -11243 12735 -14559 16850 -19824 23860 -29668 38781 -55184 93805 -373916 48717 611416
72 611416 -466736 -32450 632861 -226546 -576245 381963 162693 -390730 187348 348532
82 348532 -388382 -177520 356449 4842 -208235 246683 135687 -343618 -137934 283236
92 283236 35371 -166392 185127 180968 -338496 -188135 300397 5426 -232853 263285
102 263285 162855 -402722 -40328 326823 -188738 -142328 372461 -57529 -389316 198407
$$ packed form
0@%%%%%%%qJ6j6J6k4M0m8N6p2Q8j12J36j60J92k32K80l29L86m51N28o15P06q10
30d33R30j066J216j377J556j756J977k221K484k771L086l433L813m226M675n167
46b713N710o300O941p645Q422r279J0227j1278J2449j3768J5263j6967J8933k1238
60a1243K3978k7294L1409l6674M3684n3528O8449r3965J48989m67721M22633N62699
72F11416j078152M34286O65311q59407l49699R58208k19270n53423N78078J61184
82C48532p36914K10862N33969l51607k13077M54918j10996m79305K05684M21170
92B83236k47865k01763L51519m159n19464J50361M88532k94971k38279M96138
102B63285j00430n65577L62394L67151n15561M6410N14789m29990l31787N87723
$$ plain form
112 198407 181961 -294368 96636 328514 -239753 -203372 245519 -25107 -201006 190662
122 190662 137448 -201345 -47380 120488 -35358 -37895 102320 54093 -89552 -99943 25608
133 25608 48417 -53212 41975 146471 -95709 -165688 120719 36600 -176544 120626 187142
144 187142 -216349 -90107 230953 -77234 -171887 226235 70568 -265840 50231 188261
154 188261 -150996 -33835 234726 -56713 -205201 95731 73555 -148442 32653 184257
164 184257 -59991 -143520 80387 62097 -136766 -9159 166188 -53430 -163970 113100
174 113100 94570 -173769 24169 207334 -137858 -157406 210258 13715 -228309 157165
184 157165 179955 -254849 -40274 259063 -134149 -176694 261253 47750 -268367 104218
$$ packed form
112A98407j6446m76329L91004K31878n68267L6381M48891k70626j75899L91668
122A90662n3214l38793J53965J67868j55846k537J40215m8227j43645j0391J25551
133B5608K2809j01629R5187J04496k42180o9979K86407q4119k13144K97170O6516
144A87142m03491J26242L21060l08187r4653L98122j55667l36408L16071J38030
154A88261l39257J17161K68561k91439j48488L00932k2176k21997J81095J51604
164A84257k44248q3529K23907j8290j98863J27607J75347k19618j10540K77070
174A13100j8530k68339J97938J83165l45192j9548L67664j96543k42024L85474
184A57165K2790m34804K14575K99337l93212m2545M37947k13503l16117L72585
$$ plain form
194 104218 177033 -220294 -46616 241738 -83401 -180249 164385 59808 -197334 50062
204 50062 170915 -119682 -96818 150838 1810 -159223 71652 130365 -123171 -65348 158544
215 158544 -13112 -155861 105167 123740 -166204 -42204 185801 -71200 -160069 166702
225 166702 82084 -203891 36657 177768 -148157 -98512 199810 -19519 -185682 120142
235 120142 101323 -184344 651 177129 -94157 -113157 153211 29123 -158420 52314
245 52314 123210 -106705 -64568 129236 1569 -120600 59019 97800 -92995 -46275 117165
256 117165 -13042 -118098 67329 83153 -113264 -24385 127884 -50417 -109899 107037
266 107037 48671 -135817 30575 119715 -103109 -66324 135575 -15379 -128701 87677
$$ packed form
194A04218P2815l97327J73678K88354l25139r6848L44634j04577k57142K47396
204E0062J20853k90597K2864K47656j49028j61033K30875N8713k53536N7823K23892
215A58544j71656j42749K61028J8573k89944J24000K28005k57001q8869L26771
225A66702q4618k85975K40548J41111l25925M9645K98322k19329j66163L05824
235A20142j8819k85667J84995J76478k71286j9000K66368j24088j87543K10734
245E2314P0896k29915M2137J93804j27667j22169J79619L8781j90795M6720J63440
256A17165j30207j05056J85427J5824j96417Q8879J52269j78301n9482K16936
266A07037n8366j84488J66392Q9140k22824L6785K01899j50954j13322K16378
$$ plain form
276 87677 79832 -126534 -2612 134995 -57309 -90425 105341 28075 -122063 29823 99981
287 99981 -74792 -49329 105476 -2424 -101910 53918 70614 -96088 -27679 104004 -36289
298 -36289 -94543 86616 54154 -115466 5761 111155 -71028 -77636 115570 20744 -122464
309 -122464 48761 95846 -101989 -38971 125613 -24901 -106714 85900 62945 -112621 5513
320 5513 113581 -64087 -81637 97327 18233 -112412 40046 92104 -85696 -42719 109495
331 109495 -17207 -103914 67111 60651 -109265 -11040 112084 -44341 -79404 96383 36144
342 36144 -110555 22068 94781 -73801 -53583 102958 1951 -96633 55401 70955 -90187
353 -90187 -23003 99850 -32940 -84497 77682 44670 -101282 7192 94228 -64439 -67841
$$ packed form
276H7677p845k06366J23922J37607j92304l3116J95766p7266j50138J51886P0158
287I9981j74773K5463J54805j07900r9486J55828J6696j66702O8409J31683j40293
298c6289n8254J81159l2462j69620J21227J05394j82183o608J93206r4826j43208
309a22464J71225M7085j97835O3018J64584j50514q1813J92614k2955j75566J18134
320E513J08068j77668j7550J78964p9094j30645J52458N2058j77800M2977J52214
331A09495j26702q6707J71025o460j69916R8225J23124j56425l5063J75787o0239
342C6144j46699J32623P2713j68582K0218J56541j01007r8584J52034J5554j61142
353i0187O7184J22853j32790n1557J62179l3012j45952J08474Q7036j58667l402
$$ plain form
364 -67841 94450 11330 -104432 48216 84740 -90123 -32259 108142 -32712 -97665 80834
375 80834 51453 -104568 13238 104186 -60390 -60999 96449 8796 -98801 40122 67705
386 67705 -78785 -24219 92758 -19915 -76609 59416 42783 -85524 -6309 83665 -38885
397 -38885 -68336 71621 32938 -90306 10915 84761 -56427 -56776 89612 13776 -93489
408 -93489 41238 74038 -80672 -28172 97527 -24943 -83169 68590 43211 -85749 13654
419 13654 84391 -53249 -54198 70163 2429 -76468 34974 58378 -60099 -27704 68028 -7619
431 -7619 -61749 40839 45930 -65007 -26464 66096 -10616 -57266 53900 45089 -73761 -11436
443 -11436 73258 -34293 -50193 78621 17449 -92343 26032 68407 -71834 -21452 100083
$$ packed form
364f7841J62291q3120j15762J52648L6524j74863N7864J40401j40854o4953J78499
375H0834k9381j56021J17806R0948j64576o09J57448q7653j07597J38923K7583
386F7705j46490N4566J16977j12673n6694J36025j6633j28307P9215Q9974j22550
397c8885k9451J39957l8683j23244J01221P3846j41188l49J46388p5836j07265
408i3489J34727L2800j54710N2500J25699j22470n8226J51759k5379j28960R9403
419A3654P0737j37640r49J24361o7734p8897J11442K3404j18477L2395R5732p5647
431g619n4130J02588N091j10937L8543R2560p6712m6650J11166q811j18850O2325
443a1436Q4694j07551j5900J28814o1172j09792J18375M2375j40241N0382J21535
$$ plain form
454 100083 -27498 -90482 65370 40994 -89798 20269 91345 -67052 -65180 79348 2615
465 2615 -80419 56597 69805 -80321 -31121 79578 -23846 -66488 71389 45113 -89838
476 -89838 -8852 78144 -41815 -48410 93040 22388 -102061 18518 70433 -76484 -28599
487 -28599 113888 -15653 -106061 58147 50616 -100610 13647 116390 -58609 -80769 82341
498 82341 4361 -95877 61512 83645 -86249 -30545 80559 -39850 -60897 92423 40104
509 40104 -88344 5278 54043 -62688 -28514 90266 10431 -70681 20036 31305 -59654
520 -59654 -6409 78866 -5688 -62417 21522 17093 -59398 8965 78978 -15810 -52514 32293
532 32293 5063 -59803 28482 69947 -34315 -35850 38302 -18807 -49155 52883 50919 -43909
$$ packed form
454A00083j27581o2984J55852k4376j30792J10067P1076j58397J872J44528p6733
465B615q3034J37016J3208j50126M9200J10699j03424m2642J37877k6276j34951
476h9838Q0986Q6996j19959o595J41450p0652j24449J20579N1915j46917M7885
487b8599J42487j29541r0408J64208p531j51226J14257J02743j74999k2160J63110
498H2341p7980j00238J57389K2133j69894N5704J11104j20409k1047J53320n2319
509D0104j28448R3622M8765j16731L4174J18780p9835q1112R0717J1269r0959
520e9654N3245Q5275q4554n6729Q3939m429p6491O8363P0013r4788l6704Q4807
532C2293k7230o4866Q8285M1465j04262j535P4152n7109l0348J02038j964r4828
$$ plain form
544 -43909 -12162 31339 -37027 -32975 56370 30787 -40546 -7952 16437 -32992 -20827 48135
556 48135 30952 -31557 -15662 13536 -25927 -24810 48126 35237 -41888 -13595 28299 -33293
568 -33293 -25034 70403 26810 -59338 6864 29697 -59308 -9009 86062 -5271 -59899 37261
580 37261 11486 -74793 23152 83796 -37185 -46213 49178 -14442 -73341 43026 68364 -46578
592 -46578 -25916 47979 -28263 -56238 56294 47860 -52692 -5045 42370 -50731 -39546 78832
604 78832 24828 -63068 26569 40587 -78768 -18842 95341 -9051 -65346 52682 16923
615 16923 -92571 16702 86691 -41427 -34971 66534 -24915 -80148 53859 52101 -61980
626 -61980 4920 58983 -58723 -50306 75250 20764 -57744 32709 40548 -71534 -24456 73698
$$ packed form
544d3909L1747M3501o8366M052Q9345k5583p1333L2594K4389m9429J2165O8962
556D8135j7183o2509J5895K9198l9463J117P2936j2889p7125K8293M1894o1592
568c3293Q259R5437m3593q6148O6202K2833q9005N0299R5071r1333n4628R7160
580C7261k5775q6279R7945O0644j20981r028R5391o3620n8899J16367K5338j14942
592d6578K0662P3895p6242k7975J12532q434j00552M7647M7415r3101J1185J18378
604G8832n4004q7896Q9637J4018j19355N9926J14183j04392n6295J18028l5759
615A6923j09494J09273O9989j28118O456J01505r1449n5233J34007j758j14081
626f1980O6900N4063j17706Q417J25556n4486p8508R0453P839j12082M7078R8154
$$ plain form
638 73698 -2826 -48743 43438 23002 -71728 -2930 69755 -17913 -37540 48640 2836 -70848
650 -70848 15727 55687 -35633 -18790 53257 -19044 -58482 39639 37065 -46828 3473 48158
662 48158 -37899 -41917 48326 17849 -42565 17648 36715 -37956 -23132 43078 4859 -33173
674 -33173 19329 21880 -37103 -13615 36351 -3542 -27274 24273 17821 -38265 -6531 36010
686 36010 -12477 -27371 29122 11028 -41117 3659 36108 -20689 -17835 38616 1626 -41209
698 -41209 16171 30372 -31731 -10427 42346 -8215 -39780 25164 26572 -35138 -2529 41797
710 41797 -17992 -36302 30456 14233 -41085 9475 38416 -32509 -24685 44556 -265 -44132
722 -44132 28702 32076 -48495 -10750 50888 -18551 -39607 43927 19788 -51958 9714 48000
$$ packed form
638G3698p6524m5917R2181k0436r4730O8798P2685q7668j9627Q6180m5804p3684
650g0848Q6575L9960r1320J6843P2047p2301l9438R8121k574q3893N0301M4685
662D8158q6057m018R0243l0477o0414O0213J9067p4671J4824O6210l8219l8032
674c3173N2502K551n8983K3488M9966l9893k3732N1547o452n6086L1734M2541
686C6010m8487j4894N6493j8094n2145M4776L2449n6797K854N6451l6990m2835
698d1209N7380J4201o2103K1304N2773n0561l1565O4944J408o1710L2609M4326
710D1797n9789j8310O6758j6223n5318N0560K8941p0925P824O9241m4821m3867
722d4132P2834L374q0571L7745O1638o9439k1056Q3534k4139p1746O1672L8286
$$ plain form
734 48000 -33104 -25753 49801 -550 -50702 24858 35083 -43538 -10560 50254 -15294 -41150
746 -41150 36995 20132 -49087 4456 43650 -32005 -29679 46365 2774 -49517 25109 38981
758 38981 -43486 -13010 52592 -15049 -45612 38306 25189 -48584 3548 46479 -27991 -29315
770 -29315 45130 6961 -44103 19089 30862 -40153 -12418 44689 -12237 -38283 31022 18454
782 18454 -44187 3971 44024 -24293 -30859 37951 6088 -45627 16495 38845 -34580 -19474
794 -19474 45053 -4070 -40584 30541 30139 -43230 -7896 43331 -18454 -33163 38568 14897
806 14897 -45407 8787 38653 -30100 -20100 43619 -4083 -46986 22293 30613 -40576 -8570
818 -8570 47256 -14968 -41623 34073 24803 -42911 1095 43079 -24831 -33211 39787 12923 -41764
$$ packed form
734D8000q1104P351P5554n0351n0152P5560J0225p8621L2978O0814o5548k5856
746d1150P8145j6863o9219N3543L9194p5655K326P6044m3591n2291P4626J3872
758C8981q2467L0476O5602o7641l0563Q3918j3117p3773N2132M2931p4470j324
770b9315P4445l8169n1064O3192J1773p1015K7735N7107n6926k6046O9305j2568
782A8454o2641M8158M0053o8317o566O8810l1863n1715O2122K2350p3425J5106
794a9474O4527m9123l6514P1125m02p3369L5334N1227o1785j4709P1731k3671
806A4897o0304N4194K9866o8753J0000O3719m7702m2903O9279Q320p1189L2006
818h570N5826o2224k6655P5696r270o7714M4006M1984o7910q380P2998k6864n4687
$$ plain form
831 -41764 14344 36451 -33795 -18380 44979 -2772 -40372 24931 24342 -43300 -5999 44714
843 44714 -16883 -34031 35126 13491 -44967 9208 40606 -29690 -25742 40295 934 -43571
855 -43571 21710 34809 -35847 -12761 43724 -9252 -36365 30895 21744 -41404 391 39288
867 39288 -22908 -25535 39715 6283 -42597 16897 33366 -35807 -15394 43038 -9682 -41456
879 -41456 27325 24095 -40546 -2313 42334 -18980 -31484 35451 12408 -41504 9463 35447
891 35447 -29446 -20390 41442 1097 -38265 23078 28789 -36962 -8247 42365 -14235 -34956
903 -34956 32348 15141 -43592 6926 39919 -28143 -23565 41834 69 -44377 21052 30665
915 30665 -37996 -10674 41336 -13236 -34219 31073 18884 -35695 4876 33655 -23144 -21720
$$ packed form
831d1764N6108K2107p0246J5415O3359m7751l7600O5303n89o7642L7301N0713
843D4714o1597j7148O9157k1635n8458N4175L1398p0296L948O6037l9361m4505
855d3571O5281J3099p0656K3086N6485n2976k7113O7260r151o3148M1795L8897
867C9288o2196k627O5250l3432m8880N9494J6469o9173K0413N8432n2720l1774
879d1456O8781l230o4641L8233M4647o1314j2504O6935k3043n3912N0967K5984
891C5447o4893R056O1832m0345l9362O1343N711o5751K8715N0612n6600k0721
903c4956O7304j7207n8733N0518L2993o8062M578O5399m1765m4446O5429R613
915C0665o8661K7322N2010n4572k0983O5292j2189n4579M0571K8779n6799J424
$$ plain form
927 -21720 33339 4348 -33082 15237 25669 -29195 -11333 36262 -3956 -30905 21609 18138
939 18138 -35597 -4642 35371 -14003 -26822 28849 9213 -37197 8285 33144 -23125 -16245
951 -16245 32773 -4393 -33851 19007 22645 -26576 -2174 30218 -13517 -22923 25116 11145
963 11145 -25517 6165 22826 -20785 -19075 25402 6773 -25392 9542 24554 -23364 -20476
975 -20476 28685 5414 -29812 13019 23682 -31477 -14939 35325 -3123 -26087 28020 14905
987 14905 -40653 949 35791 -19434 -16420 37580 -2284 -42035 15824 28786 -25325 -2824
999 -2824 35873 -15333 -36338 20137 18719 -25403 3209 30194 -21229 -32054 25007 17181 -25342
1012 -25342 9046 30076 -29644 -29801 33158 8952 -29537 23135 25909 -43474 -12830 43966
$$ packed form
927b1720N5059k8991l7430M8319J0432n4864J7862M7595m0218k6949N2514l471
939A8138n3735L0955M0013m9374j2819N5671j9636m6410M5482K4859n6269O880
951a6245M9018l7166k9458N2858L638m9221K4402L2392m3735r406M8039j3971
963A1145l6662L1682J6661m3611J710M4477j8629l2165L4934J5012m7918K888
975b0476M9161k3271l5226M2831J0663n5159J6538N0264l8448k2964N4107j3115
987A4905n5558M1602L4842n5225L014N4000l9864l9751N7859J2962n4111K2501
999b824L8697n1206k1005N6475j418m4122K8612K6985n1423j0825N7061p826m2523
1012b5342L4388K1030n9720j57O2959k4206l8489N2672K774o9383L0644N6796
$$ plain form
1024 43966 -9761 -24754 41190 6093 -55054 9645 39066 -28814 -7739 46025 -15726 -45601
1036 -45601 25283 21346 -30593 9135 32438 -28357 -28726 26257 6830 -21777 17611 21597 -28211
1049 -28211 -16955 25576 1990 -18626 20368 17350 -32858 -12057 30200 -5516 -18925 32039
1061 32039 12950 -40912 -181 31722 -21117 -14504 38383 -2612 -40658 13547 20036 -26063
1073 -26063 4368 32686 -17275 -24496 18138 -73 -20528 18568 20201 -21694 -10829 16834
1085 16834 -4323 -12815 19136 17551 -18344 -14366 13040 501 -14211 14422 20496 -19058 -16175
1098 -16175 17123 -1398 -15902 20900 14653 -28942 -7102 19292 -15501 -10386 31971 2458
1110 2458 -30643 7971 15388 -22170 1544 30677 -9481 -24092 12874 6386 -19204 9162
$$ packed form
1024D3966n3727j4993O5944l5097o1147O4699K9421o7880K1075N3764o1751k9875
1036d5601P0884l937n1939L9728K3303o0795l69N4983j9427k8607L9388L986m9808
1049b8211J1256M2531k3586k0616L8994l018n0208K0801M2257l5716j3409N0964
1061C2039j9089n3862M0731L1903n2839O613N2887m0995l8046N4205O489m6099
1073b6063L0431K8318m9961p221M2634j8211k0455L9096J633m1895J0865K7663
1085A6834k1157q492L1951j585l5895L978K7406j2539j4712K8633O074l9554K883
1098a6175L3298j8521j4504L6802o247m3595K1840K6394l4793N115M2357k9513
1110B458l3101L8614P417l7558K3714K9133m0158j4611L6966o488k5590K8366
$$ plain form
1122 9162 25176 -10791 -17854 12539 4277 -17443 7972 22385 -13466 -19350 15010 3327 -21336
1135 -21336 12856 24374 -21968 -15211 24124 -7041 -25279 26180 17685 -34604 -802 28995
1147 28995 -21818 -16340 38450 3282 -34457 15466 19402 -31421 -1380 35658 -12210 -24417
1159 -24417 23366 6097 -28342 10128 26992 -17771 -15797 19923 -2272 -24098 12585 20639
1171 20639 -18581 -9949 21323 -5407 -21777 18826 17882 -25569 -4452 25816 -14601 -21363 30001
1184 30001 11652 -31834 7597 26363 -24160 -11960 33671 -3446 -28540 17905 12132 -28846
1196 -28846 4037 27470 -16816 -15581 23843 -1313 -25304 13322 17514 -21008 -7807 20715
1208 20715 -5293 -18709 14485 14378 -17440 -4537 19775 -5214 -17480 14953 11893 -20993
$$ packed form
1122I162J6014l5967p063L0393q262k1720K5415J4413l5851n884L4360j1683k4663
1135b1336L4192J1518m6342O757L9335l1165j8238N1459q495n2289L3802K9797
1147B8995n0813N478N4790l5168l7739M9923L936n0823L0041L7038m7868j2207
1159b4417M7783j7269l4439L8470J6864m4763J974L5720k2195k1826L6683Q054
1171B0639l9220Q632L1272k6730j6370M0603r44m3451K1117L0268m0417o762N1364
1184C0001j8349m3486L9431J8766n0523J2200M5631l7117k5094M6445n773m0978
1196b8846L2883K3433m4286J235L9424k5156k3991L8626M192l8522J3201K8522
1208B0715k6008j3416L3194j07l1818J2903K4312k4989j2266L2433l060l2886
$$ plain form
1220 -20993 -1527 21998 -10400 -16315 22227 6613 -24996 7556 19740 -21351 -9470 25253
1232 25253 -6830 -23153 18465 11190 -25000 3232 23547 -15192 -15181 21559 2574 -22681 7961
1245 7961 17744 -15350 -8547 19743 768 -17250 9723 14106 -15762 -6123 18690 -4755 -18209
1258 -18209 14604 11206 -21621 -329 23221 -12988 -17256 22762 4009 -26777 8640 20040
1270 20040 -21988 -8433 26431 -6233 -21847 19036 12084 -23874 2292 22274 -13905 -14393
1282 -14393 20281 3647 -20346 8031 16891 -14941 -7657 19390 -1686 -18275 10815 11969
1294 11969 -18972 -4576 20805 -7700 -18073 17362 9784 -23021 2174 22527 -14448 -15490
1306 -15490 22273 1961 -23929 10777 18060 -19555 -4979 24099 -6496 -18059 17449 8689
$$ packed form
1220b0993J9466K3525l2398n915L8542j5614l1609L2552J2184m1091J1881L4723
1232B5253l2083j6323M1618p275l6190K8232K0315l8739J1L6740j8985k5255L0642
1245G961R783l3094O803K8290j8975j8018K6973M383k9868R639K4813k3445j3454
1258a8209L2813l398l2827K1292K3550l6209m268M0018j8753l0786L5417J1400
1270B0040m2028J3555L4864l2664j5614M0883o952l5958K6166J9982l6179m88
1282a4393L4674j6634k3993K8377Q860l1832P284K7047k1076j6589K9090J154
1294A1969l0941J4396K5381k8505j0373L5435p578l2805K5195K0353l6975j042
1306a5490L7763k0312k5890L4706P283l7615J4576K9078l0595j1563L5508q760
$$ plain form
1318 8689 -21798 2682 19129 -13353 -12151 19399 2546 -19124 8372 14933 -16450 -7579 18874
1331 18874 -4137 -19015 12432 12295 -19147 -2122 21079 -7704 -16438 17229 8166 -21007 2976
1344 2976 18706 -13002 -10893 19626 990 -18181 11127 13344 -17087 -2804 19128 -7700
1356 -7700 -15748 15155 6311 -19939 2902 17728 -12046 -11413 17723 2578 -18966 6840 14004
1369 14004 -15334 -7105 17890 -2975 -16286 12237 10949 -16271 -288 18116 -8365 -12802
1381 -12802 15243 4159 -17593 5361 14641 -12995 -7401 17738 -1657 -16495 10278 10741 -17591
1394 -17591 -3519 17411 -7309 -15183 13781 7693 -17362 1784 16391 -10047 -10603 15756 1751
1407 1751 -16494 7560 12005 -14268 -3563 17935 -4280 -13734 13416 7487 -17235 1380 16080
$$ packed form
1318H689l0487K4480J6447l2482J202L1550j6853k1670K7496O561l1383Q871K6453
1331A8874k3011j4878L1447j37l1442J7025K3201k8783q734L3667r063k9173K3983
1344B976J5730l1708K109L0519j8636j9171K9308K217l0431J4283K1932k6828
1356g700q048L0903q844k6250K2841J4826k9774O33K9136j5145k1544K5806P164
1369A4004k9338Q229K4995k0865j3311K8523j288k7220J5983J8404k6481m437
1381a2802K8045j1084k1752K2954R280k7636N594K5139j9395j4838K6773M63k8332
1394a7591J4072K0930k4720p874K8964o088k5055J9146J4607k6438n56K6359j4005
1407A751j8245K4054M445k6273J0705K1498k2215r454K7150n929k4722J8615J4700
$$ plain form
1420 16080 -10275 -11283 14902 2045 -16683 6654 13979 -12695 -6851 15171 -3274 -15676
1432 -15676 9674 9926 -15282 -2283 15281 -6474 -11267 14662 6380 -15612 3637 12824 -12209
1445 -12209 -7033 17170 -585 -15532 9633 9435 -15781 -504 18146 -6808 -13613 11744 3285
1458 3285 -16835 3792 14562 -9790 -7990 12391 -1059 -12333 8738 10213 -11561 -3643 10721
1471 10721 -5286 -10012 11809 7626 -11725 245 11562 -7672 -7738 13932 3916 -14058 2636
1484 2636 9309 -12097 -5029 16287 -346 -13447 7415 6266 -14671 -113 15305 -5576 -10755
1497 -10755 8959 626 -13048 5923 12637 -7226 -4364 9621 -4076 -11006 9304 9251 -9899
1510 -9899 -1869 10126 -6233 -10256 12170 9275 -10923 -1163 9647 -9373 -9807 13066 5331
$$ packed form
1420A6080k6355j008K6185j2857j8728K3337P325k6674N844K2022j8445j2402
1432a5676K5350K52k5208J2999J7564k1755m793K5929q282k1992J9249R187k5033
1445a2209N176K4203j7755j4947K5165j98k5216J5277J8650k4954o805K5357q459
1458C285k0120K0627J0770k4352J800K0381j3450j1274K1071J475k1774P918J4364
1471A0721j6007m726K1821m183j9351J1970J1317j9234o6K1670j0016j7974J6694
1484B636O673k1406P068K1316j6633j3101K0862j149k0937J4558J5418k0881n179
1497a0755J9714q333j3674J8971O714j9863K862J3985j3697o930K0310n3j9150
1510i899Q030J1995j6359m023K2426k895k0198R760J0810j9020m34K2873p735
$$ plain form
1523 5331 -12558 2242 7692 -12741 -4271 16329 -343 -11402 7848 2922 -15971 2043 15793
1536 15793 -5616 -6933 11174 -1503 -14071 8124 13026 -8413 -3709 10175 -5652 -12880 9338
1549 9338 10569 -9119 -2326 10023 -6921 -11337 10466 8211 -10740 -254 8221 -11678 -8475
1562 -8475 14857 3483 -10794 7796 6584 -16617 -1763 17427 -4092 -10100 12195 1111
1574 1111 -17183 4640 15142 -6799 -4100 11604 -4137 -13762 6814 9106 -7665 -1599 8033
1587 8033 -6366 -10273 7900 7464 -6830 -135 7715 -8249 -9664 10080 5558 -9769 4001
1600 4001 9178 -12265 -6324 16045 1508 -11463 9269 6861 -16409 -2038 15626 -4258 -8630
1613 -8630 11149 973 -14170 4032 10302 -7215 -2596 9162 -5273 -11246 6933 6288 -8115
$$ packed form
1523E331j7889J4800N450k0433Q470K0600j6672j1059J9250m926j8893J8014J3750
1536A5793k1409j317J8107j2677j2568K2195M902k1439M704J3884j5827p228K2218
1549I338J231j9688O793J2349j6944m416K1803k255j8951J0486Q475j9899L203
1562h475K3332j1374j4277J8590j212k3201J4854J9190k1519o008K2295j1084
1574A111j8294K1823J0502k1941K699J5704j5741r625K0576K292j6771O066R632
1587H033j4399l907J8173m36j4294O695P850j5964j415J9744m522j5327J3770
1600D001N177k1443N941K2369j4537j2971K0732k408k3270J4371J7664j9884m372
1613h630J9779j0176j5143J8202O270j7517M619J1758j4435n973J8179o45j4403
$$ plain form
1626 -8115 610 9668 -5381 -9657 8556 6854 -9542 121 10887 -7014 -10193 11204 5070
1639 5070 -10803 4810 10770 -11220 -6129 13567 -1792 -11013 9566 5161 -14496 468 12240
1652 12240 -7060 -5838 12218 -887 -12781 4953 7981 -9340 -2230 10971 -3660 -10384 6869
1665 6869 7336 -7853 -778 10796 -3509 -10036 7173 6092 -9637 640 10857 -7125 -7791
1678 -7791 11237 2069 -11564 6176 8289 -13022 -3643 12960 -4726 -10275 10518 3880 -13533
1691 -13533 2672 11394 -7742 -5346 10502 -1023 -10688 5142 7415 -7681 -1787 9274 -1193
1704 -1193 -7847 5642 6120 -7459 -2080 8487 -3026 -8204 6556 4058 -9772 972 9582
1717 9582 -7076 -6772 10950 428 -12778 5649 8727 -11636 -3508 12894 -3491 -9728 9480
$$ packed form
1626h115Q725R058j5049m276J8213j702j6396R663J0766j7901l179K1397o134
1639E070j5873J5613N960k1990N091J9696j5359r221K0579m405j9657J4964J1772
1652A2240j9300J222J8056j3105j1894J7734L028j7321P110J3201j4631o724J7253
1665F869M67j5189P075J1574j4305o527J7209j081j5729J0277J0217j7982o66
1678g791J9028r168j3633J7740K113k1311R379J6603j7686n549K0793o638j7413
1691a3533J6205Q722j9136K396J5848j1525r665J5830K273j5096N894J1061j0467
1704a193o654J3489M78j3579N379J0567j1513n178J4760k498j3830J0744Q610
1717I582j6658L04J7722j0522j3206J8427L078k0363Q128J6402j6385o237J9208
$$ plain form
1730 9480 5570 -10861 1173 9480 -6419 -4899 9046 47 -8943 4304 6301 -6782 -1524
1743 -1524 9127 -2060 -8467 5037 4915 -8329 -1237 9033 -3976 -8747 7635 4797 -9224
1756 -9224 1515 9969 -7328 -7857 10507 1760 -10462 5566 8318 -10190 -2714 12132 -2316
1769 -2316 -7400 8422 2285 -11165 2327 8902 -6824 -4212 9292 -1916 -9760 5972 7178
1782 7178 -8172 -2606 8098 -3424 -8795 6147 5812 -7727 -1182 8109 -3669 -6230 8069
1795 8069 3946 -8598 1172 7471 -6785 -4093 10883 408 -9368 5451 6193 -9233 -208 10201
1809 10201 -5065 -8093 7846 1275 -9876 3864 7876 -7654 -4388 8683 -1012 -7639 4944
1822 4944 4965 -7855 -2039 7351 -1930 -4976 5952 3755 -6506 438 6733 -3282 -4468 6657
$$ packed form
1730I480l910j6431J2034Q307j5899J520J3945q999q990J3247J997j3083N258
1743a524J0651j1187o407J3504j22j3244P092J0270j3009m771J6382k838j4021
1756i224J0739Q454j7297n29J8364q747j2222J6028K752j8508P476J4846j4448
1769b316n084J5822o137j3450J3492O575j5726K612J3504j1208p844J5732J206
1782G178j5350N566J0704j1522n371J4942l35j3539O545R291j1778k561J4299
1795H069m123j2544R770O299j4256K692J4976j0475r776J4819P42j5426R025J0409
1809A0201j5266l028J5939o571j1151J3740M012j5530L266J3071r695o627J2583
1822D944K1j2820N816R390r281l046J0928k197j0261O944O295j0015j186J1125
$$ plain form
1836 6657 916 -8284 2551 7146 -6342 -3211 9146 -1422 -9076 5629 5318 -8936 -897 8321
1850 8321 -5209 -6798 8239 2087 -8452 3279 6835 -6438 -2692 8134 -1095 -6865 4690
1863 4690 4397 -6310 -266 7272 -2283 -4749 5549 2597 -6602 1155 6306 -5251 -4783 6735
1877 6735 804 -8085 3242 6665 -6549 -3099 7991 -1501 -7648 4778 3772 -7702 135 7408
1891 7408 -4260 -4301 7719 1374 -7142 3640 5660 -6382 -2300 7717 -1764 -6337 5352 4022
1905 4022 -7099 51 7106 -3498 -5423 5856 1621 -7988 1335 6042 -5113 -3404 7071 -15
1919 -15 -6724 3944 4758 -6217 -940 6294 -3197 -5086 5935 2262 -6619 2593 6852 -5317 -3460
1934 -3460 7481 -265 -7123 3769 4980 -7232 -2579 7307 -1848 -5761 5651 2845 -7503 -51
$$ packed form
1836F657n741r200J0835M595j3488L131J2357j0568p654J4705l11j4254Q039R218
1850H321j3530j589J5037o152j0539J1731L556j3273L746J0826r229n770J1555
1863D690k93j0707O044P538r555k466J0298k952r199P757N151j1557M68J1518
1877F735n931q889J1327L423j3214L450J1090r492o147J2426j006j1474P837P273
1891G408j1668m1J2020o345q516J0782K020j2042M082J0017r481m573J1689j330
1905D022j1121P150P055j0604j925J1279m235r609R323M707j1155J709J0475p086
1919a5o709J0668Q14j0975N277P234r491j889J1021l673q881R212M259j2169J857
1934c460J0941p746o858J0892J211j2212M653R886r155l913J1412k806j0348P452
$$ plain form
1948 -51 5813 -4927 -3086 6969 -709 -7191 3673 4543 -5892 331 7430 -3345 -5973 4973
1962 4973 2168 -5549 1778 6016 -4379 -4350 5171 1901 -4790 2585 4885 -5451 -4490 4878 417
1977 417 -5288 3407 3953 -6200 -2381 6022 -1559 -4062 6014 1416 -8031 1152 6294 -4482 -2203
1992 -2203 7970 -499 -7460 3759 4740 -5228 -524 6559 -2774 -5836 3348 2100 -4379 1251 4587
2007 4587 -2846 -4180 2980 1319 -4146 1079 4522 -3886 -4601 4768 1283 -5367 3769 6325 -6271
2022 -6271 -3018 7497 -1798 -6522 7147 4260 -9503 174 8153 -5448 -4039 9732 455 -9098
2036 -9098 2962 4443 -7227 -474 7943 -2927 -5922 4374 1225 -5939 2976 6376 -4649 -4609
2050 -4609 4613 8 -6165 4138 6964 -5350 -4092 6640 -214 -6339 5890 6215 -8286 -2843
$$ packed form
1948e1N864j0740J841J0055p678o482J0864Q70j0435O223P099j0775k628J0946
1962D973k805p717P327M238j0395K9R521l270o691P375K300j0336R61R368m461
1977D17n705Q695N46j0153L819Q403p581k503J0076m598r447R183N142j0776K279
1992b203J0173q469o961J1219R81r968M704P083r333l062R184j248o479N630L336
2007D587p433j334P160j661n465N225L443q408p15R369l485o650R136K556j2596
2022f271L253J0515r295m724J3669k887j3763R677P979j3601J409J3771r277r553
2036i098J2060J481j1670O753Q417j0870k995J0296l149p164Q915L400j1025M0
2050d609R222m605o173J0303K826j2314J258J0732o854o125J2229L25j4501N443
$$ plain form
2064 -2843 7692 -3943 -5554 9066 2637 -9555 2391 5961 -7466 -1605 9504 -3364 -7600
2077 -7600 5533 1314 -7762 3966 7366 -5710 -3057 6342 -1159 -5353 4611 4688 -5045 -2265 4036
2092 4036 -690 -3475 3443 4403 -3383 -2463 3704 -875 -4167 3775 3230 -5676 -1025 4799 -3790 -3289
2108 -3289 7185 968 -7514 2814 4011 -6793 -623 7477 -2415 -5241 4726 1446 -5021 2882
2122 2882 4881 -2928 -2010 2713 -737 -2470 1664 2521 -1188 -1879 1643 1264 -2387 587 3784 -2260
2138 -2260 -4512 3025 645 -5557 2512 5529 -5866 -2880 7239 -1758 -6130 6843 3339 -8591
2152 -8591 955 6591 -5199 -2389 8087 -757 -5664 4265 2785 -5505 1221 4959 -3882 -3521 3679
2167 3679 428 -3881 1631 3733 -3036 -3259 3668 1618 -4708 663 4868 -4488 -4433 6015 1113
$$ packed form
2064b843J0535j1635j611J4620o429j2192J1946L570j3427N861J1109j2868m236
2077g600J3133m219r076J1728L400j3076K653R399p501m194R964P7r733K780O301
2092D036m726k785O918R60p786R20O167m579l292P942n45q906M651N824q589N01
2108c289J0474o217q482J0328J197j0804O170Q100r892k826R967l280o467P903
2122B882J999p809R18M723l450j733M134Q57l709o91L522l79l651K974L197o044
2138b260k252P537k380o202Q069L017j1395K986J0119q997m372J2973l504j1930
2152h591R546N636j1790K810J0476q844m907R929j480q290O726L738q841L61P200
2167C679l251m309N512K102o769k23O927k050o326N371M205r356N5J0448m902
$$ plain form
2182 1113 -6098 4121 5731 -7087 -1272 7967 -3298 -5303 7262 881 -8344 3701 5666 -6507
2196 -6507 -334 7511 -4209 -5520 6086 1044 -6468 2833 4404 -5147 -2463 4703 -35 -3553
2210 -3553 2436 2762 -3259 -2087 3246 430 -2900 1805 2684 -3279 -1264 4945 -673 -3661 4022
2225 4022 1986 -6179 495 5241 -4202 -2641 6358 -999 -5676 3717 3133 -5479 724 4639 -3946
2240 -3946 -3588 4062 148 -3586 2114 2629 -2749 -833 2540 -46 -1535 1075 1242 -1769 -1059 1958
2256 1958 414 -1612 1632 2253 -3063 -1164 3801 -1007 -3921 2998 2149 -5199 -211 4703 -2894
2271 -2894 -2688 4959 -156 -4609 2271 2710 -4245 -157 3781 -2211 -2281 3478 931 -2858 1748 2704
2287 2704 -2360 -1290 2576 -340 -2754 1268 1888 -2332 -1267 3104 83 -3461 1599 2638 -3476
$$ packed form
2182A113p211J0219J610j2818N815R239j1265k005J2565o381r225J2045J965j2173
2196f507O173P845j1720j311J1606n042p512R301J571r551K684P166m738l518
2210c553N989L26o021J172N333k816l330M705Q79n963K015O209n618k988P683
2225D022k036q165O674M746r443J561Q999p357m677R393n84q612O203L915q585
2240c946L58P650l914l734N700N15n378J916L373k586j489K610J67l011P10L017
2256A958j544k026L244O21n316J899M965m808k914O919q49p348M988M914p597
2271b894K06P647n115m453O880M39o955M088L938n992p0N759k547l789M606R56
2287B704n064J070L866k916k414M022O20m220J065M371l021l544N060J039o114
$$ plain form
2302 -3476 -1641 3888 -1069 -3942 2972 2058 -4059 578 4157 -2770 -1817 4524 -888 -4196 2796
2317 2796 1981 -4138 472 4146 -2037 -2522 4144 466 -4099 1249 2941 -3046 -1846 2906 -683
2332 -683 -2897 1994 2128 -2419 -426 2904 -910 -2647 2253 1519 -3026 -165 3173 -1384 -1688 3622
2348 3622 958 -3235 1322 3037 -3305 -1168 3885 -1174 -3508 3083 1852 -3845 879 3989 -2494
2363 -2494 -2885 2875 -117 -3439 1149 2116 -2930 -735 2902 -600 -1663 2262 1253 -3049 98
2378 98 2951 -1341 -1764 2557 952 -2997 890 3357 -1613 -1572 2683 -144 -3461 1227 2228 -2991
2394 -2991 -992 2846 -1336 -2850 2691 1949 -3116 56 2153 -2186 -1775 3022 179 -2899 1326
2409 1326 1836 -2076 287 3191 -742 -2547 2108 1104 -3020 169 3198 -1369 -2466 2439 962
$$ packed form
2302c476J835N529m957k873O914r14o117M637L579o927R53O341n412l308O992
2317B796q15o119M610L674o183m85O666l678m565N348J692n987J200M752l589
2332f83k214M891J34m547J993L330l814j737M900p34m545K861L338m557l04N310
2348C622k664m193M557J715o342K137N053n059k334O591j231n697M724L110o483
2363b494l91N760k992l322M588R67n046K195L637l502j063L925j009m302L147
2378I8K853m292m23M321j605l949L887K467m970M1M255k827l317M688J001n219
2394b991J999L838m182j514N541p42n065L172K097m339M11M797k843l078M225
2409A326N10l912K363K904l933j805M655j004m124L189L029m567j097M905j477
$$ plain form
2424 962 -2822 703 2626 -2101 -1911 2289 -173 -2972 1692 2135 -2600 -715 3160 -1147 -2605 2667
2440 2667 1320 -3415 513 2918 -2239 -1928 3525 570 -3136 1717 2800 -3300 -1059 3721 -905
2455 -905 -3508 1897 1644 -3595 -96 3687 -1442 -2157 2962 248 -3792 1175 2538 -2844 -660 3104
2471 3104 -1394 -3060 2947 2134 -3157 336 3247 -2055 -3018 3518 1150 -3235 624 2495 -2501
2486 -2501 -1701 3263 261 -3440 1446 1449 -3480 -431 3153 -1530 -1994 2722 269 -3046 986 2949
2502 2949 -2304 -1031 2624 -942 -2831 2184 1972 -2432 209 2892 -1215 -2085 2128 1347 -1764 -84
2518 -84 1459 -1457 -1711 1561 446 -1459 578 1149 -1487 -882 1718 2 -1808 894 747 -2059
2534 -2059 -623 2397 -83 -1605 1793 985 -2300 -300 2320 -392 -1408 1749 746 -2391 313
$$ packed form
2424I62l784L525J923m727J90M200k462k799M664M43m735J885L875m307j458N272
2440B667j347m735L928K405n157L11N453k955l706M853J083o100K241M780m626
2455i05k603N405k53n239L499L783n129p15N119k714m040M967J363n382K184L764
2471C104m498j666O007q13n291L493K911n302r63O536k368m385L859J871m996
2486b501Q00M964l002l701M886Lm929L049L584m683m64M716k453l315M032J963
2502B949n253J273L655l566j889N015k12m404K641K683m107q70M213p81l111J680
2518h4J543k916k54L272j115j905K037N71k636O05K600j716j810K702j47k806
2534b059J436L020k480j522L398q08l285K000K620k712j016L157j003l137K704
$$ plain form
2549 313 2471 -665 -1214 1746 -236 -2541 102 1829 -1432 -1019 1630 -219 -2347 1409 1746 -1996
2565 -1996 -49 2393 -1495 -2810 2774 1408 -2799 1036 3255 -2302 -1740 3709 742 -3129 1634
2580 1634 1903 -3357 -666 3250 -1243 -2171 2563 509 -3179 887 2543 -2470 -1317 2881 -1274
2595 -1274 -3237 2095 1922 -2858 147 3083 -1317 -2257 2887 1279 -3016 638 2445 -1936 -1507 3198
2611 3198 560 -2395 1565 1598 -2672 -597 2813 -1336 -2251 2229 327 -2837 1454 2522 -2670 -913
2627 -913 2937 -922 -2592 2291 1487 -2770 -127 2129 -1224 -1128 2201 767 -1561 579 907 -1263
2643 -1263 -131 1320 -393 -1148 726 442 -1034 89 1337 -130 -1428 128 363 -1200 -249 1453
2659 1453 -297 -1803 786 919 -1231 354 2113 -604 -1237 1090 270 -1456 663 1745 -342 -751
$$ packed form
2549C13K158l136n49K960j982k305K643J727l261M13K649j849k128L756L37l742
2565a996J947K442l888j315N584j366m207L835K219n557N62N449k967l871M763
2580A634K69n260K691L916m493r28M734k054l688M066J656n013J153M198m155
2595a274j963N332j73m780L005K936m400r40N144j608m295L654J807m381M29M705
2611C198k638k955L960L3m270K075L410m149r15M480j902l164M291J068n192J757
2627i13L850l859j670M883q04m257K643K256l353R6L329j434k328K140L28k170
2643a263J132J451j713p55J874k84j476J123J248j467j298J556K35j563R51J702
2659A453j750j506K589J33k150J585J759k717o33K327q20j726K119J082k087m09
$$ plain form
2675 -751 918 119 -473 729 646 -990 -492 446 -559 -833 967 761 -1282 -314 1336 -449 -1703
2692 -1703 1691 1016 -2085 -347 1945 -1196 -1138 2505 699 -1761 918 1443 -1617 16 2380 -978
2708 -978 -1255 1320 30 -1512 1000 1875 -1440 -449 1450 -1222 -1704 1504 1309 -1972 -552 1465
2724 1465 -883 -1208 1792 1233 -1486 -315 980 -1155 -824 2029 619 -1739 667 692 -1540 354
2740 354 2247 -738 -1621 1443 -353 -2250 1221 2152 -1780 -1140 1544 -513 -1430 1703 1006 -1681
2756 -1681 -485 900 -968 -600 1566 403 -1243 347 935 -514 -24 1453 -68 -1314 453 749
2772 749 -958 213 1283 -246 -1116 881 456 -1245 244 1149 -1317 -1626 1047 225 -1563 424
2788 424 1469 -647 -677 1263 10 -795 551 396 -1181 41 1181 -234 -129 1239 452 -1204 502
$$ packed form
2675g51J669p99n92J202q3j636M98R38j005k74J800k06k043R68J650j785j254
2692a703L394o75l101J738K292l141N8L643j806k460K679N25l060J633K364l358
2708i78k77K575j290j542K512Q75l315R91J899k672m82L208j95l281J420K017
2724A465k348l25L000n59k719J171J295k135L31K853j410k358K406K5k232J894
2740C54J893k985q83L064j796j897L471R31l932O40K684k057r17L133o97k687
2756a681J196J385j868L68K166j163j646J590N88j449M90J477j521j246J767K96
2772G49j707J171J070j529q70J997m25j701J489R05k466l09K673q22j788J987
2788D24J045k116l0J940j253q05J346j55j577J222J140j415J05J368p87j656J706
$$ plain form
2805 502 1138 -929 -758 1086 -8 -1341 548 817 -794 -343 1153 -235 -1083 365 619 -1419 -331
2822 -331 960 -456 -900 897 767 -980 490 1302 -566 -461 1174 -267 -1230 929 884 -1464 324
2839 324 1612 -558 -1020 1442 228 -1493 95 984 -1290 -955 977 29 -1073 520 603 -694 -51
2856 -51 943 -448 -878 792 451 -917 296 1289 -729 -468 1526 430 -1154 306 1141 -1045 -751
2873 -751 1596 -288 -1439 789 843 -1603 -175 1368 -1008 -1000 967 -18 -1302 312 954 -847 -440
2890 -440 1043 -298 -581 940 632 -1183 181 1207 -553 -972 963 476 -1195 156 1488 -702
2906 -702 -1221 1059 462 -1502 246 954 -1188 -450 1395 -288 -1063 993 689 -1322 3 1468 -831
2923 -831 -782 1342 351 -1074 834 1114 -879 -248 1300 -136 -1238 900 947 -912 -221 1340 -235
$$ packed form
2805E02O36k067J71J844j094j333J889K69j611M51J496j388q48J448K54k038J088
2822c31J291j416m44J797j30j747J470Q12j868J05J635j441r63K159m5k348J788
2839C24J288k170m62K462j214j721J588Q89k274L35J932r48j102J593Q3j297O43
2856e1R94j391m30J670l41j368J213R93k018K61J994j096j584J460Q35k186K94
2873g51K347j884j151K228N4k446J428J543k376QJ967r85j284J614O42j801M07
2890d40J483j341k83J521l08j815J364J026j760m19J935m87j671J351J332k190
2906g02n19K280n97j964J748P08k142P38J845j683p75K056l04k011J325J465k299
2923h31M9K124r91j425J908K80j993O31J548j436j102K138M7j859O91J561j575
$$ plain form
2940 -235 -1167 1079 740 -1110 -216 897 -775 -974 833 -3 -948 356 1112 -966 -355 1087 -239
2957 -239 -1291 959 840 -1233 -288 1576 -272 -984 1317 990 -1370 -32 1296 -809 -848 1209 247
2974 247 -1685 425 1030 -830 -578 1440 -113 -1292 384 431 -1479 147 1606 -880 -1057 1462
2990 1462 406 -1451 982 1420 -1183 -856 1532 -278 -1423 1124 1341 -1506 -563 1696 -521 -768
3006 -768 1138 187 -1219 -177 642 -1339 -699 1613 -385 -1443 800 779 -1104 64 1762 -599
3022 -599 -1166 1202 208 -1346 407 1286 -644 -766 1289 -144 -874 865 448 -931 -573 665 -449
3039 -449 -830 645 445 -450 5 305 -377 -465 598 44 -758 394 550 -564 -115 1372 340 -920
3057 -920 318 1037 -824 -524 853 102 -586 261 543 -218 176 791 -87 -445 284 21 -669 -553 509
$$ packed form
2940b35r32K246l39j850Q94J113j672j99J807q36r45J304P56k078O11J442j326
2957b39j052K250j19k073R45J864j848p12K301l27k360J338J328k105l9K057r62
2974B47j932K110O05j860K52K018j553j179J676M7j910J626J459k486j77K519
2990A462j056j857K433M38k603L27K388j810j145K547K17k847R43K259k217k47
3006g68J906r51j406J042Q19j981O40K312j998j058K243k1j883J168J698k361
3022e99n67K368r94j554J753Q79j930j22K055j433p30J739m17j379L58J238j114
3039d49l81J475k00q95M55L00o82q8J063n54q02J152J56j114M49J487j032j260
3057i20J238P19j861L00J377p51o88Q47K82p61L94O15q78l58P29k63o90J16J062
$$ plain form
3076 509 -97 -717 354 611 -743 119 851 -431 -937 914 513 -1152 455 1218 -760 -610 1979
3093 1979 354 -1409 928 1160 -1590 -385 1514 -731 -1026 1012 226 -1376 1004 869 -1328 -179
3109 -179 1235 -969 -1173 1312 578 -1453 226 1351 -655 -778 1402 317 -1433 79 1067 -995
3125 -995 -587 1532 229 -1189 970 972 -1280 -25 1549 -967 -1364 1216 -179 -1883 733 1122 -1444
3142 -1444 119 1721 -858 -1280 1623 211 -1216 620 746 -1020 -383 1465 -60 -510 941 363
3158 363 -705 -69 603 -404 -44 436 -65 -801 431 620 -228 -289 679 -302 -1119 348 559 -749 -339
3177 -339 766 -179 -798 627 576 -471 437 432 -737 -274 361 105 -241 667 5 -247 263 258 196 162 55
3198 55 -451 -271 -280 248 400 -3 36 542 -499 -595 1006 238 -919 198 613 -1002 -454 1122 -26
$$ packed form
3076E09o06o20J071K57j354Q62P32j282n06J851m01j665J607P63j978J50K589
3093A979j625j763K337K32k750J205J899k245k95K038p86j602K380j35k197J149
3109a79J414k204k04K485p34k031J679J125k006j23K180j085j750J512R88k062
3125i95M08K119j303j418K159Kk252J255J574k516l97K580j395j704K616L89k566
3142a444J563J602k579m22K903j412j427J836J26j766O37J848j525m50J451n78
3158C63j068O36O72j007L60M80n01p36J232J89q48o1R68r81q17J467K11j308M10
3177c39J105r45o19J425n1j047R08nj169M63O35k56l46R08o62k52N10no2l4j07
3198E5n06J80rN28J52m03L9N06j041r6J601p68j157J117M15j615N48J576j148
$$ plain form
3217 -26 -750 755 181 -651 472 553 -406 77 729 -240 -805 559 397 -677 179 813 -692 -697 622
3236 622 102 -574 -58 644 -517 -823 736 555 -690 230 1016 -724 -573 1157 -47 -1045 771 556
3254 556 -1306 274 1323 -432 -174 1243 -539 -1434 660 633 -1543 92 1394 -826 -758 1056 281
3271 281 -1211 446 722 -841 -596 898 385 -239 871 311 -592 27 787 -202 -461 688 522 -837
3289 -837 168 929 -750 -568 1058 45 -1194 467 804 -782 -261 1037 -506 -1185 674 374 -897
3306 -897 184 1027 -520 -449 616 465 -781 504 544 -657 -37 743 -112 -294 540 347 -612 -118 843
3325 843 -394 -514 634 467 -940 -93 1253 -394 -720 640 110 -1164 203 879 -776 -538 1338
3342 1338 -163 -827 1027 570 -1064 84 772 -724 -524 805 10 -880 543 717 -958 2 944
$$ packed form
3217b6p24J505n74q32J123Q1r59M83O52r69n65J364j62j074Q56O34j505nJ319
3236F22n20o76N16P02j161l06J559j81j245R20P86j740J51J730j204r98J816k15
3254E56j862J580J049j755K58J417j782q95K094k7k176J635J302k220O8J814p75
3271B81j492J657K76j563K45J494n13o24J110n60r03O19P60r89k59J149j66j359
3289h37J005P61j679J82J626j013j239J661L37j586N21J298j543o79J859l00j271
3306h97J081Q43j547P1J065j51j246J285M0j201O20P80q55j82Q34j93r59M94R61
3325H43j237j20J148j67j407Q47J346j647l26J360n30j274J367O76j655K38J876
3342A338j501o64J854m57j634J148O88j496K00J329p95q90J423J74j675R60R42
$$ plain form
3359 944 -36 -954 494 529 -1105 -244 888 -101 -902 427 416 -789 -195 834 -412 -533 1012 300
3377 300 -804 565 678 -889 -68 1244 -232 -856 1044 439 -1404 145 1092 -723 -973 1120 219
3394 219 -1003 603 1133 -920 -583 704 -79 -1165 496 473 -876 -110 968 -92 -519 810 519
3411 519 -758 332 1014 -632 -583 1133 345 -1143 783 1040 -915 -395 1110 -290 -1261 573 615
3428 615 -1202 -5 1061 -687 -537 970 15 -971 230 545 -1327 -427 1036 -182 -921 660 937
3445 937 -704 135 1163 -508 -1073 854 325 -1122 126 1180 -584 -660 992 58 -1016 322 773
3462 773 -1028 -489 891 -364 -952 685 224 -734 189 858 -511 -621 701 192 -1130 495 926
3479 926 -921 -426 1202 227 -1189 830 835 -1072 -315 1052 -349 -799 928 497 -1042 -208 931
$$ packed form
3359I44r80r18J448L5j634Q61J132r89q01J329j1j205N94J029j246j21J545p12
3377C00j104J369J13j567Q21J312j476o24J900o05j843J549R47j815k50K093r01
3394B19j222J606N30k053L37J287p83j086J661k3j349P66J078j060m27J329k91
3411E19j277J090O82j646M9J716p88j488J926K57j955N20J505j400r71J834M2
3428F15j817J197J066j748J50J507r55r86J201L15j872R00J463j218p39J581K77
3445I37j641Q39J028j671n65J927n29j447J248J054j764p6J652r34j074J338M51
3462G73j801N39J380j255n88J637m61r58R23O69j369j10J322n09j322J625M31
3479I26j847M95J628r75j416K019Nj907P57J367j401m50J727m31j539Q34J139
$$ plain form
3496 931 -422 -395 822 -243 -1063 382 823 -899 -32 1145 -301 -899 1071 683 -942 60 1094
3513 1094 -909 -916 1282 117 -916 242 901 -748 -334 1134 186 -962 420 170 -1221 -284 940
3530 940 -216 -483 897 127 -959 579 777 -821 -493 992 -146 -1107 516 896 -517 -417 1132
3547 1132 -183 -887 568 356 -1162 -76 868 -600 -582 835 132 -841 141 802 -830 -299 1028
3564 1028 -363 -903 810 396 -871 152 1021 -435 -509 1219 428 -1244 220 1041 -570 -507 1014
3581 1014 111 -771 394 270 -633 -99 492 -441 -584 651 133 -817 3 589 -712 -485 987 54
3599 54 -991 250 750 -775 -400 1040 -50 -863 729 581 -855 13 1111 -305 -696 530 190
3616 190 -673 725 710 -604 -506 797 -146 -837 592 459 -1196 -175 778 -615 -623 791 511 -908
$$ packed form
3496I31j353K7J217j065q20J445M41j722Q67J177j446n98J970l88j625J002J034
3513A094k003pK198j165j033J158O59j649M14J468r48j148J382k50j391R37J224
3530I40j156k67J380p70j086J538J98j598L28J485j138r61J623L80j413J00J549
3547A132j315p04J455k12j518J086R44j468J8J417p03r73R82O61j632N31J327
3564A028j391n40J713m14j267J023Q69j456p4J728p91j672J464Q21j611O3J521
3581A014r03q82J165j24r03N34N91r33j43J235n18r50Q20N86j301K27J472r33
3599E4j045J241N00j525L75J440j090q13J592j48j436Q68J098j416l91J226l40
3616A90q63J398j5j314R8J303r43o91J429j33j655J021R53j393qJ414k80j419
$$ plain form
3634 -908 152 970 -584 -566 1062 10 -1085 288 604 -860 78 1114 -197 -641 754 181 -760
3651 -760 596 896 -1087 -417 566 -494 -845 693 648 -896 -466 638 -419 -731 1041 464 -660
3668 -660 -101 764 -399 -206 1212 449 -879 -197 288 -872 -111 1157 -302 -759 688 265 -948
3685 -948 278 1220 -664 -986 594 -2 -1172 471 940 -753 -501 588 -155 -759 928 669 -763
3702 -763 -143 601 -345 -418 828 285 -652 59 793 -376 -39 1096 -231 -1012 394 547 -965 -97
3720 -97 956 12 -955 374 349 -857 180 1073 -299 -701 429 -196 -826 398 893 -589 -195 798
3738 798 -262 -628 868 363 -982 -228 626 -714 -544 1006 581 -858 289 868 -888 -669 1120
3755 1120 277 -1029 308 627 -1039 -455 1385 -90 -864 616 254 -1146 394 878 -386 -226 865
$$ packed form
3634i08J060Q18j554J8J628j052j095J373L16j464R38J036j311m44J395n73r41
3651g60J356L00j983O70R83j060l51J538m5j544M30J104j057l12J772n77j124
3668f60N59Q65j163J93J418p63j328O82M85j160P61J268j459m57J447m23j213
3685i48J226R42j884l22J580n96j170J643M69j693K52J089p43o04J687k59j432
3702g63O20P44r46p3J246n43r37P11P34j169L37J135j327p81J406J53j512Q68
3720i7J053r44r67J329k5j206J037Q93j372m02J130o25o30J224M95j482L94R93
3738G98j060l66J496n05j345P54Q54j340J70J550m25j439J147N79j756K19J789
3755A120q43j306J337L19j666N84J840j475p74J480l62j400J540M84j264J60J091
$$ plain form
3772 865 -115 -912 694 607 -891 -410 925 -515 -962 847 538 -924 -44 880 -568 -721 945 173
3790 173 -1218 216 907 -872 -489 1132 144 -543 901 497 -1060 5 1146 -398 -455 1119 150
3807 150 -1230 466 1140 -509 -410 891 -104 -1173 539 674 -939 -469 983 -272 -639 826 331
3824 331 -977 -9 1006 -509 -404 792 354 -925 624 885 -793 -401 1071 -104 -831 780 723
3841 723 -1311 -32 1192 -625 -822 1049 35 -1107 -14 801 -609 -661 1127 -206 -1305 251
3857 251 717 -779 -166 1144 -216 -654 783 324 -917 228 1030 -702 -353 999 122 -1064 439
3874 439 703 -844 -367 1024 -377 -1139 588 158 -1059 -144 899 -554 -684 915 387 -897 358
3891 358 786 -1032 -644 927 -158 -757 893 615 -822 160 1193 -331 -1072 750 425 -1100 -47
$$ packed form
3772H65r80p97J606q7j498M81J335j440m47J809l09j462Q80R24j448j53J666p72
3790A73j391J434O91j779L83J621r88o87J444m04j557J065J141j544n7J574r69
3807A50j380J696O74j649R9J301r95j069J712J35j613M70J452j255l67J465m95
3824C31j308R68J015j515J05J196m38j279J549K61j678L92J472j175p27J611n7
3841G23k034J279J224j817j97J871j014j142J093Q15j410n2J788j333j099J556
3857B51M66j496O13J310j360m38J437m59j241J145Q02j732L49J352q77j186J503
3874D39K64j547M77J391j401p62J727m30j217R15J043j453j30J599n28j284J255
3891C58M28j818L88J571j085n99J650k78j437R82J033j524p41J822l25j525J053
$$ plain form
3908 -47 854 -622 -563 915 233 -914 260 724 -986 -254 895 -108 -1004 832 534 -874 316
3925 316 1169 -358 -857 1020 271 -1037 542 785 -876 -426 777 -16 -672 693 518 -934 -306
3942 -306 1024 -403 -831 563 171 -878 65 1070 -635 -508 870 -11 -851 328 433 -1119 -267
3959 -267 1165 -237 -942 720 531 -874 225 1206 -455 -759 892 -2 -1204 522 711 -780 -245
3976 -245 1098 -205 -827 541 347 -1002 -145 706 -444 -604 895 129 -1045 138 793 -748 -396
3993 -396 899 -19 -833 738 845 -807 137 1071 -201 -523 833 276 -946 253 967 -340 -340 721
4011 721 -221 -841 452 573 -668 1 704 -567 -712 722 476 -980 -28 670 -354 -541 800 240
4029 240 -836 272 720 -640 -223 679 -98 -853 525 485 -587 -55 597 -463 -675 780 231 -734
$$ packed form
3908d7R01j476N9J478o82j147J174M64j710P32J149j003q96J836k98j408J190
3925C16Q53j527m99J877p49j308J579K43j661M50J203p93o56J365j75j452O28
3942c06J330j427m28J394l92j049R43J005j705J27J378q81q40J179J05j552Q52
3959b67J432j402p05J662j89j405J099R81j661l04J651q94j202J726J89j491N35
3976b45J343j303o22J368j94j349Q57Q51j150j60J499p66j174J183O55j541L52
3993c96J295r18q14J571J07j652R44R34j272l22J356n57j222J199P14j307%J061
4011G21r42o20J293J21j241O69P03j271j45J434k46j456R52O98j024j87J341n60
4029B40j076J108M48j360M17R02p77p55J378m0j072N32O52j060k12J455n49r65
$$ plain form
4047 -734 108 588 -488 -249 843 -65 -800 625 448 -836 -237 1044 -357 -735 722 648 -542 -60
4065 -60 915 -285 -686 704 81 -809 191 437 -488 -194 768 -364 -532 858 586 -990 -86 761
4083 761 -361 -801 1061 444 -815 472 849 -703 -384 859 -73 -868 497 572 -808 -73 1085
4100 1085 -307 -491 901 153 -967 300 865 -1063 -585 941 -428 -990 709 751 -628 -266 913
4117 913 -467 -807 615 539 -879 211 635 -387 -341 1042 153 -664 555 479 -1036 -217 876 -386
4135 -386 -877 744 8 -978 245 1080 -596 -691 834 -314 -1148 342 695 -860 -122 674 -493 -890
4153 -890 565 628 -660 58 592 -775 -639 689 164 -336 386 716 -858 -375 925 190 -796 453
4171 453 287 -938 -139 920 -327 -707 921 227 -1058 54 763 -496 -368 582 -62 -919 304
$$ packed form
4047g34Q42M80j076K39J092r08p35J425j77j284N99J281j401l78J457p4j190M82
4065f0R75j200m01J390o23q90J000K46r25K94R62j132j68J390k72j576R04Q47
4083G61j122m40J862o17j259J287L77j552L19J243r32p95J365P5j380P35J158
4100A085j392j84J392p48j120J267N65j928M78J526j369n62J699M2j379L62J179
4117I13j380l40J422p6j418J090M24j022M6J383q89q17J219p6j515Q19J093j262
4135c86m91J621p36r86J223Q35j676r5J525j148q34J490L53j555P38P96j167l97
4153h90J455O3j288P18N34j367J36J328n25n00P22L30j574M83J300p35r86J249
4171D53j66j225P99J059j247l80J628o94j285J112P09j259J28R50o44q57J223
$$ plain form
4188 304 890 -444 2 793 -532 -720 693 513 -704 353 479 -542 -618 942 289 -789 330
4205 330 575 -842 -529 636 259 -965 345 352 -968 -158 991 -295 -964 818 485 -833 264
4222 264 1130 -706 -426 755 28 -966 322 707 -549 -134 935 -624 -1138 435 395 -1021 107
4239 107 713 -699 -720 508 281 -814 455 631 -704 -187 622 -282 -606 604 778 -992 -89 843
4257 843 -316 -835 873 137 -1195 0 1026 -658 -330 1161 -159 -1135 284 603 -927 -308 972
4274 972 -415 -893 716 472 -707 19 908 -741 -510 570 259 -704 584 721 -838 -427 784
$$ packed form
4188C04N86j334M46P91j325j88J413j80j217J057J26j021p6J560o53j078J119
4205C30K45j417L13J165l77j224J310Pj320Q10J149j286o69J782l33j318J097
4222B64Q66j836K80J181p27r94J288L85j256M15J069j559n14J573m0j416J128
4239A07O06j412k1J228k27j095J269J76j335N17Q09r04l24J210J74j770R03R32
4257H43j159n19J708p36j332J195J026j684L28J491j320r76J419L19j530O19J280
4274I72j387m78J609k44j179P26Q89j649K31J080l11r63J288J37j559M11J211
$$ [...]
8191a11
##END NTUPLES=NMR FID
##END=
