##TITLE=1H_B3C2301
 200.13MHz, CDCl3,
 8 sc
 
 23.1.2025
##JCAMPDX= 6.0         $$ Bruker NMR JCAMP-DX V2.0
##DATA TYPE= NMR FID
##DATA CLASS= NTUPLES
##ORIGIN= UXNMR, Bruker Analytische Messtechnik GmbH
##OWNER= pz
$$ XWIN-NMR		Version 3.5
$$ Fri Jan 24 13:57:21 2025 Russian Standard Time (UT+4h)  she@DPX200
##.OBSERVE FREQUENCY= 200.1313
##.OBSERVE NUCLEUS= ^1H
##.DELAY= (6, 6)
##.ACQUISITION MODE= SIMULTANEOUS
##.ACQUISITION SCHEME= undefined
##.AVERAGES= 8
##.DIGITISER RES= 18
##SPECTROMETER/DATA SYSTEM= spect
##.PULSE SEQUENCE= zg30
##.SOLVENT NAME= CDCl3
##.SHIFT REFERENCE= (INTERNAL, CDCl3, 0, 14.3821)
##AUDIT TRAIL= $$ (NUMBER, WHEN, WHO, WHERE, WHAT)
$$ ##TITLE= Audit trail, XWIN-NMR		Version 3.5
$$ ##JCAMPDX= 5.01
$$ ##ORIGIN= Bruker BioSpin GmbH
$$ ##OWNER= she
$$ F:/spectra/data/she/nmr/H-C/1/audita.txt
$$ ##AUDIT TRAIL=  $$ (NUMBER, WHEN, WHO, WHERE, WHAT)
(   1,<2025-01-24 13:56:05.53 +0400>,<she>,<DPX200>,
      <created by zg, POWCHK disabled, PULCHK disabled
       configuration hash MD5:
       00 E9 B6 7A A2 85 ED C7 34 08 36 98 17 FE 4E 26
       data hash MD5: 16K
       8C 47 31 64 C1 4B B7 B5 61 A4 92 2A 73 FD BF 21>)
$$ ##END=
$$ 
$$ hash MD5
$$ 24 64 84 3E 3A 97 CC 06 24 F2 2C 61 1F 5A CB C0
##$RELAX= 
##$RELAX= 
##$RELAX= 
##$RELAX= 
##$RELAX= 
##$RELAX= 
$$ Bruker specific parameters
$$ --------------------------
##$DU= <F:/spectra>
##$EXPNO= 1
##$NAME= <H-C>
##$PROCNO= 1
##$TYPE= <nmr>
##$USER= <she>
##$AMP= (0..31)
100 100 100 100 100 100 100 100 100 100 100 100 100 100 100 100 100 100 
100 100 100 100 100 100 100 100 100 100 100 100 100 100 
##$AQSEQ= 0
##$AQ_mod= 1
##$AUNM= <au_zg>
##$AUTOPOS= <>
##$BF1= 200.13
##$BF2= 200.13
##$BF3= 200.13
##$BF4= 200.13
##$BF5= 200.13
##$BF6= 200.13
##$BF7= 200.13
##$BF8= 200.13
##$BYTORDA= 1
##$CFDGTYP= 0
##$CFRGTYP= 5
##$CHEMSTR= <none>
##$CNST= (0..31)
1 1 145 1 1 1 1 1 1 1 1 1 1 1 1 1 1 1 1 1 1 1 1 1 1 1 1 1 1 1 1 1 
##$CPDPRG= <>
##$CPDPRG1= <>
##$CPDPRG2= <>
##$CPDPRG3= <>
##$CPDPRG4= <mlev>
##$CPDPRG5= <mlev>
##$CPDPRG6= <mlev>
##$CPDPRG7= <mlev>
##$CPDPRG8= <mlev>
##$CPDPRGB= <>
##$CPDPRGT= <>
##$D= (0..31)
0 0.7 0 0 0 0 0 0 0 0 0 0.03 0 0 0 0 0 0 0 0 0 0 0 0 0 0 0 0 0 0 0 0 
##$DATE= 1737712564
##$DBL= (0..7)
120 120 120 120 120 120 120 120 
##$DBP= (0..7)
150 150 150 150 150 150 150 150 
##$DBP07= 0
##$DBPNAM0= <>
##$DBPNAM1= <>
##$DBPNAM2= <>
##$DBPNAM3= <>
##$DBPNAM4= <>
##$DBPNAM5= <>
##$DBPNAM6= <>
##$DBPNAM7= <>
##$DBPOAL= (0..7)
0.5 0.5 0.5 0.5 0.5 0.5 0.5 0.5 
##$DBPOFFS= (0..7)
0 0 0 0 0 0 0 0 
##$DE= 6
##$DECBNUC= <off>
##$DECIM= 32
##$DECNUC= <off>
##$DECSTAT= 4
##$DIGMOD= 1
##$DIGTYP= 9
##$DL= (0..7)
0 120 120 120 120 120 120 120 
##$DP= (0..7)
150 150 150 150 150 150 150 150 
##$DP07= 0
##$DPNAME0= <>
##$DPNAME1= <>
##$DPNAME2= <>
##$DPNAME3= <>
##$DPNAME4= <>
##$DPNAME5= <>
##$DPNAME6= <>
##$DPNAME7= <>
##$DPOAL= (0..7)
0.5 0.5 0.5 0.5 0.5 0.5 0.5 0.5 
##$DPOFFS= (0..7)
0 0 0 0 0 0 0 0 
##$DQDMODE= 0
##$DR= 18
##$DS= 0
##$DSLIST= <SSSSSSSSSSSSSSS>
$$ [...]
##$SUBNAM0= <"">
##$SUBNAM1= <"">
##$SUBNAM2= <"">
##$SUBNAM3= <"">
##$SUBNAM4= <"">
##$SUBNAM5= <"">
##$SUBNAM6= <"">
##$SUBNAM7= <"">
##$SUBNAM8= <"">
##$SUBNAM9= <"">
##$SW= 18.0517328524113
##$SWIBOX= (0..15)
0 0 2 0 0 0 0 0 0 0 0 0 0 0 0 0 
##$SW_h= 3612.71676300578
##$TD= 16384
##$TD0= 1
##$TE= 0
##$TE2= 300
##$TE3= 300
##$TEG= 300
##$TL= (0..7)
0 120 120 120 120 120 120 120 
##$TP= (0..7)
150 150 150 150 150 150 150 150 
##$TP07= 0
##$TPNAME0= <>
##$TPNAME1= <>
##$TPNAME2= <>
##$TPNAME3= <>
##$TPNAME4= <>
##$TPNAME5= <>
##$TPNAME6= <>
##$TPNAME7= <>
##$TPOAL= (0..7)
0.5 0.5 0.5 0.5 0.5 0.5 0.5 0.5 
##$TPOFFS= (0..7)
0 0 0 0 0 0 0 0 
##$TUNHIN= 0
##$TUNHOUT= 0
##$TUNXOUT= 0
##$USERA1= <user>
##$USERA2= <user>
##$USERA3= <user>
##$USERA4= <user>
##$USERA5= <user>
##$V9= 5
##$VALIST= <valist>
##$VCLIST= <CCCCCCCCCCCCCCC>
##$VD= 0
##$VDLIST= <DDDDDDDDDDDDDDD>
##$VPLIST= <PPPPPPPPPPPPPPP>
##$VTLIST= <TTTTTTTTTTTTTTT>
##$WBST= 1024
##$WBSW= 4
##$XGAIN= (0..3)
0 0 0 0 
##$XL= 0
##$YL= 0
##$YMAX_a= 463618
##$YMIN_a= -579427
##$ZGOPTNS= <>
##$ZL1= 120
##$ZL2= 120
##$ZL3= 120
##$ZL4= 120
##$ABSF1= 10
##$ABSF2= 0
##$ABSG= 5
##$ABSL= 3
##$ALPHA= 0
##$AQORDER= 0
##$ASSFAC= 0
##$ASSFACI= 0
##$ASSFACX= 0
##$ASSWID= 0
##$AUNMP= <proc_1d>
##$AZFE= 0.1
##$AZFW= 0.1
##$BCFW= 1
##$BC_mod= 2
##$BYTORDP= 1
##$COROFFS= 0
##$CY= -3
##$DATMOD= 1
##$DC= 2
##$DFILT= <>
##$DTYPP= 0
##$F1P= 0
##$F2P= 0
##$FCOR= 0.5
##$FTSIZE= 0
##$FT_mod= 4
##$GAMMA= 1
##$GB= 0.15
##$INTBC= 1
##$INTSCL= 1
##$ISEN= 128
##$LB= 0.25
##$LEV0= 0
##$LPBIN= 0
##$MAXI= 10000
##$MC2= 0
##$MEAN= 0
##$ME_mod= 0
##$MI= 1.114404
##$NCOEF= 0
##$NC_proc= 0
##$NLEV= 6
##$NOISF1= 3.799351
##$NOISF2= 2.8
##$NSP= 1
##$NTH_PI= 0
##$NZP= 0
##$OFFSET= 14.38212
##$PC= 1
##$PHC0= 252.7617
##$PHC1= 9.792201
##$PH_mod= 1
##$PKNL= yes
##$PPARMOD= 0
##$PSCAL= 0
##$PSIGN= 0
##$REVERSE= no
##$SF= 200.129724274929
##$SI= 16384
##$SIGF1= 3
##$SIGF2= 2
##$SINO= 400
##$SIOLD= 16384
##$SREGLST= <1H.CDCl3>
##$SSB= 0
##$STSI= 0
##$STSR= 0
##$SW_p= 3205.1282051282
##$SYMM= 0
##$S_DEV= 0
##$TDeff= 0
##$TDoff= 0
##$TI= <>
##$TILT= no
##$TM1= 0
##$TM2= 0
##$TOPLEV= 0
##$USERP1= <user>
##$USERP2= <user>
##$USERP3= <user>
##$USERP4= <user>
##$USERP5= <user>
##$WDW= 1
##$XDIM= 8192
##$YMAX_p= 0
##$YMIN_p= 0
$$ End of Bruker specific parameters
$$ ---------------------------------
##NTUPLES= NMR FID
##VAR_NAME=  TIME,          FID/REAL,        FID/IMAG
##SYMBOL=    X,             R,               I
##VAR_TYPE=  INDEPENDENT,   DEPENDENT,       DEPENDENT
##VAR_FORM=  AFFN,          ASDF,            ASDF
##VAR_DIM=   8192,          8192,            8192
##UNITS=     SECONDS,       ARBITRARY UNITS, ARBITRARY UNITS
##FACTOR=    0.0002768,     1,               1
##FIRST=     0,             0,               0
##LAST=      2.2672688,     0,               0
##MIN=       0,             -579427,         0
##MAX=       2.2672688,     463618,          0
$$ Real data points
##PAGE= N=1
##DATA TABLE= (X++(R..R)), XYDATA
$$ [...]
$$ plain form
2190 4937 -5238 -8627 23 1186 -4917 225 5874 -2589 -7252 3352 7144 -1052 1202 7863
2204 7863 -141 -6481 3020 7673 -1720 -3388 2982 -1229 -8571 -1693 4643 -1698 -5408 44 -194
2219 -194 -4516 731 6385 1675 -2242 2575 3664 -1663 1228 7567 1634 -5776 -400 3243 -3707
2234 -3707 -4214 3481 467 -8644 -3498 4069 -1771 -4484 4151 3725 -4692 -1316 7363 2900 -2340
2249 -2340 3487 4850 -2889 -2550 4229 1094 -4219 -763 544 -4648 -4021 2023 3 -4825 -416
2264 -416 3341 -1915 -2461 5185 4841 -2250 -242 6304 1967 -3585 1955 4871 -3064 -4626 2396 385
2280 385 -6121 -1949 2396 -3072 -4957 2182 2180 -3433 -312 5041 743 -1157 4449 3845 -1682 530
2296 530 4445 -202 -3427 1380 1483 -5477 -3851 2808 -770 -5872 -963 2680 -2881 -3489 3821 4264
$$ packed form
2190D937j0175l389Q650J163o103N142N649q463m663J0604L792q196K254O661
2204G863q004o340R501M653r393j668O370m211p342O878O336o341l710N452k38
2219a94m322N247N654m710l917M817J089n327K891O339n933p410N376L643o950
2234c707n07P695l014r111N146P567n840k713Q635m26q417L376Q679m463n240
2249b340N827J363p739L39O779l135n313L456J307n192O27O044k020m828M409
2264d16L757n256n46P646l44p091K008O546m337n552N540K916p935j562P022k011
2280C85o506M172M345n468j885P139kn613L121N353m298j900N606o04n527K212
2296E30L915m647l225M807J03o960J626O659l578n102M909L643n561o08P310M43
$$ plain form
2312 4264 -2090 -487 5014 1726 -1421 3501 4229 -2180 -2331 1962 -437 -3790 309 1355 -5008
2327 -5008 -4799 1448 -185 -3152 1346 3234 -2401 -2279 4694 4013 -796 2239 4691 -1728 -3547 3561
2343 3561 3587 -2965 -2805 997 -2709 -5939 -334 3221 -2154 -3782 648 101 -1971 2432 5355 941
2359 941 -1216 2345 2086 -967 2289 4924 -1505 -4734 -51 351 -3532 -1012 2196 -2934 -6550 -103
2375 -103 2823 -1394 143 4693 508 -4153 1815 6478 1780 -613 2575 721 -4106 -816 3840
2390 3840 266 -3570 -1629 -2287 -4655 -878 3523 71 -3258 79 950 -1801 1971 7434 2425
2405 2425 -3207 328 3048 -804 -46 4920 1083 -6492 -3843 1489 -1505 -2763 2071 554 -6094
2420 -6094 -3660 3403 2711 -206 3070 2660 -2760 -1026 4940 3658 154 1440 403 -4608 -2780
$$ packed form
2312D264o354J603N501l288l147M922P28o409j51M293k399l353M099J046o363
2327e008K09O247j633k967M498J888n635J22O973o81m809L035K452o419j819P108
2343C561K6o552J60L802l706l230N605L555n375j628M430n47k072M403K923m414
2359I41k157L561k59l053L256K635o429l229M683M02l883K520L208n130l616O447
2375a03K926m217J537M550m185m661N968M663m698k393L188j854m827L290M656
2390C840l574l836J941o58k368L777M401l452l329L337Q71k751L772N463n009
2405B425n632L535K720l852P58M966l837p575K649N332k994j258M834j517o648
2420f094K434P063o92k917L276m10n420J734N966j282l504J286j037n011J828
$$ plain form
2435 -2780 3259 1480 -4066 -1744 -77 -5013 -3886 4137 3921 -3217 -2086 2704 651 -1032 5110
2450 5110 5870 -1813 -2935 2336 1027 -1618 1865 2465 -4292 -6050 -45 788 -2348 239 1982 -3553
2466 -3553 -4279 2671 4086 523 2042 3820 -1501 -3271 3897 5786 -1017 -1681 1719 -2133 -6025
2481 -6025 196 4473 -1917 -5176 -460 -554 -3971 744 5641 673 -3173 1541 2564 -444 2323
2496 2323 5851 541 -4428 -80 2144 -1774 -1059 2562 -2014 -6760 -1762 2179 -1459 -1714 3015
2511 3015 325 -4990 -52 6495 2143 -1215 3380 2696 -3511 -1433 5343 2192 -3893 -1286 599
2526 599 -4250 -3366 3053 856 -4179 -1966 1183 -1731 -1144 4789 3482 -2595 -313 3959 567 -381
2542 -381 3984 2892 -3920 -2782 2266 -341 -3700 572 1462 -4789 -5012 2294 2132 -2836 -218 3919
$$ packed form
2435b780O039j779n546K322J667m936J127Q023k16p138J131M790k053j683O142
2450E110P60p683j122N271j309k645L483O00o757j758O005Q33l136K587J743n535
2466c553p26O950J415l563J519J778n321j770P168J889o803o64L400l852l892
2481f025O221M277o390l259M716r4l417M715M897m968l846M714J023l008K767
2496B323L528n310m969M348K224l918P15L621m576m746M998L941l638k55M729
2511C015k690n315M938O547m352l358M595o84o207K078O776l151o085K607J885
2526E99m849Q84O419k197n035K213L149k914N87N933j307o077K282M272l392r48
2542c81M365j092o812J138N048k607l359M272Q90o251k23P306j62m968K618M137
$$ plain form
2558 3919 -630 -2898 3511 5341 -312 -512 3085 1 -2777 1758 2672 -2734 -2905 610 -1917 -4470
2574 -4470 762 2609 -3167 -3267 2330 1206 -2141 1971 5201 -52 -2268 2882 3624 -1539 -295
2589 -295 3456 -495 -4611 -633 1990 -2288 -3716 748 -73 -4294 -1073 3050 -47 -1357 2682
2604 2682 2150 -1301 1413 4625 245 -1984 2691 2089 -3473 -1257 3284 -1476 -5100 34 1449
2619 1449 -3288 -2966 2331 550 -3165 398 3590 571 -842 2868 2782 -740 100 2979 631 -2359
2635 -2359 95 1200 -2393 -2344 844 -966 -3848 -750 1498 -1937 -1760 2852 1488 -2446 1344 4820
2651 4820 161 -1516 3286 2165 -2960 -699 3304 -667 -3570 -363 321 -3188 -2112 1353 -214
2666 -214 -2719 -458 1434 -188 51 3029 2222 -962 13 2675 1023 -217 1959 1045 -2954 -2380
$$ packed form
2558C919m549k268O409J830n653k00L597l084k778M535R14n406j71L515k527k553
2574d470N232J847n776j00N597j124l347M112L230n253k216N150P42n163J244
2589b95L751l951m116L978K623m278j428M464q21m221L221M123l097j310M039
2604B682n32l451K714L212m380k229M675o02n562K216M541m760l624N134J415
2619A449m737L22N297j781l715L563L192l019j413L710q6l522Q40K879k348k990
2635b359K454J105l593M9L188j810k882L098K248l435J77M612j364l934L790L476
2651D820m659j677M802j121n125K261M003l971k903L207O84l509J076L465j567
2666b14k505K261J892j622K39K978q07l184R75K662j652j240K176r14l999N74
$$ plain form
2682 -2380 1097 -727 -2789 152 637 -4134 -2804 2842 1462 -2067 1140 2880 -1315 -1318 3857 3272
2698 3272 -810 70 1270 -1438 -1665 1499 692 -2362 -2319 -1258 -1966 -1572 1061 1155 -1558 -1350 926
2715 926 878 645 2875 3069 -423 -1677 1630 2146 -703 612 1948 -2585 -4835 -112 1766 -1809
2731 -1809 -1525 1026 -1590 -3570 850 3592 831 434 1831 -342 -853 2708 3239 193 -263 197
2747 197 -1782 -2450 756 1517 -2007 -3006 -1184 -1318 -1596 876 2597 246 -2331 160 2491 1004
2763 1004 1353 3583 990 -2697 -865 2337 614 -1094 394 -1311 -4346 -1790 1408 -257 -772
2778 -772 525 -1530 -3129 1148 4120 1279 104 2061 155 -2216 1242 4307 1173 -1893 -1070
2793 -1070 -889 -2190 -881 1674 322 -3308 -2688 -488 -318 233 2535 1901 -1546 -1293 1805 2181 1389
$$ packed form
2682b380L477j824k062K941M85m771J330N646j380l529L207J740m195lN175n85
2698C272m082Q80J200k708k27L164q07l054M3J061p08L94K633R4k713K08K276
2715I26m8k33K230J94l492j254L307N16k849J315J336m533k250M723J878l575
2731a809K84K551k616j980M420K742k761l97J397k173n11L561N31l046m56M60
2747A97j979o68L206P61l524r99J822j34k78K472J721k351k577K491K331j487
2763A004L49K230k593l687J832L202j723j708J488j705l035K556L198j665n15
2778g72J297k055j599M277K972k841j175J957j906k371L458L065l134l066Q23
2793a070J81j301J309K555j352l630O20K200J70N51K302o34l447K53L098L76p92
$$ plain form
2810 1389 2673 1545 -2423 -1955 1436 407 -1262 665 -681 -4541 -2688 1857 848 -1818 546
2825 546 1049 -2545 -915 3596 3367 72 319 989 -670 -588 2356 1975 -1360 -2420 -1080 -1545 -1639 564
2843 564 1143 -1948 -2833 -99 683 110 1897 3034 -581 -1532 1891 2126 10 1464 2101 -1847 -3538
2860 -3538 750 1727 -1931 -1329 770 -2324 -3944 288 2430 -123 -763 1042 239 -914 1820 3402
2876 3402 1165 -483 638 104 -1245 495 1860 -824 -2770 -1363 -245 -1969 -627 1616 -621
2891 -621 -2887 -55 1961 -145 279 3251 1542 -2239 257 3343 517 -1254 1305 674 -2991 -1881
2907 -1881 1251 -161 -2198 -685 -280 -2142 -688 1799 768 -432 1060 1542 -350 480 3098 1543
2923 1543 -1464 -189 1404 -1092 -1789 1069 437 -2991 -2212 842 -478 -2401 458 1766 -1322 -1183
$$ packed form
2810A389J284j128l968M68L391j029j669J927j346l860J853M545j009k666K364
2825E46N03l594J630M511k29l295K47O70j659Q2K944l81l335j060J340m65r4K203
2843E64N79l091q85K734P82n73J787J137l615r51L423K35k116J454O37l948j691
2860c538M288R77l658O02K099l094j620M232K142k553o40J805q03j153K734J582
2876C402k237j648J121n34j349J740J365k684j946J407J118j724J342K243k237
2891f21k266K832K016k106M24K972j709l781K496L086k826j771K559o31l665J110
2907a881L132j412k037J513M05j862J454K487j031j200J492M82j892Q30K618j555
2923A543l007J275J593k496o97K858o32l428P79L054j320j923K859J308l088J39
$$ plain form
2939 -1183 2310 1909 -525 819 2607 183 -872 1325 1357 -1085 -658 572 -1747 -2103 125 -204
2955 -204 -2180 -955 1158 -608 -1694 1297 2280 -631 -406 2653 1732 -739 799 2248 -319 -1607
2971 -1607 786 591 -2226 -1504 622 -1012 -2379 -210 861 -1198 -970 1157 862 -432 1187 2196
2987 2196 131 -15 1865 1154 -736 422 1137 -1541 -2251 385 441 -2447 -1455 887 -1024 -2183 682
3004 682 1693 -353 -543 1741 1124 -386 1288 2610 279 -889 467 368 -1106 -529 589 -981
3020 -981 -2364 -1000 -276 -1036 -368 941 -393 -1156 683 1584 713 980 2204 706 -1385 672 2281
3037 2281 -255 -1229 334 -454 -2615 -1380 1020 -126 -1934 -652 -29 -866 -59 1863 1323 -82
3053 -82 296 883 435 1006 1889 757 -949 -652 -99 -886 -455 328 -811 -2427 -1329 172 -301 -422
$$ packed form
2939a183L493m01k434J344J788k424j055K197L2k442M27J230k319l56K228l29
2955b04j976J225K113j766j086K991R83k911K25L059r21k471J538J449k567j288
2971a607K393j95k817P22K126j634j367K169J071k059K28K127k95j294J619J009
2987B196k065j46J880p11j890J158P15k678p10K636N6k888R92K342j911j159K865
3004F82J011k046j90K284o17j510J674J322k331j168J356r9j474N77J118j570
3020i81j383J364P24p60O68J309j334p63J839R01q71K67J224j498k091K057J609
3037B281k536r74J563p88k161J235K400j146j808J282O23q37Q07J922n40j405
3053h2L78N87m48N71Q83j132j706K97N53p87M31P83j139j616J098J501m73j21
$$ plain form
3071 -422 1054 992 -967 -662 2160 2105 410 827 1056 -375 -935 741 1204 -595 -1112 -1024 -1872 -1293 310
3090 310 137 -837 -545 -294 -807 214 2104 1646 49 248 776 100 463 1546 1325 -902 -1595 -751
3108 -751 -168 -981 -430 30 -1293 -2409 -593 969 777 453 784 98 -356 760 1982 1296 932 463
3126 463 -1167 -1118 506 583 -544 -777 -660 -1863 -1827 489 1050 -418 -614 152 -165 231 1628 2022 985
3145 985 -122 9 416 347 655 738 -330 -1632 -1598 -614 -205 -100 -198 -746 -1399 -629 577 745 1181 1266
3165 1266 0 -769 843 1725 764 373 764 -591 -1934 -405 833 -411 -1252 -778 -1216 -1480 -250
3182 -250 1087 663 -154 15 257 392 1285 1560 963 20 -310 -308 89 393 324 -599 -1549 -1381 -660 -833 -312
3203 -312 606 -119 -1533 -506 1408 920 237 1633 1161 -554 -351 1453 1269 -192 -299 -150 -1464
$$ packed form
3071d22J476o2j959L05K822n5j695M17K29j431n60J676M63j799n17Q8q48N79J603
3090C10j73r74K92K51n13J021J890m58j597J99N28o76L63J083k21k227o93Q44
3108g51N83q13N51M60j323j116J816J562j92l24L31o86m54J116J222o86l64m69
3126D63j630M9J624P7j127k33J17j203L6K316N61j468j96P66l17L96J397L94j037
3145I85j107J31M07o9L08Q3j068j302L4R84M09J05r8n48o53P70J206J68M36Q5
3165A266j266p69J612Q82r61l91L91j355j343J529J238j244q41M74m38k64J230
3182b50J337m24q17J69K42J35Q93K75n97r43l30KL97L04o9r23r50J68P21j73N21
3203c12R18p25j414J027J914m88o83J396m72j715K03J804j84j461j07J49j314
$$ plain form
3220 -1464 -1136 -72 -34 -737 -883 -824 -1119 -143 950 702 264 676 434 105 593 1828 1043 -359 -308
3239 -308 301 -394 -839 114 353 -1449 -2077 -151 222 -923 -231 980 1 -644 531 1350 787 713 916
3258 916 165 -182 856 487 -602 -122 -169 -1186 -1518 70 113 -924 -904 161 -250 -568 729 1543 496
3277 496 -128 921 1133 340 220 1140 534 -1036 -544 370 -686 -1210 -424 -376 -1291 -796 190 -30 -190
3296 -190 657 362 -57 682 1192 367 437 1138 585 -376 -97 551 -346 -1272 -435 -132 -959 -1044 -183 -167 -830
3317 -830 -189 972 378 -158 674 1207 321 296 1080 626 -221 -246 406 -100 -680 -215 -700 -1346 -565 -430
3337 -430 -695 -374 534 -83 -640 447 1300 546 139 1191 758 -130 -18 928 390 -672 -511 -389 -878
3356 -878 -1062 -184 10 -865 -891 -6 226 48 645 1063 620 62 532 732 638 767 481 -581 -367 -167
$$ packed form
3220a464L28J064L8p03j46N9k95R76J093k48m38M12k42l29M88J235p85j402N1
3239c08O09o95m45R53K39j802o28J926L73j145O92J211r79o45J175Q19n63p4K03
3258I16p51l47J038l69j089M80m7j017l32J588M3j037K0J065m11l18J297Q14j047
3277D96o24J049K12p93j20R20o06j570M92R14j056n24P86M8r15M95R86k20j60
3296a90Q47k95m19P39N10q25P0P01n53r61K79O48q97r26Q37L03q27q5Q61J6o63
3317h30O41J161n94n36Q32N33q86k5P84m54q47k5O52n06n80M65m85o46P81J35
3337d30k65L21R08o17n57J087Q53p54m07J052m33q88J12R46n38j062J61J22m89
3356h78j84Q78J94q75k6Q85K32j78N97M18m43n58M70K00r4J29k86j062K14K00
$$ plain form
3376 -167 -373 -597 -5 -311 -1340 -1242 92 459 -118 158 606 -124 -334 783 1752 983 86 129 220 -188
3396 -188 58 541 53 -750 -1318 -1046 -475 -44 23 -168 -591 -357 -166 404 1319 1347 161 -163 151 619
3416 619 344 710 699 -192 -1522 -1172 -47 19 -661 -529 -614 -1194 -884 369 1260 599 93 -14 178 581
3436 581 1005 1115 743 -134 -833 -441 34 433 -46 -811 -1250 -1187 -843 103 628 145 -252 -623 195 821
3456 821 1018 1258 923 -197 -638 20 975 794 -201 -688 -1100 -1262 -903 131 577 -418 -961 -1001 -257 345
3476 345 910 1087 263 -59 -199 627 1082 951 537 -373 -995 -759 -238 64 -10 -456 -1316 -1217 -461 292 632
3497 632 543 39 -506 -423 593 1587 1176 341 102 -69 -529 -160 815 368 -838 -1477 -925 -671 -128 261
3517 261 315 -521 -829 -308 497 1149 931 825 -75 -251 281 674 566 502 -323 -1264 -917 -259 -65 -202 -294
$$ packed form
3376a67k06k24N92l06j029R8J334L67n77K76M48p30k10J117R69p69q97M3R1m08
3396a88K46M83m88q03n68K72N71M31O7j91m23K34J91N70R15K8j186l24L14M68
3416F19k75L66j1q91j330L50J125O6o80J32q5n80L10J253Q91o61n06j07J92M03
3436E81M24J10l72q77o99L92M75L99m79p65m39O3L44R46N25m83l97l71Q18O26
3456H21J97K40l35j120m41O58R55j81r95m87m12j62L59J034M46r95n43m0P44O02
3476C45N65J77q24l22j40Q26M55j31m14r10o22K36N21L02p4m46q60R9P56P53L40
3497F32q9n04n45Q3J016R94m11q35k39j71m60L69R75m47j206o39N52K54N43L89
3517B61N4q36l08N21Q05O52k18j06r00j76N32L93j08o4q25r41L47O58J94j37r2
$$ plain form
3538 -294 -520 -1108 -929 510 964 375 203 313 281 -149 795 1530 850 -527 -490 -225 21 -6 8 -357 -893
3559 -893 -1193 -888 -115 331 238 -167 -500 284 493 620 1072 1005 239 -526 93 709 327 -176 -155 -616 -1390
3580 -1390 -812 180 12 -617 -505 -216 -496 -225 905 1054 517 99 327 536 561 577 329 -137 -283 -345
3600 -345 -673 -398 260 -188 -1094 -629 -103 -121 -232 490 556 -40 17 914 921 287 457 535 145 -351 -54 189
3622 189 -510 -757 -316 -552 -756 -420 -130 -342 -359 14 161 205 364 865 427 414 497 193 88 294 466
3643 466 -288 -557 -100 -209 -771 -702 -3 -395 -399 -98 357 8 -16 392 587 262 407 620 409 133 189 235
3665 235 -147 -206 -465 -407 -668 -477 -353 -262 -277 -151 -532 -38 556 568 161 225 559 423 117 379 889 -115
3687 -115 -673 -334 -267 -378 -351 -333 -398 -832 -761 -222 305 183 253 85 195 420 548 806 861 313 -123 -110 260
$$ packed form
3538b94k26n88J79J439M54n89j72J10l2m30R44P35o80j377L7K65K46k7J4l65n36
3559h93l00L05P73M46r3m05l33P84K09J27M52o7p66p65O19O16l82n03K1m61p74
3580a390N78R92j68o29J12K89k80K71J130J49n37m18K28K09K5J6k48m66j46o2
3600c45l28K75O58m48r06M65N26j8j11P22O6n96N7Q97Po34J70P8l90m96K97K43
3622A89o99k47M41k36k04L36K90k12j7L73J47M4J59N01m38j3Q3l04j05K06J72
3643D66p54k69M57j09n62O9O99l92mL01M55l49k4M08J95l25J45K13k11k76N6M6
3665B35l82n9k59N8k61J91J24R1j5J26l81M94N94J2m07O4L34j36l06K62N10j004
3687a15n58L39O7j11K7J8o5m34P1N39N27j22P0j68J10K25J28K58N5n48m36J3L70
$$ plain form
3710 260 147 -135 -204 -512 -831 -979 -235 261 -2 -453 -249 -6 -198 280 918 689 311 -132 -48 477 471
3731 471 303 45 -196 -543 -804 -395 74 -132 -839 -689 -208 -94 -89 576 665 -32 -255 382 727 651 516
3752 516 494 -65 -577 -351 94 230 -338 -518 -610 -795 -417 174 280 196 -134 -392 -15 926 1011 512 94
3773 94 429 98 -251 382 704 15 -1082 -453 -398 -594 -117 288 -299 -888 -578 154 386 583 656 437 -228
3794 -228 72 565 712 318 228 -299 -774 -470 231 -108 -199 -301 -742 -1140 -326 740 417 -143 174 332
3814 332 -117 307 1243 1178 -59 -367 79 -309 -236 514 201 -845 -998 -606 -323 -237 310 298 -555 -532 358
3835 358 656 475 679 601 1 -300 516 509 98 84 135 -935 -1095 89 497 -428 -514 73 -517 -776 281
3856 281 1106 499 -211 380 338 68 447 1017 288 -509 -361 -152 -244 -73 196 -389 -928 -654 -194 -234 42
$$ packed form
3710B60j13k82o9l08l19j48P44M96k63m51K04K43j92M78O38k29l78m43Q4N25o
3731D71j68k58k41l47k61M09M69k06p07J50M81J14NO65Q9o97k23O37L45p6j35
3752E16k2n59n12K26M45J36n68j80r2j85L78N91J06q4l30k58L77R41Q5m99m18
3773I4L35l31l49O33L22o89j097O29N5j96M77M05n87n89L10P32K32J97P3k19o65
3794b28L00M93J47l94r0n27m75L04P01l39r1j02m41l98Q14J066l23n60L17J58
3814C32m49M24R36o5j237l08M46l88P3P50l13j046j53L92K83Q6N47j2q53K3Q90
3835C58K98j81K04p8o00l01Q16pm11j4N1j070j60J184M08r25q6N87n90k59J057
3856B81Q25o07p10N91m2k70L79N70p29p97J48K09r2J71K69n85n39K74M60m0K76
$$ plain form
3877 42 493 -109 -672 306 897 464 303 994 386 -774 -135 788 185 -567 -260 -18 -754 -760 275 328 -379
3898 -379 -407 63 -257 -5 1039 629 69 305 314 160 178 860 459 -750 -436 11 -345 -667 -139 209 -733
3919 -733 -736 347 238 -204 186 729 -108 -319 785 974 70 170 590 -26 -710 4 402 -481 -593 -217
3939 -217 -442 -595 92 139 -402 -146 386 64 -59 444 845 63 -263 556 317 -224 14 409 -156 -905
3959 -905 -139 227 -727 -572 65 -46 -771 -113 620 194 -201 528 607 75 289 535 332 -156 88 -133
3979 -133 -740 -159 -34 -539 -868 -173 36 -611 -335 376 112 -295 255 917 146 4 464 640 -75 -73 546
4000 546 -88 -444 -137 -58 -566 -702 -73 14 -691 -167 199 -97 30 421 331 -5 270 768 271 80 637
4021 637 308 -509 -98 460 -244 -668 -85 -5 -645 -521 163 161 -268 -42 373 171 45 661 821 279 188
$$ packed form
3877D2M51o02n63R78N91m33j61O91o08j160O39R23o03p52L07K42p36oJ035N3p07
3898c79k8M70l20K52J044m10n60K36Rj54J8O82m01j209L14M47l56l22N28L48r42
3919g33lJ083j09m42L90N43q37k11J104J89r04J00M20o16o84P14L98q83j12L76
3939b17k25j53O87M7n41K56N32l22j23N03M01p82l26Q19k39n41K38L95n65p49
3959i05P66L66r54J55O37j11p25O58P33m26l95P29P9n32K14K46k03m88K44k21
3979a33o07N81J25n05l29O95K09o47K76P11k64m07N50O62p71j42M60J76p15KO19
4000E46o34l56L07P9n08j36O29Q7p05N24L66k96J27L91r0l36K75M98m97j91N57
4021F37l29q17M11N58p04m24N83Q0o40J24O84km29K26M15k02j26O16J60n42r1
$$ plain form
4042 188 295 109 27 326 56 -530 -533 -277 -425 -502 193 -250 -582 -296 129 178 -257 674 561 -218 -208 718
4064 718 647 -36 112 141 -244 -770 -170 233 -285 -516 -378 -572 -346 292 354 115 143 276 106 163 681 683
4086 683 24 -233 -34 -209 -293 241 233 -621 -1024 -417 -110 -502 -114 417 -256 -472 192 586 442 277 527
4107 527 409 -230 256 622 228 -120 -175 -701 -807 -324 211 -270 -307 -199 -199 -680 386 883 182 18 143
4128 143 131 -36 610 952 313 -587 -337 -38 -301 156 249 -313 -800 -826 15 75 288 467 106 -473 -102
4149 -102 640 444 541 575 -215 -499 -51 459 144 -148 14 -404 -1164 -547 409 251 -590 -152 37 -278 -170
4170 -170 850 932 -126 -44 308 30 158 779 408 -418 -743 -267 -229 -138 -10 -106 -869 -609 37 16 69 547
4192 547 401 -420 -336 800 781 -64 236 364 -530 -792 167 571 -359 -647 -214 -529 -782 96 651 -49
$$ packed form
4042A88J07j86q2K99k70n86lK56j48p7O95m43l32K86M25M9m35R31j13p79J0R26
4064G18p1o83J48K9l85n26O00M03n18k31J38j94K26O38O2k39K8J33j70N7N18K
4086F83o59k57J99j75q4N34qq54m03O07L07l92L88N31o73k16O64L94j44j65K50
4107E27j18o39M86L66l94l48n5n26j06M83N35m81l7J08%m81J066M97p01j64J25
4128A43j2j67O46L42o39r00K50K99k63M57R3n62m87k6Q41O0K13J79l61n79L71
4149a02P42j96R7L4p90k84M48N10l15k92J62m18p60O17R56j58q41M38J89l15J08
4170a70J020Q2j058Q2L52k78J28O21l71q26l25M76L8R1J28r6p63K60O46k1N3M78
4192E47j46q21Q4J136j9q45L00J28q94k62R59M04r30k88M33l15k53Q78N55p00
$$ plain form
4212 -49 -316 137 84 -60 812 824 209 -218 182 374 -183 429 554 -429 -875 -215 100 -301 -112 456 -519
4233 -519 -1085 -48 661 -98 8 694 294 -505 119 1058 186 -282 -12 -113 -623 -263 268 -104 -586 -303
4253 -303 -340 -642 -116 606 323 -652 181 484 -121 303 1227 428 -498 -80 385 -144 -347 284 213 -998
4273 -998 -791 235 -172 -643 27 344 -403 -306 573 486 -42 272 425 28 -18 631 409 -268 -16 203 -649
4294 -649 -503 233 230 -585 -615 323 -207 -591 297 733 -129 -273 767 591 -243 124 694 16 -410 171 259
4315 259 -436 -254 82 -315 -583 -175 -93 -408 -249 487 78 -133 493 620 -34 -27 529 466 -530 39 545
4336 545 -436 -680 141 226 -579 -438 154 -111 -700 -70 423 73 -20 446 441 -211 409 519 253 -213 273
4357 273 139 -299 10 10 -519 -705 -1 -126 -546 -189 176 -3 -558 311 745 35 -147 582 282 -377 31
$$ packed form
4212d9k67M53n3j44Q72J2o15m27M00J92n57O12J25r83m46O60L15m01J89N68r75
4233e19n66J037P09p59J06O86m00p99O24R39q72m68K70j01n10L60N31l72m82K83
4253c03l7l02N26P22k83r75Q33L03o05M24R24p99r26M18M65n29k03O31p1j211
4273i98K07J026m07m71O70L17p47R7Q79q7n28L14J53l97m6O49k22o77K52K19q52
4294f49J46P36lq15l0R38n30l84Q88M36q62j44J040j76q34L67N70o78m26N81Q8
4315B59o95J82L36l97k68M08Q2l15J59P36m09k11O26J27o54PN56o3r96N69N06
4336E45r81k44Q21Q5q05J41N92k65n89O30M93l50r3M66no52O20J10k66m66M86
4357B73j34m38L09%n29j86P04j25m20L57L65j79n55Q69M34p10j82P29l00o59M08
$$ plain form
4378 31 786 197 -414 -53 149 -613 -558 266 -111 -646 -103 -25 -304 3 574 213 -64 217 416 77 455
4399 455 639 30 -389 -103 238 -143 -245 93 -76 -920 -576 301 -137 -269 150 415 -322 -15 571 610
4419 610 169 166 284 -15 -97 325 245 -242 -349 -328 -427 -456 198 85 -527 -212 205 -214 44 564 510 20 -194
4442 -194 555 322 -14 235 250 -440 -694 63 169 -331 -64 -74 -328 -670 -24 152 140 320 298 96 -117
4463 -117 598 421 139 150 573 -288 -423 264 257 -275 -451 -148 -408 -642 147 396 -429 -510 133 259 53
4484 53 276 688 16 -287 84 280 -5 107 336 -155 -723 -317 -180 -203 -202 -76 -323 -575 102 347 109
4505 109 94 407 36 -306 276 726 119 -180 199 -85 -405 -255 364 -92 -656 -295 24 -387 -68 353
4525 353 -99 -318 -99 203 73 379 589 242 -411 69 312 -176 -77 375 -215 -952 -444 260 -68 -362
$$ packed form
4378C1P55n89o11L61K02p62N5Q24l77n35N43P8k79L07N71l61k77K81J99l39L78
4399D55J84o09m19K86L41l81j02L38j69q44L44Q77m38j32M19K65p37L07N86L9
4419F10m41lJ18k99q2M22q0m87j07K1r9k9O54j13o12L15M17m19K58N20n4m90k14
4442a94P49k33l36K49J5o90k54P57J06n00K67j0k54l42O46J76j2J80k2k02k13
4463a17P15j77k82J1M23q61j35O87pn32j76L03k60k34P89K49q25q1O43J26k06
4484E3K23M12o72l03L71J96k85J12K29m91n68M06J37k3JJ26k47k52O77K45k38
4505A09j5L13l71l42N82M50o07k99L79k84l20J50O19m56n64L61L19m11L19M21
4525C53m52k19K19L02j30L06K10l47o53M80K43m88R9M52n90p37N08P04l28k94
$$ plain form
4545 -362 128 69 -556 -298 493 350 -17 221 533 64 -167 499 196 -151 13 -1 -347 -371 14 47 -437
4566 -437 -282 120 -406 -287 350 461 -290 -26 621 205 -107 467 542 -314 -418 219 154 -450 -234 59 -336
4587 -336 -734 -70 315 -233 -182 193 3 -167 196 680 164 172 414 85 -198 200 465 -231 -419 128 -23
4608 -23 -476 -59 196 -405 -572 73 16 -169 -23 622 446 -252 135 611 62 -187 402 125 -388 -273 120
4629 120 -228 -483 -207 -12 -566 -90 271 -158 -279 217 290 -185 114 770 325 -270 289 362 -314 -293 380
4650 380 -110 -814 -243 241 -279 -619 100 135 -382 -362 377 202 -91 265 479 -44 10 536 223 -398 -48
4671 -48 71 -358 -321 188 -16 -597 -276 211 -93 -416 330 305 -337 -180 565 210 -197 497 434 51 -465
4692 -465 211 184 -447 -234 2 -156 -534 107 110 -305 -318 75 -55 -243 349 305 -34 151 458 12 -186 338
$$ packed form
4545c62M90n9o25K58P91j43l67K38L12m69k31O66l03l47J64j4l46k4L85L3m84
4566d37J55M02n26J19O37J11p51K64O47m16l12N74P5q56j04O37o5o04K16K93l95
4587c36l98O64L85n48N1L75j90j70L63M84n16QK42l29k83L98K65o96j88N47j51
4608b3m53M17K55o01j67O45n7j85J46O45j76o98L87M76n49k49N89k77n13J15L93
4629A20l48k55K76J95n54M76L61m29j21M96P3m75K99O56m45n95N59P3o76K1O73
4650C80m90p04N71M84n20l40P19L5n17K0P39j75k93L56K14n23N4N26l13o21L50
4671d8J19m29L7N09k04n81L21M87l04l23P46k5o42J57P45l55m07O94o3l83n16
4692d65O76k7o31K13K36j58l78O41Lm15j3L93j30j88N92m4l39J85L07m46j98N24
$$ plain form
4714 338 381 -271 -551 313 88 -451 -159 246 -514 -512 -19 416 -222 52 311 187 -102 224 552 216 -86
4735 -86 291 14 -352 -74 169 -164 -527 -120 -204 -509 -136 450 -234 -190 187 274 -106 163 693 255 -415
4756 -415 171 479 -180 -40 299 115 -485 -241 -71 -123 -318 -64 -29 -433 -58 330 123 1 343 293 -247
4777 -247 254 531 511 -113 60 -95 -438 -302 346 -132 -517 -232 -58 -348 -242 401 268 -263 -208 228 165
4798 165 127 415 397 -123 -147 205 161 -130 -15 -94 -565 -410 -95 -93 -197 9 31 -342 -253 396 369 144 252
4821 252 403 -104 -130 379 383 40 -223 -84 -95 -512 -19 87 -374 -529 -161 -107 -18 184 213 9 -137 281
4843 281 268 301 503 332 -143 -336 52 123 -178 -63 -88 -490 -741 -99 201 -40 -40 208 16 -137 112 636
4865 636 249 39 112 6 -195 -16 220 -126 -375 -315 -215 -423 -90 206 -167 -400 -160 5 -84 250 444
$$ packed form
4714C38M3o52k80Q64k25n39K92M05p60KM93M35o38K74K59j24k89L26L28l36l02
4735h6L77k77l66K78K43l33l63M07q4l05L73N86o84M4L77Q7l80K69N30m38o70
4756d15N86L08o59J40L39j84o00K44J70n2j95K54L5m04L75L88k07j22L42n0n40
4777b47N01K77k0o24J73j55l43J36O48m78l85K85J74k90J06O43j33n31N5M36o3
4798A65l8K88j8n20k4L52m4k91J15p9m71J55L15Kj04K06K2l73Q9O49k7k25J08
4821B52J51n07k6N09Ml43k63J39j1m17M93J06m61j55L68N4Q9K02K9k04j46M18
4843B81j3L3K02j71m75j93L88P1l01J15k5m02k51O42L00k41%K48j92j53K49N24
4865F36l87k10P3j06k01J79K36l46k49O0J00k08L33K96l73k33K40J65q9L34J94
$$ plain form
4886 444 -14 -234 114 224 -24 137 425 113 -447 -288 92 62 -211 -91 64 -587 -245 261 292 15 40
4907 40 -61 -144 -53 404 311 77 109 74 -398 -27 286 117 -458 -197 -162 -345 -55 221 97 -439 -73 167
4929 167 144 -160 541 609 -12 -56 403 240 8 71 -22 -201 -359 70 -173 -274 -41 -155 -354 -191 8 279
4951 279 -151 120 343 -101 13 459 461 -140 -294 366 -13 -330 3 177 -433 -591 86 30 -177 -243 193
4972 193 42 -30 405 180 -35 280 361 -19 -38 98 311 -53 -181 128 -200 -529 -116 239 -208 -521 29
4993 29 -144 -249 126 400 163 123 276 449 -205 126 432 61 -445 -2 237 -363 -530 -131 -179 -561 -138
5014 -138 118 -108 -157 241 234 -35 96 477 11 -155 259 360 -141 -210 401 -174 -493 -181 155 -309 -480
5035 -480 198 50 -253 34 419 45 -12 361 386 -102 140 349 199 -191 128 -34 -347 -143 -46 8 -369
$$ packed form
4886D44m58k20L48J10k48J61K88l12n60J59L80l0k73J20J55o51L42N06L1k77K5
4907D0j01q3R1M57r3k34L2l5m72L71L13j69n75K61L5j83K90K76j24n36L66K40
4929A67k3l04P01O8o21m4M59j63k32O3r3j79j58M29k43j01K33j14j99J63J99K71
4951B79m30K71K23m44J14M46Ko01j54O60l79l17L33J74o10j58O77n6k07o6M36
4972A93j51p2M35k25k15L15Q1l80j9J36K13l64j28L09l28l29M13L55m47l13N50
4993B9j73j05L75K74k37m0J53J73o54L31L06l71n06M43K39o00j67L99m8l82M23
5014a38K56k26m9L98pk69J31L81m66j66M14J01n01o9O11n75l19L12L36m64j71
5035d80O78j48l03K87L85l74n7L73K5m88K42K09j50l90L19j62l13K04R7N4l77
$$ plain form
5056 -369 -146 155 -300 -253 557 179 -147 40 349 167 -56 412 557 -228 -117 394 123 -379 134 -18
5076 -18 -254 -411 119 -26 -415 -39 -2 -379 20 361 461 106 125 415 119 -16 331 165 -364 -68 -6
5097 -6 -209 -305 35 247 -484 -339 -74 -50 15 5 385 -71 -124 86 399 70 214 21 12 -252 -68 36 -122
5120 -122 -217 20 -369 -469 -68 72 -227 -241 23 118 -330 292 483 115 -91 306 195 -75 -59 281 -34
5141 -34 -514 -219 -287 -124 -122 125 5 -184 -252 -76 34 157 257 224 -139 188 363 169 207 223 -192 -347 -24
5164 -24 231 41 -305 -156 -242 -396 -125 253 183 -292 11 155 -24 -37 418 238 -208 -48 -52 -27 -32 152 67
5187 67 -78 -286 -102 -287 -178 29 -48 -316 57 288 74 107 259 282 -195 -47 158 194 1 10 62 -326 -364
5210 -364 -109 -1 -232 -285 -163 -246 -64 -6 260 49 -127 177 244 350 186 204 -48 112 69 -106 84 203
$$ packed form
5056c69K23L01m55M7Q10l78l26J87L09j82k23M68J45p85J11N11k71n02N13j52
5076a8k36j57N30j45l89L76L7l77L99L41J00l55J9K90k96j35L47j66n29K96O2
5097fk03r6L40K12p31J45K65K4O5j0L80m56n3K10L13l29J44j93rk64J84J04j58
5120a22r5K37l89j00M01J40k99j4K64R5m48O22J91l68k06L97j11k70J6L40l15
5141c4m80K95o8J63KK47j20j89o8J76J10J23J00l3l63L27J75j94L8J6m15j55L23
5164b4K55j90l46J49q6j54K71L78p0m75L03J44j79j3M55j80m46J60mK5nJ84q5
5187F7j45k08J84j85J09K07p7k68L73K31k14L3J52K3m77J48K05L6j93RN2l88l8
5210c64K55J08k31n3J22q3J82N8K66k11j76L04O7J06j64J8k52J60m3j75J90J19
$$ plain form
5232 203 -31 -465 -353 -269 -118 -175 67 241 -142 42 79 276 61 328 237 75 53 169 161 101 22 -83 -152
5255 -152 -141 -188 -32 -276 -77 -26 -66 -112 292 434 138 100 233 244 -24 109 383 31 -355 -239 16 -231
5277 -231 -325 111 -217 -363 -299 243 -51 -97 -62 66 -110 119 141 198 141 229 -43 -143 -3 195 -82 -214 -9
5300 -9 -158 -444 -132 99 -230 -215 74 113 -15 117 532 369 -133 91 190 160 -34 163 -19 -347 -336 62
5322 62 -122 -81 -9 -161 -343 -133 18 -56 -63 387 240 10 -16 414 172 -61 35 177 -153 -274 210 66 -294
5345 -294 -398 31 -85 -407 -194 184 -83 -237 58 119 105 162 217 -49 114 366 65 -6 121 -100 -432 -210
5367 -210 99 -99 -209 -41 110 -177 -103 183 161 -115 89 319 101 -28 206 412 65 -152 106 18 -44
5388 -44 -349 -80 -28 -310 -64 -169 -202 -22 211 48 -125 131 276 85 114 244 177 -42 130 233 -75 -324
$$ packed form
5232B03k34m34J12Q4J51n7K42J74l83J84L7J97k15K67r1j62k2J16qo0p9j05o9
5255a52J1m7J56k44J99N1m0m6M04J42k96l8J33J1k68J33K74l52l86J16K55k47
5277b31r4M36l28j46O4N42k94m6L5J28j76K29K2N7n7Q8k72j00J40J98k77j32K05
5300ij49k86L12K31l29J5K89L9j28J32M15j63n02K24R9l0j94J97j82l28J1L98
5322F2j84M1P2j52j82K10J51p4pM50j47k30k6M30k42k33R6J42l30j21M84j44l60
5345b94j04M29j16l22K13L78k67j54K95O1j4N7N5k66J63K52l01p1J27k21l32K22
5367b10L09j98j10J68J51k87P4K86k2k76K04K30k18j29K34K06l47k17K58q8o2
5388d4l05K69N2k82K46j05l3J80K33j63j73K56J45j91K9J30o7k19J72J03l08k49
$$ plain form
5410 -324 110 -91 -428 -160 57 -69 -216 29 172 31 114 228 277 79 301 313 179 80 117 8 -66 -22
5432 -22 66 -141 -127 -119 -198 -271 -135 135 -25 -66 165 45 -69 100 380 217 -173 -93 32 -15 16 150 51 -290
5456 -290 -395 -141 -19 -211 4 -118 -91 51 133 234 -118 201 127 101 154 199 -5 -9 -33 -194 -399 -215 48
5479 48 44 -254 -300 -127 -42 -213 111 334 -10 -45 61 225 164 330 239 76 52 37 -93 -30 107 -173 -278 -305
5503 -305 -251 -59 84 131 -81 -157 -37 126 323 314 275 341 148 -101 -59 332 2 -67 8 -208 -307 -191 105 -10
5527 -10 -424 -196 -41 56 265 335 132 102 260 -33 -37 291 292 -90 -127 -10 -74 -228 -32 -169 -179 -358 -314 20
5551 20 9 22 270 41 -35 43 220 246 358 116 85 -21 -45 121 42 -128 -113 -305 -454 -127 -156 -195 50 143
5575 143 -92 -156 172 341 225 -54 28 235 83 39 200 150 -84 -20 -214 -261 -122 -22 -163 -22 -161 -163 -14
$$ packed form
5410c24M34k01l37K68K17j26j47K45J43j41Q3J14M9j98K22J2j34r9L7j09p4M4
5432b2Q8k07J4Qp9p3J36K70j60m1K31j20j14J69K80j63l90Q0J25m7L1J34r9l41
5456b90j05K54J22j92K15j22K7J42Q2J01l52L19p4k6N3M5k04mk4j61k05J84K63
5479D8mk98m6J73Q5j71L24K23l44l5J06J64o1J66r1j63k4j5j30O3J37k80j05k7
5503c05N4J92J43M7k12p6J20J63J97rl9O6j93k49M2L91l30o9P5k16r9J16K96j15
5527a0m14K28J55R7K09P0k03l0J58k93mL28Jl82l7J17o4j54J96j37j0j79M4L34
5551B0j1J3K48k29p6P8J77K6J12k42l1j06k4J66p9j70J5j92j49L27k9l9K45R3
5575A43k35o4L28J69j16k79Q2K07j52m4J61n0k34O4j94m7J39J00j41J41j39kJ49
$$ plain form
5598 -14 35 189 -32 -50 190 72 283 418 8 -62 -65 -108 58 -47 -92 -180 -97 -264 -101 -108 -35 -77 39 -46 4
5623 4 13 142 326 26 112 24 199 -134 53 -21 -233 -73 -239 -190 -194 84 -108 -351 -103 -62 127 109 219 96
5647 96 -87 61 207 93 -58 49 36 -109 -236 41 -127 -252 -175 -20 -215 9 139 80 -74 71 129 -95
5669 -95 64 299 118 -39 150 252 50 14 -57 151 -140 -183 1 137 -334 -115 46 76 -256 142 304 114
5691 114 47 357 357 27 158 83 -53 -200 -14 -39 -71 -188 -229 -316 -193 100 -161 -147 16 263 1 24 97 481
5715 481 115 -45 164 -15 -219 190 -15 -93 -232 -201 23 -113 -340 96 -96 -261 -69 64 154 25 172
5736 172 68 126 132 220 85 -72 158 -105 -176 60 212 -228 -115 -23 -1 -279 -189 90 21 -271 -7 164 165 313
5760 313 272 417 160 88 113 55 -178 122 -261 -170 -218 72 -208 -118 64 -184 -160 -70 125 30 21 242 213 -15
$$ packed form
5598a4M9J54k21j8K40j18K11J35m10p0lm3J66j05m5q8Q3j67J63pP3m2J16q5N0
5623DRJ29J84l00Q6q8J75l33J87p4k12J60j66M9mK78j92k43K48M1J89j8J10j23
5647I6j83J48J46j14j51J07j3j45j27K77j68j25P7J55j95K24J30n9j54J45N8k24
5669i5J59K35j81j57J89J02k02l6p1K08k91m3J84J36m71K19J61L0l32L98J62j90
5691A14o7L10%l30J31p5j36j47J86k5l2j17m1q7J23K93k61J4J63K47k62K3P3L84
5715D81l66j60K09j79k04M09k05p8j39L1K24j36k27M36j92j65J92J33R0j29J47
5736A72j04N8OQ8j35j57K30k63p1K36J52m40J13R2K2k78R0K79o9k92K64J71JJ48
5760C13m1J45k57p2K5n8k33L00l83R1m8K90k80R0J82k48K4R0J95r5rK21k9k28
$$ plain form
5784 -15 64 433 117 -19 39 46 -253 -149 77 15 -108 -351 -136 180 -160 26 69 -41 104 108 52 285 287 341
5808 341 -122 -62 -4 -164 -251 -71 -82 -186 -170 -198 -136 -165 -47 13 -72 -16 239 338 7 -101 163 73 -131 3
5832 3 131 -65 -154 -86 -244 -24 -101 37 -7 -111 -225 57 -235 339 377 -13 61 -75 124 74 223 5 168
5855 168 -319 -132 21 -156 -144 23 -204 -171 -163 66 107 77 233 -119 47 105 201 454 165 123 -79 -105 63
5878 63 -160 -174 -52 -100 -141 -306 -46 65 -83 -136 173 63 38 -26 300 95 42 11 48 271 -33 33 -75 -55
5902 -55 -32 -9 99 -85 -210 -168 -123 -33 -90 -64 53 165 -49 -326 120 234 170 -132 25 -33 -187 -233 95 -53
5926 -53 -44 -130 -46 -69 -171 152 32 -10 80 118 127 282 315 -4 148 102 13 122 -28 37 104 52 -163 44 -29 -140
5952 -140 45 -123 -174 -74 88 300 -11 123 114 101 -48 64 203 -124 -78 -85 -136 -99 28 -5 -196 39 -87
$$ packed form
5784a5P9L69l16j36N8Pk99J04K26o2j23k43K15L16l40J86M3j10J45Mn6K33KN4
5808C41m63O0N8j60q7J80j1j04J6k8O2k9J18O0q5N6K55R9l31j08K64r0k04J34
5832CJ28j96q9O8j58K20p7J38m4j04j14K82k92N74L8l90P4j36J99n0J49k18J63
5855A68m87J87J53j77J2J67k27L3QK29M1l0J56l52J66N8R6K53k89m2k02k6J68
5878F3k23j4J22m8m1j65K60J11j48n3L09j10k5o4L26k05n3l1L7K23l04O6j08K0
5902e5K3K3J08j84j25M2M5R0n7K6J17J12k14k77M46J14o4l02J57n8j54m6L28j48
5926e3Rq6Q4k3j02L23j20m2R0L8RJ55L3l19J52m6q9J09j50O5O7n2k15K07p3j11
5952a40J85j68n1J00J62K12l11J34rj3j49J12J39l27M6pn1L7J27l3j91K35j26
$$ plain form
5975 -87 -71 -58 151 243 -55 55 94 157 77 303 115 -5 -121 14 -37 -276 43 -160 -184 -280 -107 125 -289
5998 -289 -166 -15 -43 -54 17 142 82 93 34 64 -23 58 97 -46 -36 121 -51 -181 63 35 -292 -145 25 55
6022 55 17 46 153 -118 103 290 277 182 94 207 -126 -156 -26 153 -120 -163 -201 6 -218 -221 -48 -109 37 109
6046 109 -26 186 112 193 181 68 122 81 -71 -11 51 -76 -233 -124 23 -94 -247 81 -148 -108 -138 34 135
6069 135 -48 189 125 116 140 246 95 -96 -86 215 244 -156 36 -49 -255 -1 -50 -217 -50 110 -108 112 101
6092 101 390 -5 44 212 282 -121 10 94 49 -126 -7 103 -71 -213 -92 27 -171 -115 8 -221 -71 200
6114 200 143 47 -72 20 89 -25 110 205 -72 41 107 -97 -112 -147 45 -138 -209 60 -58 -114 250 158 -20 -154
6138 -154 188 335 190 194 232 139 -85 -29 81 -40 -67 -91 -130 -124 -155 95 -224 -53 -50 -201 2 149 287 158
$$ packed form
5975h7J6J3K09R2k98J10L9O3q0K26j88j20j16J35n1k39L19k03k4r6J73K32m14
5998b89J23J51k8j1P1J25o0J1n9L0q7Q1L9j43J0J57j72j30K44k8l27J47J70L0
6022E5l8K9J07k71K21J87j3r5q8J13l33l0J30J79k73m3l8K07k24lJ73o1J46P2
6046A09j35K12p4Q1j2j13N4m1j52O0O2j27j57J09J47j17j53L28k29M0l0J72J01
6069A35j83K37o4rK4J06j51j91J0L01K9m00J92q5k06K54m9j67J67J60k18K20j1
6092A01K89l95M9J68P0m03J31Q4m5j75J19J10j74j42J21J19j98N6J23k29J50K71
6114B00n7r6j19R2O9j14J35R5k77J13O6k04j5l5J92j83p1K69j18n6L64r2j78j34
6138a54L42J47j45ML8r3k24N6J10j21k7k4l9Ol1K50l19J71Lj51K03J47J38j29
$$ plain form
6162 158 -126 259 210 -21 -52 -51 55 -72 -2 46 -148 -184 -113 -16 -237 -54 -17 36 173 222 27 -57 180 38
6186 38 195 96 169 35 -68 -40 86 -76 -65 -59 -73 -226 -2 85 24 9 47 -55 -57 0 254 411 117 70 -34
6211 -34 85 89 126 -38 -59 -200 -110 -86 -70 -109 -108 -193 -31 43 23 138 291 156 -63 -7 185 -65 1 63 -21 -183
6237 -183 -126 -38 29 -17 -40 -123 -161 -181 128 49 -86 85 49 171 137 165 141 -3 -105 25 25 5 57 73 -70 -29
6263 -29 2 70 -26 -11 -115 -76 6 222 102 -47 90 -37 55 -15 183 63 -23 -51 -14 -133 -178 70 40 -28 103
6288 103 21 -57 -147 68 37 -97 123 66 106 73 102 105 -19 -238 127 -46 -121 -90 -57 -97 -269 -132 199 -43 -27
6313 -27 -37 151 -131 81 125 107 85 -25 104 114 -60 13 -39 -134 81 -72 -82 -6 187 -178 -62 89 94 64 -48
6338 -48 188 209 -17 66 214 64 -51 76 52 -139 -69 157 -213 4 -26 -136 -158 -31 84 30 -57 -138 119
$$ packed form
6162A58k84L85m9k31l1JJ06j27P0M8j94l6P1R7k21J83L7N3J37M9j95q4K37j42
6186C8J57r9P3j34j03K8J26j62J1Oj4j53K24Q7o1j5L8j02kN7K54J57k94m7j04
6211c4J19ML7j64k1j41R0K4J6l9Jq5J62P4k0J15J53j35k19N6J92k50O6O2q4j62
6237a83N7Q8O7m6k3q3l8k0L09p9j35J71l6J22l4K8k4j44j02J30%k0N2J6j43M1
6263b9L1O8r6J5j04L9Q2K16j20j49J37j27R2p0J98j20q6k8L7j19m5K48l0o8J31
6288A03q2p8r0K15l1j34K20n7M0l3K9Lj24k19L65j73p5L1L3m0j72J37L31k42J6
6313b7j0J88k82K12M4j8k2j10J29J0j74P3n2r5K15j53j0P6J93l65J16J51Nl0j12
6338d8K36K1k26Q3J48j50j15J27k4j91P0K26l70K17l0j10k2J27J15n4q7q1K57
$$ plain form
6361 119 -94 172 118 12 -120 19 12 -5 -295 -24 161 -93 -94 -82 2 -282 -60 10 -116 1 103 78 35 -19
6385 -19 216 43 75 67 20 11 -6 -83 37 -142 132 -5 -231 -52 -33 -180 -98 23 22 -116 -22 71 105 62 133 186
6411 186 -163 -123 74 53 -132 -1 -125 -155 -65 11 -11 72 -56 89 4 -147 241 92 17 234 86 -170 23
6434 23 273 157 -22 -246 60 19 -273 10 -13 -32 -150 -67 -50 -45 -57 60 72 -28 172 285 38 -51 82 46
6458 46 -204 -99 49 -182 -97 156 -296 -214 -116 0 -123 -154 -51 -6 -30 92 168 382 85 71 159 101 -20 26
6482 26 -3 -167 -70 26 -87 -255 -20 12 -243 -42 193 -70 36 28 19 37 213 -23 70 -13 77 -10 -50 -109 -23 50
6508 50 -143 2 119 -172 -127 216 114 -134 45 91 121 51 217 96 -37 -84 174 -81 115 11 -30 -255
6530 -255 -18 -90 -117 -91 -121 -8 -205 4 96 3 -20 -62 79 0 184 182 143 -40 31 48 -22 -107 -44 68 -103 -206
$$ packed form
6361A19k13K66n4j06j32J39pj7k90K71J85k54jJ2Q4k84K22P0j26J17J02k5m3n4
6385a9K35j73L2qm7rj7p7J20j79K74j37k26J79J9j47Q2J21jj38R4R3L4m3P1N3
6411A86l49M0J97k1j85J31j24l0R0P6k2Q3j28J45q5j51L88j49p5K17j48k56J93
6434B3K50j16j79k24L06m1k92K83k3j9j18Q3J7Nj2J17J2j00K00J13k47q9J33l6
6458D6k50J05J48k31Q5K53m52Q2R8J16j23l1J03M5k4J22P6K14k97j4Q8n8j21M6
6482B6k9j64R7R6j13j68K35L2k55K01K35k63J06qrJ8J76k36R3q3R0q7m0n9Q6P3
6508E0j93J45J17k91M5L43j02k48J79M6L0p0J66j21j33m7K58k55J96j04m1k25
6530b55K37p2k7K6l0J13j97K09R2r3k3m2J41p9J84kl9j83P1J7p0q5O3J12j71j03
$$ plain form
6556 -206 -107 -102 14 -65 38 -191 34 -135 253 21 189 -27 -46 -5 102 -34 -59 57 -79 -48 -162 -12 6
6579 6 21 -177 225 -124 -22 -144 61 81 -62 -71 97 -4 95 -81 -84 -90 -62 -19 -51 -69 -80 -82 -176 -54 -43 74 182
6606 182 -140 -141 -44 65 76 184 -66 196 -40 -140 -33 -47 223 -217 88 -41 -142 -156 -56 -55 -54 -14 -52 33
6630 33 -5 84 128 31 349 -58 -105 -25 24 -147 -80 26 -173 -26 -6 -54 -31 -214 -32 134 91 96 -66 75 -64
6655 -64 -178 49 136 -63 -71 2 -127 -129 -88 -71 -79 17 -152 24 -15 15 -202 0 40 50 -5 -27 301 130 71 89 155
6682 155 23 -70 51 -91 -179 -55 72 -55 -71 28 -41 -50 53 5 -22 32 91 215 25 -24 41 8 -90 48 -46
6707 -46 -225 -123 -22 -10 -65 -87 142 65 -128 1 -52 21 76 92 296 -180 -28 44 127 -15 -65 -76 76 -53
6731 -53 -13 -128 -97 -108 -93 59 102 -14 23 9 186 114 170 -1 -80 61 -67 -16 183 -58 17 11 150 -255 -73
$$ packed form
6556b06R9NJ16p9J03k29K25j69L88k32J68k16j9M1J07j36k5J16j36L1j14J50J8
6579FJ5j98M02l49J02j22K05K0j43rJ68j01R9j76loK8M3l2j8j1kr4J22J1J17J08
6606A82l22jR7J09J1J08k50K62k36j00J07j4K70m40L05j29j01j4J00JJM0l8Q5
6630C3l8Q9M4r7L18m07m7Q0M9j71O7J06j99J47K0m8K3j83J82J66m3Nj62J41j39
6655f4j14K27Q7j99qP3j29kM1J7qR6j69J76l9L0k17K02M0J0n5k2L28j71n9J8O6
6682A55j32r3J21j42q8J24J27j27j6R9o9rJ03m8k7N4N9J24j90m9O5l3r8J38r4
6707d6j79J02J01J2n5k2K29p7j93J29n3P3N5J6K04m76J52P2Q3j42n0j1J52j29
6731e3M0j15L1j1J5J52M3j16L7j4J77p2N6j71p9J41j28N1J99k41P5oJ39m05J82
$$ plain form
6756 -73 -90 -149 -12 -43 -10 -89 51 44 27 -60 39 69 44 11 6 -16 -56 -1 163 -20 -93 53 -47 -208 163 47 196
6783 196 -108 45 194 112 50 206 135 29 -30 -28 80 -137 -133 -242 -115 -137 164 -29 48 29 46 -289 -23 125
6807 125 95 187 20 -37 -116 1 49 217 -26 -148 -62 -27 -12 -121 137 13 -77 -19 -70 -46 -63 26 -87 30 244
6832 244 32 24 56 -96 -69 -96 64 -75 57 43 32 -129 -24 126 82 -90 86 -20 -120 48 -45 2 -113
6855 -113 185 36 63 85 17 19 -40 -215 -45 -75 -25 19 27 -106 -98 -9 24 92 9 99 -116 106 25 70 99 -20 109
6882 109 -23 23 -3 88 -222 -25 29 -53 59 -207 -63 51 -112 45 40 -6 16 -80 -116 43 6 78 -276 11
6906 11 75 -48 -20 -91 108 -29 -13 -62 31 -61 66 100 -128 -27 59 190 69 5 98 119 -22 -54 -21 -188 61
6931 61 -8 -38 -27 42 72 -34 -13 43 88 -51 -9 -8 43 69 24 -64 -99 114 141 -48 -182 58 -130 -87 12 29 67
$$ packed form
6756g3j7n9J37l1L3p9J40pj7q7R9L0k5l3nk2m0N5J64j83p3J46j00j61L71j16J49
6783A96l04J53J49q2o2J56p1j06n9KJ08k17Mj09J27k2L01j93P7j9J7l35K66J48
6807A25l0R2j67n7p9J17M8J68k43j22Q6L5J5j09K58j24r0N8n1K4j7Q9j13J17K14
6832B44k12qL2j52K7k7J60j39J32j4j1j61J05J50m4j72J76j06j00J68r3M7j15
6855a13K98j49K7K2o8Kn9j75J70l0N0M4Qj33QQ9L3O8q3R0k15K22q1M5K9j19J29
6882A09j32M6k6R1l10J97N4q2J12k66J44J14j63J57nm6K2r6l6J59l7P2l54K87
6906A1O4j23K8p1J99j37J6m9R3r2J27L4k28J01Q6J31j21o4R3K1j41l2L3j67K49
6931F1o9l0J1O9L0j06K1N6M5j39M2JN1K6m5q8l5K13K7j89j34K40j88M3R9J7L8
$$ plain form
6958 67 -25 99 -82 51 48 125 -55 73 -60 132 109 25 126 -34 -254 -1 -33 -35 -34 123 55 54 39 156 -22
6983 -22 -56 88 -30 39 135 48 124 19 -42 147 14 -90 38 39 -57 -43 -49 -106 -15 78 -115 -96 -146 -14 177 -115
7009 -115 -146 2 66 -13 8 -94 1 -16 113 -15 -58 -65 -65 28 -38 -45 -49 62 19 81 81 122 47 67 -134 36 -28 24 -139
7038 -139 -62 -26 81 -32 -117 -97 20 13 -17 -16 -27 6 10 -8 -87 71 151 -20 36 -79 42 -10 49 -105 -65 -62 -149 56
7066 56 0 -66 -165 118 32 -9 -34 124 -24 32 64 93 -53 160 -37 113 -13 -17 -42 -108 125 101 71 -98 -49 -59
7092 -59 86 -11 -105 194 2 -31 -108 16 -31 -1 31 -31 118 -25 -80 -108 -55 99 15 -144 -141 104 -47 -22 -160
7117 -160 -115 63 71 52 128 -84 -111 21 -83 18 162 97 54 7 14 -68 -138 -34 26 -60 116 192 57 -60 -47 161
7143 161 -103 -163 -24 3 45 48 61 10 -117 -22 -11 30 51 113 -178 74 118 -82 -32 212 -124 -19 -115 39 -7
$$ packed form
6958F7r2J24j81J33lP7j80J28j33J92k3q4J01j60k20K53l2kJJ57o8jj5J17j78
6983b2l4J44j18O9R6q7P6j05o1J89j33j04J28Jr6J4on7R1R3j93J9n0J32J91k92
7009a15l1J48O4p9K1j02R5j7J29j28m3p%R3o6pmJ11m3O2%M1p5K0k01J70o4N2j63
7038a39P7L6J07j13q5K0J17pl0Jj1L3Mj8p9J58Q0j71N6j15J21n2N9j54M0Lq7K05
7066E6n6o6r9K83q6m1k5J58j48N6L2K9j46K13j97J50j26mk5o6K33k4l0j69M9j0
7092e9J45r7r4K99j92l3p7J24m7L0L2o2J49j43n5k8N3J54q4j59LK45j51K5j38
7117a60M5J78Qj9P6k12k7J32j04J01J44o5m3m7Pq2p0J04O0q6J76P6j35j17J3K08
7143A61k64o0J39K7M2LJ3n1j27R5J1M1K1O2k91K52M4k00N0K44l36J05r6J54m6
$$ plain form
7168 -7 -94 -44 194 0 62 -20 -43 96 -157 -137 39 51 81 91 -4 -153 -135 -73 -56 -24 -140 46 18 -44 83 -33
7194 -33 38 -87 132 -12 9 113 174 -181 6 9 37 -53 -4 -1 -141 143 12 -4 20 -97 76 77 122 82 -63 -42
7220 -42 77 -107 27 38 79 43 -65 72 197 71 -29 70 -4 65 -202 78 59 49 -203 12 -63 -57 -25 -147
7244 -147 -56 -67 35 61 0 -65 -1 56 119 96 -11 -270 -64 143 55 -12 123 88 13 -210 -19 -42 52 -12 -23 -150
7270 -150 -32 52 152 -54 -86 -107 -122 15 3 49 -129 -108 142 -50 -49 -109 -68 79 -216 -219 -59 53 -116 -32 -111
7295 -111 208 -26 10 39 86 77 -75 41 -56 -64 32 -64 -81 96 162 -181 -81 -54 37 94 86 -8 75 18 -145 221 36
7322 36 -18 131 175 113 69 -54 2 -164 -157 0 202 63 -96 -3 100 62 69 116 147 -28 160 -16 61 -66 115
7347 115 18 -80 55 44 190 -195 -1 80 9 -19 -39 -173 -140 -64 143 -65 26 -41 -74 -31 -10 32 207 -27 75
$$ packed form
7168gq7N0K38j94O2q2k3J39k53K0J76J2L0J0r5j49J8O2J7L2j16J86k8o2J27j16
7194c3P1j25K19j44K1J04O1l55J87LK8r0M9Lj40K84j31j6K4j17J73JM5m0j45K1
7220d2J19j84J34J1M1l6j08J37J25j26j00R9p4O9k67K80j9j0k52K15p5OL2j22
7244a47R1j1J02K6o1o5O4N7O3k3j07k59K06K07q8o7J35l5p5k23J91k3R4o4j1j27
7270a50J18Q4J00k06l2k1j5J37j2M6j78K1K50j92Jo0M1J47k95lJ60J12j69Q4p9
7295a11L19k34L6K9M7rj52J16r7qR6r6j7J77O6l43J00K7R1N7qr4Q3n7j63L66j85
7322C6n4J49M4o2m4j23N6j66PJ57K02j39j59R3J03l8PM7L1j75J88j76P7j27J81
7347A15r7r8J35j1J46l85J94Q1p1k8k0j34L3P6K07k08R1o7l3M3K1M2J75k34J02
$$ plain form
7372 75 31 18 163 104 101 39 -27 96 281 63 80 -14 56 106 111 98 211 76 58 -61 126 184 13 -107 -174 82
7398 82 -61 59 -64 -40 138 15 -91 0 178 153 -82 -122 -82 -20 -69 -28 34 2 38 134 64 -109 -31 -15 81 -136
7424 -136 -45 -37 -18 -73 -37 57 -140 88 74 -34 86 30 -31 54 36 -26 -117 84 -133 -47 -120 -29 31 249 126 -23
7450 -23 -35 -57 11 75 -66 -51 -44 3 18 -205 55 -155 -119 -80 4 -54 -248 -114 64 42 123 -80 73 -11 -88 85
7476 85 -72 -15 81 178 136 -14 91 -85 -6 -73 -8 37 -12 -132 -77 -17 31 78 -92 -64 -31 293 109 -59 -97 -115
7502 -115 -74 259 2 -5 93 34 -74 -1 77 -49 43 58 49 -2 55 62 59 174 -42 238 -117 -8 10 -32 83 -13 -137
7529 -137 -56 29 13 -10 105 147 -43 -212 -191 -30 -136 -28 -86 29 17 6 -63 -91 -38 132 -80 -82 47 35 -33
7554 -33 -152 5 98 -13 -50 79 -59 -107 82 -49 -47 74 94 42 -57 33 -98 -106 -131 -62 14 77 33 -76 -59 72
$$ packed form
7372G5m4j3J45n9lo2o6J23J85k18J7r4P0N0Nj3J13j35j8j19J87N8j71j20o7K56
7398H2j43J20j23K4J78j23j06R1J78k5k35m0M0O2m9M1O2l2L6R6p0j73P8J6R6k17
7424a36R1QJ9n5L6R4j97K28j4j08J20n6o1Q5j8o2r1K01k17Q6p3R1O0K18j23j49
7450b3j2k2O8O4j41J5PM7J5k23K60k10L6L9Q4n8j94J34J78k2Q1k03J53q4p7J73
7476H5j57N7R6R7m2j50J05j76P9o7O5M5m9j20N5O0M8M7j70K8L3L24j84j68l8j8
7502a15M1L33k57pR8n9j08P3P8j26R2J5rn1N7PlJ15k16K80l55J09J8m2J15r6j24
7529a37Q1Q5j6k3J15M2j90j69K1J61j06J08n8J15j2j1o9k8N3J70k12kJ29j2o8
7554c3j19J57R3j11l7J29j38m8J89j31KJ21K0n2r9R0j31qk5O9P6O3m4j09J7J31
$$ plain form
7580 72 -62 -61 9 44 67 -14 53 80 157 72 12 99 -88 -123 72 31 -14 126 80 -24 -33 -22 -65 -92 128 -5 37 -19
7608 -19 -5 184 -57 -82 16 -149 173 10 -113 -148 92 -195 -84 -64 90 86 -159 -81 117 -42 63 -102 5
7631 5 41 102 -70 136 14 2 70 142 -173 52 -44 9 179 -161 -41 38 103 -27 57 84 86 -165 64 183 214
7656 214 27 19 192 -90 -46 23 86 -108 -128 -67 -171 -39 -178 78 -51 114 80 133 95 155 231 -49 -111 -24 81
7681 81 -46 -35 194 -51 -33 -75 106 -98 52 -103 -143 -197 -123 69 -172 146 -59 53 -25 -63 117 60 62 125
7705 125 -125 -17 29 45 33 -294 -34 -59 40 38 87 -42 -112 -89 -78 11 32 -160 33 10 19 -49 80 83 -177 80
7731 80 -106 -63 24 -100 -99 66 -109 -139 18 -27 -16 65 -59 83 74 11 242 108 130 67 101 -139 -75 -5 -63 56
7757 56 -99 -11 103 34 39 -59 -47 30 136 110 -36 60 102 -146 -69 2 -45 194 -39 -62 -87 47 -56 33 -160 94
$$ packed form
7580G2j34JP0L5K3q1O7K7P7q5o0Q7j87l5J95m1m5J40m6j04rJ1m3k7K20j33M2n6
7608a9J4J89k41k5R8j65L22j63j23l5K40k87J11K0J54mk45P8J98j59J05j65J07
7631EL6O1j72K06j22j2O8P2l15K25r6N3J70l40J20P9O5j30Q4K7Kk51K29J19L1
7656B14j87qJ73k82M4O9O3j94k0O1j04J32j39K56j29J65l4N3l8O0P6k80o2Q7J05
7681H1j27J1K29k45J8m2J81k04J50j55m0n4P4J92k41L18k05J12p8l8J80n7KO3
7705A25k50J08M6J6j2l27K60k5R9kM9j29p0K3J1Q9K1j92J93k3Ro8J29Lk60K57
7731H0j86M3Q7j24JJ65j75l0J57m5J1Q1j24J42ro3K31j34K2o3L4k40O4P0n8J19
7757E6j55Q8J14o9Nr8J2P7J06k6j46R6M2k48P7P1m7K39k33k3k5J34j03Q9j93K54
$$ plain form
7783 94 236 34 11 57 111 108 -65 -43 -72 -19 -75 -7 -24 91 141 32 52 -205 -113 -116 -63 -239 16 117 -120 43
7809 43 63 100 152 49 44 -77 2 10 9 116 40 -92 -64 19 37 120 110 -10 -85 -132 193 144 -42 -8 -6 -95 41 78
7837 78 66 231 194 -175 -89 -110 -45 -10 -23 -104 -30 -26 25 37 94 233 140 179 194 167 92 62 -98 -73 -203 -69 198
7864 198 -63 152 -115 -139 88 5 -34 183 155 -30 -101 175 -121 -72 108 129 185 45 -56 140 -17 -191 -57
7887 -57 48 69 -46 -118 111 -204 99 -47 -169 95 -7 225 101 55 37 61 -57 35 -13 -63 70 -98 -93 38
7911 38 -31 -74 -138 -87 -3 -33 -65 113 -22 47 86 46 -132 103 86 -132 79 56 -66 37 -145 -135 -43 -33 -239
7936 -239 -154 -81 -50 21 55 -6 -86 -56 75 71 -34 42 89 145 121 138 78 -17 -64 80 -61 85 -132 -47 15 118 -96
7963 -96 -81 180 138 -68 97 120 174 104 65 -35 -150 -41 87 8 -19 -85 -46 43 19 -6 15 -85 -172 100 -38
$$ packed form
7783I4J42k02k3M6N4lj73K2k9N3n6O8j7J15N0j09K0k57R2lN3j76K55J01k37J63
7809D3K0L7N2j03nj21P9QjJ07p6j32K8Q3J8Q3j0j20p5m7L25m9j86L4Kq9J36L7
7837G8j2J65l7l69Q6k1O5L5j3q1P4MN1J2N7J39r3L9J5k7p5l0j60K5j30J34K67
7864A98k61K15k67k4K27q3l9K17k8j85p1K76k96M9J80K1N6j40j01J96j57j74J34
7887e7J05K1j15p2K29l15L03j46j22K64j02K32j24m6j8K4j18R2m8n0J33j68NJ31
7911C8o9m3o4N1Q4l0l2J78j35O9L9m0j78K35j7k18K11k3j22J03j82J0R2J0k06
7936b39Q5P3L1P1L4o1q0L0J31mj05P6M7N6k4J7o0r5m7J44j41J46k17Q5O2J03k14
7963i6J5K61m2k06J65K3N4p0l9j00j15J09J28p9k7o6L9Q9k4k5K1j00q7K72j38
$$ plain form
7988 -38 69 51 3 41 -76 11 78 102 22 -116 -29 -86 -161 46 -172 -61 -14 118 -135 -169 132 -82 94 141 -42
8013 -42 66 58 -42 77 -10 97 36 8 -159 -32 -99 43 -41 -55 -4 -6 78 8 -78 38 56 234 -50 147 223 -255
8039 -255 -31 -54 -90 -156 -85 38 -109 -95 44 -9 9 -58 -1 67 71 189 188 157 2 -16 55 -98 20 -177 -77 -103
8065 -103 -19 -96 13 -48 -120 -3 0 26 -8 -24 146 142 33 158 179 157 75 -14 -172 53 104 -117 -47 -161 -35 64
8091 64 -226 -40 -21 10 -223 146 -43 41 -100 101 56 -134 -115 78 53 -111 135 -63 -166 -243 -21 -67 -179
8114 -179 117 -39 -58 -126 -42 107 -99 -6 48 -30 -55 126 169 -84 -80 9 -39 -34 29 178 -36 -98 -79 48 -6 -75
8140 -75 -91 -40 63 -33 -39 -24 70 40 -77 185 25 42 -143 161 -45 -206 -114 -40 18 -146 -6 108 152 -188 -13
8165 -13 126 -50 0 104 51 167 -36 205 99 -130 58 72 -51 167 -45 -41 66 37 -6 -8 -15 -64 5 46 8
$$ packed form
7988c8J07j8m8L8j17Q7O7K4q0j38Q7n7p5K07k18J11M7J32k53l4L01k14J76M7j83
8013d2J08qj00J19q7J07o1k8j67J27o7J42q4j4N1kQ4p0q6J16J8J78k84J97P6m78
8039b55K24k3l6o6P1J23j47J4J39n3J8o7N7O8MJ18jl1j55j8P1j53J18j97J00k6
8065a03Q4p7J09o1p2J17LK6l4j6J70mj09J25K1k2q2q9j58K25N1k21P0j14J26R9
8091F4k90J86J9L1k33L69j89Q4j41K01m5j90J9J93k5j64K46j98j03p7K22m6j12
8114a79K96j56j9o8Q4J49k06R3N4p8k5J81M3k53MQ9m8NO3J49k14o2J9J27n4o9
8140g5j6N1J03r6oJ5R4l0j17K62j60J7j85L04k06j61R2P4N8j64J40J14M4l40J75
8165a3J39j76N0J04n3J16k03K41j06k29J88J4j23K18k12MJ07k9m3kpm9O9M1l8
8190HN4
8191F2
$$ Imaginary data points
##PAGE= N=2
##DATA TABLE= (X++(I..I)), XYDATA
$$ plain form
0 0 0 0 0 0 0 0 0 -8 8 -8 8 -8 16 -16 24 -32 34 -48 56 -64 80 -96 112 -130 153 -178 209 -241 279 -321
30 -321 367 -415 474 -537 607 -681 765 -858 962 -1071 1191 -1325 1468 -1628 1801 -1989
46 -1989 2193 -2420 2667 -2938 3235 -3563 3930 -4336 4791 -5302 5887 -6556 7333 -8247
60 -8247 9346 -10693 12383 -14585 17580 -21912 28763 -41243 71293 -299190 -89302 449112
72 449112 -180992 -119188 310838 -30909 -449806 71468 325579 -2116 -21259 160384
82 160384 -124990 -223982 118666 245266 23043 -39925 -17524 -96291 -180095 -55614 164397
93 164397 114751 -202133 -186321 89017 2746 -134711 204431 269408 -230437 -234113 234749
104 234749 89096 -167466 215703 257284 -301092 -215041 259141 30846 -212955 141890
$$ packed form
0@%%%%%%%qJ6j6J6j6K4l2M0n6O6q2J04j20J44j76K08k42K83l31L87m50N20o00
30c21O88p82Q89j011J144j288J446j623J820k033K262k516K793l096L429l790
46a989M182m613N087n605O173o798P493q266R127j0093J1189j2443J3889j5580
60h247J7593k0039K3076k6968L2165l9492N0675p0006J12536l70483K09888N38414
72D49112o30104O1804M30026l41747m18897N21274K54111l27695j9143J81643
82A60384k85374r8992L42648J26600k22223o2968K2401p8767q3804J24481K20011
93A64397m9646l16884J5812K75338q6271j37457L39142O4977m99845l676M68862
104B34749j45653k56562L83169M1581n58376Q6051M74182k28295k43801L54845
$$ plain form
114 141890 106184 -355607 -173983 243201 40508 -127312 129818 73434 -219712 -64429
124 -64429 213584 115147 -33868 12197 19169 -70970 -55758 102743 158320 -29648 -161717
135 -161717 -35535 -2065 -137168 2769 206629 -55195 -257484 58936 149222 -133698
145 -133698 22888 300406 -38241 -272620 100680 189736 -118315 10108 230210 -85474
155 -85474 -243495 83016 108228 -135529 -11563 115758 -129605 -188800 80570 122040 -42594
166 -42594 -7607 85044 -15085 -91910 36502 147848 52306 -66314 -1486 58065 -60685
177 -60685 -63608 125736 60925 -180066 -77306 96772 -78196 -123981 144795 93902 -184178
188 -184178 -43546 168521 -25561 -83247 165138 87295 -156596 -2010 149658 -43287
$$ packed form
114A41890l5706m61791J81624M17184k02693j67820K57130n6384k93146J55283
124f4429K78013r8437j49015M6065O972r0139J5212J58501N5577j87968j32069
135a61717J26182L3470j35103J39937K03860k61824k02289L16420R0286k82920
145a33698J56586K77518l38647k34379L73300Q9056l08051J28423K20102l15684
155h5474j58021L26511K5212k43757J23966J27321k45363n9195K69370M1470j64634
166d2594L4987R2651j00129p6825J28412J11346r5542j18620O4828N9551j18750
177f0685k923J89344o4811k40991J02760J74078j74968m5785K68776n0893k78080
188a84178J40632K12067j94082n7686K48385p7843k43891J54586J51668j92945
$$ plain form
198 -43287 -69939 120061 22819 -165076 -31954 93440 -47469 -92899 44020 27886 -95087
209 -95087 -41808 83168 49298 -41827 4306 79835 4039 -56985 62682 101970 -53241
220 -53241 -62387 81002 12633 -119868 8138 89372 -89392 -104793 78274 13415 -120988
231 -120988 31610 104162 -76728 -52570 128190 31702 -96968 60320 123480 -61436 -61442
242 -61442 104931 34142 -109699 -13847 73825 -39241 -87208 16672 27050 -67611 -46000
253 -46000 52000 22438 -49518 9884 61914 -16050 -28529 79682 65783 -48825 -8022 72055
265 72055 -26410 -72489 60578 50010 -103160 -52801 60739 -39987 -91534 61383 66714
276 66714 -96161 -53328 90413 16075 -59922 66980 95873 -50067 -49051 72738 40906
$$ packed form
198d3287k6652J90000r7242j87895J33122J25394j40909m5430J36919j6134j22973
209i5087N3279J24976l3870r1125M6133P5529p5796o1024J19667L9288j55211
220e3241r146J43389o8369j32501J28006Q1234j78764j5401J83067o4859j34403
231a20988J52598P2552j80890K4158J80760r6488j28670J57288O3160j84916o
242f1442J66373p0789j43841R5852Q7672j13066m7967J03880J0378r4661K1611
253d6000R8000k9562p1956N9402N2030p7964j2479J08211j3899j14608M0803Q0077
265G2055r8465m6079J33067j0568j53170N0359J13540j00726n1547J52917N331
276F6714j62875M2833J43741p4338p5997J26902K8893j45940J016J21789l1832
$$ plain form
287 40906 -41429 15352 43943 -60183 -78414 27991 26554 -54308 -15962 34813 -46495 -75836
299 -75836 44664 77989 -29501 -27086 61975 8417 -55213 55366 107114 -22905 -57865
310 -57865 35629 1685 -75873 16986 80018 -51964 -105764 13237 21577 -61950 8542 89155
322 89155 -19595 -92571 17312 68465 -4825 17703 85756 -382 -80922 13781 68650 -14501
334 -14501 -19373 41880 -32774 -114786 -11407 74514 -13996 -48453 31966 -5839 -92482 2995
346 2995 110288 24950 -43608 31411 32480 -53599 4624 114459 33956 -80714 -24286 20887
358 20887 -50984 -33442 68336 23725 -92988 -53914 28855 -9627 -14145 71655 34908 -79134
370 -79134 -28208 72084 23353 -6300 77438 44033 -93700 -52629 77092 25922 -54269
$$ packed form
287D0906q2335N6781K8591j04126j8231J06405j437q0862L8346N0775q1308k9341
299g5836J20500L3325j07490K415Q9061n3558o3630J10579N1748j30019l4960
310e7865R3494l3944p7558R2859O3032j31982n3800J19001Q340q3527P0492Q0613
322H9155j08750p2976J09883N1153p3290K2528O8053q6138q0540R4703N4869q3151
334a4501m872O1253p4654q2012J03379Q5921q8510l4457Q0419l7805q6643R5477
346B995J07293q5338o8558P5019J069q6079N8223J09835q0503j14670N6428M5173
358B0887p1871J7542J01778m4611j16713L9074Q2769l8482m518Q5800l6747j14042
370g9134N0926J00292m8731k9653Q3738l3405j37733M1071J29721n1170q0191
$$ plain form
381 -54269 16565 20678 -99946 -74279 65858 48807 -44392 -7433 27095 -51578 -44376 81078
393 81078 84069 -20772 -18497 31721 -13853 -31481 59149 71927 -42485 -70232 841 -16482
405 -16482 -49887 35681 62056 -61381 -86491 27513 28959 -38252 37546 93452 -37964 -89327
417 -89327 50840 81962 -18376 10318 69673 -34658 -98244 15974 63494 -25464 -31229
428 -31229 19461 -42386 -85538 17608 73212 -5082 -31586 18692 -5138 -46128 30726 98111
440 98111 20239 -44116 9912 17716 -40888 6337 80973 -2203 -96840 -26614 26982 -43183
452 -43183 -25078 75237 12663 -101896 -26269 66266 4120 -10976 71330 30598 -72036
463 -72036 -14703 74348 19233 -16492 39618 3679 -85831 -33446 54808 8074 -45025 1260
$$ packed form
381e4269P0834M113j20624K5667J40137j7051r3199L6959L4528p8673P202J25454
393H1078K991j04841K275N0218m5574j7628R0630J2778j14412k7747P1073j7323
405a6482l3405Q5568K6375j23437k5110J14004J446o7211P5798N5906j31416n1363
417h9327J40167L1122j00338K8694N9355j04331o3586J14218M7520q8958n765
428c1229N0690o1847m3152J03146N5604p8294k6504N0278k3830m0990P6854O7385
440I8111p7872o4355N4028P804n8604M7225P4636q3176r4637P0226N3596p0165
452d3183J8105J00315o2574j14559P5627R2535o2146j5096Q2306m0732j02634
463g2036N7333Q9051n5115l5725N6110l5939q9510N2385Q8254m6734n3099M6285
$$ plain form
475 1260 4220 -64700 -34166 65290 43315 -34493 -4760 33671 -19820 -19004 73996 64578 -41250
488 -41250 -32739 37469 -10202 -49611 38757 50912 -66697 -73197 24509 8239 -44936 21589
500 21589 53026 -41730 -54531 41726 39762 -15460 30387 55344 -29036 -44634 41975 43706
512 43706 -26557 -7666 29091 -36378 -69013 14542 40893 -33124 -35338 22884 -7431 -51973
524 -51973 18339 71380 -2988 -37256 34745 33766 -32812 7440 70603 4531 -55147 3032
536 3032 24640 -35407 -21129 34678 -12677 -61542 -3536 22696 -28351 -10393 46252 4370
548 4370 -44371 16392 56524 -4398 -15235 47879 25330 -44276 -8266 46702 -4685 -45588
560 -45588 6549 16315 -46767 -34540 31519 4075 -46152 1023 34626 -16802 -20121 40871
$$ packed form
475A260K960o8920L0534R9456k1975p7808K9733L8431n3491Q16R3000r418j05828
488d1250Q511P0208m7671l9409Q8368J2155j17609o500R7706j6270n3175O6525
500B1589L1437r4756j2801R6257j964n5222M5847K4957q4380j5598Q6609J731
512D3706p0263J8891L6757o5469l2635Q3555K6351p4017k214N8222l0315m4542
524e1973P0312N3041p4368l4268P2001r79o6578M0252O3163o6072n9678N8179
536C032K1608o0047J4278N5807m7355m8865N8006K6232n1047J7958N6645m1882
548D370m8741O0763M0132o0922j0837O3114k2549o9606L6010N4968n1387m0903
560d5588N2137R766o3082J2227O6059k7444n0227M7175L3603n1428l319O0992
$$ plain form
572 40871 29625 -21436 7770 42607 -2495 -19237 28444 15633 -35916 -8410 25436 -22887
584 -22887 -45815 10376 15887 -42062 -24189 36398 5069 -41488 10158 48408 -2476 -16150
596 -16150 36969 27921 -25358 -1011 40146 -218 -28375 11553 5798 -43136 -17932 26397
608 26397 -9652 -38526 2604 10317 -30448 -8098 43064 15005 -21425 13576 28215 -9487
620 -9487 1260 44636 17737 -32356 -9917 19102 -15090 -26291 18463 10255 -46341 -33575
632 -33575 16791 3320 -20262 14508 24549 -23654 -18905 37640 29078 -6325 19124 26608 -24189
645 -24189 -22160 32096 20814 -24680 -9437 4102 -36002 -32196 23174 15490 -28923 -13135 8712
658 8712 -17107 -11482 41256 39145 -14990 -15392 22002 10934 -7638 25185 35356 -19344 -44512
$$ packed form
572D0871j1246n1061K9206L4837m5102j6742M7681j2811n1549K7506L3846m8323
584b2887k2928N6191N511n7949J7873O0587l1329m6557N1646L8250n0884j3674
596a6150N3119r048n3279K4347M1157m0364k8157L9928n755m8934K5204M4329
608B6397l6049k8874M1130P713m0765K2350N1162k8059l6430L5001J4639l7702
620i487J0747M3376k6899n0093K2439K9019l4192j1201M4754q208n6596J2766
632c3575N0366j3471k3582L4770J0041m8203M749N6545q562l5403K5449P484n0797
645b4189K029N4256j1282m5494J5243J3539m0104L806N5370p684m4413J5788K1847
658H712k5819N625N2738k111n4135m02L7394j1068j8572L2823J0171n4700k5168
$$ plain form
671 -44512 -5311 10883 -11096 -1890 12397 -26417 -46765 -751 22015 135 11804 25355
683 25355 -17129 -31426 26552 46853 5516 5198 22778 -20724 -41711 17506 38041 -12130
695 -12130 -23463 -2452 -27323 -43052 9899 41006 -3742 -29553 -1751 3086 -10184 19795
707 19795 49163 16016 -23503 -8838 12609 4292 12103 28364 -6748 -46082 -19562 7778
719 7778 -9807 -3519 22773 -13135 -57092 -11554 39436 10177 -3378 31446 8010 -39923
731 -39923 159 54410 23407 -10346 7612 -3820 -40875 -11869 37124 12163 -29621 -19941
743 -19941 -14014 -28896 -5150 35109 20784 -19543 -16403 3963 -132 13475 47596 26687 -26397
756 -26397 -19881 15420 3126 -6751 27233 16928 -49586 -47986 13788 12775 -17460 8535 15040
$$ packed form
671d4512L9201J6194k1979R206J4287l8814k0348M6014K2766k1880J1669J3551
683B5355m2484j4297N7978K0301m1337l18J7580m3502k0987N9217K0535n0171
695a2130j1333K1011k4871j5729N2951L1107m4748k5811K7802M837j3270K9979
707A9795K9368l3147l9519J4665K1447q317P811J6261l5112l9334K6520K7340
719G778j7585O288K6292l5908m3957M5538N0990k9259j3555L4824k3436m7933
731c9923M0082N4251l1003l3753J7958j1432l7055K9006M8993k4961m1784R680
743a9941N927j4882K3746M0259j4325m0327L140K0366m095J3607L4121k0909n3084
756b6397O516L5301j2294r877L3984j0305o6514J600O1774j013l0235K5995O505
$$ plain form
769 15040 -36443 -34789 27786 35722 2518 12186 17916 -21798 -19424 35333 36988 -6304 -8985
782 -8985 -1365 -27622 -27515 18497 25844 -18272 -29654 -8823 -15877 -16425 26988 38776 -9669 -26028
796 -26028 9914 14552 -3546 25914 46812 -8299 -44012 264 20772 -9705 -1309 21508
808 21508 -18843 -53662 -10967 21845 -3672 -4203 19634 -8572 -35972 7251 41066 12737
820 12737 283 19625 2455 -25506 4279 36266 5011 -21697 -2538 -7056 -33349 -8479
832 -8479 28202 -694 -36202 -8594 12747 -14003 -6042 39420 22707 -26716 -8233 29262
844 29262 10205 -4417 22895 16572 -27607 -21429 15023 2672 -16663 3575 -159 -35515 -22382
857 -22382 19553 10378 -14103 6055 16148 -16829 -11810 35225 29266 -10175 1895 20183 -11443
$$ packed form
769A5040n1483J654O2575P936l3204R668N730l9714K374N4757J655m3292k681
782h985P620k6257J07M6012P347m4116j1382K0831p054n48M3413J1788m8445j6359
796b6028L5942M638j8098K9460K0898n5111l5713M4276K0508l0477Q396K2817
808B1508m0351l4819M2695L2812k5517n31K3837k8206k7400M3223L3815k8329
820A2737j2454J9342j7170k7961K9785L1987l1255k6708J9159m518k6293K4870
832h479L6681k8896l5508K7608K1341k6750P961M5462j6713m9423J8483L7495
844B9262j9057j4622K7312o323m4179O178L6452j2351j9335K0238l734l5356J3133
857b2382M1935r175k4481K0158J0093l2977N019M7035n959l9441J2070J8288l1626
$$ plain form
870 -11443 -20657 21604 22463 -25460 -24318 8934 -9688 -30461 5967 22174 -16405 -24072 10669
883 10669 11969 -6911 11438 27242 -159 -11062 15582 15071 -7051 4945 17779 -11555 -26902
896 -26902 3233 10172 -21274 -17145 13045 -5208 -30658 1640 24524 -6830 -12864 22354 16093
909 16093 -14963 6298 32843 1754 -16369 14823 14249 -19711 -10618 13761 -6299 -24714 -3122
922 -3122 4797 -16648 -12807 9416 550 -11562 8577 17568 -3300 -3344 20456 15899 -8049 3088
936 3088 22785 -2153 -23127 4400 15001 -17414 -19486 9025 -3830 -29648 -3989 19446
948 19446 -7993 -14797 15842 8967 -14933 9158 30318 3846 -8223 12658 9005 -11207 1596
961 1596 15721 -5496 -19373 -5226 -4774 -15239 -4029 8997 -5534 -19790 -3688 12844 2027
$$ packed form
870a1443r214M2261Q59m7923J142L3252j8622k0773L6428J6207l8579p667L4741
883A0669J300j8880J8349J5804k7401j0903K6644n11k2122J1996J2834k9334j5347
896b6902L0135O939l1446M129L0190j8253k5450L2298K2884l1354o034L5218o261
909A6093l1056K1261K6545l1089j8123L1192n74l3960R093K4379k0060j8415K1592
922c122P919k1445L841K2223q866j2112K0139Q991k0868m4K3800m557k3948J1137
936C088J9697k4938k0974K7527J0601l2415k072K8511j2855k5818K5659K3435
948A9446k7439o804L0639o875k3900K4091K1160k6472j2069K0881l653k0212J2803
961A596J4125k1217j3877J4147M52j0465J1210J3026j4531j4256J6102J6532j0817
$$ plain form
974 2027 -323 20207 15023 -14052 -5454 24921 14456 -8388 5456 9165 -22308 -20631 14354
987 14354 6254 -19384 -5574 202 -23789 -13398 20578 13108 -8512 2245 7707 -7340 3830
1000 3830 27752 16063 -4380 -694 -507 -9855 -1437 13465 4429 -18197 -20632 -5955 -3901 -8208
1014 -8208 4525 13095 -7838 -21238 3656 22083 6457 4362 18774 1644 -16585 7306
1026 7306 21367 173 -4145 3194 -15932 -23803 3806 11128 -10666 -9659 -1269 -16286 -12571
1039 -12571 17742 18890 -1439 -447 5199 -2545 2085 20728 21318 -507 -14834 -8949 233 -260
1053 -260 -678 5095 -3152 -26082 -23914 4834 11246 756 5707 2067 -15640 -5599 18853 16596
1067 16596 9998 15047 -1418 -21379 -89 21571 3512 -6891 2557 -13645 -29769 -5044
$$ packed form
974B027k350K0530n184k9075Q598L0375j0465k2844J3844L709l1473J677L4985
987A4354q100k5638J3810N776k3991J0391L3976p470k1620J0757N462j5047J1170
1000C830K3922j1689k0443L686J87r348Q418J4902r036k2626k435J4677K054m307
1014h208J2733Q570k0933j3400K4894J8427j5626k095J4412j7130j8229K3891
1026G306J4061k1194m318P339j9126p871K7609P322k1794J007Q390j5017L715
1039a2571L0313J148k0329R92N646p744M630J8643N90k1825j4327N885R182m93
1053b60m18N773q247k2930K168K8748O412j0490M951l640j7707J0041K4452k257
1067A6596o598N049j6465j9961K1290K1660j8059j0403R448j6202j6124K4725
$$ plain form
1079 -5044 15222 1302 -7781 -3678 -9773 -10882 7973 21142 13517 2016 -3181 -2301 4925 10402
1093 10402 11878 9481 -6178 -19459 -9232 2600 -578 264 -841 -17339 -19765 1089 7838
1106 7838 1793 10471 9095 -13595 -8229 20495 17494 3010 10985 4671 -17845 -9017 13359 6208
1120 6208 -6830 -4014 -10654 -21914 -8552 9613 6427 -2006 -5274 -7982 -2897 8282 13612 14819
1134 14819 8803 -4313 -6628 3333 8945 9100 6308 -7355 -18099 -8856 -1129 -6355 765 8228
1148 8228 -13376 -24169 3226 14606 276 6080 15904 -3123 -11869 10764 18443 4614 4371
1161 4371 4140 -12152 -12662 3821 4649 -4088 -5001 -9522 -15375 -7949 3696 6451 3341 -716 -3063
1176 -3063 -1286 4629 12016 16456 7715 -6161 -2642 6015 -1920 -2964 11273 592 -23724 -13678
$$ packed form
1079e044K0266j3920r083M103o095j109J8855J3169p625j1501n197Q80P226N477
1093A0402J476k397j5659j3281J0227J1832l178Q42j105j6498k426K0854O749
1106G838o045Q678j376k2690N366K8724l001j4484P975o314k2516Q828K2376p151
1120F208j3038K816o640j1260J3362J8165l186q433l268k708N085J1179N330J207
1134A4819o016j3116k315R961N612J55k792j3663j0744R243P727n226P120P463
1148H228k1604j0793K7395J1380j4330N804R824j9027q746K2633P679j3829k43
1161D371k31j6292n10J6483Q28q737r13m521n853P426J1645K755l110m057k347
1176c063J777N915P387M440q741j3876L519Q657p935j044J4237j0681k4316J0046
$$ plain form
1190 -13678 5643 -3714 -9160 6235 2258 -15566 -4814 12711 6267 4359 12985 3519 -6748
1203 -6748 5270 12295 2989 997 3082 -6130 -12725 -4324 2250 -3504 -7936 -5153 -4829 -7393 -3398
1218 -3398 8332 9759 -2723 -2776 11204 7289 -3126 9684 16647 -3692 -11243 5311 4716 -9877
1232 -9877 -3467 3848 -10816 -14018 436 -1656 -8408 3056 5552 -6838 -2378 12271 7773 -1135
1246 -1135 7704 12046 -332 -3698 6841 5586 -5433 -5694 685 -3472 -12158 -6157 2950 -5422
1260 -5422 -11709 1862 6726 -5877 -3098 12277 7118 -3978 6822 14435 -172 -2739 9260
1273 9260 2712 -7686 1998 3232 -11598 -9944 2318 -4310 -12316 -8 5166 -8054 -7819 8494
1287 8494 8892 -1131 4166 11323 3027 -3716 6331 12060 -375 -6104 2366 -1222 -12878 -4884
$$ packed form
1190a3678J9321r357n446J5395l977j7824J0752J7525o444j908Q626r466j0267
1203f748J2018P025r306j992K085r212o595Q401O574n754m432K783L24k564L995
1218c398J1730J427j2482n3J3980l915j0415J2810O963k0339p551J6554n95j4593
1232i877O410P315j4664l202J4454k092o752J1464K496j2390M460J4649m498q908
1246a135Q839M342j2378l366J0539j255j1019k61O379m157q686O001R107q372
1260e422o287J3571M864j2603K779J5375n159j1096J0800P613j4607k567J1999
1273I260o548j0398R684J234j4830J654J2262o628q006J2308N174j3220K35J6313
1287H494L98j0023N297P157q296o743J0047N729j2435n729Q470l588j1656P994
$$ plain form
1301 -4884 6774 -3996 -15046 -4172 2218 -7278 -2622 12170 4988 -6529 3230 8985 1539
1314 1539 6452 14425 1812 -9457 380 5631 -5824 -4221 6469 -4794 -19777 -7919 6182
1327 6182 -913 -6279 3209 3352 -8759 -3635 14669 12914 504 3273 6712 -3571 -4023 10950
1341 10950 10216 -7121 -9814 -2347 -8110 -9565 4297 5006 -9946 -10428 -936 -2007 -86 13374
1355 13374 11957 -5535 -5039 9416 6649 323 10848 11291 -9921 -16369 1197 6727 -4723 -4789
1369 -4789 1258 -10236 -18046 -1223 11081 2513 -2120 2860 -1583 -5845 7858 19191 8061
1382 8061 -2654 1111 -1478 -6565 4249 11747 -1637 -13307 -8724 -6256 -9141 1779 11455 -2704
1396 -2704 -15938 -3681 6967 1556 5862 17570 7043 -12471 -5056 13090 9282 889 5102
$$ packed form
1301d884J1658j0770j1050J0874O390r496M656J4792p182j1517R759N755p446
1314A539M913P973j2613j1269R837N251j1455J603J0690j1263j4983J1858J4101
1327F182p095n366R488J43j2111N124J8304j755j2410K769L439j0283m52J4973
1341A0950p34j7337k693P467n763j455J3862P09j4952m82R492j071J921J3460
1355A3374j417j7492M96J4455k767o326J0525M43k1212o448J7566N530j1450o6
1369d789O047j1494p810J6823J2304q568m633M980m443m262J3703J1333j1130
1382H061j0715L765k589n087J0814P498j3384j1670M583K468k885J0920R676j4159
1396b704j3234J2257J0648n411M306J1708j0527j9514P415J8146l808q393M213
$$ plain form
1409 5102 -497 -16511 -12034 4337 4469 -3219 -3235 -6859 -15137 -6223 11323 10560 902 1594 779 -5494
1425 -5494 2044 17389 13819 -2127 -5249 -1747 -6534 -4483 9775 7290 -13009 -16734 -4061 -2102
1439 -2102 -4759 6330 11117 -6910 -14067 2981 11804 6351 8999 10064 -3749 -9069 3051 8919
1453 8919 3033 1594 -1095 -13723 -14809 797 6389 -1851 -4094 -3067 -8584 -7987 6842 15511
1467 15511 6180 -2128 736 810 -1353 8267 16120 3370 -11352 -6960 -89 -4898 -1754 8050 -1824
1482 -1824 -18232 -11058 2227 1629 3034 8436 766 -8870 -546 9259 7393 8235 10215 -2087 -11424
1497 -11424 -967 7682 1522 -2457 -1238 -7134 -14251 -6603 5978 4004 -4394 -3830 -1310 -3722
1511 -3722 117 12229 12822 -300 -3695 4048 2637 -294 8384 7862 -7293 -10861 -2626 -2774 -3677
$$ packed form
1409E102n599j6014M477J6371J32p688j6l624q278Q914J7546p63r658O92q15o273
1425e494P538J5345l570j5946l122L502m787K051J4258k485k0299l725J2673J959
1439b102k657J1089M787j8027p157J7048Q823n453K648J065j3813n320J2120N868
1453H919n886j439k689j2628j086J5606N592q240k243J027n517N97J4829Q669
1467A5511r331q308K864P4k163R620P853j2750j4722M392O871m809L144R804r874
1482a824j6408P174J3285n98J405N402p670r636Q324R805j866Q42J980j2302r337
1497a1424J0457Q649o160l979J219n896p117P648J2581j974q398N64K520k412
1511c722L839J2112N93j3122l395P743j411k931Q678n22j5155l568Q235j48r03
$$ plain form
1526 -3677 2741 -33 -11512 -7764 2666 156 646 10330 5810 -7178 -1604 10331 7322 2115
1540 2115 5294 3294 -6284 -6876 1698 3297 -2939 -5619 -4657 -6451 -7232 -511 5581 348 -4541 1167
1556 1167 3007 -497 5596 11645 3028 -2667 3159 2496 -2945 3252 5475 -7430 -9753 1264 -2760
1571 -2760 -10241 487 5474 -7183 -8737 4378 5798 -1666 2874 8569 2603 -1372 4026 6173
1585 6173 2289 659 421 -1558 -4160 -3517 -959 -3110 -6204 -2686 -1102 -5391 -2633 4563 1110
1600 1110 -3018 5005 8020 -1331 963 10817 2821 -5719 5378 7526 -7300 -6761 4650 -1851
1614 -1851 -11007 -1860 3180 -6875 -7191 1891 596 -2374 3622 5070 71 1124 5689 4908 1879
1629 1879 3250 4606 -944 -5107 -340 2621 -3774 -6843 -903 -2263 -9799 -3218 6843 -1645 -7304
$$ packed form
1526c677O418k774j1479L748J0430k510M90R684m520j2988N574J1935l009n207
1540B115L179k000r578n92Q574J599o236k680R62j794p81O721O092n233m889N708
1556A167J840l504O093O049q617n695N826o63n441O197K223j2905k323J1017m024
1571b760p481J0728M987j2657j554J3115J420p464M540N695n966l975N398K147
1585F173l884j630k38j979k602O43K558k151l094L518J584m289K758P196l453
1600A110m128Q023L015r351K294R854p996q540J1097K148j4826N39J1411o501
1614a851r156R147N040j0055l16R082j295k970N996J448m999J053M565p81l029
1629A879J371J356n550m163M767K961o395l069N940j360p536O581J0061q488n659
$$ plain form
1644 -7304 4835 5907 -5196 2580 14858 2879 -6848 4845 7986 -4314 -1098 8284 -1898
1657 -1898 -11403 -2950 40 -5458 -1526 2819 -4806 -8522 -41 4824 1471 3047 7759 2537 -4929
1672 -4929 1130 10372 5997 -2033 1134 1996 -8726 -8009 6790 4135 -10462 -5892 1496 -8665
1686 -8665 -8372 9915 9425 -7185 -3228 7371 -205 -1175 12999 9927 -5293 -3080 3370 -2639
1700 -2639 -2107 6896 855 -12173 -8389 825 -2704 -4157 4378 4077 -7930 -7951 5717 10108 1883
1715 1883 2175 8015 -384 -8254 4902 13178 -187 -6291 1609 -4202 -13020 189 10056 -4679
1729 -4679 -10845 89 -2266 -8417 5845 13887 -688 -5477 4579 2554 -2606 8690 13581 -2856
1743 -2856 -10079 737 1884 -5343 89 6440 -4415 -15051 -6042 5354 601 -2794 5005 2472
$$ packed form
1644g304J2139J072j1103P776J2278j1979r727J1693L141j2300L216R382j0182
1657a898r505Q453K990n498L932M345p625l716Q481M865l353J576M712n222p466
1672d929O059R242m375q030L167Q62j0722P17J4799k655j4597M570P388j0161
1686h665K93J8287m90j6610L957J0599p576r70J4174l072j5220K213O450o009
1700b639N32R003o041j3028L784R214l529j453Q535l01j2007k1J3668M391q225
1715A883K92N840q399p870J3156Q276j3365o104P900n811q818J3209R867j4735
1729d679o166J0934k355o151J4262Q042j4575m789J0056k025n160J1296M891j6437
1743b856p223J0816J147p227N432O351j0855j0636R009J1396m753l395P799k533
$$ plain form
1757 2472 -8692 -2423 12737 8451 -1079 4363 4418 -7919 -3279 12134 4853 -9014 -2894 -995
1771 -995 -11654 -5465 9978 2114 -10720 -2875 2183 -5778 470 15429 7180 -8029 -1442 7487
1785 7487 812 -195 9977 6719 -9758 -11018 1948 2697 -4126 -71 2176 -9433 -12015 2029
1799 2029 7371 -32 1724 5769 -4322 -7013 8977 12596 -53 537 5722 -5342 -9844 5768
1813 5768 9005 -6303 -7488 884 -6431 -11302 4034 9602 -4950 -7916 3120 2825 -3136 5292
1827 5292 12911 1605 -6909 1512 6066 21 695 5356 -2361 -11024 -3705 3082 -2805 -3895 3222
1842 3222 -3012 -11370 -424 9748 1300 -2053 6686 3079 -6956 2127 13525 3335 -5188 2538
1856 2538 1569 -9247 -3034 8507 63 -10767 -4115 783 -6060 -3892 7600 4237 -6215 -2322
$$ packed form
1757B472j1164O269J5160m286r530N442N5j2337M640J5413p281j3867O120J899
1771i95j0659O189J5443p864j2834P845N058p961O248J4959q249j5209O587Q929
1785G487o675j007J0172l258j6477j260J2966P49o823M055K247j1609k582J4044
1799B029N342p403J756M045j0091k691J5990L619j2649N90N185j1064m502J5612
1813E768L237j5308j185Q372p315m871J5336N568j4552k966J1036k95n961Q428
1827E292P619j1306q514Q421M554o045O74M661p717q663P319O787n887j090P117
1842C222o234q358J0946J0172q448l353Q739l607j0035R083J1398j0190q523P726
1856B538r69j0816O213J1541q444j0830O652M898o843K168J1492l363j0452L893
$$ plain form
1870 -2322 5375 2376 1487 8071 5680 -4369 -2405 4686 381 -3198 3390 1096 -10382 -7466 3679
1885 3679 330 -6654 467 4174 -6267 -5818 7604 7190 -2486 1961 7459 -676 -3504 6654 7517
1900 7517 -3582 -3796 2306 -2733 -7206 603 2567 -5584 -6023 503 -1046 -3611 3225 5652 -2013
1915 -2013 -1758 6565 3850 -2223 4489 7947 -2241 -5754 3534 3474 -6008 -3842 3361 -2933 -8964
1930 -8964 -1105 3102 -3961 -3749 3664 1665 -3116 2438 7066 927 -804 5667 3855 -2644 881
1945 881 4312 -2433 -4856 1194 -40 -6842 -3154 2546 -3902 -6478 3190 3677 -4648 -1432 7163
1960 7163 2573 -2941 4260 7946 -831 -2957 4387 2940 -3434 -751 2013 -4025 -6339 -583 130
1975 130 -4175 -1849 1950 -2461 -4422 3370 5824 -251 970 5654 1120 -3057 4121 7631 -1602
$$ packed form
1870b322P697k999q89O584k391j0049J964P091m305l579O588k294j1478K916J1145
1885C679l349o984P121L707j0441M49J3422m14r676M447N498q135k828J0158Q63
1900G517j1099k14O102n039m473P809J964q151m39O526j549k565O836K427p665
1915b013K55Q323k715o073O712L458j0188l513R288o0r482K166P203o294o031
1930h964P859M207p063K12P413j999m781N554M628o139j731O471j812o499L525
1945H81L431o745k423O050j234o802L688N700o448k576R668M87q325L216Q595
1960G163m590n514P201L686q777k126P344j447o374K683K764o038k314N756P13
1975A30m305K326L799m411j961P792K454o075J221M684m534m177P178L510r233
$$ plain form
1990 -1602 -3823 2736 -1655 -8074 -333 5333 -3978 -8211 73 498 -5306 249 7816 979 -4352
2005 -4352 2099 4394 430 3568 6935 406 -4450 306 1916 -2422 -1114 2653 -3357 -9182 -2799
2020 -2799 3119 -1388 -2976 2624 1004 -5862 -127 9363 4117 -1968 3970 3959 -4794 -989 8904
2035 8904 3013 -6797 -2436 665 -6143 -4446 4993 988 -7601 -3573 1084 -2247 818 8220 3512
2050 3512 -4366 -125 5402 1287 1344 7559 3003 -7783 -5312 3478 1086 -3906 473 996 -8559
2065 -8559 -8668 3957 5125 -2886 -331 4449 -3261 -4706 7437 10200 -649 -1430 3996 -2081 -4906
2080 -4906 5135 5968 -4800 -5667 -703 -4970 -5748 4497 5236 -6354 -6104 2836 724 -2174 6760
2095 6760 9443 -1899 -6172 3258 6052 -113 1333 5589 -2711 -10105 -1804 4658 -1516 -3638 1198
$$ packed form
1990a602k221O559m391o419P741N666r311m233Q284M25n804N555P567o837n331
2005d352O451K295l964L138L367o529m856M756J610m338J308L767o010n825O383
2020b799N918m507j588N600j620o866N735R490n246o085N938j1q753L805R893
2035H904n891r810M361L101o808J697R439m005q589M028M657l331L065P402m708
2050C512p878M241N527m115N7O215m556j0786K471Q790k392m992M379N23r555
2065h559j09J2625J168q011K555M780p710j445J2143K763j0849p81N426o077k825
2080d906J0041Q33j0768q67M964m267p78J0245P39j1590K50Q940k112k898Q934
2095F760K683j1342m273R430K794o165J446M256q300p394Q301O462o174k122M836
$$ plain form
2110 1198 -3317 -9331 -506 8404 1686 -2297 3936 778 -5424 3495 11120 2246 -3871 2122 26
2125 26 -7157 535 8670 -1748 -9746 -2079 301 -6253 -1536 7751 1716 -8061 -2528 5424 2043
2140 2043 1028 7361 4424 -5436 -2969 5131 2978 -1443 2379 745 -8865 -6683 4275 1610 -5125
2155 -5125 164 1449 -7048 -4463 8334 6120 -3089 1468 5280 -3622 -2787 9608 7221 -5341
2169 -5341 -3027 2962 -3456 -5968 3689 4456 -6654 -7606 502 -147 -2982 3024 5274 -2369 -4116
2184 -4116 3357 4680 377 3593 6473 -2222 -6089 2937 4629 -3390 -1969 3084 -4485 -9848 496
2199 496 5487 -3599 -3915 4170 -619 -6613 3564 9861 336 -3008 4764 3102 -4117 1179 7561
2214 7561 -192 -6102 -706 280 -4520 -2037 2876 -1875 -6529 -1127 2414 -1996 -133 6267 1935
$$ packed form
2110A198m515o014Q825Q910o718l983O233l158o202Q919P625q874o117N993k096
2125B6p183P692Q135j0418p998P667K380o554M717R287o035r777N533P952l381
2140B043j015O333k937r860K467Q100k153m421L822j634r610K182J0958k665o735
2155e125N289J285q497K585J2797k214r209M557L812q902Q35J2395k387j2562
2169e341K314N989o418k512R657P67j1110r52Q108o49k835O006K250p643j747
2184d116P473J323m303L216K880q695l867R026J692q019J421N053p569n363J0344
2199D96M991r086l16Q085m789n994J0177O297r525l344P772j662p219N296O382
2214G561p753n910N396R86m800K483M913m751m654N402L541m410J863O400m332
$$ plain form
2229 1935 -4679 1260 6946 949 -1659 5017 3118 -6233 -2809 5341 -714 -6319 547 1608 -6994
2244 -6994 -4688 4596 1275 -5261 683 4615 -1574 -1461 6284 4439 -2069 1186 4036 -1096 -1986
2259 -1986 2990 1068 -5098 -2478 1634 -3196 -5402 1548 2257 -5178 -3077 4381 2174 -3567 2159
2274 2159 6595 -511 -2396 5069 4345 -3125 -564 4251 -1339 -5062 671 1387 -5236 -3597 2284
2289 2284 -1503 -4702 1121 2471 -2803 -492 5076 1865 -1549 3199 4627 -1624 -919 5115 1514
2304 1514 -5021 -1189 2671 -3105 -5276 1075 1875 -4993 -4079 2420 662 -2760 1909 4247 -1218
2319 -1218 -1208 4355 3505 -828 1990 3684 -2431 -3607 2415 1116 -4048 -1474 615 -4349 -5091 1764
2335 1764 2068 -3213 -849 3248 -858 -2454 4977 6120 -853 -1179 3593 1187 -2716 1602 4242
$$ packed form
2229A935o614N939N686n997k608O676j899r351L424Q150o055n605O866J061q602
2244f994K306R284l321o536N944L932o189J13P745j845o508L255K850n132q90
2259a986M976j922o166K620M112m830k206O950P09p435K101P458k207n741N726
2274B159M436p106j885P465p24p470K561M815n590l723N733P16o623J639N881
2289B284l787l199N823J350n274K311N568l211l414M748J428o251P05O034l601
2304A514o535L832L860n776k171O351Q00o868R14O499j758l422M669K338n465
2319a218J0N563q50m333K818J694o115j176O022j299n164K574K089m964p42O855
2335A764L04n281K364M097m106j596P431J143o973l26M772k406l903M318K640
$$ plain form
2350 4242 -2273 -5413 -1103 -407 -3348 -649 2097 -2357 -4344 383 2303 -304 1998 4992 151
2365 151 -2741 2871 4836 -105 577 3367 -1531 -5661 -7 3276 -2499 -3673 683 -2121 -6075
2380 -6075 -259 5125 501 -2852 1469 2194 -1410 1684 6536 2754 -2223 -109 785 -1504 359
2395 359 3251 -1256 -5853 -2350 -54 -2575 -879 3773 -455 -5887 -1098 4253 1515 787 5001
2410 5001 2574 -4111 -1103 5664 2533 -1419 1473 275 -5996 -3980 2891 1501 -3527 -1713 -504
2425 -504 -4043 -2231 4393 3889 -975 528 1744 -1155 880 6333 4048 -2755 -1652 1643 -2252
2440 -2252 -2941 3226 2290 -5894 -5383 1050 -100 -2685 1876 3630 -3337 -3698 3427 4148 451 2704
2456 2704 4015 -1824 -3401 2846 3823 -1252 -1141 551 -4111 -5245 1165 2457 -2549 -2248 656 -2479
$$ packed form
2350D242o515l140M310O96k941K699K746m454j987M727J920k607K302K994m841
2365A51k892N612J965m941O82K790m898m130N654L283n775j174M356k804l954
2380f075N816N384m624l353M321P25l604L094M852l782m977K114Q94k289J863
2395C59K892m507m597L503K296k521J696M652m228n432M789N351k738p28M214
2410E001k427o685L008O767l131l952K892j198o271K016O871j390n028J814J209
2425e04l539J812O624n04m864J503J216k899K035N453k285o803J103L295l895
2440b252o89O167r36q184N11O433j150k585M561J754o967l61P125P21l697K253
2456B704J311n839j577O247R77n075J11J692m662j134O410J292n006L01K904l135
$$ plain form
2472 -2479 -3458 3818 6429 -553 -2116 3180 1613 -2099 3213 6678 -677 -5506 -496 989 -3129
2487 -3129 -968 3117 -2080 -6627 -1455 1828 -1152 391 4057 108 -4134 1200 5427 1547 702
2502 702 3775 213 -4360 -5 4162 -569 -3263 266 -1052 -6155 -1906 4568 136 -4707 265
2517 265 2264 -2437 -565 6496 3913 -2882 -293 3599 -149 -1033 4076 2071 -4666 -3085 1041
2532 1041 -1801 -2877 1674 492 -5308 -3054 2930 893 -1351 3115 3142 -2599 -1226 5134 3307
2547 3307 -1494 1147 3036 -3121 -4030 2855 2395 -4310 -3359 1319 -2060 -4793 1114 3968 -1905 -2685
2563 -2685 2592 1662 -1481 2914 4695 -696 -1624 2668 1142 -2514 1364 2872 -3327 -4661 1090
2578 1090 493 -4128 -994 2477 -2038 -4279 1788 3835 -716 -276 4477 1594 -2419 1402 4808
$$ packed form
2472b479r79P276K611o982j563N296j567l712N312L465p355m829N010J485m118
2487c129K161M085n197m547N172L283k980J543L666l949m242N334M227l880q45
2502G02L073l562m573M355M167m731k694L529j318n103M249O474m432m843M972
2517B65J999m701J872P061k583o795K589L892l748q84N109k005o737J581M126
2532A041k842j076M551j182n800K254N984k037k244M466K7n741J373O360j827
2547C307m801K641J889o157r09O885m60o705R51M678l379k733N907K854n873p80
2563b685N277r30l143M395J781n391r28M292j526l656L878J508o199j334N751
2578A090n97m621L134L471m515k241O067K047m551M40M753k883m013L821L406
$$ plain form
2593 4808 -51 -2558 1541 1020 -3648 -1869 2117 -1167 -4220 -290 573 -3033 -727 3111 -31
2608 -31 -2342 2643 3689 -1381 341 4966 1181 -3090 1230 3543 -1948 -3047 1670 128 -4394
2623 -4394 -1864 1740 -1293 -3294 662 1501 -1574 -494 3210 1833 -963 1395 3574 296 -715
2638 -715 2303 1156 -2583 -636 1605 -1958 -3247 602 -201 -4347 -1137 3018 -1109 -3077 2308
2653 2308 2901 -1645 83 4753 1644 -2134 1305 2920 -1013 -1254 2004 -205 -3686 -1548 519
2668 519 -1576 -2058 229 182 -2641 -1264 2277 1520 -166 1949 2084 -820 -314 3600 1957 -1365 460
2685 460 1249 -3153 -2816 2310 623 -4157 -1726 956 -2423 -2705 2698 2757 -1718 -847 2228 802 411
2702 411 3307 2620 -1066 -918 860 -112 -587 914 -54 -3102 -3006 -280 -195 -1168 283 722 -1777 -2187
$$ packed form
2593D808m859k507M099n21m668J779L986l284l053L930Q63l606K306L838l142
2608c1k311M985J046n070J722M625l785m271M320K313n491j099M717j542m522
2623d394K530L604l033k001L956Q39l075J080L704j377k796K358K179l278j011
2638g15L018j147l739J947K241l563j289L849q03m146L210M155m127j968N385
2653B308N93m546J728M670l109l778L439J615l933k41L258k209l481K138K067
2668E19k095m82K287m7k823J377L541p57j686K115J35k904N06L914j643l322J825
2685D60P89m402L37N126j687m780K431K682l379k82N403N9m475Q71L075j426l91
2702D11K896o87l686J48J778r72m75J501r68l048R6K726Q5r73J451M39k499m10
$$ plain form
2720 -2187 1978 3305 506 983 2775 -434 -2354 2155 4100 -516 -1977 302 -1317 -3786 -132
2735 -132 2418 -1311 -2867 -652 -1261 -1371 2115 2903 -138 -533 1311 723 379 3124 3304 -999 -2321
2752 -2321 32 399 -1011 -58 722 -2033 -4355 -1386 1387 -162 -918 1398 160 -2534 198 4365
2768 4365 2486 -232 1280 737 -1808 80 3140 574 -1990 -874 -1905 -3429 -208 2368 -828
2783 -828 -2922 -482 -324 -1590 1471 4622 1217 -1950 -78 1936 797 1105 2741 782 -3045 -2613
2799 -2613 384 142 -819 91 -617 -3378 -2833 1173 1623 141 873 1141 -1374 -406 3790 3037 202
2816 202 1027 728 -2642 -1210 2934 1203 -2860 -1540 -322 -3095 -2132 2332 1562 -2279 -1749 669
2832 669 308 486 3151 2856 -701 -1105 1224 1245 491 1365 1099 -2164 -3216 -402 488 -1075 -674 209
$$ packed form
2720b187M165J327k799M77J792l209j920M509J945m616j461K279j619k469L654
2735a32K550l729j556K215o09j10L486P88l041l95J844n88l44K745J80m303j322
2752b321K353L67j410R53P80k755k322K969K773j549p56K316j238k694K732M167
2768D365j879k718J512n43k545J888L060k566k564J116j031j524L221K576l196
2783h28k094K440J58j266L061L151l405l167J872K014j139L08J636j959l827M32
2799b613K997k42r61R10p08k761N45M006M50j482P32K68k515R68M196p53k835
2816B02Q25k99l370J432M144j731m063J320J218k773R63M464p70l841N30K418
2832F69l61J78K665k95l557m04K329K1p54Q74k66l263j052K814Q90j563M01Q83
$$ plain form
2850 209 -2315 -2885 1117 2583 -85 778 2303 -749 -1665 2729 4222 -479 -981 1519 -644 -2831
2866 -2831 434 2244 -1591 -3263 -1028 -843 -2129 264 2212 -194 -1626 537 1340 356 1807 2963
2882 2963 595 -1515 134 1582 -177 -182 1228 -1090 -3800 -1062 1156 -1146 -1815 905 211 -3091
2898 -3091 -340 3553 1129 -1135 1628 2182 -750 -86 3104 1620 -1513 -531 315 -1690 -1321 763
2914 763 -382 -2437 -1040 -9 -1226 -590 2159 1167 -1405 247 2600 805 -136 2296 2098 -1343
2930 -1343 -1149 1594 499 -2254 -486 819 -2386 -2792 915 815 -2087 -917 1407 13 -1123 1620
2946 1620 2430 77 228 2046 490 -335 1332 1080 -1582 -1207 649 -934 -2783 -173 888 -2106
2962 -2106 -2160 1045 910 -1373 107 2442 559 -753 1714 2361 -319 -360 1765 543 -1761 11
$$ packed form
2850B09k524n70M002J466k668Q63J525l052r16M394J493m701n02K500k163k187
2866b831L265J810l835j672K235J85j286K393J948k406j432K163Q03r84J451J156
2882B963k368k110J649J448j759nJ410k318k710K738K218k302o69K720o94l302
2898c091K751L893k424k264K763N54k932O64L190j484l133R82Q46k005L69K084
2914G63j145k055J397J031j217O36K749r92k572J652K353j795r41K432j98l441
2930a343J94K743j095k753J768J305l205m06L707j00k902J170K324j394j136K743
2946A620Q10k353J51J818j556q25J667k52k662L75J856j583j849K610J061k994
2962b106n4L205j35k283J480K335j883j312K467O47k680m1K125j222k304J772
$$ plain form
2978 11 692 -1655 -2033 26 -140 -1787 -671 881 -855 -1030 1108 1508 -234 918 1998 269 -555
2995 -555 1807 2077 -999 -868 1051 -635 -2382 -311 845 -1629 -2505 19 -67 -1542 -79 1743
3011 1743 -30 -1085 1202 1893 498 873 1861 359 -1153 283 861 -693 -801 -14 -1170 -2168 -699
3028 -699 489 -726 -838 684 -11 -1388 711 2815 919 -572 1259 1359 -756 9 2055 711
3044 711 -1981 -1086 -226 -1370 -833 565 -467 -1935 -1124 206 86 486 1362 650 -397 505 1414 909
3062 909 951 1424 165 -1355 -526 765 13 -1178 -542 -498 -2385 -1828 1008 1122 -923 -635 739 82
3080 82 -391 1912 2414 463 -298 345 99 -53 1114 421 -1297 -1390 -841 -1442 -549 716 42 -1700 -1015
3099 -1015 342 419 573 1796 1492 -436 -506 936 1566 602 495 460 -1154 -1884 -466 646 -368 -1268
$$ packed form
2978A1O81k347l78K059j66j647J116J552j736j75K138M00j742J152J080j729q24
2995e55K362K70l076J31J919j686j747K071J156k474q76K524q6j475J463J822
3011A743j773j055K287O91j395L75R88j502j512J436N78j554j08P87j156r98J469
3028f99J188j215j12J522o95j377K099K104j896j491J831J00k115P65K046j344
3044G11k692Q95Q60j144N37J398j032j468Q11J330j20M00Q76p12j047R02R09n05
3062I09M2M73j259j520Q29J291p52j191O36M4j887N57K836J14k045K88J374o57
3080H2m73K303N02j951p61O43k46j52J167o93j718r3N49o01Q93J265o74j742O85
3099a015J357P7J54J223l04j928p0J442O30r64j07l5j614p30J418J112j014r00
$$ plain form
3117 -1268 -1057 -1168 -1242 176 1158 608 82 184 -260 392 1873 2039 260 42 409 -404 -859 841 958
3136 958 -1361 -1999 -1098 -770 -853 375 568 -604 -1182 0 754 1223 1326 1249 448 -595 -5 999 1171
3155 1171 339 -345 -939 -1648 -901 91 -110 -527 -543 -1367 -1362 319 1486 631 24 940 409 -406 1118 2383
3175 2383 874 -884 -225 -371 -1007 -215 314 -366 -1804 -1416 -551 -342 32 785 84 -515 -26 680 1244
3194 1244 1389 1098 284 -421 4 664 170 -5 39 -930 -2340 -1202 495 42 -1299 -315 101 -1007
3212 -1007 -434 1823 1658 100 318 821 358 171 1323 823 -524 -648 -718 -869 -522 197 -585 -1559 -962
3231 -962 -447 -292 -44 1118 660 -348 -1 1213 1052 416 1014 1096 -168 -1243 393 819 -828 -1071
3249 -1071 -70 -905 -1664 -534 328 -283 -509 186 -55 11 1111 1224 282 454 1046 22 -345 682
$$ packed form
3117a268K11j11p4J418R82n50n26J02m44O52J481J66j779k18L67q13m55J700J17
3136I58k319o38R01L28q3J228J93j172n78J182P54M69J03p7q01j043N90J004J72
3155A171q32o84n94p09P47R92k01m17j6q24NJ681J167q55o07R16n31q15J524J265
3175B383j509j758O59j46o36P92N29o80j438L88Q65K09L74P53p01n99M89P06N64
3194A244J45k91q14p05M25O60m94j75M4r69j410J138J697m53j341R84M16j108
3212a007N73K257j65j558K18N03m63j87J152n00j347j24p0j51L47P19p82r74N97
3231i62N15J55K48J162m58j008L47J214j61o36N98Q2j264j075J636M26j647k43
3249a071J001q35p59J130Q62o11k26O95k41O6J100J13r42J72N92j024l67J027
$$ plain form
3267 682 807 -819 -949 -201 -304 -1381 -357 49 -723 -1236 -85 638 -88 -62 1281 865 -460 421
3285 421 1406 667 -156 700 417 -724 -778 143 -479 -1163 -551 -705 -1064 -344 359 -314 -298 719 630 -130
3305 -130 464 1423 821 -312 526 890 -146 -656 125 -158 -1229 -929 -147 -489 -1425 -418 268 -208 -323
3324 -323 560 634 30 392 1187 884 503 608 432 -367 -10 221 -410 -792 -181 -802 -1477 -605 351 -192
3344 -192 -577 118 467 -360 201 1231 1079 233 266 745 343 -75 491 505 -630 -1161 -502 -437 -891 -296
3364 -296 -96 -705 -850 -273 348 575 790 824 239 305 1178 673 429 625 286 -798 -744 277 191 -981
3384 -981 -1039 -514 -844 -1031 87 809 116 -616 -215 607 583 954 1211 838 -161 -375 214 538 498 -67 -753
3405 -753 -1149 -1126 -675 -204 180 96 -1010 -1013 110 868 826 646 1129 180 -401 401 1326 1031 63 -270 -443
$$ packed form
3267F82J25j626j30P48j03j077J024M06p72n13J151P23p26K6J343m16j325Q81
3285D21R85p39q23Q56k83j141n4R21o22o84O12j54l59P20P03o73J6J017q9p60
3305a30N94R59o02j133Q38L64j036n10P81k83j071L00P82l42r36J007O86m76j15
3324c23Q83P4o04L62P95l03l81J05j76p99L57K31o31l82O11o21o75Q72R56n43
3344a92l85O95L49q27N61J030j52q46L3M79m02m18N66J4j135n31O59O5m54N95
3364b96K00o09j45N77O21K27K15L4n85O6Q73n05k44J96l39j084N4J021q6j172
3384i81n8N25l30j87J118P22o93p32M01Q22k4L71K57l73r99k14N89L24m0n65o86
3405g53l96K3M51M71L84q4j106lJ123P58m2j80M83r49n81Q02R25k95r68l33j73
$$ plain form
3426 -443 -920 -750 -77 420 -585 -1356 -905 -418 395 447 648 210 -284 -39 867 1230 1105 559 -210 -566
3446 -566 -300 28 282 93 -545 -1215 -1321 -380 164 82 4 -122 -579 -354 676 1635 1299 285 -170 59
3466 59 110 458 949 538 -716 -1479 -1090 -140 164 -47 -168 -871 -1175 -631 436 1097 748 303 -9 -43
3486 -43 636 1146 1167 443 -238 -777 -719 93 390 -164 -788 -1169 -1289 -907 158 1080 224 -369 -308 191 242
3507 242 918 1516 905 -181 -742 49 579 248 76 -523 -1156 -1412 -603 15 245 -174 -514 -863 -467 502
3527 502 881 997 595 128 -327 291 805 857 145 -384 -596 -910 -751 317 405 -720 -1208 -661 -533 -364
3547 -364 500 1195 378 -501 166 857 819 740 706 198 -439 -622 22 313 7 -564 -1145 -1293 -369 -81 -34
3568 -34 152 259 -253 -508 284 1518 830 253 555 247 -186 176 986 328 -570 -880 -375 -516 -836 -59
$$ packed form
3426d43m77J70O73M97j005p71M51M87Q13N2K01m38m94K45R06L63j25n46p69l56
3446e66K66L28K54j89o38o70j06R41N44q2p8j26m57K25J030R59l36j014m55K29
3466E9N1L48M91m11j254p63L89R50L04k11j21p03l04N44J067O61l49m45l12l4
3486d3O79N10K1p24o81n39N8Q12K97n54o24l81j20L82J065R22q56n93O1M99N1
3507B42O76N98o11j086n61P91N30l31j72n99o33k56Q09O18K30m19l40l49L96R69
3527E02L79J16m02m67m55O18N14N2p12n29k12l14J59J068Q8j125m88N47J28J69
3547c64Q64O95q17q79O67O91l8p9l4n08o37j83O44K91l06n71n81j48R24K88M7
3568c4J86J07n12k55P92J234o88n77L02l08m33L62Q10o58q98l10N05j41l20P77
$$ plain form
3588 -59 64 -713 -855 -359 145 407 509 470 429 272 472 321 647 711 12 -791 -484 -59 -247 -642 -360
3609 -360 -242 -834 -837 -34 431 -43 -15 275 298 130 606 860 340 44 195 466 -188 -194 48 -289 -826 -827 -432
3632 -432 -442 -201 -146 -383 -22 273 294 127 602 811 269 213 686 524 -71 -75 145 -126 -607 -413 -154 -465
3654 -465 -797 -252 -43 -136 -279 82 280 181 319 851 600 158 472 396 206 164 130 -186 -352 -361 -645 -649 -155
3677 -155 -251 -683 -657 109 108 -45 586 854 488 25 422 701 254 408 327 47 -426 -346 -81 211 -288 -626
3699 -626 -669 -568 -183 -62 203 260 -227 -16 417 638 789 506 272 247 -234 -451 506 375 -329 -837 -666
3720 -666 -508 -602 -194 107 -113 -521 -541 -30 495 692 701 408 266 337 234 413 664 342 -529 -1040 -325 -268
3742 -268 -495 -50 -181 -749 -817 -82 354 374 287 258 189 43 308 1027 728 45 -122 -155 -247 -49 89 -260
$$ packed form
3588e9J23p77j42M96N04K62J02l9m1j57K00j51L26O4o99q03L07M25j88l95K82
3609c60J18n92lQ03M65m74K8K90K3j68M76K54n20k96J51K71o54oK42l37n37jL95
3632d32j0K41N5k37L61K95K1j67M75K09n42n6M73j62n95mK20k71m81J94K59l11
3654d65l32N45K09r3j43L61J98r9J38N32k51m42L14p6j90m2l4l16j66rk84mM94
3677a55r6m32K6P66jj53O31K68l66m63L97K79m47J54q1k80m73Q0K65K92m99l38
3699f26m3J01L85J21K65N7m87K11M33K21J51k83k34k5m81k17R57j31p04n08J71
3720f66J58r4M08L01k20m08k0N11N25J97Rk93j42P1j03J79K51l22q71n11P15N7
3742b68k27M45j31n68o8P35M36K0q7k9o9j46K65P19k99o83j67l3r2J98J38l49
$$ plain form
3764 -260 -622 -791 -803 -436 359 362 -260 -509 92 289 147 878 1319 181 -492 65 576 158 258 210 -202
3785 -202 -1333 -952 -7 201 -229 -194 -392 -719 -200 476 856 603 72 55 -194 349 1058 559 -51 -167
3805 -167 -333 -725 -325 621 -158 -910 -689 -256 -633 -297 776 619 -463 -219 686 569 578 816 659 -244
3825 -244 -425 163 310 -52 0 -354 -945 -980 -309 242 -97 -12 -41 -342 -272 581 777 291 169 309 -49 -267
3847 -267 831 906 -241 -637 -78 -455 -909 74 554 -374 -1201 -415 233 158 184 755 163 -433 256 710
3867 710 642 640 445 -110 -564 -329 197 -125 -292 -57 -520 -1079 -306 284 0 -262 325 150 -674 122 1245
3888 1245 830 -301 288 390 -335 -260 621 395 -800 -735 -415 -399 -323 92 -36 -524 -294 20 93 114 787
3909 787 537 -276 -114 746 391 -91 501 286 -654 -831 216 117 -884 -447 -107 -634 -832 274 681
$$ packed form
3764b60l62j69j2L67P95Lo22k49O01J97j42P31M41j138o73N57N11m18J00m8m12
3785b02j131L81R45K08m30L5j98l27N19O76L80k53n31j7k49N43P09m99o10j16
3805a67j66l92M00R46p79p52K21M33l77L36J073j57j082K44R05j17RK38j57r03
3825b44j81N88J47l62N2l54n91l5O71N51l39Q5k9l01P0Q53J96m86j22J40l58k18
3847b67J098P5j147l96N59l77m54R83M80r28q27P86O48p5K6N71n92n96O89M54
3867G10o8kj95n55m54K35N26l22j67K35m63n59P73N90k84k62N87j75q24P96J123
3888A245m15j131N89J02p25P5Q81k26j195O5L20J6P6M15j28m88K30L14P3K1O73
3909G87k50q13J62Q60l55m82N92k15r40j77J047r9j001M37L40n27j98J106M07
$$ plain form
3928 681 1 -161 674 408 -167 381 952 168 -203 77 32 -385 74 280 -587 -713 -200 -252 -596 -122 388
3949 388 -119 -566 593 586 7 141 858 483 -247 331 617 -142 -387 268 57 -854 -631 234 -393 -727
3969 -727 -170 -19 -270 -246 658 253 -35 315 621 80 204 519 155 -309 67 343 -456 -791 71 -235
3989 -235 -1033 -263 259 -408 -453 217 634 -236 -79 820 562 -250 315 590 111 -162 324 116 -315 -481
4009 -481 -39 -343 -471 -160 -364 -712 -221 242 -61 124 619 282 -101 465 970 476 -437 393 371 -483
4029 -483 -251 201 100 -854 -527 -37 -142 -567 235 233 -349 -137 215 278 382 589 400 64 -10 448 308
4050 308 92 31 -171 -747 -667 7 -175 -388 -202 22 -552 -491 494 584 13 -40 499 297 -57 626 836 193
4072 193 -384 -276 -344 -221 168 45 -367 -732 -500 -256 -110 543 519 -240 -314 415 569 341 693 777 -122
$$ packed form
3928F81o80j62Q35k66n75N48N71p84l71K80m5m17M59K06q67j26N13n2l44M74N10
3949C88n07m47J159pn79J34P17l75p30N78K86p59k45O55k11r11K23Q65o27l34
3969g27N57J51k51K4R04m05k88L50L06n41J24L15l64m64L76K76p99l35Q62l06
3989b35p98P70N22o67m5O70M17q70J57Q99k58q12N65K75m79k73M86k08m31j66
4009d81M42l04j28L11k04l48M91M63l03J85M95l37l83N66N05m94r13Q30k2q54
4029d83K32M52j01r54L27M90j05m25Q02kn82K12L52O3J04K07j89l36p4M58j40
4050C08k16o1k02n76Q0O74j82k13J86K24n74O1R85R0n71n3N39k02l54O83K10o43
4072A93n77J08o8J23L89j23m12l65K32K44J46O53k4p59p4P29J54k28L52Q4q99
$$ plain form
4093 -122 -476 86 405 -166 -203 -58 -725 -1150 -394 442 -49 -385 44 -115 -266 283 761 532 174 137 11
4114 11 30 558 721 -222 -520 -397 -281 -514 -81 488 -386 -859 -280 170 -15 236 954 115 -506 8 742
4135 742 580 150 540 76 -823 -111 296 143 -276 -261 -515 -936 -320 234 201 -17 -33 -273 -569 391 1177
4156 1177 559 -69 296 241 -331 182 665 254 -797 -764 -135 -437 -404 250 407 -549 -490 152 276 182 530
4177 530 442 -302 -123 372 420 301 413 -64 -789 -573 143 178 -393 -93 -249 -991 -712 376 593 -254 39
4198 39 299 -194 -73 1007 1097 52 -351 54 -168 -318 190 256 -339 -868 -405 -136 -289 196 329 -328
4218 -328 -466 157 537 257 532 861 -118 -643 313 778 52 -53 372 -594 -989 -184 468 -25 -586 24
4238 24 -98 -538 -104 953 561 -213 218 311 16 199 861 333 -264 -153 202 -505 -175 343 -110 -899
$$ packed form
4093a22l54N62L19n71l7J45o67m25P56Q36m91l36M29j59j51N49M78k29l58l7j26
4114A1J9N28J63r43k98J23J16k33M33N69q74m73N79M50j85K51P18q39o21N14P34
4135G42j62m30L90m64q99P12M07j53m19J5k54m21O16N54l3k18j6k40k96R60P86
4156A177o18o28L65n5n72N13M83m11j051L3O29l02L3O54J57r56N9O42J24r4L48
4177E30q8p44J79M95M8j19J12m77p25K16P16L5n71L00j56p42K79J088K17q47K93
4198C9K60m93J21J080R0j045m03M05k22j50N08O6n95n29M63K69j53M85J33o57
4218c28j38O23L80k80K75L29r79n25R56M65p26j05M25r66l95Q05O52m93n61O10
4238B4j22m40M34J057l92p74M31R3k95J83O62n28n97J11L55p07L30N18m53p89
$$ plain form
4258 -899 -520 76 -191 -395 527 261 -640 -3 922 334 54 660 522 -442 -273 608 154 -565 -185 141
4278 141 -422 -755 172 293 -356 -158 25 -232 -225 707 542 -151 27 675 117 -83 475 514 -501 -518 206
4299 206 -274 -647 80 340 -517 -692 291 270 -313 187 649 134 -358 600 687 -12 -115 380 276 -332 -100
4320 -100 197 -355 -598 4 -202 -672 -120 99 -503 -507 312 405 -235 107 917 104 -285 557 619 -312 -429
4341 -429 254 -55 -673 -106 345 -411 -659 -123 -116 -293 -85 488 69 -199 164 269 174 280 702 75 -286
4362 -286 166 240 -297 -345 87 -537 -845 -185 351 -377 -420 222 128 -386 2 855 338 -171 391 528 65
4383 65 25 644 104 -431 -265 -94 -289 -303 72 -297 -805 -384 171 -194 78 507 195 -325 107 762 188
4404 188 -96 396 246 -532 -325 346 236 -558 -340 -7 -647 -548 208 323 -227 -134 107 21 172 649 636
$$ packed form
4258h99L79N96k67k04R22k66r01O37R25n88k80O06j38r64J69Q81m54p19L80L26
4278A41n63l33R27J21o49J98J83k57PR32j65o93J78O48n58k00N58L9j015j7P24
4299B06m80l73P27K60q57j75R83k1n83N00M62n15m92R58Q7o99j03M95j04o08K32
4320a00K97n52k43O02k06m70N52K19o02mQ19R3o40L42Q10q13l89Q42O2r31j17
4341d29O83l09o18N67M51p56k48N36Pj77K08N73m19k68L63J05r5J06M22o27l61
4362b86M52P4n37m8M32o24l08O60N36p28m3O42r4n14L88Q53n17n09N62J37m63
4383F5m0O19n40n35J66J71j95j4L75l69n08M21N55l65K72M29l12n20M32O55n74
4404A88k84M92j50p78K07O71j10p94K18L33o40R9P56J15n50R3K41q6J51M77j3
$$ plain form
4425 636 -94 74 231 77 37 392 85 -570 -441 19 -207 -337 273 40 -737 -483 166 235 -22 208 537
4446 537 -41 -249 644 671 320 -125 174 -188 -602 42 141 -124 -513 -345 -437 -323 137 326 -7 -189 326
4467 326 75 -60 535 703 -53 -279 134 137 -491 72 414 -527 -630 -391 41 -261 -172 311 -127 -544 55
4488 55 582 343 314 382 178 -392 208 586 152 -20 10 -380 -604 -37 265 -357 -427 -77 -170 -409 4 750
4510 750 86 -356 137 227 105 159 622 386 -324 -130 327 -256 -187 101 -108 -759 -424 99 -111 -35 270
4531 270 164 -420 -35 624 373 130 566 245 -391 26 371 85 -472 27 119 -592 -582 192 158 -561 -276
$$ packed form
4425F36p30J68J57j54m0L55l07o55J29M60k26j30O10k33p77K54O49O9k57K30L29
4446E37n78k08Q93K7l51m45K99l62m14O44R9k65l89J68r2J14M60J89l33j82N15
4467C26k51j35N95J68p56k26M13Lo28N63L42r41j03K39M32l02Q9M83m38m17N99
4488E5N27k39k9O8k04n70O00L78m34j72L0l90k24N67L02o22p0L50r3k39M13P46
4510G50o64m42M93R0j22N4M63k36p10J94M57n83O9K88k09o51L35N23k10P6L05
4531B70j06n84L85O59k51k43M36l21o36M17L45k86n57M99R2p11J0P74l4p19K85
$$ [...]
8191B
##END NTUPLES=NMR FID
##END=
