##TITLE=1H_B2705-1
 CDCl3, 8 sc, 
 28.5.2019
##JCAMPDX= 6.0         $$ Bruker NMR JCAMP-DX V2.0
##DATA TYPE= NMR FID
##DATA CLASS= NTUPLES
##ORIGIN= UXNMR, Bruker Analytische Messtechnik GmbH
##OWNER= root
$$ XWIN-NMR		Version 3.5
$$ Tue May 28 14:12:18 2019 Russian Standard Time (UT+4h)  she@DPX200
##.OBSERVE FREQUENCY= 200.1315
##.OBSERVE NUCLEUS= ^1H
##.DELAY= (6, 6)
##.ACQUISITION MODE= SIMULTANEOUS
##.ACQUISITION SCHEME= undefined
##.AVERAGES= 8
##.DIGITISER RES= 18
##SPECTROMETER/DATA SYSTEM= spect
##.PULSE SEQUENCE= zg30
##.SOLVENT NAME= CDCl3
##.SHIFT REFERENCE= (INTERNAL, CDCl3, 0, 15.7039)
##AUDIT TRAIL= $$ (NUMBER, WHEN, WHO, WHERE, WHAT)
$$ ##TITLE= Audit trail, XWIN-NMR		Version 3.5
$$ ##JCAMPDX= 5.01
$$ ##ORIGIN= Bruker BioSpin GmbH
$$ ##OWNER= she
$$ F:/spectra/data/she/nmr/H-F/1/audita.txt
$$ ##AUDIT TRAIL=  $$ (NUMBER, WHEN, WHO, WHERE, WHAT)
(   1,<2019-05-28 14:11:07.20 +0400>,<she>,<DPX200>,
      <created by zg, POWCHK disabled, PULCHK disabled
       configuration hash MD5:
       00 E9 B6 7A A2 85 ED C7 34 08 36 98 17 FE 4E 26
       data hash MD5: 16K
       41 3B 29 5B 97 55 ED 5C DB E9 ED 6A DD 87 75 4F>)
$$ ##END=
$$ 
$$ hash MD5
$$ 1A 91 2C B8 7C 25 AE 50 B4 4A BA 02 F1 05 D7 F5
##$RELAX= 
##$RELAX= 
##$RELAX= 
##$RELAX= 
##$RELAX= 
##$RELAX= 
$$ Bruker specific parameters
$$ --------------------------
##$DU= <F:/spectra>
##$EXPNO= 1
##$NAME= <H-F>
##$PROCNO= 1
##$TYPE= <nmr>
##$USER= <she>
##$AMP= (0..31)
100 100 100 100 100 100 100 100 100 100 100 100 100 100 100 100 100 100 
100 100 100 100 100 100 100 100 100 100 100 100 100 100 
##$AQSEQ= 0
##$AQ_mod= 1
##$AUNM= <au_zg>
##$AUTOPOS= <>
##$BF1= 200.13
##$BF2= 200.13
##$BF3= 200.13
##$BF4= 200.13
##$BF5= 200.13
##$BF6= 200.13
##$BF7= 200.13
##$BF8= 200.13
##$BYTORDA= 1
##$CFDGTYP= 0
##$CFRGTYP= 5
##$CHEMSTR= <none>
##$CNST= (0..31)
1 1 145 1 1 1 1 1 1 1 1 1 1 1 1 1 1 1 1 1 1 1 1 1 1 1 1 1 1 1 1 1 
##$CPDPRG= <>
##$CPDPRG1= <>
##$CPDPRG2= <>
##$CPDPRG3= <>
##$CPDPRG4= <mlev>
##$CPDPRG5= <mlev>
##$CPDPRG6= <mlev>
##$CPDPRG7= <mlev>
##$CPDPRG8= <mlev>
##$CPDPRGB= <>
##$CPDPRGT= <>
##$D= (0..31)
0 1.2 0 0 0 0 0 0 0 0 0 0.03 0 0 0 0 0 0 0 0 0 0 0 0 0 0 0 0 0 0 0 0 
##$DATE= 1559038266
##$DBL= (0..7)
120 120 120 120 120 120 120 120 
##$DBP= (0..7)
150 150 150 150 150 150 150 150 
##$DBP07= 0
##$DBPNAM0= <>
##$DBPNAM1= <>
##$DBPNAM2= <>
##$DBPNAM3= <>
##$DBPNAM4= <>
##$DBPNAM5= <>
##$DBPNAM6= <>
##$DBPNAM7= <>
##$DBPOAL= (0..7)
0.5 0.5 0.5 0.5 0.5 0.5 0.5 0.5 
##$DBPOFFS= (0..7)
0 0 0 0 0 0 0 0 
##$DE= 6
##$DECBNUC= <off>
##$DECIM= 24
##$DECNUC= <off>
##$DECSTAT= 4
##$DIGMOD= 1
##$DIGTYP= 9
##$DL= (0..7)
0 120 120 120 120 120 120 120 
##$DP= (0..7)
150 150 150 150 150 150 150 150 
##$DP07= 0
##$DPNAME0= <>
##$DPNAME1= <>
##$DPNAME2= <>
##$DPNAME3= <>
##$DPNAME4= <>
##$DPNAME5= <>
##$DPNAME6= <>
##$DPNAME7= <>
##$DPOAL= (0..7)
0.5 0.5 0.5 0.5 0.5 0.5 0.5 0.5 
##$DPOFFS= (0..7)
0 0 0 0 0 0 0 0 
##$DQDMODE= 0
##$DR= 18
##$DS= 0
##$DSLIST= <SSSSSSSSSSSSSSS>
##$DSPFIRM= 0
$$ [...]
##$SUBNAM2= <"">
##$SUBNAM3= <"">
##$SUBNAM4= <"">
##$SUBNAM5= <"">
##$SUBNAM6= <"">
##$SUBNAM7= <"">
##$SUBNAM8= <"">
##$SUBNAM9= <"">
##$SW= 24.9337058887773
##$SWIBOX= (0..15)
0 0 2 0 0 0 0 0 0 0 0 0 0 0 0 0 
##$SW_h= 4990.01996007984
##$TD= 16384
##$TD0= 1
##$TE= 0
##$TE2= 300
##$TE3= 300
##$TEG= 300
##$TL= (0..7)
0 120 120 120 120 120 120 120 
##$TP= (0..7)
150 150 150 150 150 150 150 150 
##$TP07= 0
##$TPNAME0= <>
##$TPNAME1= <>
##$TPNAME2= <>
##$TPNAME3= <>
##$TPNAME4= <>
##$TPNAME5= <>
##$TPNAME6= <>
##$TPNAME7= <>
##$TPOAL= (0..7)
0.5 0.5 0.5 0.5 0.5 0.5 0.5 0.5 
##$TPOFFS= (0..7)
0 0 0 0 0 0 0 0 
##$TUNHIN= 0
##$TUNHOUT= 0
##$TUNXOUT= 0
##$USERA1= <user>
##$USERA2= <user>
##$USERA3= <user>
##$USERA4= <user>
##$USERA5= <user>
##$V9= 5
##$VALIST= <valist>
##$VCLIST= <CCCCCCCCCCCCCCC>
##$VD= 0
##$VDLIST= <DDDDDDDDDDDDDDD>
##$VPLIST= <PPPPPPPPPPPPPPP>
##$VTLIST= <TTTTTTTTTTTTTTT>
##$WBST= 1024
##$WBSW= 4
##$XGAIN= (0..3)
0 0 0 0 
##$XL= 0
##$YL= 0
##$YMAX_a= 377047
##$YMIN_a= -331468
##$ZGOPTNS= <>
##$ZL1= 120
##$ZL2= 120
##$ZL3= 120
##$ZL4= 120
##$ABSF1= 10
##$ABSF2= 0
##$ABSG= 5
##$ABSL= 3
##$ALPHA= 0
##$AQORDER= 0
##$ASSFAC= 0
##$ASSFACI= 0
##$ASSFACX= 0
##$ASSWID= 0
##$AUNMP= <proc_1d>
##$AZFE= 0.1
##$AZFW= 0.1
##$BCFW= 1
##$BC_mod= 2
##$BYTORDP= 1
##$COROFFS= 0
##$CY= 11.3945322036743
##$DATMOD= 1
##$DC= 2
##$DFILT= <>
##$DTYPP= 0
##$F1P= 18.9103706918063
##$F2P= -1.10871071338519
##$FCOR= 0.5
##$FTSIZE= 0
##$FT_mod= 4
##$GAMMA= 1
##$GB= 0.15
##$INTBC= 1
##$INTSCL= 1
##$ISEN= 128
##$LB= 0.24
##$LEV0= 0
##$LPBIN= 0
##$MAXI= 10000
##$MC2= 0
##$MEAN= 0
##$ME_mod= 0
##$MI= 1.114404
##$NCOEF= 0
##$NC_proc= 0
##$NLEV= 6
##$NOISF1= 3.799351
##$NOISF2= 2.8
##$NSP= 1
##$NTH_PI= 0
##$NZP= 0
##$OFFSET= 15.70392
##$PC= 1
##$PHC0= -9017.259
##$PHC1= 16.20025
##$PH_mod= 1
##$PKNL= yes
##$PPARMOD= 0
##$PSCAL= 0
##$PSIGN= 0
##$REVERSE= no
##$SF= 200.130013532006
##$SI= 16384
##$SIGF1= 3
##$SIGF2= 2
##$SINO= 400
##$SIOLD= 16384
##$SREGLST= <1H.CDCl3>
##$SSB= 0
##$STSI= 0
##$STSR= 0
##$SW_p= 3612.71676300578
##$SYMM= 0
##$S_DEV= 0
##$TDeff= 0
##$TDoff= 0
##$TI= <>
##$TILT= no
##$TM1= 0
##$TM2= 0
##$TOPLEV= 0
##$USERP1= <user>
##$USERP2= <user>
##$USERP3= <user>
##$USERP4= <user>
##$USERP5= <user>
##$WDW= 1
##$XDIM= 8192
##$YMAX_p= 0
##$YMIN_p= 0
$$ End of Bruker specific parameters
$$ ---------------------------------
##NTUPLES= NMR FID
##VAR_NAME=  TIME,          FID/REAL,        FID/IMAG
##SYMBOL=    X,             R,               I
##VAR_TYPE=  INDEPENDENT,   DEPENDENT,       DEPENDENT
##VAR_FORM=  AFFN,          ASDF,            ASDF
##VAR_DIM=   8192,          8192,            8192
##UNITS=     SECONDS,       ARBITRARY UNITS, ARBITRARY UNITS
##FACTOR=    0.0002004,     1,               1
##FIRST=     0,             0,               0
##LAST=      1.6414764,     0,               0
##MIN=       0,             -331468,         0
##MAX=       1.6414764,     377047,          0
$$ Real data points
##PAGE= N=1
##DATA TABLE= (X++(R..R)), XYDATA
0@%%%%qJ6j6J6k4L2m0M8n7P3q8J12j38J62j92K26k67L13l61M18m85N57o36P24
$$ 0 0 0 0 0 -8 8 -8 8 -16 16 -24 24 -33 40 -48 64 -74 88 -104 122 -145 168 -193 225 -260 297 -339 385
28C85q22R31j051J181j325J484j660J852k059K287k541K821l123L455l827M241
$$ 385 -437 494 -557 624 -701 783 -877 975 -1084 1203 -1338 1483 -1640 1815 -2012 2229
44B229m693N200n778O430p171Q028r035J0232j1685J3494j5820J8933k3338L0109
$$ 2229 -2464 2736 -3042 3388 -3783 4245 -4790 5442 -6243 7251 -8569 10364 -12974 17135
58A7135m1951O8505k26480N5296M61577l19121l46429J82567L30511j85458k13243
$$ 17135 -24816 43689 -182791 -127495 334082 14961 -331468 -148901 181610 -3848 -217091
69b17091J69525J75392k24597j36122K35752J69556k33488j84257J62910J98632
$$ -217091 -47566 127826 -96771 -232893 2859 172415 -61073 -245330 -82420 116212
79A16212p9784j49913j2160Q0224O1997J5966p7851q0454O2474J18258m9784j11801
$$ 116212 36428 -113485 -125645 -45421 16576 32542 -45309 -125763 -63289 54969 5185 -106616
91a06616N8420R9023r7400q8613J53766J08064k05148j43487K33697J88072k32518
$$ -106616 -48196 50827 -46573 -135186 18580 126644 -78504 -221991 11706 199778 -32740
102c2740k14513K11961K19231j86240j97567J71475J66160j69420j33851J77707
$$ -32740 -247253 -35292 183939 -2301 -199868 -28393 137767 -31653 -165504 12203
112A2203J12856j83472r9188J81570R0604j66409p7113J44371N8071j17648l1675
$$ 12203 125059 -58413 -157601 23969 114573 -51836 -128949 15422 73493 -44155 -75830
123g5830R3431M073o9909K5529M9932n2827l0726P9913J6224j02684m309J20455
$$ -75830 17601 21674 -48235 -22706 27226 -25601 -56327 23586 39810 -62874 -67183 53272
135E3272l151j28533J2487J29335k5176j23752M5536J20772o7874j21862Q8945
$$ 53272 50121 -78412 -65925 63410 38234 -85518 -39982 80790 12916 -108946 -20001
146b0001J29539r8427j35115R6788J34066q5131j17192P5075Q8922p1726n4272
$$ -20001 109538 11111 -124004 -27216 106850 21719 -95473 -20398 68524 -3202 -57474
157e7474Q1634K6343r6952r345J10897N509j11311m063R8241k371p4392K2737
$$ -57474 24160 50503 -46449 -55794 55103 60612 -50699 -54762 43479 41108 -33284 -10547
169a0547N3044n2676m1126Q5734M4138j07965n3804J15507O2242j07219n7320
$$ -10547 42497 -10179 -51305 34429 78567 -29398 -83202 32305 94547 -12672 -69992
180f9992R4661L9709q5719j2679Q9463j0649j01362K3647J14836k1841j17984
$$ -69992 24669 64378 -21341 -34020 55443 44794 -56568 -32921 81915 60074 -57910
191e7910J3063J07186n428q3119Q735N5997k2955l4158M4045K4485o0972k3292
$$ -57910 -44847 62339 56911 -26208 -17473 38524 15569 -18589 25456 49941 -11031 -34323
203c4323O7760K5147o1628k0007M8766N010l6641J8340L2717m2292l7226N9637
$$ -34323 33437 58584 -3044 -23051 25715 30725 -5916 12424 45141 2849 -34377 25260
215B5260M6195o6161n2064O3936M9493n8818l7949N7078K1624o1595o752P0698
$$ 25260 71455 5294 -46770 17166 66659 7841 -30108 26970 48594 -13001 -19753 50945
227E0945k134p9601M340Q3220l241p9385K969O9410p494n7816J6262M7910k7485
$$ 50945 48811 -30790 -26450 56770 53529 -25856 -22887 46523 39029 -18787 -2525 45385 17900
240A7900m2401L6757L9613m2361l7598M3084L3164m1391k6181L9014J6628l8033
$$ 17900 -24501 12256 51869 9508 -28090 14994 48158 6767 -19414 19600 36228 -1805
252a805p129L7984j251l8604P355L7830j2240l5970J5931L2262j9942k8397K3142
$$ -1805 -8934 29050 27799 -10805 -3450 34380 22140 -13830 2101 34363 14421 -13976 9166
265I166K3689k6301j9685K7895J4826k9255j0255K9638M873l0640n86L0637l189
$$ 9166 32855 6554 -13131 14764 29590 335 -9920 19718 24591 -6049 -6635 24002 20813
278B0813l0617N268K8385p436k5589R281K0823j2558j7127J5611J3355j9120j1791
$$ 20813 -9804 -4536 23849 16413 -9176 105 20928 8370 -8757 6854 20209 1089 -10702
291a0702K0142R996k0269q620J7782M948j5523r27J3169m346j2758Q366J2501
$$ -10702 9440 19436 -833 -9453 8329 13277 -2246 -3173 9996 5650 -7108 1258 13759
304A3759j1427j2776J2248J1577j2707r500J2703N985j3795k991J4927L22j6678
$$ 13759 2332 -10444 1804 13381 674 -8826 3877 9862 -3933 -6924 8003 8325 -8353
317h353R18J7248k047j7139K770J5833m099j4822N618J3446p082j2925P912J2082
$$ -8353 -7435 9813 7766 -9373 -6603 9230 5131 -9691 -4073 9373 2291 -10634 -2722 9360
331I360q269j1299P836R543p938p969P779O095q317n163Q213M179p990l822O746
$$ 9360 1091 -10208 -2372 7171 -767 -8736 -957 5138 -3179 -8342 -129 4050 -3940 -7762 -1016
346a016K577n865j397M652n38m743J582M836k435n475J957N058j499m284J040
$$ -1016 1561 -4304 -5701 -1049 -1587 -6330 -4748 88 -2347 -7822 -5865 -807 -2306 -6590 -5550
361e550K572j416j461K300P46l502j071M055J726l760k519K821K499j712k024
$$ -5550 -2978 -4394 -5855 -3555 -2809 -6311 -7382 -3327 -1601 -5361 -7880 -5059 -2560 -4272 -6296
376f296J139J399j034q22J279J165j225j650R53K353M2k297q04K152J544j479
$$ -6296 -5157 -3758 -4792 -5614 -4335 -3170 -4395 -6045 -5092 -2739 -2697 -4994 -5798 -3646 -2102 -3581
392c581j371J458J157j598q91K488J466k981k226L150L338k570l603J869L462
$$ -3581 -4952 -3494 -2337 -3935 -4826 -2338 -872 -3853 -6079 -2929 409 -2161 -5764 -3895 -433
407d33j304k525J571J997k468j912L524K899l737l914L005M897j486m471K02L170
$$ -433 -1737 -4262 -2691 -694 -3162 -5074 -1550 1349 -2388 -6302 -3297 1600 114 -4357 -4155 -985
423i85M47j354J79K71j416n3K836J132l101k386K139L494l79l062j089J677K163
$$ -985 -538 -1892 -1713 -1442 -2858 -2911 -75 1057 -2044 -4430 -2291 1203 824 -2238 -3327 -1650 513
440E13O7j444j237L85J445J015l13j243q40N86K032Q76j851k171J158K713K63
$$ 513 580 -864 -2101 -1716 -271 744 431 -812 -1652 -1066 966 1842 -9 -2180 -1022 1691 1954
457A954k054j007R42R74M61K02j119j557J064K864l20l195m45L182P96k495l04
$$ 1954 -100 -1107 -165 809 1270 1472 353 -1204 -140 2724 2404 -791 -1236 1946 2742 247 -57
474e7J972m69j813J665K240k404k754K861L457k989l687L166L774l333l406L728
$$ -57 1915 1446 -367 1298 3538 1134 -1620 1241 4698 1709 -1978 1188 4962 1629 -1777 1951
490A951L316m125l139M589L174m650k884M756K696m625k084M896J491m913j099
$$ 1951 5267 1142 -1997 2592 5766 1116 -1768 2988 5684 1059 -1025 3871 5362 449 -650
505f50N438R76n469q42N316Q45m563n14L696r2k966J284K741k222l008K772L367
$$ -650 4788 5764 295 -547 4769 5614 1051 537 4233 4141 1175 2459 5200 2978 -30 2742 6109
522F109k279l598J487K728n72r60K27j038j065K509K673l037m152K090M655n69
$$ 6109 3830 232 1719 4447 3875 2915 3142 2104 1039 3548 6221 3184 -968 1122 5777 5208
538E208l708o87J533N20R54J028k530l536K508N358r82n658q83M074J534j101
$$ 5208 1500 813 2346 2866 3820 4848 2318 -1218 1290 6648 5666 8 -875 3199 4733 3632
554C632l97j374k418K307N627j195p813r95P728K899n685k935L204N89j712K936
$$ 3632 3235 1861 -557 1750 7377 6182 -1631 -2626 5102 8001 2316 -619 2585 3174 1462 4398
570D398K503o091n364P217Q526n743j0422K859R500p0o467o73K609j205J16M325
$$ 4398 6901 810 -4554 2663 11189 5446 -4976 -2117 7383 7313 846 173 2782 1577 1693 6018
586F018m17p339j583P905M109o113n551K396M227R88q40k595l535J650O319R34
$$ 6018 5601 -1738 -3321 4584 8693 2580 -2971 -575 3652 4640 3800 1205 -2330 -680 5639 6573
602F573o941l374N153L850k536k128P29j168j300M356L475n852o408M876Q310
$$ 6573 -368 -3742 1411 5261 2725 597 1326 158 -1142 3214 6689 837 -5571 -695 7615
617G615k554q215n6O042J370k939r16L03p02J128K448r89l343J03L001L65j345
$$ 7615 5061 -3154 -3210 2832 4202 1263 347 650 -52 1076 3524 2535 -808 -705 2296 2661 1316
634A316q2o03j207K182L008l068m909L217O394k895p430K303P662j738p345J314
$$ 1316 1234 631 -576 1606 4614 1546 -3363 -146 6248 3353 -4077 -1774 5888 4150 -3195 -1881
650a881O295j368n038K137L610l724k823N408L007o677m215O487N459m811n404
$$ -1881 4414 3046 -1992 145 3755 31 -2792 2616 5623 -1054 -5269 1218 6677 1866 -3538
665c538J841L323N12N36j146n278n37Q531M168r346p678P317R158l887p427J471
$$ -3538 -1697 1626 2138 2674 1528 -3750 -4287 4244 8412 -934 -8612 -1295 7863 3976 -3451 -1980
681a980L156j878J502N505l867j0556K312J4838K104j5206p279J1521J0282n254
$$ -1980 1176 -702 800 6305 2438 -8118 -5806 9032 11136 -4070 -11349 172 10454 5200
695E200r153l97M606K990Q68j381m321k594L813N814O33n852o233J376R940N764
$$ 5200 -3953 -4350 256 3246 4114 2733 -1588 -4182 -369 5445 6078 226 -6007 -4631 5309 11073
711A1073r584j2676N398J6527K72j5910m405J2395M761q576j433P269l557r536
$$ 11073 1489 -11187 -5789 10738 11010 -4900 -9305 3090 7851 -725 -2158 5111 1554 -7982
725g982P165J4221p676j9048M872K1223m44k0044k936J6272L777j1946j829R204
$$ -7982 -817 13404 5728 -13320 -8448 12775 12331 -7713 -10649 5623 9400 -2546 -4375 4829
739D829j130q650L503R828l857j0985K332J0750J00q678j999N278K712k013j969
$$ 4829 3699 -4951 -1448 8380 4523 -6462 -4130 6620 6720 -1958 -3957 1321 4033 2020 51
754E1m70J023J789n42k316R36L057j907m219K960N672l587p014L811P725m329
$$ 51 -419 604 2393 1851 -465 471 3528 1621 -2598 362 6034 2447 -4567 -756 6969 2640
770B640p965M963Q107o206q649P143R553p762j0539P362J0628o573r865N836Q129
$$ 2640 -5325 -362 7745 1539 -7110 33 9586 1824 -8715 -1353 9275 2702 -7163 -1327 6802
785F802o155o332P052N073q431n088R160N604q739o342P150N912n138m623L423
$$ 6802 647 -5685 1367 6440 -1991 -7079 2081 7685 -1054 -7396 -246 5666 528 -4095 -672
800f72K347k642n52K777n57l157M98K677L42j291q86j116O05L687M52n612k096
$$ -672 1675 -967 -1519 1258 701 -2456 -1958 719 1061 -230 -1116 -2232 -1627 2060 2512 -3100 -5196
817e196O409L304o704l743O625L170p128k369Q127J664r648j658J0885K007j1587
$$ -5196 1213 4517 -2187 -5930 695 3865 -3263 -5632 2495 4159 -5489 -7147 3738 5745 -5842
832e842k661J1672K627j1248k511J0728J846j0544j447J0344J022j0105j217R356
$$ -5842 -8503 3169 5796 -5452 -7963 2765 4611 -5933 -7380 2964 3986 -6119 -7336 2020
846B020J246q400j099O879N07n504J62M416q42l662J242K800j207j976J238O53
$$ 2020 3266 -5134 -6233 646 1153 -4351 -4189 227 -615 -4277 -3035 -235 -1442 -3418 -2180 -1527
862a527j117O32J230j868j596K837J853l532j934M181J721m546j440N101J350
$$ -1527 -2644 -2012 -782 -2650 -4246 -1409 444 -3088 -5022 -841 880 -3666 -5106 -5 1345
877A345n558j155N878J217n952q99N599Q23n201l98M824o0m473N71L995q70l348
$$ 1345 -4213 -5368 510 1727 -4225 -5124 475 1298 -3903 -4301 523 463 -4010 -3439 556 -314 -3662
894c662J031K772j426j850J958J045k393m01K806N0k963M33K998j147k665K085
$$ -3662 -2631 141 -1285 -3135 -1177 -132 -2525 -2926 -120 -70 -3033 -2600 398 -749 -3414 -1329
910a329K598l075k739L981L241m472l581M518L800m248l350M214K550m299j811
$$ -1329 1269 -1806 -4545 -564 2677 -1795 -5376 -858 2942 -1306 -4656 -442 2108 -2191 -4002
925d002M971J451n575j449N896K006n480k240M557K122l506j240K718J52k591
$$ -4002 969 2420 -3155 -4604 1292 3298 -2182 -4422 135 2257 -1249 -2489 229 381 -2210
940b210R19K950j381l493R21L575j46k873o22J527P44n4k03j075q26J305J693
$$ -2210 -1291 1659 278 -3215 -2294 1281 1135 -1738 -2360 -833 -89 -143 -346 -1421 -2247 -942 751
957G51r27k020J72J348R9l97K58o40j313J058K365o73l158j82L209R10k505j141
$$ 751 -176 -2196 -2024 -676 -577 -974 -716 -1356 -2669 -1611 754 81 -3077 -3259 -50 860 -1645 -2786
975b786J641O07p52L92N93j396r19K058J729j994k263J457K485n04j956J05J093
$$ -2786 -1145 -538 -1290 -898 -305 -1701 -2620 -562 1167 -827 -3090 -1633 852 348 -1608 -1503 -410
992d10K62J36K38q02p90J288J756j170k098Q21K181j22j768k3J137j18k27Q25
$$ -410 -148 -12 226 -576 -1366 -78 1678 508 -1590 -769 1412 1290 -478 -501 636 518 291 1116
1010A116j92j694J81K569N60k984j399K786K223j884k296P90J608j4n60L3p04
$$ 1116 924 -770 -589 1980 2540 -444 -1843 943 3166 1282 -1014 -224 1384 1370 810 843 139
1027A39r39J280K130q99l261l79L255J831k240k832L89K557J302j056k270r26
$$ 139 -800 480 2610 1711 -1550 -1929 1326 3157 917 -1915 -1526 1031 2333 1277 -993 -1919
1043a919J483K375J87k730k017J464K945M84k494k214M40K692J610j532l170p91
$$ -1919 -436 1939 2126 -604 -2621 -1157 1788 2272 -222 -2436 -1996 696 2306 774 -2396 -3187
1059c187K926K822j351l644j083K750K698o33k919j464J197K578J019k053k741
$$ -3187 -261 2561 1210 -2434 -3517 -767 1931 1298 -1621 -3085 -1888 690 1709 -344 -3085
1074c085j52L031K308j673l495q13K837K981j082l672j369K655K920o81l106j221
$$ -3085 -3237 -206 2102 429 -3066 -3879 -1042 1939 857 -2815 -4184 -1529 1391 710 -2396 -3617
1090c617J686K070Q3j381j500m27J786K165m69l420j058K943K639j731l248K72
$$ -3617 -1931 139 222 -1159 -2659 -3086 -1300 865 396 -3024 -4082 -1139 1500 -231 -3479 -3207
1106c207K728Q05j410q46J24O8N95J152l60j979l94K147J496j628j976P02J832
$$ -3207 -479 326 -1084 -1930 -1806 -1738 -1143 9 -351 -2330 -2724 -577 919 -709 -2685 -1983 -151
1123a51K38r23q01N2O45R26j6j376o18J291J243q68j318K98J113J32n29k42m2
$$ -151 87 -836 -1637 -1585 -940 -14 -30 -1406 -2024 -733 510 -358 -1676 -1378 -265 -133 -662 -904 -946
1142i46qM35N94n81j095L73J476J20j494o43J201R80o20r34o1P10N85k48o89k53
$$ -946 -954 -519 75 -506 -1601 -1228 248 368 -1126 -1769 -568 412 -208 -1142 -1203 -493 92 -156 -845 -1098
1162a098N68O30l14m46N8J28p5M39M93q03j083Q96J846l45k387j34K475P51j986
$$ -1098 -530 100 -214 -660 -602 -474 -549 -110 383 -420 -1503 -607 1239 894 -1493 -1627 848 1599 -387
1181c87j098J446Q63p93k14O71n63j075J286J735j324k403Q63K864k05k416m72
$$ -387 -1485 -39 824 31 -183 488 -75 -1150 136 1871 547 -1856 -993 1871 1666 -750 -1222
1198a222J499O44l53l6m19j114P47K265k88k832m18K722J057k015q76J160J82
$$ -1222 277 921 568 532 113 -1001 -254 2011 1723 -1109 -1527 1195 2252 237 -639 521 703
1215G03p09J249J081k297k008K873L212k357l760J532L746n38k689M94J337q62
$$ 703 -6 1243 2324 27 -1981 892 4104 1747 -2013 -481 3265 2727 38 532 1869 1007
1231A007k05K167J16l244m90L881J433l415j923K461J923j103p03K31p13K4K154
$$ 1007 802 2969 3085 -159 -649 3232 4665 1250 -673 1788 3711 2608 1905 2136 1423 1447 3601
1248C601P04k916j482L026K009k431j657J748Q00j529N22J884j556k854K258L652
$$ 3601 4305 1389 -93 2933 4942 2511 854 2602 3402 1873 2395 4279 2723 -131 2127 5779
1264E779k103m271J663M167j212l510J113K420j475j498K319Q05l389m95M000
$$ 5779 3676 -595 1068 5235 4023 513 1626 4046 2571 1073 3392 4197 808 313 4313
1279D313O51m328p34M062P08l336k12K623q61j922K210J741l637j980M852K495
$$ 4313 4964 636 -98 3964 4672 1336 1124 3747 2886 964 3174 4915 1278 -702 4150 6645
1295F645n336l004N317L086m731k556M348J404m110P6M726j325n651K081O605
$$ 6645 1309 -1695 3622 6708 1977 -579 3769 5173 1063 1139 5865 4540 -1111 970 7575
1310G575j936p001J337O610q47n116R05L314j828j754L349J044n015j092N915
$$ 7575 5639 -1362 -25 6585 5738 622 1527 4841 3013 1259 4608 5652 637 -455 5460
1325E460J517n916j702M775J090l416N65K339k950k392N203L118o737m475O961
$$ 5460 6977 1061 -641 4134 5224 1808 2373 4712 1762 -630 4573 7691 954 -3521 3440
1340C440N144o406m927N364L406m923j426N212m98o682J678P962j998q793J344
$$ 3440 8584 2178 -2749 2615 6021 1098 -328 4884 4386 -2296 -618 7344 5346 -3447 -2103
1355b103Q414r64p181R89N102k093l384L903K118n831j847O985J882p338j994
$$ -2103 6311 5347 -1834 -845 4257 2164 -1220 2683 4801 -1030 -2877 4108 5990 -1348 -3342
1370c342O802J035n890M47N104k679n177M816N458o359o447P038O931p352o694
$$ -3342 3460 4495 -1395 -948 4156 1477 -3700 1116 6574 215 -6232 806 7737 385 -6309
1385f309P002N612p001m223P324K488q281j193R123K37r859O1R825m73r310Q09
$$ -6309 693 6305 -696 -4919 2405 4893 -3388 -4581 4542 4779 -5080 -5019 4806 4333 -4977 -4168
1401d168Q180j842o975L018N764m605m909N753M189o682l763P120K968p237j880
$$ -4168 4012 2170 -4805 -1787 3977 -628 -5537 216 4405 -2277 -6040 1080 4048 -3189 -5069
1416e069O818M38o763J238O659l004o887M363O932n383p039N907O527o221n684
$$ -5069 1749 2187 -4576 -3338 3321 317 -6570 -2207 4725 -658 -7697 -1790 4737 -1484 -7168
1431g168O339M463o882k997P490J457q311n41Q919k40r113O05Q825j340q093K182
$$ -7168 -829 3634 -3248 -6245 1245 2702 -5609 -6150 2769 2529 -6584 -5979 2846 1506 -6587 -4405
1447d405O978l400o094M701N255n939m699O698M238p122l491P022K489o973r96
$$ -4405 2573 -827 -6921 -2220 3035 -2904 -7603 -905 3333 -3789 -7280 -258 2231 -4742 -5738
1462e738O814o57o773K145P007l246p017M225O650m755n969N502N030o243l655
$$ -5738 1076 419 -6354 -4209 2798 -448 -7465 -3240 3410 -1345 -7314 -1812 3218 -3025 -6680
1477f680P190K555q003j465Q868P38r346J39R492q54r232J841Q948k764q370L918
$$ -6680 510 3065 -4938 -6403 2465 3203 -6143 -6004 3488 2634 -6598 -4757 4191 1427 -6943 -3025
1493c025P770m721p144N546O589o243n624O742M721o879l679P104K532p044j335
$$ -3025 4745 24 -7120 -1574 5015 -1228 -6852 -110 4611 -2268 -5947 1157 3689 -3355 -4690
1508d690O913J62o609J275O189k393n677L413N261m440m522N309L809o042k820
$$ -4690 2223 2385 -4224 -2949 3240 847 -4830 -1417 3844 -596 -5118 191 4000 -2042 -4862
1523d862O685J991p264q58P700R5p980Q43Q097j523p922K359P570k988o883L720
$$ -4862 1823 3814 -3450 -4308 3392 3487 -4493 -3650 4447 2924 -4998 -2639 4931 1943 -4940 -1220
1539a220O315m401n413M996M776n580l690O067K899o355j771O328Q70o068L04
$$ -1220 5095 694 -4719 277 5053 -527 -4217 1850 4749 -1606 -3377 2951 3821 -2247 -1943
1554a943N784j346n451K687N168l999m669M946M601n877m167O358L791o613l147
$$ -1943 3841 2495 -2956 -269 4899 900 -3769 1177 5778 -99 -4266 2092 5883 -730 -3877
1569c877O816K151o861j126P134J45p352N74P504r27p381J182O653j472n572K037
$$ -3877 2939 5090 -1771 -2897 4237 4382 -2970 -2396 5108 4181 -3200 -2018 4635 3163 -2409 -372
1585c72M377k822l429L822K603m506k306M866J936m683j407M152M37l579J002
$$ -372 4005 1183 -2246 1576 4179 -327 -2633 2233 4169 -514 -1921 2231 2668 -911 91
1600I1L329k501l453L659L833m273m309M364M233m065l676L699K577l722j510
$$ 91 3420 919 -2534 1125 4958 685 -3624 740 4973 908 -2768 931 3508 -214 -1724
1615a724M298L42m928k5N484j8n464j93M669K02l609M47K341j680j530K740J258
$$ -1724 2574 2916 -2012 -2037 3447 3429 -2035 -2228 2441 2643 -966 -519 1822 142 -1388 1352 2610
1632B610l846j511M185J653l988j695L423Q71l038L68K818j728l170K574L962
$$ 2610 -1236 -2747 1438 3091 -897 -2592 831 1702 -1336 -968 1850 122 -3048 -474 3488
1647C488l084m640K825M669k198m303J478L328j470k161J836J108k530o97L105
$$ 3488 404 -4236 -1411 3258 1060 -3243 -1765 1563 93 -2068 -232 876 -1654 -2351 754
1662G54O87l348r38K994R90k165o73J119k58l15J318J13k578l56L210Q39l417
$$ 754 1441 -1907 -2845 149 1139 -1026 -1699 -580 -838 -1153 165 278 -2300 -2656 554 1393 -2024
1679b024j252K974J131k426o91K076k50k258J215K751j798l523J652M094j169
$$ -2024 -3276 -302 829 -1597 -2288 -212 -462 -2720 -1505 1246 -552 -4075 -2423 1671 502
1694E02m300L14L737K39k802l01J507q0q20Q15N11j462q48J794J129j445j366
$$ 502 -3798 -3484 253 492 -2310 -2611 -1104 -1184 -2004 -1189 -678 -2140 -2988 -1194 -65 -1510 -2876
1711b876P23J043J52l16o17q22O43J801j43k391m98K337J048j878j015J259N82
$$ -2876 -2153 -1110 -958 -1274 -1891 -2713 -2070 -269 -412 -2803 -3301 -964 84 -1794 -2809 -1550 -968
1728i68j051L43J093j008j565J317K335j068k724N26K555J81j810n85R89L33o4
$$ -968 -2019 -1676 -583 -1591 -3156 -1839 496 -572 -3296 -2770 -215 -34 -1844 -2429 -1440 -1107 -1171
1745a171K43l64j047M43J642j24j699j58J342L26q55J38M84p67k36J472N45j889
$$ -1171 -928 -1292 -2339 -1896 -254 -378 -2077 -2235 -893 -567 -1422 -1284 -800 -1567 -1803 -331 214 -1675
1763a675q74J986J448j676j587J340J597j082r08Q55O10q93j59J183K76j272l76
$$ -1675 -2549 -563 885 -791 -2378 -1038 559 -523 -1431 -576 34 -859 -1018 165 441 -831 -1207
1780a207J350P35p97q15L18Q96K73l92o23J9Q86M57p06n79P70N44n46k99P20K13
$$ -1207 143 878 81 -734 -416 480 753 361 -262 -243 643 1100 394 -185 585 1129 583 284 1004 1217
1800A217q94l4J213J65j384k33J483N14j316n16J089N27q53k53P39P2o65K44N46
$$ 1217 323 289 1502 1667 283 50 1533 2047 731 215 1304 1831 978 725 1464 1536 871 1115 1661
1819A661j69n79K34M46j90j88K05qk63L37M72n78o42P68Q74q17q68Q48Q67o79
$$ 1661 1492 913 1147 1593 1403 1215 1420 1412 1149 1486 1958 1380 738 1506 2380 1563 695 1543 2410 1731
1839A731r31Q63O93p78m79Q62M81r22l45R57L35j027j93J004K44q09j16O34R1
$$ 1731 800 1663 2356 1578 1099 1961 2442 1520 1175 2132 2467 1440 1247 2251 2495 1686 1570 2204 2295
1858B295m09J13K73l61j29O16J94p58k08Q77J56p80p8O38j17o01M85O55o81q23
$$ 2295 1886 1999 2272 1911 1782 2398 2592 1834 1626 2503 2659 1879 1801 2439 2322 1721 2206 2861 2180 1357
1878A357R08Q56q10j071O23R76m50n91L51O7m88M42O61o81j033O95J242n69j370
$$ 1357 2265 3121 2311 1240 1863 2839 2389 1798 2149 2216 1728 2170 2831 2150 1117 1812 3054 2485 1115
1897A115M63J010n43n52Q53J47j274j33J825R3k240l57K224O49k087o58J634L49
$$ 1115 1578 2588 2045 1493 2346 2493 1219 1086 2911 3004 764 407 2631 3280 1193 535 2169 2518
1915B518j406Q3J258n76j480Q66J650r77j957Q78J689o91j418M76P31o48j40R16
$$ 2518 1112 1195 2453 1877 397 1263 2913 1936 -21 857 2546 1855 437 913 1644 996 856 1772
1933A772l91j417M42J672m95j931L95J564l05j525N92R92j082q67J527O41j934
$$ 1772 1381 -36 406 2078 1583 -348 47 1611 1306 -219 373 1365 283 -584 943 1584 -350
1950c50r09K071R05k056r60J819O81j766l10J488j46j551M85J424o97j610Q86
$$ -350 -1259 812 1717 -339 -1299 520 1201 -565 -875 613 467 -1084 -599 825 128 -1482 -596
1967e96J323j031j141J078P77j355l39J528j05j912K97K079n75k113N37K111q98
$$ -596 727 -304 -1445 -367 410 -945 -1284 244 139 -1773 -1476 603 28 -2085 -1548 563 -335
1984c35k034J106J764j481j684J721J484j942j546K042J357k281j091K290N44
$$ -335 -2369 -1263 501 -980 -2664 -943 541 -1401 -2947 -905 452 -1829 -2920 -630 -86
1999h6k221l79K209J7k229K68K120o29j947Q20J671j170j530J623J145j907r29
$$ -86 -2307 -2686 -477 -460 -2689 -2421 -301 -930 -2877 -2057 -386 -1556 -3086 -1463 -318 -2225 -3154
2016c154K241O86k479m41K577K06k506O6K459m00k357Q61K315j271k279J628K262
$$ -3154 -913 -227 -2706 -3147 -570 -364 -2870 -2804 -345 -745 -3102 -2241 74 -1197 -3476 -1848 414
2033D14j752k087J934J908k026j443K269R96k239o97K548K77k636J89K577k97
$$ 414 -1338 -3425 -1491 417 -1609 -3052 -783 213 -2026 -2723 -175 102 -2534 -2345 232 -65
2049f5k433O67K190r34j837J428J476j822j295K372J085k644p85K692P17k696
$$ -65 -2498 -1831 359 -575 -2412 -984 492 -1330 -2625 -253 832 -1812 -2597 95 812 -1884
2065a884l08K678k39k482P72K514j226k532J736K523k022k421K201K281k340j840
$$ -1884 -2192 486 247 -2235 -1463 1051 -175 -2707 -971 1552 -470 -2891 -690 1591 -749 -2589
2081b589K583J401k708r00K924O45l132l41L248J42l110J72L017o28k612J066
$$ -2589 -6 1395 -1313 -2213 711 1356 -1776 -2117 1131 1273 -1837 -1665 1352 724 -1888 -822
2097h22K498j545k241J923K193k196j857K353J644k504j105K510O51k432j71K609
$$ -822 1676 131 -2110 -187 2006 -190 -2047 306 1950 -554 -1659 851 1502 -930 -1101 1508
2113A508k98k706Q18K766j145k575J398K433j614k159J960J851k210j442K475
$$ 1508 1210 -1496 -678 2088 943 -1632 -234 2199 585 -1574 386 2237 27 -1415 1060
2128A060J156k595q50K843M89k755j18K725k12k609P63K457j072k261J571K081
$$ 1060 2216 -379 -1229 1614 2103 -652 -770 1955 1743 -866 -103 2354 1282 -979 592 2673
2144B673j754j799K067J579k221j168K354Q24k264m27K473J20k482L82K641q44
$$ 2673 919 -880 1187 2766 545 -623 1731 2555 291 -136 2337 2457 -25 357 2998 2154
2160B154k529J158K496j375k263J657J995j704j718J940J394k139j035K467O02
$$ 2154 -375 783 3279 1904 -359 1298 3293 1589 -129 1811 3205 1066 31 2498 3100
2175C100k468l02K546M9k609L00K533o58k369J071K153j506j944J726J866k091
$$ 3100 632 330 2876 2925 316 616 3149 2491 122 1193 3346 1840 -104 1622 3488 1397
2191A397j638K252J324k353j097K485O69k580l93K679M3k720K71K688o72k583
$$ 1397 -241 2011 3335 982 -115 2370 3039 459 66 2745 2788 68 339 3027 2355 -228
2207b28Q50K409j072k297J241K050j485j611J496J357j790r57J858M53j988j84
$$ -228 622 3031 1959 -338 903 2953 1468 -143 1353 2710 920 -37 1821 2274 286 102
2223A02K090L6k303K67K054m86j958P86J623j167j303J392J199j921j106K101
$$ 102 2192 2228 -75 192 2246 1760 -198 588 2211 1044 -259 1133 2332 411 -695 1406
2239A406R57k215r14K186N37k120k38K011k54k003M92K026p11k180Q77K039q51
$$ 1406 2363 148 -766 1420 1957 -163 -401 1610 1356 -647 -155 1871 1160 -1020 -143 1896 1045
2256A045j940Q99J445j130r76J311O07j648m36J953K02k059k33J988N9j740K71
$$ 1045 -895 4 1449 319 -657 654 1261 -387 -823 1130 1332 -727 -960 1028 1087 -653 -382
2273c82J434o10j322J026J367j516j388J560J522j675j426J534J098j427o59J356
$$ -382 1052 442 -880 146 1513 -3 -1391 169 1691 16 -1410 124 1222 -205 -864 492
2289D92K94j596j6J840k63j862J23J792r7j540J37J112m24q33Q39N45j270m66
$$ 492 786 -810 -826 1014 751 -1111 -988 804 707 -833 -696 416 -8 -841 -2 543 -727 -1193
2307a193J313O06j407p02J287N26j075l24Q99j15p90L74R55p87j120Q31J188q21
$$ -1193 120 726 -681 -1383 -96 430 -645 -969 -70 -185 -975 -601 354 -433 -1553 -722 466 -355
2325c55j197P14Q68o21o45O60M31q60k11R62J15j093n4R87J16r26p5Q01k13n09
$$ -355 -1552 -838 30 -591 -1236 -576 -145 -1005 -1216 -254 -139 -1232 -1286 -299 -183 -1109 -1184 -383 -596 -1105
2345a105L94L43o90l19R12L40j023m64J046M38j038l10Q27K27q20oR00l62r37
$$ -1105 -711 -368 -1058 -1377 -465 -125 -1148 -1612 -566 -128 -1166 -1476 -649 -422 -1242 -1248 -348 -710 -1647
2364a647M57J010n86j070N55J037m09j029L78Q25m37n98M65M29o30k91P59K32
$$ -1647 -1190 -180 -766 -1836 -1281 -244 -653 -1682 -1304 -479 -916 -1514 -1049 -620 -1250 -1541 -782 -550
2382e50p78k31O44L24o91r9M92j8l07J16L51l85l72N03N09n57n27N27M77m09l88
$$ -550 -1328 -1559 -915 -591 -1282 -1381 -889 -907 -1214 -1098 -747 -1132 -1504 -1001 -492 -1049 -1576 -1049 -572 -981 -1369
2403a369L52K24k70o6L72j03l84J45M57m4n50M9M82pl37l9J45J0l6J95j47k40
$$ -1369 -1017 -793 -1063 -1129 -757 -860 -1244 -1099 -642 -686 -1236 -1187 -705 -712 -1049 -1088 -943 -933 -969 -774 -921 -1161
2425a161J68L52j16m80J32M44j66m38K88L61l59k82M11L00l28m33L64M36k93m46
$$ -1161 -993 -641 -757 -1237 -1105 -661 -827 -1265 -977 -616 -975 -1257 -846 -546 -874 -1307 -943 -507 -800 -1246
2445a246K81M35k70k96J53L49k19j57J53K30k19j42K46J32j04j72O7J38R8n0j10
$$ -1246 -965 -530 -800 -1096 -943 -594 -813 -970 -817 -587 -806 -948 -702 -570 -674 -846 -779 -641 -543 -593 -703
2466g03n7J88J96k75k27K71L68k38l80J89M12j18l92K02L41n3l75P2L57o8l63
$$ -703 -760 -572 -376 -651 -878 -607 -239 -477 -857 -668 -256 -374 -766 -564 -223 -276 -651 -579 -222 -290 -653
2487f53J60L21q7l81J23L64M1m74q0M66J67m17j78K64K90j52k55K30K07j84l41
$$ -653 -493 -172 -259 -640 -517 -153 -112 -586 -666 -200 -33 -450 -628 -364 -74 -226 -481 -251 -44 -228 -569
2508e69L34L18j86l86J68M27m7l63j41M13K58k50k96J60K82K9j03m0j5ML0K24
$$ -569 -235 83 -103 -489 -321 106 59 -304 -445 -32 226 -24 -320 -160 122 151 48 8 -7 -3 27 251
2530B51N8k00j54K39L07l1m44p3L46K16j29k84O8J35N1P5j44k4K1L0K13n5j57
$$ 251 309 109 -45 194 501 470 26 -47 299 515 386 102 170 305 356 431 287 263 284 314 527 472 315
2553C15j33Q0L77L9l55k10J92L47L4l69k03K89K27j9j66j56R9J14J41o5j82r3
$$ 315 182 262 639 678 323 113 305 652 686 317 114 403 630 611 445 289 388 502 643 578 396 303
2575C03J68K69o9k81j09K82K39j54k78j5K37J79q3j72L0M2pmM7j26j15J85K83
$$ 303 471 740 671 390 281 563 802 648 370 355 592 771 688 516 546 588 581 577 624 498 383 568 851
2598H51r9l05j05K69J82j62j92p6K37Q1p8j77o2R7J86l6k17p2J53J65lk18j35
$$ 851 752 447 342 611 793 631 439 363 600 681 603 426 364 461 647 611 394 322 475 640 637 419 284
2621B84O6K07P2k20l27N1M54Q1m06k37K69L07j32k64j05K04mO9J21k10k94J42
$$ 284 350 557 629 409 82 133 587 668 262 25 294 601 469 205 100 304 300 369 490 280 -14 128
2643A28M49l9m84j75L72K98j29k92q8J44J02J33j46k80L5K16L51k43l53q4K57
$$ 128 577 538 54 -121 251 549 420 128 40 184 286 419 273 -7 28 244 595 352 -1 -85 172
2664A72K41p6k51k44K37M54q6n14j62N16K55k73k79J3J29K0J14%l20j06J93M44
$$ 172 413 337 86 -158 79 533 447 -67 -229 287 542 269 -10 3 132 152 266 266 -54 -160 33 477
2686D77j53m71l6M39J14k72m0k3LJ30K33j51l15r2M27K13m07k27J26K90K2j42
$$ 477 324 -147 -183 256 370 98 58 35 38 168 401 250 -65 -157 270 483 76 -151 -25 265 287 145
2708A45r3j24R4K99P9l16l57L04M07o7n62o3L81J28j83j28j05R7oJ28Ok69j04
$$ 145 52 -72 22 321 400 84 -273 31 438 371 -191 -254 127 255 72 -56 -161 -64 -70 58 64 -205 -309
2731c09J91J87j72j76n5J07J71j03k11p7R8J33q5j04m6J6QJ37l7j14k12R3K67
$$ -309 -118 69 -103 -279 -334 -227 -56 -159 -370 -447 -349 -216 -301 -405 -451 -435 -427 -290 -327 -441 -653 -560 -293
2754b93n9l59j26L98J70k97j36J72J03j52PJ05n3j24O0J89j15j87L1K04k7q8p0
$$ -293 -352 -711 -837 -439 -269 -566 -702 -530 -427 -579 -572 -467 -520 -644 -584 -395 -510 -697 -666 -462 -489 -577 -647
2777f47J20K0Mm5K3q7O2P6j3o2P7m7j4J0Q3Rj35M4O8Q5j18r0J41R6k42N1K18k1
$$ -647 -527 -507 -503 -548 -525 -612 -550 -474 -487 -549 -472 -519 -533 -523 -440 -431 -566 -522 -454 -369 -487 -577 -436 -340 -582 -531 -313 -334
2805c34k03p1K61J16k36l3J94oj92J23J46n8k83R2L99o4l35m9K99K25j56k61J69
$$ -334 -537 -608 -347 -231 -467 -500 -306 -312 -504 -381 -235 -293 -576 -484 -85 -149 -484 -533 -234 -9 -165 -426 -257
2828b57R9n3pL4j8j14J79P8M1j92O8J1O9K4j49k2J19J99j44j58n9L61j30k23J60
$$ -257 -158 -211 -218 -184 -202 -316 -137 -59 -18 -210 -142 -131 -62 -38 -187 -209 -90 109 -35 -193 -252 109 -21 -244 -84
2853h4J22k04p7K20K50l67k30K99L47k43m90K88M42j70m48J28M56k10k02J48K06
$$ -84 38 -166 -243 -23 227 -140 -370 -71 276 33 -457 -169 273 103 -345 -217 239 29 -173 -25 181
2874A81l36o1L37J77l93k38M04L20l35k97K09L46j05j57J2PN4M0R6j53j10J89
$$ 181 -155 -216 121 298 -95 -333 71 391 56 -241 -32 314 209 52 64 71 125 165 261 108 -2 187
2896A87J45J7p9l6j20L8K96j1l04j76L63L72k90l30J20L05P4k43RP7j21O2L00
$$ 187 332 349 270 234 114 152 448 437 133 -43 320 692 402 72 192 497 571 328 337 414 293 355 655
2919F55K7n18j38N60L63n11l15J83M21n4k27j00R1J22Q2Q6k00j82J87K79q6j46
$$ 655 682 164 26 586 949 438 123 306 727 673 446 346 437 559 641 727 527 345 532 811 725 579
2941E79j24jK46P6Ok97o2L27K28j59m08M8M12j8j40l0J00j40NL29K8m73j57M83
$$ 579 455 454 700 776 782 485 423 750 978 819 411 459 871 853 713 683 783 643 648 977 1005 532 375 858
2965H58L39m71l63K01M60k15k60J11J53j34K7R9k7k25PL11L8m23m0K13J24j90
$$ 858 1197 726 363 564 1024 809 549 660 813 679 706 805 778 553 560 871 909 486 446 659 783 593
2987E93k2n4n9M4J44p2k38m7K51N2j29j21J61j7k07J12J03k07j54K08K39k66l69
$$ 593 571 517 458 502 646 574 336 289 540 592 463 342 503 486 279 391 494 287 133 341 580 314 -55
3010e5K43L56j42l52R6J44n0j84J74K2k62K1J84J16l55n9K95M2k55j25K00J5j71
$$ -55 188 544 402 50 146 290 240 56 230 252 -10 11 195 311 -44 -103 192 234 -21 -146 54 69 -102
3033a02NO3j32o8J77L9k40n5J24Q6k49J08N1j06j90J50K36k05k73Q3M16k25k53
$$ -102 -97 -34 -166 -234 -57 -18 -258 -313 -189 -103 -352 -244 -193 -299 -489 -339 -103 -308 -581 -498 -82 -307 -560
3056e60Q9L04j80l05K63K35l40k36K62K24l22j67L58J11l54j62L55K01l61j47
$$ -560 -471 -167 -347 -652 -389 -154 -494 -730 -468 -244 -566 -733 -375 -264 -618 -780 -425 -224 -585 -732
3076g32K54J16j82m1Q7k1p2J16jj33r0K06J30k81j25K59M2k84J13J82q6l85K53
$$ -732 -478 -362 -544 -585 -498 -519 -591 -475 -476 -609 -699 -493 -363 -644 -769 -510 -468 -752 -639 -457 -543 -928 -675
3099f75L33j13m75J33M25j58l05O7L40k83j92K79J92l81k69M25K36k95l16K46
$$ -675 -342 -455 -930 -797 -372 -530 -835 -768 -428 -711 -903 -624 -432 -813 -1082 -657 -421 -716 -1032 -786
3119g86K29j26j84O8Q4j11R9M1j24j11J91J24j39q6Q4L6j43L2K20o0k68J12L73
$$ -786 -557 -683 -867 -799 -715 -826 -727 -686 -810 -921 -730 -606 -745 -831 -747 -711 -854 -822 -602 -662 -930 -818 -445
3142d45j85l55K30L22k64k37K29K55k34l88L71L26l16k63L26K90l54j14J88K40
$$ -445 -630 -985 -755 -433 -697 -934 -705 -450 -684 -1072 -701 -375 -691 -954 -628 -338 -692 -806 -618 -378
3162c78k82n7K52Kj60MK12l5j24J09J66k17o9J69J95j36k43L87J20k05q6K08l5
$$ -378 -660 -717 -465 -463 -623 -619 -407 -442 -566 -457 -291 -508 -577 -408 -213 -349 -592 -205 -85 -290 -376 -168 -203
3185b03j39R5L07j12l67J91M62j59m41J25L94J2k80Q2K36j51j39K37K18k34l14
$$ -203 -342 -247 60 -52 -419 -228 234 75 -366 -241 153 165 -115 -33 203 52 -87 150 368 134 -180
3206a80L34L01j78j50J00L1l4J26R9k75q3K59K65k88k47K87K01j46j07K27q8k98
$$ -180 154 455 277 127 227 258 224 350 449 174 91 350 615 327 80 367 568 422 315 542 454 156
3228A56R1N40k17n28J07O61k5o20O3N03j45k85J77K71k90k90L02L89l40l03L04
$$ 156 247 787 570 42 149 810 785 165 228 731 586 301 478 749 459 169 471 860 520 217 521
3249E21K07j25j92R8J01j33M0K17p8k66J37K95k47k53K84J08k21q6K81J27m30
$$ 521 728 603 411 509 610 477 517 734 656 390 527 822 575 322 606 714 493 407 688 815 385
3270C85K6M25M1m83p8O19j32m95O2M53J6n13O6M51j56l59Q2L12j50k48K26J91
$$ 385 411 836 877 394 316 935 803 308 370 823 839 326 392 843 687 328 410 722 572 324 550 741
3292G41k01l13K73J52j52j26J85j2j80Q5J64j96j61J89J80j96k06K86R1l51j3
$$ 741 540 227 500 652 500 374 559 547 367 452 616 420 259 448 628 432 226 512 603 252 239
3313B39L28J2m16L9M80j50m46L5N52j57m95J17L81q4m21J81L33m07j55L54J69
$$ 239 567 579 163 202 682 532 86 121 673 516 21 138 519 435 14 195 528 121 -34 320 489
3334D89l30l31M17J97l66j90L22N7l10L9K93k04l49K24L34k30l84K19K66k50j49
$$ 489 159 -172 245 442 76 -114 208 265 -45 -6 287 83 -266 -42 292 62 -322 -103 163 -87 -236
3355b36J97J66l90l2M13j4o45Q0N03M7m93kL59r1k62J1K80k55j81K83K77m34k08
$$ -236 -39 127 -263 -295 118 104 -541 -461 42 89 -404 -406 -47 -138 -400 -389 -109 -364 -545 -262 15 -419 -627
3378f27M02J37l84j67L31J72m58j2L79j15m44K09M36k78m43L68L75l80l29L23
$$ -627 -225 -88 -472 -639 -308 -136 -594 -606 -227 -342 -786 -577 -141 -419 -862 -494 -119 -499 -828 -505
3398e05K39l76k10M37K24n84j36N89P4m88j52M67L3l99Q3L54j88m37L57L66l64
$$ -505 -266 -642 -852 -415 -191 -775 -911 -322 -248 -736 -888 -421 -388 -787 -704 -350 -538 -975 -618 -252 -616
3419f16l76L34L93l70k62L53K04l88j39M94Q6n82P5N42j46m23J92L83k32l89K93
$$ -616 -992 -658 -265 -635 -897 -544 -340 -728 -867 -373 -287 -869 -794 -252 -398 -821 -629 -246 -478 -867 -574
3440e74M26l98l52M80L41m61l41N24K55n05j40M63J15m95l3N61m5o12J38O65j98
$$ -574 -148 -546 -898 -418 -77 -538 -879 -355 -100 -605 -745 -282 -167 -662 -695 -134 -179 -791 -653 12 -186
3461a86m92J56N27k10m27L30K55l07k67M10L43m79k09M56J25m30M6M03q7m52K71
$$ -186 -678 -522 5 -205 -632 -302 -47 -354 -621 -211 132 -347 -556 -100 25 -405 -359 44 -43 -495 -224
3482b24L56k72l88L90L83m12k97M63J89m13p2M93J20n84K0N39J7n79R2N70j19
$$ -224 132 -140 -528 -138 245 -167 -464 -1 188 -225 -297 196 316 -268 -248 291 308 -271 -179 391 272
3503B72o31L62M76l15m63L54M84l74l99M05L31m54j67L99J61m24m2M37L0n40N9
$$ 272 -359 3 479 164 -299 55 539 165 -234 171 502 48 -119 280 441 17 -25 412 442 -98 -39
3524c9N96j69n20K67M99l97l94M01L95l59l74M86K60m77k13N49J28n39r1O18o1
$$ -39 557 388 -132 135 634 237 -157 244 639 280 -94 392 652 175 -38 511 639 100 9 627 566
3545E66m85J2O23j87m90K02M67j70m10K64L74m50k26M90J71n52j44O18J47n94
$$ 566 81 93 716 529 39 241 708 538 128 392 766 316 90 580 751 199 55 673 820 226
3565B26l0N73o9n48Q4P11k66o10K59O15k67o53L47N73l15m75L16L85l82j96M24
$$ 226 196 769 700 152 236 947 681 71 330 945 678 25 372 945 630 155 471 856 474 278 702
3586G02J58n10n4M61J52n24j3M56r9l46R6L70k74l03K98L49n49j42M15K45n31
$$ 702 860 350 296 757 909 385 372 828 729 383 479 849 575 272 570 919 370 228 643 888 357
3607C57j72N07J07n34J2N64o1o23R7O41k43n50K26N39k95n12K77M72m22m40M78
$$ 357 185 692 799 265 277 841 780 157 254 895 652 102 328 867 572 60 337 809 387 -53 425
3628D25L16n09j95M85K31o18j65O14M5n60RM58p1m92Q8M55j36n22L16L44l50k75
$$ 425 741 232 37 522 753 135 -30 584 629 69 78 536 465 -27 61 516 380 -142 174 518 168 -107
3650a07K80K81l99k33L44J46l51k25M98m9l64RM75j78m63K21L66k94k94K66K56
$$ -107 173 454 55 -178 166 312 -39 -264 234 185 -179 -170 305 127 -336 -115 251 -43 -337 -71 185
3671A85k45k70L01J12l26k35N21L2m83k0N18K6n04l0M98j78k99R9M60k79m50L32
$$ 185 -60 -330 -29 83 -243 -478 43 75 -408 -428 90 116 -388 -418 80 -98 -397 -298 162 -117 -567 -235
3693b35L84l11m59L89L45l65l08K85L10m35l5K66O9l79PM71k7m99R2L53j6m03
$$ -235 149 -162 -621 -232 113 -252 -560 -275 35 -400 -435 -169 -100 -479 -472 -1 -28 -527 -435 -82 -98 -501
3715e01R7L22j90l03K39K53k46j68K62J57k97j38L12J03l02J5K86j90k92K29L64
$$ -501 -404 -82 -272 -575 -336 -83 -329 -497 -235 -78 -375 -513 -201 -98 -400 -385 -99 -289 -581 -352 12
3736A2l06l19K39L73k65l75L21K64k45k84K73K51l54j44M19J3l39j18M53L5l75
$$ 12 -294 -613 -374 -1 -266 -641 -320 -56 -301 -585 -312 -61 -415 -559 -140 -127 -466 -584 -131 -96 -471
3757d71j9K81Q1l68j0K88m1k72O2K50p2j98R1J97j49j66J56J30k56O2J63m5k30
$$ -471 -490 -209 -128 -496 -506 -218 -259 -531 -469 -219 -291 -489 -398 -201 -350 -516 -360 -230 -486 -424 -261 -306 -536
3780e36L2K81m3l30J91K53k25j89J91K10k36j20J96J49k68q3K45J64l74q7L67
$$ -536 -504 -223 -266 -596 -405 -152 -377 -566 -375 -165 -401 -521 -325 -176 -444 -527 -282 -118 -492 -579 -212
3801b12Q5l32k8K79K0k73K2K73j48j47J78K60k17k99K70K67k50j66K00J56l33
$$ -212 -127 -459 -487 -208 -188 -461 -439 -166 -314 -461 -283 -23 -240 -539 -269 -2 -252 -418 -218 -62 -395
3822c95J9L35O7m13L1L88L7k87j68L63O2k49o4K57n1j34J07J49p4k34J47K28j23
$$ -395 -376 -41 26 -387 -356 32 69 -218 -386 -23 39 -210 -274 -17 -68 -202 -95 54 -20 -254 -107 121 -2
3845bk14J13J25N4p8m5J0qJ09J25j99j45J99R4p5k08K44R4j64k8K11j6k64o1L91
$$ -2 -216 -103 22 76 -2 -47 -37 -45 64 189 -10 -155 44 138 63 -145 99 193 29 1 212 196 -68 -129 262
3870B62J4l15j0K88K9k22r2L32k8j83k5J99nk87J63K25n4l34M5L34m0k39j8N7
$$ 262 276 -39 -49 239 268 46 -46 286 258 75 50 249 244 -43 120 345 291 -43 2 336 296 57 39 96
3894I6R2l5L8o0lm7J41J8j71J9K03q3j13O6N8j08kJ09L5j86q2J74J53k07n6K01
$$ 96 188 153 191 131 128 81 222 240 69 88 291 208 95 161 219 111 109 218 253 67 -15 159 312 105 49 250
3920B50K2j84j3J38rj84N1K33l3k80J7L55p2k07M1J25l5j13N9R0j02q3K44K7k55
$$ 250 272 88 75 213 204 20 71 304 271 -9 8 363 291 84 125 250 215 102 161 251 149 66 310 337 82
3945H2m1J29J41j92JP9Q6j41o3K12q1j99J26K10j04j60P1J03k9j48K4J58j62q5
$$ 82 41 170 311 119 120 199 285 144 81 293 212 13 139 349 245 85 156 259 230 82 106 264 102 17
3969A7J96M2j40l2K09l3k15L2J19Jm7jP6j06o8J82l2q9m9J38O2k15l6K46lj63
$$ 17 213 255 115 83 292 259 44 76 195 196 149 148 224 118 50 232 200 111 62 200 262 47 11 257 254 91
3995I1k1J19N6k79R6K44j16k27M1L13j38k43Q8K78k04j73J49J34j41p1P0J44k10
$$ 91 70 189 245 -34 62 306 190 -37 4 317 179 -64 24 302 98 -75 74 208 67 -4 66 210 0
4018@o6R1J66j66q8J02L3q9N7l1m3j11J39J14j33o7O2Q1n4j15J52p6j12L5J52
$$ 0 -66 25 191 25 -63 39 72 -17 40 9 -34 -145 -6 108 -25 -92 -30 51 -3 -118 34 -42 -154 -119 33
4043C3m8k44N1K35j2k79J35J51j20j06J04J10j26j56J21J55j17j93J53N9j5j19
$$ 33 -15 -259 -208 27 15 -264 -129 22 -98 -204 -100 10 -116 -272 -151 4 -113 -306 -153 -94 -109 -228
4065b28N7l3l7Q8M5K2j57J03Q5j29j2J5O3j92J04J47o1j45N9J58k9j65QJ39M4
$$ -228 -171 -204 -241 -153 -108 -86 -243 -140 -55 -184 -196 -181 -118 -310 -206 -59 -120 -265 -206 -48 -77 -242 -234 -95 -51
4090e1k53J46J73j39k13J39K39j57k49K27J98j61j69J40Q1n7p1J58L0k00n3K60
$$ -51 -304 -158 15 -124 -337 -198 41 -116 -365 -138 60 -101 -270 -130 -49 -106 -177 -19 11 -189 -242 18
4112A8O9k89l3J93O6k00J2N1P8r5J8J12p6j05O5R7j57l5J48M8j49P1J17n7j46
$$ 18 87 -202 -235 -42 24 -176 -164 -113 -35 -130 -112 0 -76 -181 -116 -19 -176 -211 -63 -15 -164 -93 24 -33 -179
4137a79PK48j16j60J7J74q9j04J19J64k54n9J79P4j78p0J67O3j53q0K12K3j53
$$ -179 -172 76 -40 -200 -183 -9 -98 -202 -83 81 -173 -232 -53 21 -157 -227 -60 3 -150 -230 -18 5 -148
4160a48qQ9kj15RJ28k5j15J5J34j19p2J11J26j40j17J47Q2j67j6J77n3j41Q8J43
$$ -148 -156 -67 -69 -184 -175 -47 -72 -187 -172 -38 -157 -229 -118 8 -132 -249 -102 -20 -187 -203 -26 -79 -220 -132 11
4185A1r0j24P2J17q5j14J26M6j61M3P5J74k48r4L00k6k08l4K61%j49l6J64J1k33
$$ 11 -79 -203 -131 -14 -99 -213 -87 -41 -202 -159 -84 90 -158 -252 48 22 -186 -220 41 41 -108 -144 20 31 -202
4210b02J59J48r9k37J18K35l2k38N7K38j57o4J60j0r9n5K10k8j30k6J60M9j70
$$ -202 -43 105 6 -231 -113 122 90 -148 -91 147 -10 -74 86 76 -23 -78 132 104 -26 -52 108 157 -13
4233a3N5R4j20K1M7R3j80k9K03Jr8j09J98Kj90N8J46j1k06J47K50k06j64R3K35
$$ -13 42 136 16 37 84 177 -3 -32 171 172 74 -35 163 165 -25 33 179 168 -38 109 359 153 -11 82 317
4258C17k29j92K01J25r8j41J22J53j47j38J69O3k09JK23j4j48J2Q1K3r8QK8n1
$$ 317 88 -104 97 222 124 -17 105 258 111 -27 142 205 -4 -3 220 206 58 70 151 174 76 84 112 61
4282F1p5J22O5j60J0N9R2j24n3J45j4j19O4J43q5k41J32K25o7k67Q3K04n6j62
$$ 61 -14 108 173 13 23 82 174 50 -3 142 128 9 73 216 131 -110 22 247 180 -87 -4 200 144 -18
4306a8pJ59jj84J83l1m4j07J39J13j36p4R7K5p7k9Q8k3j18J08P9n1q0K4J08q4
$$ -18 -25 134 133 -51 132 101 57 -50 89 202 66 -8 89 114 37 8 96 73 -45 63 142 91 11 35 143 59
4332E9j11J41K9p9o2J40%q3p9K47k6j61OJ12K3j68l3K15o5q0N5N5o1pN3Qq1l5
$$ 59 -52 89 118 39 -23 117 117 34 -45 202 176 15 21 133 156 -12 -45 170 105 25 80 135 74 67 120 128 47 12
4360A2O6J6q3P4P5o2r1K2O4m3j25J94Nq5m9O6J43j23j14K12K3j01j03J16P0j91
$$ 12 78 94 11 85 160 98 7 29 93 50 -75 119 124 39 -10 56 199 76 -38 174 197 96 -7 109 179 -12
4386a2k0J61k0j09o1J33J07j43j02J00Q0q1Mj7jl7J6R1o5k5rJ3L8p6P0pj9l3R8
$$ -12 -32 129 109 0 -61 72 179 36 -66 34 114 33 37 20 19 -18 -2 89 24 -1 -10 3 41 -35 35 28 9 -24 74
4415G4l9j33L0J14p4j02Q7R0q5m7O0J17j95k5Q1J17j34o7Q0L4Rj63P0KL6p6P3
$$ 74 35 -98 -68 46 -28 -130 -43 47 -38 -85 -25 92 -103 -128 -47 70 -64 -131 -51 -17 -8 -171 -101 -99 -63 -139 -66
4442f6O2o7M4q2M5pl4J7l8OM6j04mR4J6o1o1K2J12p8nP7O9l5j99Q0J46r5j34P5
$$ -66 -4 -71 -27 -109 -64 -71 -105 -88 -126 -120 -74 -178 -182 -88 -72 -133 -194 -172 -60 -138 -143 -66 3 -32 -231 -151 -5 -100 -234 -159
4472a59J51k0n3lP9k8n3P1j0K6j01L2k2M1n7P2K1l8lrK3pOJ28o4o8mO5n3j3Q3
$$ -159 -8 -28 -81 -84 -5 -33 -86 -15 -25 1 -100 -68 -90 -49 -106 -34 -13 -51 -54 -63 -40 -47 -41 87 23 -45 -49 16 -37 -50 33
4503C3l7n7M1J20p9p0n9K52o8j20m2J09M9j04J7Q2p9k0K9N6K1j28NM9P4l8j6L4
$$ 33 -4 -61 -20 100 21 -49 -108 144 76 -44 -86 23 72 -32 -15 67 -12 -32 -3 53 74 -54 -49 0 74 36 20 54
4531E4k3nm7O1m3L0k4J12o6q7J14njl6K6pq4Q8K1o5j04J07J52q0k7q2J12o0m2
$$ 54 31 26 -21 40 -3 27 3 115 49 -38 76 71 70 34 60 53 -31 57 78 13 -91 16 168 88 61 -21 91 31 -11
4560a1P3K6J0o9j1K8JJ6l0M6Oo2N8l4nj0N9m1J3K8N7l8j20Q6N8n5J5Rl1jl0N8
$$ -11 62 88 98 29 18 46 47 63 33 79 85 23 81 47 42 32 91 50 63 91 148 110 -10 76 134 79 94 103 72 71 41 99
4592I9M7p9JJ08p3m7nJ22l2j33J07J10q7m8N1N7o3k9J02o4nm9J13K3j26J06k3
$$ 99 146 67 68 176 103 56 51 173 141 8 115 225 138 90 141 198 135 106 208 144 139 90 203 226 100 206 183
4619A83O9j70O6NO7o9jK4K0k5o0R4L3r6%K5J8n3J41j22j8J3P5j9n8J1J8mp1J28
$$ 183 252 82 148 153 220 151 150 174 194 169 109 203 236 140 140 165 183 130 271 149 131 144 219 200 142 153 171 167 96 224
4649B24m7j9q4J18O7j12p2J17j7q0l3N4J15j53lQ2O9j79j6Q7J9m7p1Q5kl4J1R
$$ 224 177 158 74 192 259 147 75 192 175 95 62 116 231 78 75 157 226 47 31 118 137 90 19 104 102 68 79 88
4677H8n1n2L8L6Lm9Q4jo0p8K3J7o8J6N8qj06R0L1j25l3J11L7j03r4J03K6m8o1
$$ 88 37 -15 23 59 62 13 97 96 36 -42 -19 -2 -70 -54 4 -4 -110 -20 11 -114 -147 -36 1 -102 -196 -93 -67 -115 -176
4706a76O7N6j35J5Q2lr3K7Q6o4m0j3M8m7J6POL0r7K0P4m8j6L6m1J2qL6J0r7P2
$$ -176 -109 -53 -188 -173 -91 -94 -187 -160 -74 -138 -178 -191 -143 -190 -174 -167 -161 -131 -228 -208 -134 -182 -198 -162 -203 -191 -199 -163 -153 -250 -178
4737a78K5l5o6J9J05q6j6K2P4j02JoJ19r8LQ5p1q7kJ33k0j00M2J02p4r8M1J20
$$ -178 -153 -188 -254 -235 -130 -216 -232 -210 -136 -238 -237 -243 -124 -222 -219 -134 -205 -292 -294 -161 -181 -281 -239 -137 -211 -309 -268 -148
4765a48o5j39O5K09j66j0L3Q8m1j66J05Q4j30m6J31pj29O9J38j13o0P0j0K0m8
$$ -148 -213 -352 -287 -78 -244 -254 -221 -133 -174 -340 -235 -151 -281 -327 -196 -203 -332 -263 -125 -238 -298 -228 -238 -218 -266
4790b66lL8J5j21J60l9j00L1M1M8o9lO9L0j66R7Q2m5j39N2J47r4r6R2J09q8r8
$$ -266 -269 -231 -216 -337 -177 -216 -316 -285 -244 -196 -265 -268 -199 -169 -335 -238 -156 -201 -340 -288 -141 -235 -331 -239 -130 -218 -316
4817c16Q5O0j0q3Q1l0p9j3J91pj49p0K36o5p3K5Q4J2p6j3J50m0j12P1M6p4pQ4
$$ -316 -231 -171 -181 -264 -183 -213 -292 -305 -114 -121 -270 -340 -104 -169 -242 -217 -133 -121 -197 -210 -60 -100 -212 -141 -95 -169 -176 -92
4845i2Pr2k5J39rr4M3O7rp3M0J44q8o7J09kqMJ6R7k70O3J49J65k59%J96l0j23
$$ -92 -85 -177 -202 -63 -72 -166 -123 -56 -65 -138 -98 46 -42 -109 0 -2 -10 -6 10 107 -163 -100 49 214 -45 -45 151 121 -2
4874bK8J27M2j87J3J95n7j06L2J33j00p4R9R8j34J2J44j3j10JJ13k8j17J25oK2
$$ -2 26 153 195 8 21 216 159 53 85 218 118 44 143 241 107 119 263 250 140 141 254 226 109 234 228 250
4900B50p6J02N3p1j67K40Q6j83o9J66Nj29NJ28M8j84nJ87jk44J51N9n6j60J74
$$ 250 174 276 329 258 91 331 417 234 165 331 336 207 212 340 388 204 199 386 385 141 292 351 295 135 309
4925C09J43j67j11Q7J88k02n1J62K1j18qR4J0j23N1J27p3r9l3J38m8l5MR1j15
$$ 309 452 285 174 261 449 247 196 358 379 261 253 347 357 234 285 412 339 240 207 345 297 262 266 357 242
4950B42J5R7k5m6n0J53lj60L4P4K8j58K5J66q3r9j2J61q2j42J43P7p5j60J97J16
$$ 242 257 354 329 283 233 386 383 223 257 331 359 201 226 392 309 210 198 359 277 135 278 355 280 120 317 433
4976D33j47j05J45J9j07n5J04m6k4n6J71q7q8P2L9m0j05M7P7Jj57J32Q5n7r1L2
$$ 433 286 181 326 345 238 183 287 241 217 161 332 245 157 229 268 228 123 170 247 248 91 223 308 251 160 192
5002A92O7j44k9J68j3j81J03J38j19j19J73l5p4p5P2K7n6r7J27Q1o6r2J39n9j12
$$ 192 259 115 86 254 241 60 163 301 182 63 236 201 127 52 124 151 95 -2 125 206 140 48 187 128 16
5027A6L3Q1qj55J6J70j11j03J7J84r2r9N7P5p0j00Q3P7j27LM0M6j07o5J60m8j34
$$ 16 49 130 122 -33 -17 153 42 -61 -44 140 48 -51 6 81 11 -89 -6 71 -56 -53 -13 33 -74 -139 21 -27 -161
5054a61lJ45l7q9l0J11l0j38Q9J00r1j7Q8o6op6J04m4j08L5P9O9k06J10N5j34
$$ -161 -164 -19 -56 -145 -175 -64 -94 -232 -143 -43 -134 -151 -63 -129 -135 -211 -107 -151 -259 -224 -145 -76 -282 -172 -117 -251
5080b51l7J4J56n2j78J58N2j37k3R3L0j37K7J20p7m7m5J48n5q7K2O9n0o7R5N7
$$ -251 -288 -274 -118 -170 -348 -190 -138 -275 -298 -205 -175 -312 -285 -165 -242 -289 -334 -186 -241 -328 -306 -237 -287 -354 -259 -202
5106b02k1j58J00K8lk9L1K7q1o4P2J02j25KP9P8k12J21N2n6J8j0O1l8p2P9K9n6
$$ -202 -223 -381 -281 -253 -256 -285 -254 -227 -308 -372 -300 -198 -323 -321 -242 -164 -376 -255 -203 -259 -241 -251 -190 -228 -300 -221 -192 -248
5134b48m7J43k7j01K4P5j6j31M3J58j3j55K5J31J5j24PJ39p3j5P1J2j01m5J07
$$ -248 -295 -152 -179 -280 -256 -181 -197 -328 -285 -127 -140 -295 -270 -139 -124 -248 -241 -102 -175 -190 -119 -107 -208 -253 -146
5159a46J23j87l4J21N1j13j9J49q5L3p2N9Ml5J2Q7q6j6N7K8Lj6N7qj26K4J07n6
$$ -146 -23 -210 -244 -123 -72 -185 -204 -55 -140 -107 -179 -120 -116 -151 -139 -52 -138 -154 -97 -69 -66 -82 -25 -33 -159 -135 -28 -84
5187h4k5J8Q4p3Mk7J05p7k6OJ34j34kQ4j0jk6O9J8p8L7J0qJ1l5L1M0pl6L4j3o6
$$ -84 -109 -91 -7 -80 -76 -103 2 -75 -101 -95 39 -95 -97 -13 -23 -24 -50 19 37 -41 -4 6 -2 9 -26 5 45 38 2 36 23 -43
5219d3O0J4n7NO1R0j55mL5J07n4o2O5K0j07R3L2Q8j35M4M4k1p9P2N1m2r8K9R3
$$ -43 17 31 -26 -21 40 130 -25 -29 6 113 59 -3 62 82 -25 68 100 188 53 97 141 120 41 113 164 122 24 53 146
5248A46Jn7k4R8N3j06M0M2j07J7P7K6j35Q6O8rj07O2J58j72k4J14MK0n7o7J17
$$ 146 147 90 66 164 217 111 151 193 86 103 180 206 71 157 225 216 109 171 329 157 133 247 251 271 214 147 264
5275B64q6m0P8N3j08J6N5%l9j3R0kn5j06J71m2j2n5K8L4l3L1K3j05MJ09p4L3j4
$$ 264 178 138 216 269 161 177 232 232 193 180 270 268 213 107 278 236 224 169 197 231 198 229 252 147 151 260 186 219 205
5304B05LM9o5l6O5Rj32K3R4K8q1M0k0l9J8rO1q2k7M7L2o0m0O3O6r7jO7n6n8K6
$$ 205 208 257 192 156 221 230 98 121 215 243 162 202 182 143 161 152 213 131 104 151 183 123 83 146 212 115 114 181 125 67 93
5335I3K5jm6O0J5j01O8k8L9j10PQ3J5j02n3R5L9q2JK2jnn3N6M1k2o3J31j06k1
$$ 93 118 117 71 131 146 45 113 85 124 14 21 104 119 17 -36 59 98 16 17 39 38 33 -20 36 77 55 -8 123 17 -4
5365dMK7K8m0k9L0k3l2J0P0j3j42R9L1o6K6j5J22j17N0q4M0K7k4J9j0jj0l1kL0
$$ -4 0 27 55 15 -14 16 -7 -39 -29 41 28 -114 -15 16 -50 -24 -39 83 -34 16 -68 -28 -1 -25 -6 -16 -17 -27 -58 -60 -30
5396c0L7p2l0J03j5L6q1p4R5n8oN0M0p9j2Q6Ln4j38J58QMp8KK4LJ7jK8o5L3P1
$$ -30 7 -65 -95 8 -7 29 -52 -126 -31 -89 -95 -45 -5 -84 -96 -10 -7 -61 -199 -41 -33 -29 -107 -105 -81 -78 -61 -62 -34 -99 -66 5
5428Er6l3L3Pn0j0P9m1J9r4N5j4J1L7n1K8k3l5Q8j2q0KQ4K0j50L4J05r5kJ5N1
$$ 5 -91 -124 -91 -84 -134 -144 -65 -106 -87 -181 -126 -140 -129 -92 -143 -115 -138 -173 -85 -97 -177 -175 -91 -71 -221 -187 -82 -177 -179 -164 -113
5459a13j5m9pK2kk5P3k2k7K8l5l9O0o5N2Mj0J9mJ8L0J5m0ml8k9O0Kj2M3k1rj2
$$ -113 -128 -177 -184 -162 -164 -189 -116 -138 -165 -137 -172 -211 -151 -216 -164 -160 -170 -151 -155 -137 -107 -92 -132 -136 -174 -203 -143 -141 -153 -110 -131 -140 -152
5492a52M0N5j18J6O7%l3oRJQ3m0%N0l6K0Kk0J7l8M1m4L4k5OrJ9O7j6j06P9M0k0
$$ -152 -112 -57 -175 -159 -92 -92 -125 -131 -122 -121 -38 -78 -78 -28 -64 -44 -42 -62 -45 -83 -42 -86 -52 -77 -71 -80 -61 6 -10 -116 -37 3 -17
5525a7lK2K1k8k2O1%r5J9O2N0j01j7M2Q8n9o2N8l1KJ7M7J3m4ll2qN9Kj2J1KnK2
$$ -17 -20 2 23 -5 -27 34 34 -61 -42 20 70 -31 -48 -6 82 23 -39 19 -12 -10 7 54 67 23 20 -12 -20 39 41 29 40 42 37 59
5559E9l7l3J20m0K0l8k1J19n6j9J8p0pR8%m8l5P7N7j24KJ8O1j7j6n1P4Q1j52O
$$ 59 22 -11 109 69 89 51 30 149 93 74 92 22 15 113 113 65 30 107 164 40 42 60 121 104 88 37 111 192 40 46
5589D6O6o8m6R8QLp0j7P0N3o4p5oO1P1l4lp4N9qk5L7N2n9OL1Mm7l3J02k2k2n0
$$ 46 112 44 -2 96 104 107 37 20 90 143 79 4 -2 59 130 96 93 19 78 70 45 82 134 75 81 112 116 69 36 138 116 94 44
5622D4P7m5kl3Q5J3Qj33J06N0m5j7n7J3L5j8N6j0o3N5l8L2q2N3J9K5j5Ok9j5L4
$$ 44 121 76 74 41 126 139 147 14 120 170 125 108 51 64 99 81 137 127 64 119 81 113 31 84 103 128 113 119 90 75 109
5653A09oM9p2J4J1j54J00L1K9j6K1m3N2j00K9M7J7p4J7K2K1J1m0j3p7N5L7ok6
$$ 109 103 152 80 94 105 -49 51 82 111 95 116 73 125 25 54 101 118 44 61 83 104 115 75 62 -15 40 77 71 45
5682D5k6O6Ol4o7Q5kl2p2P7M8j38j4J14k1k2q5R4j6m7KP3k1n7j6N5J2o9M3J1k5
$$ 45 19 85 91 57 -10 75 73 41 -31 46 94 -44 -58 56 35 13 -72 22 6 -41 -39 34 13 -44 -60 -5 7 -62 -19 -8 -33
5713c3j8rK0K4q8mJ34m8K9q3N2l7O0o0m7JJ1l4J7L1j9K8m2j3J9K5p0l0R5J5r3
$$ -33 -51 -60 -40 -16 -104 -108 26 -22 7 -76 -24 -61 -1 -61 -108 -107 -96 -130 -113 -82 -101 -73 -115 -128 -109 -84 -154 -184 -89 -74 -167
5744a67R3J0q6O5p9O9k6k2M7l1Q6m7l9K0j0J3J3p0M6J8n4NL1l9M1loQ2r2o9Q7
$$ -167 -74 -64 -150 -85 -164 -95 -121 -143 -96 -127 -41 -88 -127 -107 -117 -104 -91 -161 -115 -97 -151 -146 -115 -154 -113 -116 -122 -40 -132 -201 -114
5775a14L8p4K4N6Ll4J6j02J12n8J9J7N7j08j7K6O5k9K1l4PL7m8j4N8np1N5K6m5
$$ -114 -76 -150 -126 -70 -67 -101 -85 -187 -75 -133 -114 -97 -40 -148 -165 -139 -74 -103 -82 -116 -109 -72 -120 -134 -76 -81 -152 -97 -71 -116
5805a16M8J0rn7lN7p1R2j4O6p2k3n9K0L2p3J14k8j9L1P4kp1l7P8p3K9o0J1N4l5
$$ -116 -68 -58 -67 -124 -127 -70 -141 -49 -63 3 -69 -92 -151 -131 -99 -172 -58 -86 -105 -74 0 -2 -73 -110 -32 -105 -76 -136 -125 -71 -106
5836a06J12j62Q9l4P6mr7N1L1Op9K1J5R6p7n6O7J5oJ6Lm5rl6O5o0M9J1N1j11K1
$$ -106 6 -156 -67 -101 -25 -29 -126 -75 -44 -38 -117 -96 -81 15 -62 -118 -51 -36 -42 -26 -23 -68 -77 -113 -48 -108 -59 -48 3 -108 -87
5867h7N7K0p8J9Q9n8M3m7J0L5q1M6N2p7M8kR0p9j2P4n8l5L1O5m9j0K0P4q2M6j6
$$ -87 -30 -10 -88 -69 20 -38 5 -42 -32 3 -78 -32 20 -57 -9 -11 79 0 -12 62 4 -31 0 65 16 6 26 100 18 64 48
5898D8L1k8omJ0k8j3M4O7m4k1K4n3P6m5M3K9J2n5N9n1%O6p4O1Mj1k2m8L3K7%k1
$$ 48 79 51 45 41 51 23 10 54 121 77 56 80 27 103 58 101 130 142 87 146 95 95 161 87 148 152 141 119 71 104 131 131 110
5931A10QL4l9l0N9kPk3j7J0R7q7K8j6J0n7Q6lo6j0J9J4O0k5j6N3n6k1K7K9p3K5
$$ 110 118 152 113 83 142 140 147 124 107 117 214 127 155 139 149 92 178 175 109 99 118 132 192 167 151 204 148 127 154 183 110 135
5963A35p1P4J7K7pjPj1J2r4R6o9NM5j01O6mJ9nM5o6kJ7N3l7Kk5OPk9QpP1q6j4
$$ 135 64 138 155 182 175 174 181 170 182 88 184 115 120 165 64 130 126 145 140 185 119 117 134 187 150 152 127 133 140 111 119 112 183 97 83
5998H3L9m6NK4L4KK6j20M7p5J1Q0o1PN7m9J3k3j5Q9m1m0L4rqj8N6J3m3O7j04O1
$$ 83 122 76 81 105 139 141 167 47 94 19 30 110 49 56 113 64 77 54 39 128 87 47 81 72 64 46 102 115 72 139 35 96
6030I6o5N1M7p1K3nj9j3J5J2J3J0pl6P6o2l9Q5r4OK4PL0o7J8J4J1q4QR8K0j00
$$ 96 31 82 129 58 81 76 57 44 59 71 84 94 87 51 127 65 26 111 17 23 47 54 84 17 35 49 60 -24 -16 82 102 2
6062BN3j02Q8q7N1L8k1j7K0m4k7O3J8j0q0L8o3N7k7J7j5Ko4J4O6k5l5o5J63j34
$$ 2 55 -47 41 -46 5 43 22 5 25 -19 -46 17 35 25 -55 -17 -80 -23 -50 -33 -48 -46 -110 -96 -30 -55 -90 -155 8 -126
6092a26lJ03J5l5qn1K7l5ML5k4j7PK3l3l4R2j02O8pm9L5o4M6R0q4n9P0K7m3n9
$$ -126 -129 -26 -11 -46 -54 -105 -78 -113 -109 -74 -98 -115 -108 -85 -118 -152 -60 -162 -94 -101 -150 -115 -179 -133 -43 -127 -186 -116 -89 -132 -191
6123a91K0Q7o7K7n9M8j3J0j8M3n4M1O7r9K5l5M9k5j1n0RM8j7O0n8m2O3LK0k4k5
$$ -191 -171 -84 -151 -124 -183 -135 -148 -138 -156 -113 -167 -126 -59 -158 -133 -168 -119 -144 -155 -205 -196 -148 -165 -105 -163 -205 -142 -139 -119 -143 -168
6154a68Q6j13l1R7K0p0L6k4P5j5r9K4J14r9J7JO2o9K2Q7q5j5l1N8J8j9nJ0k1K2
$$ -168 -82 -195 -226 -129 -109 -179 -143 -167 -92 -107 -206 -182 -68 -167 -150 -149 -87 -156 -134 -47 -132 -147 -178 -120 -102 -121 -126 -116 -137 -115
6184a15J0J7m7J5m3O3NK7on1o7O4K8JMm9J07n6k8K4m3MJ5OO9k4k1MpJ5k9N9j9
$$ -115 -105 -88 -135 -120 -163 -100 -95 -68 -74 -125 -192 -128 -100 -99 -95 -144 -37 -93 -121 -97 -140 -136 -121 -115 -46 -70 -91 -87 -94 -79 -108 -49 -68
6217f8o0L0L9L9l2oOn5m3M9Q8j42J5J34j7q8R1l0KM7j9Jj4K4OJ2o9J5O4m6j3J9
$$ -68 -128 -98 -59 -20 -52 -58 -52 -107 -150 -101 -13 -155 -140 -6 -23 -111 -20 -50 -48 -1 -20 -19 -33 -9 -3 9 -60 -45 19 -27 -40 -21
6249b1N7k1K2n1m5J25j29J2J19J2j37N7P3r0M4lK6j0N1q7P3nq8K4L4K7r9J37o2
$$ -21 36 15 37 -14 -59 66 -63 -51 68 80 -57 0 73 -17 27 24 50 40 91 4 77 72 -16 8 42 69 -30 107 45
6278D5Rk3N4k6M4k5J2l1j4Q0q2pK5nO4k9j7k6J01l7l8L2Q3p5L7j8mj7PR7n3pp
$$ 45 54 31 85 59 103 78 90 59 45 125 43 36 61 56 120 91 74 48 149 112 74 106 189 114 151 133 129 112 119 216 163 156 149
6311A49Q4r8O8j6J7k0r8P3K9k3l1M9l1O9j02NN6j8Jj6Mj9K5J8o3Q2O9n9n6K4n1
$$ 149 233 135 203 187 204 184 86 159 188 165 134 183 152 221 119 124 180 162 163 147 151 132 157 175 112 194 263 204 148 172 121
6342A21oK6j6J0l6JM2L3q2QM4J4jo7L0J5K6n0M2m2r5R0PJ7k6nk7J3n6R8n2o4K
$$ 121 115 141 125 135 99 100 142 175 93 101 145 159 158 91 121 136 162 112 154 112 17 107 114 131 105 100 73 86 30 128 76 12 14
6375A4k3Q8o9L4P4l7n0n2O7K5r4J3N6j2ln2Q0n2n8R2J0m3P0n7%jk4L8Jn0J2%r
$$ 14 -9 79 10 44 118 81 31 -21 46 71 -23 -10 46 34 31 -21 59 7 -51 41 51 8 78 21 21 20 -4 34 35 -15 -3 -3 -12
6408a2j7OnN5j30J02j0m5m8N1P3m0j4MP7p0o1P0J4k3l5L6N4o2q1J51o0nk4J4L8
$$ -12 -29 -23 -28 27 -103 -1 -11 -56 -104 -53 20 -20 -34 -30 47 -23 -84 -14 0 -23 -58 -22 32 -30 -111 40 -20 -25 -49 -35 3
6439Co8Qk7R3o7N5K2r3J0J2PPq6J4l8M7M6K3l7k3K9l0m6M5k5j4L2j04J33q7L6
$$ 3 -65 -57 -84 9 -58 -3 19 -74 -64 -52 -45 -38 -124 -110 -148 -101 -55 -32 -69 -92 -63 -93 -139 -94 -119 -133 -101 -205 -72 -159 -123
6470a23N3j9M1j05oO5J7kk9L4n9j4L5JN0j08J8P0r8P0Kqj5j7j9O5m2J5O6o0Nk3
$$ -123 -70 -89 -48 -153 -159 -94 -77 -79 -108 -74 -133 -147 -112 -111 -61 -169 -151 -81 -179 -109 -107 -115 -130 -147 -166 -101 -143 -128 -62 -122 -117 -140
6502a40K2k5o6P4M2l6%j6R0q4L6m6J9K2p3L7K5j0K8J6mo4M3ML9n2J3%jl1k3N6
$$ -140 -118 -143 -209 -135 -93 -129 -129 -145 -55 -139 -103 -149 -130 -108 -181 -144 -119 -129 -101 -85 -89 -153 -110 -106 -67 -119 -106 -106 -107 -138 -161 -105
6534a05L0J2j0mk5ML5k5j9L2P5oo1j7j6O2n5L1l3O3r4P0K7Mj2o1P5Nk8MQ1q8J03
$$ -105 -75 -63 -73 -77 -102 -98 -63 -88 -107 -75 0 -6 -67 -84 -100 -38 -93 -62 -95 -32 -126 -56 -29 -25 -37 -98 -23 -18 -46 -42 39 -49 54
6567E4n9k9%J5J5o4L4O9Mnl3j4J3k2rJ5O4j7l1N8q2P0m8LM3j7J3J0ko2K1jK9O6
$$ 54 -5 -34 -34 -19 -4 -68 -34 35 39 34 1 -13 0 -22 -31 -16 48 31 0 58 -24 46 -2 1 44 27 40 50 48 -14 7 6 35 101
6601A01m4L6K3q8n%j7K7rO0MNo8N7K2m9J6L5l3j12R0P3l6J6o3OK1K7l0PK5l5j1
$$ 101 57 93 116 28 23 23 6 33 24 84 88 93 25 82 104 55 71 106 73 -39 51 124 88 104 41 47 68 95 65 72 97 62 51
6634E1k4Q1k5L2p2L4J1%n0P7J2k6K6k6J4L6p9L3j7MKn5N0m4L6R0j10J9M6mn4K5
$$ 51 27 108 83 115 43 77 88 88 38 115 127 101 127 101 115 151 72 105 88 92 94 39 89 45 81 171 61 80 126 122 68 93
6666I3qm6M1K3J4J2k1p4LO3M7n5j3M0J9o4LK4Mk0K4m2M2n9lP5ql6L9k0o8N1J3
$$ 93 85 39 80 103 117 129 108 34 37 100 147 92 79 119 138 74 77 101 105 85 109 67 109 50 47 122 114 78 117 97 29 80 93
6699I3Oq3J9L2J4j6M3k7l6J%J3o4OO1JOl0J2J8r8N2rK4j7Kj9m3L6OQk1N2n7j8
$$ 93 99 16 35 67 81 65 108 81 45 46 46 59 -5 1 62 63 69 39 51 69 -29 23 14 38 21 23 4 -39 -3 3 11 -10 42 -15 -33
6734c3j6R1q3L1K8m9N1o9M8k3Ql0M1o1j2N7n4O5k6j8J2qJ4Nj6Nl0M2j17J06m7
$$ -33 -49 42 -41 -10 18 -31 20 -49 -1 -24 -16 -46 -5 -66 -78 -21 -75 -10 -36 -54 -42 -50 -36 -31 -47 -42 -72 -30 -147 -41 -88
6765h8kL1O8p4M3n5k7M3k6K7q5N4MML4j7m1K8M1m9k1L2l1J02q2J9o8N2rpJ7m6
$$ -88 -90 -59 9 -65 -22 -77 -104 -61 -87 -60 -145 -91 -87 -83 -49 -66 -107 -79 -38 -87 -108 -76 -107 -5 -87 -68 -136 -84 -93 -100 -83 -129
6797a29P6m2O1k3J7m3l5j9N1lk0L2j3J8n2N5K1m3lL9k8J7k8J5Ljl0j9R6Kl6k5
$$ -129 -53 -95 -34 -57 -40 -83 -118 -137 -86 -89 -109 -77 -90 -72 -124 -69 -48 -91 -94 -55 -83 -66 -94 -79 -76 -77 -107 -126 -30 -28 -64 -89
6829h9oR9o9n8N4pkl6jO9l7j9P6k2n7P0n1K7j5LQj3lN3o5P3n4J2K2P3j48O6L1
$$ -89 -95 4 -65 -123 -69 -76 -78 -114 -115 -46 -83 -102 -26 -48 -105 -35 -86 -59 -74 -71 -63 -76 -79 -26 -91 -18 -72 -60 -38 35 -113 -47 -16
6862a6j02J47j01P4o7qJRK0N2m0lK6M3q3L9n8Q2m9O8j9o4L4J3o4N5n3O3K5r9K1
$$ -16 -118 29 -72 2 -65 -73 -72 -63 -43 9 -31 -34 -8 35 -48 -9 -67 15 -34 34 15 -49 -15 -2 -66 -11 -64 -1 24 -75 -54
6893e4J4mk9N0l8K5P7n0Lk5qO3k3j0P3q4K7m3nK4N8n4O8l2l7L1J9k6j9L6RL1r1
$$ -54 -40 -44 -73 -23 -61 -36 41 -9 -6 -31 -39 24 1 -9 64 -20 7 -36 -41 -17 41 -13 55 23 -14 17 36 10 -9 27 36 67 -24
6926b4P9M5o3M4n9Nj7P2l7k4L1K4K1o9J5K3O6p8k5K2K5RKl4n1Q3k8K3l5J28j21
$$ -24 55 100 37 81 22 27 10 82 45 21 52 76 97 28 43 66 132 54 29 51 76 85 87 53 2 85 57 80 45 173 52
6957E2O2m4mpN4m4m0N9L0m7M3K2Jp2O5o2o5O8Q4l1l0Lmoo3O7j4PkM1m1l6nP9m0
$$ 52 114 70 66 59 113 69 29 88 118 71 114 136 137 65 130 68 3 71 155 124 94 97 93 87 24 91 77 84 82 123 82 46 41 120 80
6992H0J2l1L2l5j4QJ0P8j29j3Q4M2j14M6K5p6J10o6j2j1K5lk0K2j8K5n5RL6M9
$$ 80 92 61 93 58 44 52 62 140 11 -2 82 124 10 56 81 5 115 49 37 26 51 48 28 50 32 57 2 11 47 96
7022I6m4j8J%j3J5K1n8M5l7M2mo1P4%q8L5m3Q6L3j06N0k0n3j5N4J6Ro3Q5j03J7
$$ 96 52 34 35 35 22 37 58 0 45 8 50 46 -15 59 59 -29 6 -37 49 82 -24 26 6 -47 -62 -8 8 17 -46 39 -64 -47
7054d7P0o3jK5M6jq5J30j23k6O4K6m3J2lj3n0L4N4m0M6%j0l3rN8p3J2M1n0K5o3
$$ -47 23 -40 -41 -16 30 29 -56 74 -49 -75 -11 15 -28 -16 -19 -32 -82 -48 6 -34 12 12 2 -31 -40 18 -55 -43 -2 -52 -27 -90
7086i0P4o1N4Nn7Q2M0n9oL5j24M4K5p0J4Q1lk5J5p4N6M1q3Q5Op3L0j6K5J9k5j15
$$ -90 -16 -77 -23 -18 -75 7 47 -12 -18 17 -107 -63 -38 -108 -94 -13 -16 -41 -26 -100 -44 -3 -86 -1 5 -68 -38 -54 -29 -10 -35 -150
7118a50J12mn1K1k0M0Nk8l2J0N5m2l2O4k3j0OL8O2j06j9m3N1L8p5P7n2N2l5L3
$$ -150 -38 -42 -93 -72 -92 -52 -47 -75 -107 -97 -42 -84 -116 -52 -75 -85 -79 -41 21 -85 -104 -147 -96 -58 -133 -56 -108 -56 -91 -58
7148e8K0o5K1m4k2R9n7K9J4nj4Jj0k5O0Ln7N2NlkJ7M2j43O9m3O3lm9J0J1K6Jk1
$$ -58 -38 -103 -82 -126 -148 -49 -106 -77 -63 -68 -82 -81 -91 -116 -56 -53 -110 -58 -53 -56 -58 -41 1 -142 -73 -116 -53 -56 -105 -95 -84 -58 -57 -78
7182g8Qpk5JP0J2l2kM0m4j2L9l9O9q1J9k8N4Ko9J00l9OO3m0L3k1jLk3lJ4K4j8
$$ -78 -70 -77 -102 -101 -31 -19 -51 -53 -13 -57 -69 -30 -69 0 -81 -62 -90 -36 -34 -103 -3 -42 -36 27 -13 20 -1 -2 1 -22 -25 -11 13 -5
7216eJOL4l8K2Nl2Qk1K0K9k0K7l5M4k7MQNq1Q8kk3L7J1l5K7nj5J0l7k9N7K9m5
$$ -5 -4 2 36 -2 20 25 -7 1 -20 0 29 9 36 1 45 18 22 30 35 -46 42 40 17 54 65 30 57 52 37 47 10 -19 38 67 22
7251B2N4j34Q2k6M5j3m2K1N5q7K6J7j3j5kO6l%m9N7m0L0p0O2l3M5j7Mj7M5m1M4
$$ 22 76 -58 24 -2 43 30 -12 9 64 -23 3 20 7 -8 -10 56 53 53 4 61 21 51 -19 43 10 55 38 42 25 70 29 73
7283G3o5j4L4M2K5Pp8j9L4K9p7R5o4n1J01m2J5K6lk0M4j6l6NM0m1P0Jp7L5J5k7
$$ 73 8 -6 28 70 95 102 24 5 39 68 -9 86 22 -29 72 30 45 71 68 48 92 76 40 45 85 44 114 115 38 73 88 61
7315F1OK1p6N5lm2M3M7o7J4KJ9l2k3N5PK9j21Q9Mj5k6K4KM0o9M1Lj7rM6p9K2M3
$$ 61 67 88 12 67 64 22 65 112 45 59 61 80 48 25 80 87 116 -5 84 88 73 47 71 73 113 44 85 88 71 62 108 29 51 94
7349I4m3OK9k9l0n2J10k6j1J6OJ0k7l1N0Ql9M3J1k2k0No0K6nLN6n6M7n7NN1mn8
$$ 94 51 57 86 57 27 -25 85 59 48 64 70 80 53 22 72 80 41 84 95 73 53 58 -2 24 19 22 78 22 69 12 17 68 64 6
7383FK1p1K9R2n0J6j8m1J1j1r2J32k4lk5k2K4N3J4Lk0JJ0%o2kK9m3K9n2l8P0p
$$ 6 27 -44 -15 77 27 43 25 -16 -5 -16 -108 24 0 -3 -28 -50 -26 27 41 44 24 25 35 35 -27 -29 0 -43 -14 -66 -104 -34 -41
7416d1m8J1J9M6m3j1O4k7l4L2m0K9K7%K9k7J5k4m4M6p3j0R5q2N7l0M8mn9J1jM0
$$ -41 -89 -78 -59 -13 -56 -67 -3 -30 -64 -32 -72 -43 -16 -16 13 -14 1 -23 -67 -21 -94 -104 -9 -91 -34 -64 -16 -20 -79 -68 -69 -29
7448b9O4l2q3J7L1o4L8k3L6M0m4J6J6l0k3P0r0N0K1q1M6P5p2l5L2j8l9L7M8L6
$$ -29 35 3 -80 -63 -32 -96 -58 -81 -45 -5 -49 -33 -17 -47 -70 0 -90 -40 -19 -100 -54 21 -51 -86 -54 -72 -111 -74 -26 10
7478A0k9P1j10J9M5p7L1j7J8qqkk4P6j01J03l7Onl5M4J6K9n9om8J15o7k7K3J8
$$ 10 -19 52 -58 -39 6 -71 -40 -57 -39 -47 -55 -57 -81 -5 -106 -3 -40 -34 -39 -74 -30 -14 15 -44 -50 -98 17 -50 -77 -54 -36
7509c6l1k3J5M4nRo8L0k9j7R2K7m1r7R1j6m4J0J9pLPJ4J8j7j7P0j47L1R2l3j4
$$ -36 -67 -90 -75 -31 -36 -27 -95 -65 -94 -111 -19 8 -33 -130 -39 -55 -99 -89 -70 -77 -74 -67 -53 -35 -52 -69 1 -146 -115 -23 -56 -70
7541g0K1L1o0M4K9j2l6N7JOk8lm0N0p2N0J0Kk4KM8K7m3JnJ2K1j1j6M4K5n1p6P2
$$ -70 -49 -18 -78 -34 -5 -17 -53 4 5 11 -17 -20 -60 -10 -82 -32 -22 -20 -44 -42 6 33 -10 -9 -14 -2 19 8 -8 36 61 10 -66 6
7575Fj4L5l8j4M8j1J2Mj9O2r8NL5Jm0J2K7K4l8K2M0M4q6l5j6M5PNJ8k0k2Jj1O4
$$ 6 -8 27 -11 -25 23 12 24 28 9 71 -27 -22 13 14 -26 -14 13 37 -1 21 61 105 19 -16 -32 13 20 25 43 23 1 2 -9 55
7609E5Jl9RN1ln9L1l7K2K9M5j65J81j38MM2O9j05N8l6M6K0n3m9J31q8M5o5L1R
$$ 55 56 17 26 77 74 15 46 9 31 60 105 -60 121 -17 -13 29 98 -7 51 15 61 81 28 -21 110 22 67 2 33 42
7639D2j7j3O5M1r8L6j5J1r1Q8PP9j45J03m4M4j06M0RJ2m%L8K6q9L1L8n5j1M8L6
$$ 42 25 12 77 118 20 56 41 52 -39 49 56 135 -10 93 49 93 -13 27 36 48 44 44 82 108 19 50 88 33 22 70 106
7670A06q8MK9K8k0K4jm7kN4n8L4J3j21J22Qk1M9l6l8L3j4L5kr0P0m5mM2j5p6N4
$$ 106 18 22 51 79 59 83 82 35 33 87 29 63 76 -45 77 85 64 113 77 39 72 58 93 91 1 71 26 22 64 49 -27 27
7702B7L5o7P8j48J68l5n4M4O8m9L%l3m4lJ15q7K9n0L5J0k9K2l9M4K7l2k0K8q1
$$ 27 62 -5 73 -75 93 58 4 48 116 67 70 70 37 -7 -10 105 18 47 -3 32 42 13 35 -4 40 67 35 15 43 -38
7732c8P9LM4k3k9l8Q4o2oJ5jj1oL5r6J17j0o3o0K5L7M8Opp9M7L4r9N1L1Qn8L7
$$ -38 41 44 88 65 36 -2 82 20 14 29 28 17 11 46 -50 67 57 -6 -66 -41 -4 44 50 43 -36 11 45 -54 -3 28 36 -22 15
7765A5l6J2PQ4p6j8jn6O9pj8J6%p9P2m6N3j8Mm7j4P4p8M3N5p4kk9LK0M0l3j0K3
$$ 15 -21 -9 -2 82 6 -12 -13 -69 0 -7 -25 -9 -9 -88 -16 -62 -9 -27 -23 -70 -84 -10 -88 -45 10 -64 -66 -95 -92 -72 -32 -65 -75 -52
7799e2J1J3l2M8o9LoM5r7R2lo%n1N4RJ0k3K9J0m6m5M9M5j12K5M5K1np9N9J6m2
$$ -52 -41 -28 -60 -12 -81 -78 -84 -39 -136 -44 -47 -53 -53 -104 -50 -41 -31 -54 -25 -15 -61 -106 -57 -12 -124 -99 -54 -33 -38 -117 -58 -42 -84
7832h4J4K0l7K9K4rp7M7j3L0K8n5J8l2K3N9m8k8M7l1M2%K9q1L3L6n9NJ4j2NM6
$$ -84 -70 -50 -87 -58 -34 -43 -120 -73 -86 -56 -28 -83 -65 -97 -74 -15 -63 -91 -44 -75 -33 -33 -4 -85 -52 -16 -75 -70 -56 -68 -63 -17
7864a7l8nnN8j15J09k8R9j41N8j2K9r4M8n0M9K1o1L3M4k5j6N3k5ML2k7J7q9N5
$$ -17 -55 -60 -65 -7 -122 -13 -41 58 -83 -25 -37 -8 -102 -54 -104 -55 -34 -95 -62 -18 -43 -59 -6 -31 -27 5 -22 -5 -94 -39
7894c9K8k3n0Q7j29J54o2q4J28m8M2kl3rK8lkL6k8n0L9M2l9k4N5k0l7MJ8J3km9
$$ -39 -11 -34 -84 3 -126 28 -34 -118 10 -38 4 2 -31 -40 -12 -15 -17 19 -9 -59 -20 22 -17 -41 14 -6 -43 -39 -21 -8 -10 -59
7926e9L5QL0q6M6Q8n1K6r1M8L9J4m8m4oO2k6j8P9m6nR3o2l7K1J6j3K6j01J06J7
$$ -59 -24 -16 14 -72 -26 62 11 37 -54 -6 33 47 -1 -45 -51 11 -15 -33 46 0 -5 88 26 -11 10 26 13 39 -62 44 61
7957F1n4L6J5LJ7j5k2N4k3m4oN5l0l9J2L1j5J9Q9n9n5krM5n3R2k5m5JK7k3K6l6
$$ 61 7 43 58 61 78 63 41 95 72 28 22 77 47 8 20 51 36 55 144 85 30 28 19 64 11 103 78 33 34 61 38 64 28
7990B8P0j8j4K5j9J2Qk8J5ol4N4K9n6J7m0K1j7kL8J2m6n4Q1k9NJ7lK3l8k8K5j3
$$ 28 98 80 66 91 72 84 92 64 79 73 39 93 122 66 83 43 64 47 45 83 95 49 -5 76 47 52 69 66 89 51 23 48 35
8023C5L3l1NN2k1m1M6q1K5L3L4o3JM5kLOk2j6o9J07j2l3K0n2%Q1m5k3J1Km7J1
$$ 35 68 37 42 94 73 32 78 -3 22 55 89 26 27 72 70 73 79 57 41 -28 79 67 34 54 2 2 83 38 15 26 28 -19 -8
8056hML9J4j7k4rK7l3P8o0r9J53j36P5K0o1P2k5k3K8Rm3K2M5p0N8o0ql8R1l0P
$$ -8 -4 35 49 32 8 -1 26 -7 71 11 -88 65 -71 4 24 -37 35 10 -13 15 24 -19 3 48 -22 36 -24 -32 -70 21 -9 -2
8088bn5J14L8j57M2L2j5lK4l3ok8N1j2pj6J0PL9k7M0p1O1p6L4J3j7PO5q2RJ5l5
$$ -2 -57 57 95 -62 -20 12 -3 -6 18 -15 -21 -49 2 -10 -17 -33 -23 -16 23 -4 36 -35 26 -50 -16 -3 -20 -13 52 -30 -21 -6 -41
8121d1k7JL7k8N5om1MM1M8p4l0K1K0l3Kml1O1k5J5l2rJ6j0L4o7Q6l9n8R6M2q9
$$ -41 -68 -67 -30 -58 -3 -9 -50 -46 -5 43 -31 -61 -40 -20 -53 -51 -55 -86 -25 -50 -35 -67 -76 -60 -70 -36 -103 -17 -56 -114 -18 24 -65
8154f5n2M3nL8p9L2L7j7l6O6k8l5M2l6N4j9J7j2n6K1K5j5L0q0K9L8N6m7%OqJ9
$$ -65 -117 -74 -79 -41 -120 -88 -51 -68 -104 -38 -66 -101 -59 -95 -41 -60 -43 -55 -111 -90 -65 -80 -50 -130 -101 -63 -7 -54 -54 -48 -56 -37
8186c7r8O7K1k5J0
$$ -37 -135 -68 -47 -72 -62
8191f2
$$ Imaginary data points
##PAGE= N=2
##DATA TABLE= (X++(I..I)), XYDATA
0@%%%%%%%%%%%mM%Mj2J6j6J6j9K3k4K6k9L4l9M2m8N3o0O7p2Q0r0J00j07J16j30
$$ 0 0 0 0 0 0 0 0 0 0 0 0 -4 0 0 4 -8 8 -8 8 -11 12 -12 14 -15 19 -20 22 -26 27 -33 34 -38 42 -48 52 -55 61 -69
38f9J44j59J76j96K17k39K65k98L34l74M28m93N70o69Q04r91J257j661K326l549
$$ -69 75 -84 92 -104 113 -126 139 -159 175 -199 229 -264 306 -363 441 -550 707 -954 1372 -2177
58b177O208j4065P4998L12083l07269l97081K40771L46886j81203k69591J70482
$$ -2177 4031 -10034 64964 377047 69778 -327303 -86532 260354 79151 -190440 -19958
69a9958J90577j97290j49566K32436J49774k41533j77725K02728J96314j23683
$$ -19958 170619 -26671 -176237 56199 205973 -35560 -213285 -10557 185757 62074
79F2074j79815L0796J18417M1931l1439p5012n2152P1651J04314n4804j18576
$$ 62074 -117741 -86945 31472 73403 41964 -33048 -85200 -13549 90765 35961 -82615
90h2615M9919J05476p4984r1647J24286R5015j81897j24266K22806J66126k36890
$$ -82615 -32696 72780 -2204 -93851 30435 125450 -56447 -180713 42093 208219 -28671
101b8671k04341K23519K19962j98905k11051J76829J82221j69084j49415J72714
$$ -28671 -233012 -9493 210469 11564 -199487 -22658 159563 -9521 -158936 13778
111A3778J21768j81632j05388J83722R4797j75498q4836J55844O8181j31154m5800
$$ 13778 135546 -46086 -151474 32248 127045 -48453 -133289 22555 90736 -40418 -86218
122h6218J05194J7937q1648J0641N9609l9475m0098O6446K2808r1944r814J12439
$$ -86218 18976 36913 -44735 -34094 25515 -13960 -54058 12388 35196 -56748 -66562 45877
134D5877L28j25584P493J29869j7941j26724L4582J21966n6596j20314P9469J25381
$$ 45877 46205 -79379 -71886 57983 40042 -86682 -52100 69866 13270 -107044 -27575 97806
146I7806r5000j32901R9307J36196r1451j27283P9693J04469p1861p1284P5494
$$ 97806 2806 -130095 -30788 105408 13957 -113326 -33633 70836 -1025 -72309 3185
157C185L9160q8819j5889J05142O417j12864m728J06761K417q6795J1135O2995
$$ 3185 42345 -46474 -62363 42779 49196 -63668 -68396 38365 40782 -46013 -34878 28117
169B8117l6583m5209O9885M1346r8449m8343J14067N9228j12585o1444J01047
$$ 28117 -8466 -53675 16210 57556 -40893 -89236 24831 84059 -28526 -89970 11077
180A1077N0166q8816k6446Q6189J63r4576J9185J08758k4096j17962J8036J14721
$$ 11077 61243 -27573 -54019 32170 32333 -62243 -43058 65700 41604 -76358 -58322 56399
192E6399q208r6196N897O9612j4467m3630L3514K8036n3305k2851O6163K4792
$$ 56399 48191 -48005 -42108 27504 13037 -30593 2921 30957 -22348 -45199 20964 45756
204D5756o5824k3516N5731J3952m1843O232L3643l0398l3931N2345M1922o4126
$$ 45756 -20068 -43584 12147 26099 -15744 -9512 24131 -6267 -40198 12147 54069 -10057
216a0057m9644O6007N2179o1088m4496N7380L0317n8316j3535O6104J542p5483
$$ -10057 -59701 6306 58485 -2603 -47099 10281 40598 -17718 -31253 34851 36393 -39090
228c9090M083Q2503l837q2116K806P5031m480o3526J1470N2465k1804m4592L2651
$$ -39090 -35007 47496 43659 -38457 -35651 39380 34900 -28626 -17156 35309 13505 -31087 1564
241A564M0740l9946l8635M3209L5820m2437k9981M0112K1643l8371j1659L7823
$$ 1564 42304 2358 -36277 6932 42752 315 -29666 10446 32089 -6282 -17941 19882
253A9882K734l8368M550L8394j0006l7190J4168L4241j8005l0272K1574K6077
$$ 19882 22616 -15752 -11202 27192 17186 -20004 -5836 28405 10400 -19872 1702 27779
265B7779k4811k1744K7127J7372k8606j2554K9513P501l0034k653L0629j366l0823
$$ 27779 2968 -18776 8351 25723 -2883 -15437 14076 21577 -8457 -11110 19519 18153 -12670
278a2670M317K9747o426k7196Q248K3268j0845j9039J4038J4976j7482j2538J9825
$$ -12670 -8353 21394 14968 -12228 -3980 19288 8443 -10596 3442 18418 936 -11602 8223
291H223J0916k0529r479J9118O904j6615l152J4225j846j2791O478J2525j0175
$$ 8223 19139 -1390 -10869 8249 15153 -1462 -4614 9611 7765 -5026 1452 13977 3802
304C802j2800J1908J2190j2626j0763J2529P735j3245m421J4225J450j5922M45
$$ 3802 -8998 2910 15100 2474 -8289 4240 11975 -1270 -5691 8534 9984 -5938 -5493
317e493J7010j670j7311K409J6476l469j5267M751J4013o451j3163P478J2416
$$ -5493 11517 9847 -7464 -5055 11421 7952 -7315 -2564 11449 4998 -8165 -687 11729
330A1729q155j1797P882J0444p854r052P768O900q080n746Q148M564q319m172
$$ 11729 3574 -8223 -341 10103 2249 -6803 965 7865 -215 -5961 2187 6751 -1568 -5740
344e740P324L102o500k312N138J85m933R96M653k400n393K020N106k058m900R08
$$ -5740 1584 4686 -1814 -4126 1012 1197 -3736 -2740 1913 -487 -5880 -3860 1246 -812 -5712 -4804
360d804L284j360k244J502O80l087r76L474J115m262k389L144K378k529k574J254
$$ -4804 -1520 -2880 -5124 -3622 -2942 -6029 -7005 -3531 -2416 -6678 -9067 -5923 -3545 -6074 -8648 -7394
376g394J511j165j307J067Q92j524j615J164J942n64k533n70K199J263j956j492
$$ -7394 -5883 -7048 -8355 -7288 -6396 -7920 -9535 -8371 -6429 -6993 -9526 -10096 -7897 -6634 -8590 -10082
392a0082J379J263j515j021J968J208k806j900L302K814k951l565K226L758j458
$$ -10082 -8703 -7440 -8955 -9976 -8008 -6800 -9606 -11506 -8204 -5390 -8341 -11906 -9680 -5922 -7380
407g380l051J489K148j896j886L152K325l663l434L515M634k353m753P99L975
$$ -7380 -10431 -8942 -6794 -8690 -10576 -7424 -5099 -8762 -12196 -8681 -4047 -6400 -11153 -10354 -6379
422f379L44k354l03P41p82P1K275M69l073j799K872L111j370l330m87K540J783
$$ -6379 -6035 -8389 -8692 -7951 -8733 -8662 -6387 -5918 -8991 -10790 -7918 -4807 -6177 -9507 -9994 -7454 -5671
439e671p16j823p56R87J611M10r18j190k47J170J559K09k041j501J664K610l01
$$ -5671 -6387 -8210 -8966 -7979 -6368 -5958 -6876 -8066 -8313 -7143 -5584 -5375 -7416 -8917 -7253 -4643 -4944
456d944k439p12J706J184j02l54p84p23J237K407o36l005k9L335P35k611m93K245
$$ -4944 -7383 -8095 -6389 -5205 -5307 -5661 -6445 -7168 -5931 -3524 -4160 -7165 -7194 -3859 -3124 -5735 -6228 -3983
474c983j4j723J169K051j888k461K746L269k908l517L211L781l045l500L552L460
$$ -3983 -3997 -5720 -4551 -2500 -4388 -6849 -4103 -834 -3742 -7259 -4048 -267 -3312 -6812 -3260 200
490B00l780l109M394L248m574k931M818L048m691k287M849J923m787j213N410
$$ 200 -3580 -6689 -2295 953 -3621 -6552 -1734 1314 -3377 -5664 -815 1108 -3679 -4892 518
505E18R88n312p60N532J112m961o67M347M22l267P77L043j703k684K799L322k487
$$ 518 1506 -3806 -4566 966 2078 -2883 -3550 797 1219 -2048 -1271 1772 69 -2615 184 3506 1019
522A019l480K113L446q91j885L74K07m09J958J894k831l339K808M646j307m255
$$ 1019 -2461 -348 3098 2207 322 696 903 494 2452 4346 1515 -1824 984 5630 4323 68
538F8j20K896Q09r4J27j899k208K795M603j783n754R1N202J420k614j255j67q10
$$ 68 -52 2844 3653 3559 3686 1787 -421 2374 6977 5194 -560 -469 4733 6153 3539 2284 2117 1307
556A307K098M050j828o920J29Q077K165o870l199M511K059k206J149J888m557
$$ 1307 3405 7455 5627 -1293 -1164 6913 9078 2208 -991 3520 5579 3373 4522 6410 1853
571A853l802O949P096o669r686M380J0384j231q208n83M502K8q83K600m69n908
$$ 1853 -1949 5000 12096 5427 -4259 121 10505 9274 1066 483 4985 5013 4130 6730 6261 353
587C53l66P936K976p305n036M337N245m90k751k089j249K390N155m07o998k241
$$ 353 -13 7923 10899 3594 -1442 2895 8140 7650 4899 2810 1561 3951 9106 8699 1701 -540
603e40O274L914l801l269J526M70p18K932K181n337m919N605P654l812q465J307
$$ -540 5734 9648 5847 2578 4104 4574 3856 6788 8969 3632 -1287 4318 11972 8160 -305 1002
619A002P257R40m483j320J461L35O36J626j047l104P12L349J45k161l83N22m80
$$ 1002 8259 9199 4716 3396 4857 5192 5828 7454 6407 3303 4015 7364 7509 5348 4965 5487 5007
636E007J518K048k654m012L299N743l135o952K652P676k138p589J545O855j291
$$ 5007 6525 8573 5919 1907 5206 10949 7814 862 3514 11190 9052 1463 3008 9863 8572
651H572n819J696M104k828l057M431K718o257l669O640M846o057n714L304M539
$$ 8572 2753 4449 8553 5725 2668 7099 9817 3560 -109 6531 11377 5320 -394 2910 7449
666G449o32j715j297k998M61O999K266r584o187Q559Q821n912q797K408N260j286
$$ 7449 6817 5102 3805 807 1268 8267 10533 949 -5238 3321 12142 6230 -2567 -159 5101 3815
682C815p47L083l026q147L588J2927m25j5521m801J3724R239q638j0355K214P346
$$ 3815 3068 6151 3125 -5022 -1434 11493 11068 -4453 -9254 4470 13709 5071 -5284 -3070 4276
697D276K105j819k637l043l73M621M541k038o259l402M201Q577J979j0257r349
$$ 4276 6381 4562 1925 -1118 -1491 3130 7671 5633 -626 -4028 173 8750 10729 472 -8877
712h877P895J5143k452j6705k659J4397N074j0261l420P435j069p933N690J1766
$$ -8877 -982 14161 11709 -4996 -7655 6742 11816 1555 -1865 5570 4501 -3432 2258 14024
726A4024p913j6685O609K0492k720k1030j486J8447L688j4110l098J0363K81q784
$$ 14024 6111 -10574 -3965 16527 13807 -7223 -8709 9738 13426 -684 -3782 6581 6862 -1922
740a922K586R177m192j0509L280J1025j113j0038j247P015K515l581k422N68J560
$$ -1922 664 9841 5649 -4860 -1580 9445 8332 -1706 -2953 4062 6577 2996 574 1142 2702
755B702J158p00k015M11K647j389l575K357M878l352o358L745P271m033p961M560
$$ 2702 3860 3160 1145 1556 4203 2814 -761 1596 6474 3122 -3236 509 7780 3747 -4214 346
771C46Q067n599q398O699R182p672j0074P614J0592o951j0481O161R017n856p304
$$ 346 8413 2814 -5584 1115 10297 2625 -7449 165 10757 3806 -6675 -514 8503 2647 -4657
786d657O545N537p812n042Q905N217r156o069Q079O208o177n467M077L562k952
$$ -4657 1888 7425 -387 -5429 3476 8693 -463 -6532 1547 7755 1578 -3889 188 3750 798
801G98j330K591k06l004O26L044j43k183o37P9Q19K394j70m661j249O029K694
$$ 798 -532 2059 1853 -1151 -525 2519 2376 193 -444 -365 454 2848 2678 -1983 -3232 2797 5491
818E491o579l600O620L519o747k848P618J930q892j588J0299J755j1371k289J1677
$$ 5491 -1088 -4688 1932 5451 -1296 -4144 3474 5404 -3488 -5076 5223 6978 -4393 -6682 4995
833D995K730j1535k724J1020K150j0686j647J0412J111j0320j139R808J149q948
$$ 4995 7725 -3810 -6534 4486 6636 -4050 -5697 4715 5826 -4494 -5633 4175 5324 -3624
847c624j147P466Q67o210k81N022n95m139J034L205j382k429J151J316j189j22
$$ -3624 -4771 2695 3562 -2648 -2929 2093 1498 -2641 -1607 1598 216 -2213 -1062 254 -935 -1057
863a057J277j356j532K444J581l218j969L845J897m341j675M864J389n370j226
$$ -1057 220 -1136 -2668 -224 1357 -1861 -3830 15 1912 -2429 -4104 760 2149 -3221 -4447
878d447N732J098n921j173N816R48n455o32M972J78m659K52M219o71l739R82L066
$$ -4447 1285 2383 -3538 -4711 1105 2053 -3402 -4034 938 1116 -3543 -3291 928 257 -3482 -2500 566
895E66j334k306J675J373k163q38K647J64k911Q9K936q36k808J478K557k604k733
$$ 566 -768 -3074 -1399 -26 -2189 -3027 -380 -216 -3127 -3038 -102 -938 -3746 -2268 289 -2315 -5048
912e048L468K924m328l588M552L690m477l603M176K941m257k171M500J504n304
$$ -5048 -1580 1344 -2984 -6572 -2020 1670 -2807 -6410 -2234 707 -3550 -5721 -1221 283 -5021
927e021j397N688J707n782k169N115K203m029j781K977P16k539N12K735j275l139
$$ -5021 -6418 -730 977 -4805 -6974 -1859 344 -3685 -5466 -2489 -1773 -4312 -3800 -1065 -2340 -5479
943e479J269L512n07l218l09K253Q62p11n62n96k12J266J361j137j850N12J807
$$ -5479 -4210 -698 -1205 -4423 -4732 -2479 -1617 -2328 -2890 -3486 -3698 -2432 -1071 -2208 -4058 -3546 -1739
960a739O0r12L8j51o57Q64J906r14k745L89L210N23k871j013K057R14j088j72
$$ -1739 -1679 -2591 -2553 -2704 -3361 -2497 -591 -1505 -4250 -3861 -651 -128 -2999 -4012 -1955 -1041 -2129 -2301
978b301N81q55o44J837J351k073k054J784K517r20k169K77J475L16m36j12l95
$$ -2301 -1720 -2575 -3219 -1382 -31 -2104 -4158 -2374 143 -777 -2946 -2669 -1194 -878 -1314 -1426 -1821
995a821n02J222J288j241j899R98K316l60k038J06J434J88o24N22M9j164K60K260
$$ -1821 -2323 -1101 187 -1054 -2953 -1955 361 1 -2037 -1931 -497 -309 -933 -411 -362 -1526 -1266 994
1013I94K79k820r05K917J927k302k220J208K218l17j078n6k28k00J142J536j148
$$ 994 1273 -1547 -2452 465 2392 90 -2130 -922 1296 979 -99 -155 -383 -583 559 2095 947
1030I47k778L32L507J220k860k486J424K815N70j882j902J27J994J886p33k780
$$ 947 -1831 -1499 2008 3228 368 -2118 -694 2121 2691 809 -1093 -966 1028 2914 2181 -599
1046e99j133K244K693n11k871j479J613K703O38k328k507N10L365J859k194l377
$$ -599 -1732 512 3205 2694 -177 -1656 -43 2660 3298 970 -1537 -1027 2338 4197 2003 -1374
1062a374Q9L457K028j704k957m92K297K305j14k481k015J096L033J348k416l074
$$ -1374 -1285 2172 4200 2496 -461 -953 1344 3649 3535 1054 -961 135 3168 4516 2100 -974
1078i74M37L520J986k075l391j69L318K404j662l278l33K700J788p85j880r22
$$ -974 -537 2983 4969 2894 -497 -666 2652 5056 3394 116 -217 2483 4271 3486 1606 684
1094F84N50J857J321j263k868k40L288J965k399l122J061L015M51k086r50O61
$$ 684 1234 3091 4412 3149 281 41 3329 5294 2895 -227 834 3849 4300 2214 1264 1925
1110A925O61L18N01n31j710L8K249R36k031j696J165J879j66j365n97M40Q48M29
$$ 1925 2586 2904 3405 2874 1164 1202 3451 4387 2356 660 1825 3704 3538 2173 1576 2016 2864 3293
1128C293l98j141l54J390Q71j165j274N37J208p3r21k66K61l1K72K43n91r04M68
$$ 3293 2895 1754 1400 2790 3661 2496 1222 1759 2967 2894 1973 1707 1968 1937 2209 2452 1861 957 1425
1147A425J237k52j645l38J289O44r71j166K65Q07K89n89q28j10O64L56n02p34
$$ 1425 2662 2410 765 427 1716 2360 1389 223 488 1295 1584 995 167 57 721 1077 575 -159
1165a59j7L80j20N0J57p49p95P75J396p45k119J12K353M39k275j087J683J045
$$ -159 -176 204 84 134 291 -458 -1253 -478 918 173 -1946 -1834 519 958 -1317 -2404 -721 324
1183C24j129o73P02j81q21R72J347j396k086J053K638m61k713j67J971O61j018
$$ 324 -805 -1478 -776 -957 -1778 -806 541 -855 -2941 -1888 750 289 -2424 -2591 -620 41 -977
1200i77l67n9n36O77J612n05k607q5K843Q19k485j069J571N88q16M75P90j848
$$ -977 -1344 -1403 -1939 -1262 350 -155 -2762 -2847 -4 815 -1670 -2739 -1168 -580 -1396 -921 -131 -1979
1218a979j477K635K627k743l558K000L816r59l392M20J979n52p77J465O6k744
$$ -1979 -3456 -821 1806 -937 -4495 -2495 1321 362 -3030 -2610 -631 -1183 -1960 -495 -429 -3173
1234c173k10L711R22l817j722K958K114j814j375M43J74oJ410L62k686j051L058
$$ -3173 -3383 328 1250 -2567 -4289 -1331 783 -1031 -2406 -1963 -1789 -1795 -385 -23 -2709 -3760 -702
1251g02J833k715k033K105J284j526j87J739j088k399K012L336k274m000J904
$$ -702 1131 -1584 -3617 -1512 -228 -1754 -1941 -202 -1290 -3689 -1677 1659 -615 -4615 -2711
1266b711M354j450l893J130K967j261j809J819J098k807o31L817N73m221p25M297
$$ -2711 1643 193 -3700 -2570 397 -864 -2673 -854 244 -2563 -3194 623 1196 -3025 -3750 547
1282E47R36l840m84L066k42k285J659J717k881j732M308K388n218k649N356L321
$$ 547 1483 -2357 -2841 225 -17 -2302 -643 1074 -1807 -3539 769 3157 -2061 -4710 646 3967
1298C967n137k881M591K162m176o00M477p46n180J984O166k013o866J705P013
$$ 3967 -1170 -4051 540 2702 -1474 -2074 2403 1657 -3523 -1539 4627 2614 -4252 -2547 4466
1313D466r35n982P88M432j254k521K670J375m182r18N656J300o036j731N486J652
$$ 4466 3531 -2451 -1663 2769 1515 -1006 1664 3039 -1143 -2061 3595 4895 -1141 -2872 2614 4266
1329D266m093m01K830j596k288M160K659n945l880P064M864o704n151N848M281
$$ 4266 173 -228 2602 1006 -1282 2878 5537 -408 -4288 2776 7640 936 -4215 1633 5914
1344E914m938k536N013M07n931J356P297j946q556J781Q859j156p909Q50O238
$$ 5914 976 -1560 3453 3860 -2071 -715 6582 4636 -3920 -2139 6720 5564 -2345 -1495 4743
1359D743j456m116K871K731m834j942O492J926p323j964P146J677o354m21N525
$$ 4743 3287 -829 2042 4773 -61 -2003 4489 6415 -908 -2872 4274 5951 -403 -824 4701
1374D701j547n001L627N461n707o003O909O665p237o960P232O230o940m955P105
$$ 4701 3154 -1847 1780 7241 1534 -4469 2440 9105 1868 -5092 2140 8370 1430 -3525 3580
1389C580L298p821j827Q685P07r527j32R896l14r649O23Q692j298p665K420O399
$$ 3580 6878 -943 -2770 5915 6622 -2905 -3037 6859 6545 -3104 -2481 6211 4913 -2752 -332 6067
1405F067l896n308N128M558o349m064O889L373p251k420O946J153o813L48O641
$$ 6067 2171 -3137 1991 6549 200 -3864 3025 6398 -853 -3273 3673 4826 -1987 -1639 5002
1420E002k111o773L646O960n015p052N642O845o123o134O202N109o605l784P223
$$ 5002 2891 -3882 -236 6724 1709 -5343 299 7144 1021 -5113 1089 6198 -407 -4191 3032
1435C032K163p955q89Q515J25r058L88R078j098q429J656P475k820o431M024N513
$$ 3032 5195 -2760 -3649 4866 4991 -4067 -3679 5399 4301 -4128 -2472 5003 2183 -4248 -224 5289
1451E289n297n003O303M415p015l955P155K956p064j695O809O3o804J338O926
$$ 5289 -8 -5011 1292 5707 -1308 -5263 1892 4848 -2216 -3911 2898 2961 -3843 -2505 4421
1466D421k848p041L773O797m542o505N214N429n868m372O557L163p631k064Q477
$$ 4421 1573 -5468 -1695 5102 560 -5945 -731 4698 -1170 -5542 1015 4178 -3453 -5517 2960
1481B960J144r212l41R472n72r356J313Q990k350q509L251Q135m386p542N198
$$ 2960 4104 -5108 -5449 4023 3451 -5905 -4592 4398 2048 -6461 -3210 4925 539 -7003 -1805
1496a805O887n968o093O443N184o837m187P007L136p102j916O941O18o657M80
$$ -1805 5082 -886 -6979 -536 4648 -2189 -6376 631 3767 -3335 -5251 1690 2308 -4349 -3869
1511c869O407j784n975K866N414l967m822M927M160n790l300O440K397p102j362
$$ -3869 2538 754 -5221 -2355 3059 -908 -5730 -803 3357 -2433 -5733 707 3104 -3998 -5360
1526e360P454M61p854M52Q045j240q037J898P830k684p160L262O728m078n864
$$ -5360 2094 2555 -5299 -4847 3198 1958 -6079 -4181 3649 965 -6195 -2933 3795 -283 -6147
1541f147M791N032n313m120N847L238o071k294O312J469o255l23O063p24n611
$$ -6147 -1356 3676 -1637 -5757 90 3328 -2743 -5037 1275 2744 -3511 -3834 2229 1505 -4106
1556d106K068N209l252m884M600M643n461m317O232M019o509l344O694K691o752
$$ -4106 -2038 3171 -81 -4965 -365 4278 -1183 -5500 732 4751 -1758 -5102 1592 4283 -2469
1571b469j570O982O16p225L72P475p76p407J136O947j219o126J695N115k432l819
$$ -2469 -4039 2943 3559 -3666 -3294 4181 3405 -4002 -2866 4081 2862 -3264 -1569 3546 1114 -2705
1587b705L344K905m121k400M863K145m945j700M523J033l866K37L466j586l369
$$ -2705 639 3544 -577 -2977 1886 4031 -914 -2614 1909 2942 -924 -687 2779 1193 -2176
1602b176L148L707m055m077M390M354m114m089L866L231l631j928M048Q34m512
$$ -2176 972 4679 624 -3453 937 5291 1177 -2912 954 4185 554 -1374 2674 3508 -1004
1617a004J2N197p2n307r7N192J72m040R5L016j027j859K164J416l320j394M204
$$ -1004 -992 4205 4133 -1174 -1271 3921 4093 53 148 3164 2137 278 2442 3858 538 -856 3348
1634C348J600m154j695L761J356l111k64K838j077k908K239L503k875m341L037
$$ 3348 4948 794 -901 2860 4216 1105 841 3679 2602 -306 1933 5436 2561 -1780 1257
1649A257M592k396m640J869L807j516k603J485J616k159p87K840N72l338q34L215
$$ 1257 5849 3453 -1187 682 4489 2973 370 1855 3471 1312 525 3365 3937 599 -235 2980
1665B980J015k562r22J517L28p24P55P6k011j73K957N21l390j096L225J218k654
$$ 2980 3995 1433 511 2028 2356 1632 2387 2463 452 279 3236 3757 367 -729 2496 3714 1060
1682A060j037K155J50k082P48K311j486l178J722L832j560m194O31M041j3l382
$$ 1060 23 2178 2328 246 994 3305 1819 -1359 363 4195 2635 -1559 -928 3113 3100 -282
1698b82l87K095J15j169M05O40j364o18J658R27j834j247J016J246k81q52m38
$$ -282 -669 1426 1541 372 777 1417 53 -565 1093 2020 186 -1061 -45 1201 920 68 -370
1715c70l59P31J281n26k234k69K441Q04k201j153J528Q32j104j74Q54o15j400
$$ -370 -729 2 1283 757 -1477 -1746 695 1499 -702 -1855 -327 505 -599 -773 81 -534 -1934
1732a934J159J995j275k645P83K701q8k398m96J521M19m91j78j81p08M63J335
$$ -1934 -775 1220 -55 -2700 -1917 784 696 -1702 -2198 -677 -258 -749 -927 -1108 -1816 -1353 -18
1749a8l81j722j9J511J81j076k33O58m29l53J041K96j683q24J980J237j960j646
$$ -18 -399 -2121 -2140 -629 -448 -1524 -1757 -1099 -1528 -1881 -840 -544 -2227 -3051 -1071 166 -1794 -3440
1767c440J487J544j122j249P69Q09r08l89R40J70j241k88J246O09j220q07N79
$$ -3440 -1953 -409 -1531 -2780 -2011 -1202 -2110 -2499 -1559 -1389 -2630 -2918 -1672 -1063 -2283 -3090 -2511
1784b511Q09k8o31m86K09P60J59q88m50P07N98o10m92O00K89q58o5J059N4j315
$$ -2511 -1702 -1730 -2361 -2847 -2638 -1878 -1719 -2607 -3057 -2350 -1752 -2362 -2854 -2254 -1965 -2823 -2888 -1829 -1775 -3090
1804c090k04J464L67j383n32J244N21r69l78P54J48o18N3O43k17o39L25L79j98
$$ -3090 -3294 -1830 -1463 -2846 -3378 -2134 -1613 -2582 -2960 -2206 -2058 -2676 -2623 -1980 -2197 -2836 -2511 -2132 -2330
1823b330j98J36M9k04K93L48n70n34P63P10p55q57Q30R09q03q47P90P68p50n52
$$ -2330 -2528 -2392 -2343 -2547 -2254 -1906 -2476 -3010 -2247 -1537 -2292 -3149 -2319 -1410 -2213 -3060 -2270 -1502 -2252 -2804
1843b804P93M89q04l19R37L87j014k32J089K77q86j65Q40J79n17O4L60j33j09
$$ -2804 -2011 -1522 -2326 -2645 -1708 -1321 -2335 -2567 -1478 -1201 -2087 -2252 -1412 -1233 -1750 -1686 -1326 -1459 -1568
1862a568N45J09o35j38Q84K44p29j13P04J44n82K61P15o03n70Q44Q88q19j003
$$ -1568 -1023 -914 -1549 -1687 -803 -559 -1288 -1401 -697 -553 -1135 -874 -159 -762 -1332 -488 400 -419 -1422
1881a422P93J041m04p43L42L16k89K10O46o35q24P04J316o24j424O23J212m14
$$ -1422 -629 412 8 -735 -393 -77 -366 -156 490 -145 -969 -265 1051 427 -997 -374 838 424
1899D24q13O53L98j053j5J571M5k005j69K272M93k253n80J953N54j516j14J341
$$ 424 -389 264 662 -391 -406 1165 1210 -795 -964 1308 1801 -452 -1032 921 1475 -41 -155 1186
1917A186l43j296P42J604q36j859R79J812o76j470M11J099m25m23P16l6j212L75
$$ 1186 843 -453 289 1893 1057 -802 177 1989 1313 -157 254 1353 928 505 1221 1185 -27 348
1935C48J671m47j814L36J789j77j586M32J188q01q17J271O77j709p58J995Q83
$$ 348 2019 1572 -242 94 1883 1706 120 552 1740 939 122 1393 2070 361 -397 1598 2481
1952B481k103r04J983Q23j866n30J612R4j456K44J566p26j506Q41J446r98j289
$$ 2481 378 -526 1457 2280 414 -116 1496 1590 134 378 1944 1218 -288 553 1999 1001 -288
1969b88J089R00j245m53J395J71j729J33J993l39k244N88K235q25k085J030J858
$$ -288 801 1701 456 3 1398 1569 -160 -27 1966 1627 -617 -29 2206 1381 -704 326 2184
1986B184j274j749J568J617j858j515K161J273k162j150K170Q26k204n22K227
$$ 2184 910 -839 729 2346 488 -1027 1134 2407 245 -905 1265 2091 -113 -635 1592
2001A592J51k192J90K085m50k100O88J856j001j674J410J296j722j037J976Q89
$$ 1592 1743 -449 -259 1826 1376 -724 -36 1820 819 -855 555 1851 129 -908 1068 1957
2017A957k381o24K527L70k545j54K480k24k497N74K504j151k340J483K227j767
$$ 1957 -424 -1048 1479 1849 -696 -850 1630 1406 -1091 -517 1987 836 -1504 -21 2206 439
2033D39k161J842K062k069j644K073J210k249p32K271L45k463j42K647k17k557
$$ 439 -1722 120 2182 113 -1531 542 1752 -497 -1229 1042 1387 -1076 -1218 1429 1212 -1345
2049a345L73K301p59k011J200J548j666j363K037J198k465j055K681P42k745n66
$$ -1345 -972 1329 570 -1441 -241 1307 -359 -1722 315 1513 -952 -2007 674 1416 -1329 -1895
2065a895K602J13k600M17K455r92k560J397K582j852k558K011K373k296k043K377
$$ -1895 707 820 -1780 -1363 1092 100 -2460 -1063 1519 -333 -2891 -880 1493 -803 -2846 -469
2081d69J623k618j158K750P90l044n81L273K27l264J77L006m80k717Q17K541j294
$$ -469 1154 -1464 -2622 128 918 -2126 -2707 566 793 -2471 -2294 712 232 -2485 -1668 873 -421
2098d21k343J727K275k127k003K332J766k369j390K393J053k388n13K591q7k623
$$ -421 -2764 -1037 1238 -889 -2892 -560 1206 -1163 -2553 -160 893 -1495 -2008 583 496 -2127
2114b127O08K697r59k618J273K597j470k351J862J933k095j530K293J340k593
$$ -2127 -1519 1178 219 -2399 -1126 1471 1 -2350 -488 1445 -650 -2180 113 1453 -1140
2129a140r41K686O89k799k83K793j25k665N09K553r07k359J304K141j617j947
$$ -1140 -2081 605 1294 -1505 -1788 1005 880 -1785 -1276 1277 370 -1989 -685 1456 -161 -2108
2145b108J912J761k095j499K288J113k405o06K392K57k467K16K461n01k534R63
$$ -2108 -196 1565 -530 -2029 259 1372 -1033 -1639 753 1010 -1457 -1241 1220 719 -1815 -852
2161h52K450j171k369J431K192j614j827J802J604k089j175K276Q76k426n05K572
$$ -852 1598 427 -1942 -511 1681 67 -1760 42 1646 -443 -1618 658 1534 -892 -1397 1175
2177A175J82k549J45K550n21k405R08K259j195k129J588J902j756j788K196J444
$$ 1175 1357 -1192 -1047 1503 982 -1423 -515 1744 549 -1580 8 1910 154 -1634 562 2006
2193B006k380j090K477Q56k572n14K640K03k694K14K633m15k631P82K453r29k344
$$ 2006 -374 -1464 1013 1869 -703 -1217 1423 1626 -1068 -854 1779 1364 -1267 -485 1968 1039 -1305
2210a305J273K129j350j875J518J587j706j112J890O83j969l53K146J08k194K18
$$ -1305 -32 2097 747 -1128 390 1977 271 -841 1049 1732 -237 -590 1556 1664 -530 -312
2226c12K162m03j931O17J768r01j470J301J334j718j079K010J030k158q79K162
$$ -312 1850 1447 -484 133 1901 1000 -470 831 2165 447 -632 1378 2408 250 -629 1533
2242A533P57k035m92K043Q6k032L68K031o14k100P91K092q66j855Q12J622r48
$$ 1533 2290 255 -237 1806 1892 -140 228 2259 1645 -455 336 2428 1562 -293 519 2141 1193
2259A193j168J227N87j441m14J800K84k047j91K040J96j893kJ608l33j341P16
$$ 1193 25 1252 1839 398 -16 1784 2068 21 -170 1870 2066 173 171 1779 1446 105 821
2276H21J355j379j267J596J333j611j391J558J204j415q61J433M52j519j48J701
$$ 821 2176 797 -470 1126 2459 848 -543 1015 2219 804 -57 1376 1828 309 161 1862
2292A862r9j852P5J913j05j723J22J300l05q92M90O46r94n42J303M97j415n74
$$ 1862 1763 -89 -14 1899 1794 71 193 1493 1188 296 786 1432 438 -104 1199 1696 281 -293
2310b93J325N03j175m65J007Q5r08L27P91o43j027P40J166q73j142P26J060p18
$$ -293 1032 1535 360 -105 902 987 79 406 1197 554 -473 267 1433 560 -582 144 1204 486
2328D86q26N91N50p72l34R60Q5j075p9J062J57j093q6Q72j56n51K58M05n62l76
$$ 486 -340 251 801 29 -305 655 740 -335 -414 648 805 -288 -374 498 342 -209 49 454 -108 -484
2348d84P98L74r58m19J015M90j052n11J038K67r63oP85j87q45L77R21m35j153
$$ -484 314 688 -270 -689 326 816 -236 -747 291 558 -405 -411 374 187 -658 -281 640 205 -948
2367i48M69J208n04j145M10R00l73p65M54M90n70l16O13L12p74k91P14L09p12
$$ -948 -479 729 225 -920 -510 390 17 -748 -294 196 -374 -690 -77 235 -539 -830 -116 193 -519
2386e19k61M85J54n56K03L35k97l99M59L36m39n78M98O42n23m88L17M11l69p9
$$ -519 -780 -295 -141 -697 -494 -159 -456 -855 -396 -60 -499 -1077 -579 63 -460 -948 -631 -220 -589 -668
2406f68K96j7m24R2M98j21n96J20N41p1l67o5K15P8j46J23r2j66O4L63j64m53
$$ -668 -372 -389 -813 -721 -223 -344 -940 -820 -279 -350 -717 -782 -567 -489 -635 -512 -604 -770 -706 -343 -507 -960
2428i60J47M20j51m34J37L82k04l36L02K80m21l75L84M67m45m68L98L25k69l60
$$ -960 -813 -393 -544 -978 -841 -459 -663 -999 -697 -417 -838 -1213 -829 -362 -807 -1275 -877 -552 -821 -1181
2448a181J40K83j62k01J98N6j55j67K72J22k55j60R8J49o9K2j27L4J47R6k14j96
$$ -1181 -1041 -758 -920 -1121 -923 -867 -1022 -1189 -917 -795 -1050 -1210 -1112 -963 -1032 -1010 -1137 -1103 -956 -860 -1074 -1270
2470a270K41K96k39k97K35L73k05l66J51L81r6l99O5N04p9m36J55L46m8m24Q1
$$ -1270 -1029 -733 -972 -1269 -1034 -661 -866 -1232 -1081 -700 -796 -1195 -1130 -626 -705 -1141 -986 -640 -688 -1112 -1031
2491a031M43q2l32r9M45J92m12j85L10K94k94j74J10L46j69j90J75K15k22j81
$$ -1031 -588 -670 -1002 -1101 -656 -464 -876 -1061 -751 -457 -751 -925 -815 -469 -638 -828 -653 -438 -660 -841
2511h41J32M11j42l74J0M09K39l69k38K25K63J3j78o1J16l4N1R4N1k14j38L20
$$ -841 -709 -298 -440 -814 -804 -395 -156 -525 -763 -538 -275 -262 -440 -501 -385 -419 -368 -274 -223 -437 -575 -255
2533b55K96j81l74M1L59K22k82k53J01K48Q7j47j15K1K8J62P2o7k10j26K37J79
$$ -255 41 -140 -514 -473 -114 108 -174 -427 -326 -78 9 -138 -253 -232 -204 -42 30 -37 -247 -373 -136 43
2555D3ok91j23K72L12k29k99j48L60K35j13k77k7J31R0J37j30j89M7P2L17j45
$$ 43 37 -254 -377 -105 207 -22 -321 -469 -109 126 13 -264 -291 -160 -70 67 -63 -252 -205 -133 184 39
2577C9l15q7L23K79k31l03Q0K83J60k73m9OJ14P9N9j07j10m3K49J48o0l82P0L30
$$ 39 -276 -363 -40 239 8 -295 -215 68 228 -45 -94 -88 26 105 164 57 -53 -96 153 301 241 -141 -71 259
2601B59Q3j83k35J57K23P1k20j36K6J95J05o1k57l8K25J83j44j38m5J66J30K5
$$ 259 342 159 -76 81 304 375 155 19 45 240 345 284 27 -11 214 397 253 115 70 236 366 391
2623C91k14k51J68L15P4m50j17K93L01j23l58k7K55P5N7p4j32j21J46M21j61l94
$$ 391 177 -74 94 409 483 33 -84 209 510 387 29 2 257 332 389 315 183 62 208 629 468 74
2645G4j36M68K71j87l06k9K58J04L4j93o9N2K62J32j86l33R6K89K26j58l42o8
$$ 74 -62 406 677 490 184 155 413 517 551 358 289 341 603 735 549 216 312 601 827 669 327 259
2667B59K93M40k59m60m3M03K69k64k41kJ47J19J2k9j82j26L01L45l02m88P0M39
$$ 259 552 992 733 273 230 633 902 638 397 395 542 661 673 644 462 336 637 982 680 192 262 701
2689G01R6l46j56M7K17rM5j09l06P4L60J16l47l67K59L02r6j55o2o6J13K30k8
$$ 701 797 451 295 342 559 550 595 486 180 254 614 730 383 16 275 577 481 326 264 198 311 541 513
2712E13l29k51M09K87k04m04N8K50J12j52k09Q2j6R0J38j41k26m6K78J06k10j42
$$ 513 184 -67 342 629 425 21 79 329 441 289 80 162 146 236 374 233 7 -39 239 345 135 -7
2734gl4K05P5k09j17l6J67J03j30j94O4O1k5O4O5k54j73K05K67q8m18o6L83K00
$$ -7 -41 164 239 30 -87 -123 44 147 17 -177 -113 -52 -77 -13 52 -202 -375 -170 97 9 -409 -475 -92 108
2758A08l44j70J15J72j50r5J28o5r5J32J30j24k95J35K43M5k73OJ34J3r9M6Kl6
$$ 108 -236 -406 -291 -119 -269 -364 -236 -301 -396 -264 -134 -258 -553 -418 -175 -130 -403 -397 -263 -250 -349 -303 -301 -337
2782c37M0J4J2p1O0K1m3l6Q0m4r3K4J52Oj73o8J98K4k55KJ57R2k38m3K45L2k84
$$ -337 -297 -283 -271 -342 -282 -261 -304 -340 -260 -304 -397 -373 -221 -215 -388 -456 -258 -234 -489 -487 -330 -238 -476 -519 -274 -242 -526
2809e26j02K46M4k14pK49j26k34J24K31q9l43L3K99P9k80j70J43J65n5j12rm8
$$ -526 -628 -382 -338 -552 -559 -310 -436 -670 -546 -315 -404 -747 -714 -415 -336 -616 -786 -643 -478 -533 -645 -654 -702
2832g02O1K2J2Oj94L2J80qp3j14l1J57R4j44j81P9J88l9k27P8J67j00j24J24J69
$$ -702 -641 -619 -607 -601 -795 -763 -583 -591 -664 -778 -809 -652 -558 -702 -883 -804 -616 -655 -882 -804 -637 -737 -861 -737 -568
2857e68l00j80K96L12m08l43L43M06k49l99J76L52j28l03J38K57k42j42L22J76
$$ -568 -868 -1048 -752 -440 -848 -1191 -848 -442 -691 -1090 -914 -562 -690 -993 -855 -598 -840 -982 -660 -484
2877d84l55k82M61K97l93l08K66L07r1k55M0J27K3Q3k6q9p9K01J23n4j12k9J01
$$ -484 -839 -1121 -660 -363 -756 -1064 -798 -491 -582 -837 -797 -670 -647 -564 -590 -679 -758 -557 -434 -488 -600 -629 -528
2900e28P7J27l7k66m7L36L06k56l93J56M58m0k67PJ22k2NK76n3m46MN74J31l25
$$ -528 -451 -324 -361 -627 -674 -338 -32 -288 -681 -525 -67 -107 -374 -367 -245 -267 -262 14 -39 -485 -481 93 224 -101
2924a01m21L28M03p5l14o3J76P5P9j2j93r8J77K74r6k81P7Q2J88M2j7l19p9L60
$$ -101 -522 -194 209 134 -180 -243 -67 8 87 75 -118 -216 -39 235 139 -142 -65 17 205 247 230 -89 -168 192
2948A92K85k43l84K44L19Rk17j7P7oq3K75ol26q5M80L68n22l21L48M37k16k75
$$ 192 477 234 -150 94 413 422 205 188 265 259 176 451 445 119 34 514 882 360 39 387 824 608 333
2971C33l2L13nL9J1p7j34R3L20nl41j23L40J03j39q7J23nnJ21j3k60lK62Q0j64
$$ 333 301 614 609 648 659 582 448 541 861 856 515 392 732 835 696 609 732 727 722 843 830 570 567 829 909 745
2997G45j41K19R8j22K9J16j47j95L26K52l11l04K57M03j75l04R4K65pk13J82N5
$$ 745 604 823 921 799 828 944 797 602 928 1180 869 565 822 1225 1050 746 840 1105 1098 885 1067 1122
3019A122k08L1K78J2l42J1L15J24k45j75J95J31j13qP3j9m2Q4J09j72r9R3J32
$$ 1122 914 945 1223 1235 893 904 1219 1343 1098 923 1118 1249 1136 1128 1201 1182 1140 1224 1333 1161 1062 1155 1287
3042A287j57J8J45j19j87J99K00j73l13J73L36j59l59K19K47j98k87K01K01l36
$$ 1287 1130 1148 1293 1174 987 1186 1386 1213 900 1073 1409 1250 891 1110 1357 1159 872 1073 1274 938
3062I38j43K06K80l24l34M14J89l96k09L23J86l30j87K53J21k45l5J19n7j21K8
$$ 938 795 1001 1281 957 623 1037 1226 830 621 944 1130 800 613 866 987 742 707 826 769 648 676
3083F76J07j53j08K19J21l80J3J07O7k66k8K81k43k63K16K95k63l27J30L94j56
$$ 676 783 630 522 741 862 482 495 602 669 403 375 656 413 150 366 661 398 71 201 595 439
3104D39m10L0L29j73k67K22J43l83k34L77K64l54l90K91K21k23j56J0J33r3NJ6
$$ 439 29 59 388 215 -52 170 313 -70 -304 73 337 -17 -407 -116 105 -118 -274 -264 -131 -224 -219 -203
$$ [...]
8191f3
##END NTUPLES=NMR FID
##END=
