##TITLE=1H_B1e1406
 CDCl3
 32 sc, 
 15.6.2023
##JCAMPDX= 6.0         $$ Bruker NMR JCAMP-DX V2.0
##DATA TYPE= NMR FID
##DATA CLASS= NTUPLES
##ORIGIN= UXNMR, Bruker Analytische Messtechnik GmbH
##OWNER= root
$$ XWIN-NMR		Version 3.5
$$ Thu Jun 15 09:11:27 2023 Russian Standard Time (UT+4h)  she@DPX200
##.OBSERVE FREQUENCY= 200.13135
##.OBSERVE NUCLEUS= ^1H
##.DELAY= (6, 6)
##.ACQUISITION MODE= SIMULTANEOUS
##.ACQUISITION SCHEME= undefined
##.AVERAGES= 9
##.DIGITISER RES= 18
##SPECTROMETER/DATA SYSTEM= spect
##.PULSE SEQUENCE= zg30
##.SOLVENT NAME= CDCl3
##.SHIFT REFERENCE= (INTERNAL, CDCl3, 0, 15.7039)
##AUDIT TRAIL= $$ (NUMBER, WHEN, WHO, WHERE, WHAT)
$$ ##TITLE= Audit trail, XWIN-NMR		Version 3.5
$$ ##JCAMPDX= 5.01
$$ ##ORIGIN= Bruker BioSpin GmbH
$$ ##OWNER= she
$$ F:/spectra/data/she/nmr/H-F/1/audita.txt
$$ ##AUDIT TRAIL=  $$ (NUMBER, WHEN, WHO, WHERE, WHAT)
(   1,<2023-06-15 09:10:18.18 +0400>,<she>,<DPX200>,
      <created by zg, POWCHK disabled, PULCHK disabled
       terminated by command 'halt'
       configuration hash MD5:
       00 E9 B6 7A A2 85 ED C7 34 08 36 98 17 FE 4E 26
       data hash MD5: 16K
       BC 37 0A 38 20 9B 44 87 6A 78 F7 93 73 87 C9 21>)
$$ ##END=
$$ 
$$ hash MD5
$$ CB FD 30 89 B4 18 3F F5 E4 68 AE 34 F9 55 2A A8
##$RELAX= 
##$RELAX= 
##$RELAX= 
##$RELAX= 
##$RELAX= 
##$RELAX= 
$$ Bruker specific parameters
$$ --------------------------
##$DU= <F:/spectra>
##$EXPNO= 1
##$NAME= <H-F>
##$PROCNO= 1
##$TYPE= <nmr>
##$USER= <she>
##$AMP= (0..31)
100 100 100 100 100 100 100 100 100 100 100 100 100 100 100 100 100 100 
100 100 100 100 100 100 100 100 100 100 100 100 100 100 
##$AQSEQ= 0
##$AQ_mod= 1
##$AUNM= <au_zg>
##$AUTOPOS= <>
##$BF1= 200.13
##$BF2= 200.13
##$BF3= 200.13
##$BF4= 200.13
##$BF5= 200.13
##$BF6= 200.13
##$BF7= 200.13
##$BF8= 200.13
##$BYTORDA= 1
##$CFDGTYP= 0
##$CFRGTYP= 5
##$CHEMSTR= <none>
##$CNST= (0..31)
1 1 145 1 1 1 1 1 1 1 1 1 1 1 1 1 1 1 1 1 1 1 1 1 1 1 1 1 1 1 1 1 
##$CPDPRG= <>
##$CPDPRG1= <>
##$CPDPRG2= <>
##$CPDPRG3= <>
##$CPDPRG4= <mlev>
##$CPDPRG5= <mlev>
##$CPDPRG6= <mlev>
##$CPDPRG7= <mlev>
##$CPDPRG8= <mlev>
##$CPDPRGB= <>
##$CPDPRGT= <>
##$D= (0..31)
0 1.2 0 0 0 0 0 0 0 0.06 0 0.03 0 0 0 0 0.0002 0 0 0 0 0 0 0 0 0 0 0 0 
0 0 0 
##$DATE= 1686805817
##$DBL= (0..7)
120 120 120 120 120 120 120 120 
##$DBP= (0..7)
150 150 150 150 150 150 150 150 
##$DBP07= 0
##$DBPNAM0= <>
##$DBPNAM1= <>
##$DBPNAM2= <>
##$DBPNAM3= <>
##$DBPNAM4= <>
##$DBPNAM5= <>
##$DBPNAM6= <>
##$DBPNAM7= <>
##$DBPOAL= (0..7)
0.5 0.5 0.5 0.5 0.5 0.5 0.5 0.5 
##$DBPOFFS= (0..7)
0 0 0 0 0 0 0 0 
##$DE= 6
##$DECBNUC= <off>
##$DECIM= 32
##$DECNUC= <off>
##$DECSTAT= 4
##$DIGMOD= 1
##$DIGTYP= 9
##$DL= (0..7)
0 120 120 120 120 120 120 120 
##$DP= (0..7)
150 150 150 150 150 150 150 150 
##$DP07= 0
##$DPNAME0= <>
##$DPNAME1= <>
##$DPNAME2= <>
##$DPNAME3= <>
##$DPNAME4= <>
##$DPNAME5= <>
##$DPNAME6= <>
##$DPNAME7= <>
##$DPOAL= (0..7)
0.5 0.5 0.5 0.5 0.5 0.5 0.5 0.5 
##$DPOFFS= (0..7)
0 0 0 0 0 0 0 0 
##$DQDMODE= 0
##$DR= 18
##$DS= 0
$$ [...]
##$SUBNAM2= <"">
##$SUBNAM3= <"">
##$SUBNAM4= <"">
##$SUBNAM5= <"">
##$SUBNAM6= <"">
##$SUBNAM7= <"">
##$SUBNAM8= <"">
##$SUBNAM9= <"">
##$SW= 18.05172834244
##$SWIBOX= (0..15)
0 0 2 0 0 0 0 0 0 0 0 0 0 0 0 0 
##$SW_h= 3612.71676300578
##$TD= 16384
##$TD0= 1
##$TE= 0
##$TE2= 300
##$TE3= 300
##$TEG= 300
##$TL= (0..7)
0 120 120 120 120 120 120 120 
##$TP= (0..7)
150 150 150 150 150 150 150 150 
##$TP07= 0
##$TPNAME0= <>
##$TPNAME1= <>
##$TPNAME2= <>
##$TPNAME3= <>
##$TPNAME4= <>
##$TPNAME5= <>
##$TPNAME6= <>
##$TPNAME7= <>
##$TPOAL= (0..7)
0.5 0.5 0.5 0.5 0.5 0.5 0.5 0.5 
##$TPOFFS= (0..7)
0 0 0 0 0 0 0 0 
##$TUNHIN= 0
##$TUNHOUT= 0
##$TUNXOUT= 0
##$USERA1= <user>
##$USERA2= <user>
##$USERA3= <user>
##$USERA4= <user>
##$USERA5= <user>
##$V9= 5
##$VALIST= <valist>
##$VCLIST= <CCCCCCCCCCCCCCC>
##$VD= 0
##$VDLIST= <DDDDDDDDDDDDDDD>
##$VPLIST= <PPPPPPPPPPPPPPP>
##$VTLIST= <TTTTTTTTTTTTTTT>
##$WBST= 1024
##$WBSW= 4
##$XGAIN= (0..3)
0 0 0 0 
##$XL= 0
##$YL= 0
##$YMAX_a= 82693
##$YMIN_a= -82702
##$ZGOPTNS= <>
##$ZL1= 120
##$ZL2= 120
##$ZL3= 120
##$ZL4= 120
##$ABSF1= 10
##$ABSF2= 0
##$ABSG= 5
##$ABSL= 3
##$ALPHA= 0
##$AQORDER= 0
##$ASSFAC= 0
##$ASSFACI= 0
##$ASSFACX= 0
##$ASSWID= 0
##$AUNMP= <proc_1d>
##$AZFE= 0.1
##$AZFW= 0.1
##$BCFW= 1
##$BC_mod= 2
##$BYTORDP= 1
##$COROFFS= 0
##$CY= 11.3945322036743
##$DATMOD= 1
##$DC= 2
##$DFILT= <>
##$DTYPP= 0
##$F1P= 15.7292609196834
##$F2P= 12.9074282941183
##$FCOR= 0.5
##$FTSIZE= 0
##$FT_mod= 4
##$GAMMA= 1
##$GB= 0.15
##$INTBC= 1
##$INTSCL= 1
##$ISEN= 128
##$LB= 0.24
##$LEV0= 0
##$LPBIN= 0
##$MAXI= 10000
##$MC2= 0
##$MEAN= 0
##$ME_mod= 0
##$MI= 1.114404
##$NCOEF= 0
##$NC_proc= 0
##$NLEV= 6
##$NOISF1= 3.799351
##$NOISF2= 2.8
##$NSP= 1
##$NTH_PI= 0
##$NZP= 0
##$OFFSET= 15.70392
##$PC= 1
##$PHC0= -20789.12
##$PHC1= 18.85272
##$PH_mod= 1
##$PKNL= yes
##$PPARMOD= 0
##$PSCAL= 0
##$PSIGN= 0
##$REVERSE= no
##$SF= 200.130013532006
##$SI= 16384
##$SIGF1= 3
##$SIGF2= 2
##$SINO= 400
##$SIOLD= 16384
##$SREGLST= <1H.CDCl3>
##$SSB= 0
##$STSI= 0
##$STSR= 0
##$SW_p= 3612.71676300578
##$SYMM= 0
##$S_DEV= 0
##$TDeff= 0
##$TDoff= 0
##$TI= <>
##$TILT= no
##$TM1= 0
##$TM2= 0
##$TOPLEV= 0
##$USERP1= <user>
##$USERP2= <user>
##$USERP3= <user>
##$USERP4= <user>
##$USERP5= <user>
##$WDW= 1
##$XDIM= 8192
##$YMAX_p= 0
##$YMIN_p= 0
$$ End of Bruker specific parameters
$$ ---------------------------------
##NTUPLES= NMR FID
##VAR_NAME=  TIME,          FID/REAL,        FID/IMAG
##SYMBOL=    X,             R,               I
##VAR_TYPE=  INDEPENDENT,   DEPENDENT,       DEPENDENT
##VAR_FORM=  AFFN,          ASDF,            ASDF
##VAR_DIM=   8192,          8192,            8192
##UNITS=     SECONDS,       ARBITRARY UNITS, ARBITRARY UNITS
##FACTOR=    0.0002768,     1,               1
##FIRST=     0,             0,               0
##LAST=      2.2672688,     0,               0
##MIN=       0,             -82702,          0
##MAX=       2.2672688,     82693,           0
$$ Real data points
##PAGE= N=1
##DATA TABLE= (X++(R..R)), XYDATA
0@%%%%%%%%%%%%%%%%%%%%%%Pj6J8j8J8j8J8k5L4l6L7m6N4n7O6p5Q4r6J05j16J31
$$ 0 0 0 0 0 0 0 0 0 0 0 0 0 0 0 0 0 0 0 0 0 0 0 7 -9 9 -9 9 -9 9 -16 18 -18 19 -27 27 -30 36 -39 45 -51 54 -62 69
43F9j47J62j77J98k19K40k67K94l22L55l91M29m73N25n79O40p12P93q89J000j133
$$ 69 -78 84 -93 105 -114 126 -141 153 -169 186 -205 224 -249 276 -303 337 -375 418 -471 529 -604
64f04J298j493J722j949J872J290Q0557q9996o0554J33109k6062j13706P2686
$$ -604 694 -799 923 -1026 846 2136 82693 -7303 -67857 65252 39190 -74516 -1830
77a830O2361r8550J440Q9566l8648n9998N9252K3100o3664K674O0636k5894n0275
$$ -1830 60531 -38019 -36579 52987 14339 -45659 13593 36693 -26971 -24297 36339 10445 -39830
90c9830M6652L1789o8887j069P7433l7555o1423P8001K1803r7036K9671Q1159
$$ -39830 6822 38611 -30276 -31345 46088 8533 -52890 25111 46914 -50122 -20451 60708
102F0708p8496l6579J00897j9068q6956O6144M5099q7310M432P8465m3799m8348
$$ 60708 -17788 -54367 46530 27462 -59494 6650 51749 -35561 -31129 47336 3537 -44811
114d4811O3031J2785o2967J7341N0509l6706l0607N0148Q978n5511J5431N0046
$$ -44811 18220 31005 -31962 -14621 35888 -818 -31425 18723 27701 -27810 -12379 37667
126C7667m2562l1919O3431M86o8110L6904M9696o8190j3506P7286k9981o0193
$$ 37667 -4895 -36814 26617 27103 -41007 -4103 45593 -22597 -36103 41183 11202 -48991
138d8991O3176K3060p4398J8472O0614m8972k9636O1748l450n4390K9771L5277
$$ -48991 14185 37245 -37153 -18681 41933 -7039 -36675 25073 21623 -32767 -2996 32281
150C2281m4199j2294M7780q811m1718K7762K8935m2694j0169M9420j4245m4720
$$ 32281 -11918 -24212 23568 14757 -26961 801 29736 -12958 -23127 26293 12048 -32672
162c2672L8891K5894n5731L095N5749l4689l7691N6364O572n9839K6633M3644
$$ -32672 6219 32113 -23618 -20523 35226 537 -37154 19210 25782 -34057 -7424 36220
174C6220n0021j5359N6066j4507m4794L7086K3517m6490M30M3719k0944l1455
$$ 36220 -13801 -29160 26906 12399 -32395 4691 28208 -18282 -17852 25867 4923 -26532
186b6532L5364J4459m1841N402L9770k5096k8360M0509Q176m6524J6374L9035
$$ -26532 8832 23291 -18550 -13148 26622 1526 -26834 13675 21851 -24673 -8299 30736
198C0736l8497j9251M9346q058m5270L3238K6607m7372n58M6110k4129l1388L9940
$$ 30736 -7761 -27012 22334 14276 -30994 2244 28851 -18521 -19079 27031 2902 -28486 11454
211A1454R491m2731J2566L4555k8693j9032L7067J032l6661J6476K8864l0429
$$ 11454 20945 -21786 -9220 25335 -3358 -22390 14677 15709 -20952 -4476 24388 -6041
223f041j4631L8295m427l7308K3789K6175l8589o729M2882j6668l4811L5860J5556
$$ -6041 -20672 17623 13196 -24112 -323 25852 -12737 -19466 23416 6748 -28063 7797 23353
236B3353m4321Q373L9105k9215k2671M0625P43l9298J9531K7902l2459j0270L6184
$$ 23353 -20968 -12595 26510 -2705 -25376 15249 15992 -23306 -3775 24127 -8332 -18602 17582
249A7582p545l1144K2301J9849l1139m543L2865j1539k7475K5114J5192l3105
$$ 17582 10037 -21107 1194 21043 -10096 -14639 18226 6687 -20788 4326 19518 -13587
261a3587J316L2643j8688k3345L1195O697l4885J1814K8231k6855j3387L3727
$$ -13587 -12271 20372 1684 -21661 9534 16231 -18654 -6840 21391 -5464 -18851 14876
273A4876m813l0273K0688J8531k9416k389K9746j2849k2136K3725R567k7502M554
$$ 14876 10063 -20210 478 19009 -10407 -12796 16950 4101 -18035 5690 15257 -12245 -7691
286g691K4482j6844j5754K4523L207k5964R901K0703k0923r926K6112l778k4309
$$ -7691 16791 -53 -15807 8716 11923 -14041 -4140 16563 -4360 -14286 11826 8048 -16261
299a6261J6561J5355k4735k016K5797j1790j9332K1925P505k5419O306K1852j7647
$$ -16261 300 15655 -9080 -11096 14701 2911 -16421 5504 13009 -12410 -6104 15748 -1899
312a899j2195K3649j62k3054J2254J6347k0586n601K3298o514j9840J6589J1025
$$ -1899 -14094 9555 9393 -13661 -1407 14940 -5646 -11247 12051 5537 -14303 2286 13311
325A3311k2418P13K1923j2100j5823K0192N156k2997O975J9448j7124j0456K2468
$$ 13311 -9107 -8394 13529 1429 -14394 5798 10954 -12043 -5068 14380 -2744 -13200 9268
338I268j163k1678J2630J5205k0423m439K2781p183j8835J6976J0006k2226J573
$$ 9268 8105 -13573 -943 14262 -6161 -10600 12181 4998 -13837 3139 13145 -9081 -7508
351g508K1320j2710j4629K0105L818k2201P659J7804j6976q778K1117k506j9523
$$ -7508 13812 1102 -13527 6578 10396 -11805 -4146 13658 -3318 -12096 9021 6515 -13008
364a3008J2707J2622j8919k798K0010p324j5695J5419P874j9109J970J8153j0981
$$ -13008 -301 12321 -6598 -9396 10614 3290 -12405 3014 10888 -8221 -6251 11902 921
377I21j2388J7391L671j9378O330J6273j4828q707J9360j662j8889J1613J2615
$$ 921 -11467 5924 9595 -9783 -3453 12820 -2008 -10715 8645 6983 -11906 -293 12322
390A2322j8444k920J9688p986j5334J6108O499j9331L790J6819j2504r712J7378
$$ 12322 -6122 -9042 10646 2660 -12674 3434 9933 -9398 -5608 11211 -1293 -11005 6373
403F373O73j7064P968J2905j3919n657J6645k377j5343R925J0820j5202l297J6952
$$ 6373 7046 -10018 -2050 10855 -3064 -8721 7924 5547 -9796 129 10949 -4253 -7550 9402
417I402n327j4783J3027Q112j7447P80J6905j0104j1637J6207K590j7490O849
$$ 9402 4075 -10708 2319 10431 -7016 -6236 10669 565 -11072 5135 7725 -9765 -2916
430b916J3089j3858n091J6253l806j3447J0829P205j3758L82J3161o753r250J1046
$$ -2916 10173 -3685 -8776 7477 3671 -9776 1053 8258 -5500 -5118 8043 1290 -7960 3086
444C086L859j2409K178J1391p517p965J1449K522j2987L732J1239r971o328J3503
$$ 3086 6945 -5464 -3286 8105 588 -7377 4072 6594 -6393 -2661 8578 -1393 -7721 5782
458E782j138j3272Q455Q316j3326n57J3565p418r098J2763J437j3155O425R287
$$ 5782 4644 -8628 -173 8143 -5183 -5740 7825 407 -8691 4072 5509 -7646 -1221 8066
472H066j1446k561J2554m205r591R122M703j1021Q17J0230n425p480Q476L572
$$ 8066 -3380 -5941 6613 2408 -7183 1939 6642 -4379 -3562 6668 1243 -6237 2239 5811
486E811j0226J009R793n729p430R424K729j1271L235R843q820n195J2029j620
$$ 5811 -4415 -3406 6387 658 -6772 2652 5381 -5890 -2655 7188 -1632 -6827 5202 3582
500C582j1414Q482O836j2580L03J2794p391q659J2398K034j3487N136J0660j0340
$$ 3582 -7832 650 7486 -5094 -4791 8003 612 -8047 4351 6385 -7102 -1966 8694 -1646
514a646n325J2693j093j1908O729Q288j0583l172J1692k593j0277P500O367j0643
$$ -1646 -6971 5722 4629 -7279 -550 7738 -2845 -6017 5675 3082 -7195 305 6672 -3971
528c971r75J0982m652q475R212L601j1038K386R965p634n828J1071J4j1209N927
$$ -3971 -4946 6036 1384 -7091 2121 5722 -5316 -2930 7035 -599 -6427 4644 4658 -6551 -624
543f24Q325j0321l092J2024l120j0574Q495O243j1817k73J1612n791q565J0048
$$ -624 7701 -2620 -5712 6312 3192 -7382 1113 7356 -4461 -4734 6878 1087 -7478 2570
557B570L040j1321K965R206p751m614R973r41q891N649N501q076r72Q558l310
$$ 2570 5610 -5711 -2746 6460 -1291 -5905 4068 3127 -5764 -115 5386 -2690 -3662 4896 1586
572A586o715O621L621q296K43Q424m324o825P785L339r976J443R665o695o679
$$ 1586 -5129 1492 5113 -3183 -2940 5484 1160 -5665 2120 5459 -4517 -3074 6591 -104 -6783
587f783J0543J034j1517N262Q533j0102k762J1583l815q915Q736L537j0148K502
$$ -6783 3760 4794 -6723 -1461 7072 -3030 -5792 5791 1976 -6939 1797 5334 -4814 -2312
601b312Q282o760l950Q329n73p309M137M915o219j880O807j095o292L678M820
$$ -2312 5970 -790 -4740 3589 3016 -4293 -156 4759 -1460 -3340 3467 2372 -3920 -242 4578
616D578o115k335P556j359p428N230M866q350k92Q754m730o100Q437J083q974
$$ 4578 -1537 -3872 3684 2325 -5103 127 4993 -3357 -3649 5105 375 -5725 2712 3795 -5179
631e179M496O254q031j369Q668l626o098O916K127p537J789O182m627l626O013
$$ -5179 -683 5571 -2460 -3829 4839 1213 -4885 2031 4158 -3379 -1590 4592 -35 -3661 2352
646B352O85o383K011N431m447l840O492P09p298L009O227o725k893Q675j825p919
$$ 2352 3037 -3346 -1335 4096 -351 -4191 2301 3010 -4288 -1279 4948 -1777 -4670 4005 2180 -5739
662e739O612M410r170R39Q751n789n251Q676M40q635M245O104p256k106P899j859
$$ -5739 873 5283 -3887 -2948 5803 14 -5237 3439 3879 -4756 -511 5593 -1663 -3769 4130 2271
678B271o823M868M374o919j244P328k193o613N368M104p590m66Q030l667o301
$$ 2271 -4552 316 4690 -2229 -3473 3855 1662 -4951 417 4521 -3069 -3535 4495 828 -5473
693e473P345K435q744K382P524o297l885Q405n97p820M754N204p114j463P616
$$ -5473 1872 4307 -4437 -2055 5469 -828 -4713 3692 3095 -4725 29 5233 -1881 -3344 4272
708D272k379o286N264L546o942k87O915l151n541N811K632p327J118O753m778
$$ 4272 1893 -4393 871 4417 -2525 -2812 4103 952 -4589 1222 3854 -3473 -2355 4398 -380
723c80m303P218L18p286L770N215o452j474P186k409n509N305K544o222Q11N524
$$ -380 -4683 2535 2853 -4433 -663 4552 -1900 -3374 3812 1403 -4106 1199 3743 -2479 -1668 3856
739C856l510l611N048J189n526J343M699l648l252N373O05n879K272M756n042
$$ 3856 346 -3265 1783 2972 -2554 -1211 3488 -160 -3412 1961 2566 -3313 -1041 3715 -1327
754a327k243O560j307n939M673L412o566M07O386l938l961O103N13n945K724M257
$$ -1327 -3570 2990 1683 -4256 417 3829 -2737 -2330 4056 118 -3843 2260 2773 -3172 -448 3809
770C809m764j545N198j084m419K998K769m287p67M575j392m011L195K433m618
$$ 3809 -955 -2500 2698 1614 -2805 193 2962 -1325 -2092 2483 1091 -2920 275 2708 -1910
785a910k83M998k335l884M525J499n345J464M639m067k141N282p28m759L473K784
$$ -1910 -2193 2805 470 -3414 1111 2610 -2735 -1271 3368 -699 -2840 2442 1714 -3045 428 3212
801C212m790j60M725k322l293L860J211m473J014L752k849k316L812L62m125J630
$$ 3212 -1578 -1738 2987 665 -2628 1232 2443 -2030 -1016 2736 -113 -2429 1383 1745 -2380 -750
817g50L338l429j737M368m17m112K643K854m261m64M631j912l510L989J336m630
$$ -750 2588 -841 -2578 1790 1373 -2739 -96 2758 -1503 -1967 2664 752 -2758 1231 2567 -2063
833b063J159M037l336k154M391k06m271K413K827l906p92M054j274l474K876J913
$$ -2063 -904 3133 -203 -2357 2034 1828 -2443 -30 2797 -1109 -1901 2153 879 -2595 281 2194
849B194l710k16L801j674k912L155J461l885M51L742k211k601L733Q25m104J258
$$ 2194 -1516 -1732 2069 395 -2517 638 2099 -1786 -1335 2407 196 -2405 1328 2153 -1951 -693
865f93L640l300j825M215m83l860K511K468l875l65L850j880k655L076Q85l492
$$ -693 2947 -353 -2178 2037 1554 -2306 205 2673 -1202 -1567 2283 403 -2252 824 1709 -1783
881a783R28K674k181j370K643R9k495J029J956j716j134K246K78k281P19K212
$$ -1783 -855 1819 -362 -1732 911 1010 -1485 -456 1500 -216 -1350 896 1174 -1107 -388 1824
897A824j911j305K804k22k794J848J847l103L7K958j921j755K859j71k714J804
$$ 1824 -87 -1392 1412 1190 -1604 244 2091 -1012 -975 1983 62 -1693 1166 995 -1719 85
913H5J302k634M76K046j594q00J894l63j362J045N47q57l9N94J44m78k15Q80m3
$$ 85 1387 -1247 -771 1275 -319 -1119 775 412 -950 95 642 -215 -254 340 484 6 -209 671 628
932F28j252Q45J044j792k8J974j450j330K439l50k366K008R39k700Q49K094k345
$$ 628 -624 221 1265 -527 -555 1419 -31 -1361 1078 728 -1638 370 1309 -1391 -542 1552 -793
949g93m11K507j240j519K250q6j879J366Q65j561K65J049o27l49M79J02j03k77
$$ -793 -1204 1303 63 -1456 794 708 -1171 195 1060 -501 -236 813 186 -163 316 418 315 38
967C8r2P53n60o16J072j73j277J095N27j731O26J295j590j33J764j224q72J917
$$ 38 -54 699 139 -477 595 422 -855 240 767 -964 -338 957 -633 -766 998 -226 -1098 819
985H19m82j526J641M95j754O83J203j249k77J177l48p22O05L37m68k91N03J40
$$ 819 337 -1189 452 947 -807 -124 1079 -170 -447 730 382 -340 265 602 134 -157 346 486
1003D86o77j7Q05o28p01J180j17j306J070O56j621M44J419j509m08J930q14j267
$$ 486 -191 -208 597 -31 -732 448 331 -975 95 751 -870 -426 993 -516 -924 1006 192 -1075
1021a075J713J25j622J009P32j196J09R52n57k62L29k4k8k17m2N51m76n72J067
$$ -1075 638 763 -859 150 882 -314 -205 747 190 -72 257 233 205 -12 -54 497 21 -551 516
1040E16k30j292J235N54j930R11J564k202j7K424j767j282K799o39k228K261P09
$$ 516 286 -1006 229 783 -1147 -236 1328 -874 -891 1533 -234 -1516 1283 644 -1584 677 1386
1057A386k646J165J761k246K8J851j179q74J484l14q07N01J87k81j15j59N34o5
$$ 1386 -1260 -95 1666 -580 -552 1299 120 -754 730 416 -391 110 297 16 -99 -258 276 211
1075B11j100R79Q45k037N63K160k176r17L109j140k531L156N63l666J915K514
$$ 211 -889 90 935 -1102 -539 1621 -555 -1472 1637 497 -2034 1122 1685 -1981 -66 2448
1091B448l467j33L419k050j955L042j47k532J496J209j763k74J322j72r74O7R90
$$ 2448 -1019 -1152 2267 217 -1738 1304 1157 -1375 121 1330 -433 -707 615 443 -531 -464 526
1108E26j72j482J010J503k200n22L096j352k666L426O75m084K046L006l999l84
$$ 526 354 -1128 -118 1385 -815 -1337 1759 407 -2259 1167 1842 -2242 -196 2810 -1189 -1573
1124a573M228k293k617L835R7l643K092K001l095j48K655j215j604J525O78j470
$$ -1573 2655 362 -2255 1580 1677 -1966 126 2127 -968 -1116 1539 324 -1280 245 923 -547
1140e47k82J386R5j689M72J963j589j586L007P5l429K127K522l881r9M229k500
$$ -547 -829 557 652 -1037 -565 1398 -191 -1777 1230 1305 -2124 3 2525 -1356 -1455 2774 274
1157B74k744M250O1m227K484K612m002j49L742k025k334K931N61k871O88K339
$$ 274 -2470 1780 1841 -2386 98 2710 -1292 -1441 2301 276 -2058 873 1434 -1437 -749 1590
1173A590j648j515K013Q83k480O5K767j288k305K687J153l616R13L499k990j907
$$ 1590 -58 -1573 440 1323 -1157 -1092 1675 387 -1918 769 1922 -1694 -781 2718 -272 -2179
1189b179M285o92l856K903K125m062J69L846k439k325L431L49l459J344K608k525
$$ -2179 2106 1414 -2442 461 2586 -1476 -1307 2539 100 -2225 1206 1555 -1904 -560 2048 -477
1205d77j335K975M1l028J280K555k383j537L366l6l582K048K825l797p37M428
$$ -477 -1812 1163 1204 -1824 -544 2011 -372 -1909 1457 1421 -2161 -113 2712 -1085 -1822 2606
1221B606j730l561L884J225m486J260L716l437j702M164p02l576K383K147l394
$$ 2606 876 -2685 1199 2424 -2062 -802 2914 -523 -2225 1939 1237 -2339 44 2191 -1203
1236a203m16L370j151k724K329J664k989l99L382j163l017K854J885l993J86M211
$$ -1203 -1619 1751 600 -2124 205 1869 -1120 -1519 1863 700 -2317 537 2422 -1571 -1385 2826
1252B826k559k928M411N12m815K194L594m276j140M803j620l861L601J811m426
$$ 2826 267 -2661 1750 2262 -2553 -359 3235 -1041 -2181 2622 1002 -2859 742 2553 -1873
1267a873N15L822k485k504L522Q05l759R29L411k556k185L659N90m038J445L571
$$ -1873 -1358 2464 -21 -2525 997 1802 -1957 -1028 2383 -173 -2358 1301 1891 -2147 -702 2869
1283B869l344j874M593n48m415K926K908m605l87M808k300l521M088J195m668
$$ 2869 -475 -2349 2244 1696 -2719 207 3115 -1490 -1877 2931 631 -2890 1198 2393 -2275
1298b275J250L799l196k058M065l8l958J939L036l417j330M089n50l895K499K841
$$ -2275 -1025 2774 -422 -2480 1585 1547 -2411 -472 2564 -853 -2183 1906 1356 -2539 -40 2801
1314B801m021p81M642j672l831L813J812m821P57M432l186k743M702J05m686K318
$$ 2801 -1220 -2001 2641 969 -2862 951 2763 -2058 -1301 3131 -55 -2798 1904 2009 -2677 -359
1330c59L325m075j175M538j235l793L024K194m037j90M164j795l278L471J673
$$ -359 2966 -1109 -2284 2254 1019 -2774 250 2444 -1593 -1783 2381 586 -2692 779 2452
1345B452m310O12M105k663k792M165O98m663J838L771l900j770M788q66m360L142
$$ 2452 -1858 -1246 2859 196 -2596 1569 2267 -2396 -558 3213 -687 -2457 2331 1465 -2895 247
1361B47K646m611k39M565k160l409L860J440m611R97M065l013k495M239M53m489
$$ 247 2893 -1718 -1957 2608 448 -2961 899 2339 -2272 -1275 2790 -223 -2718 1521 1974 -2515
1377b515J897L656l752j616M628p35m262L023K714m484m26M694k054l588L865
$$ -2515 -618 3038 -714 -2330 2298 1563 -2699 324 3038 -1446 -1872 2822 768 -2820 1045
1392A045J457m623Q73M098k946k666M326L47m592J975L623l826j671M746q11m258
$$ 1045 2502 -2121 -1248 2850 -96 -2762 1564 1911 -2681 -706 2917 -909 -2580 2166 1355 -2903
1408b903L075K744m466l56M665k066l411L869J429m616R68L980k966k447M149
$$ -2903 172 2916 -1550 -1906 2759 693 -2718 1151 2580 -2036 -1068 2912 -54 -2501 1648
1423A648K90m253J804L278l443j669M279n72m144K682K860m102q92M768j679l943
$$ 1648 1938 -2315 -511 2767 -676 -2345 1934 1362 -2782 -100 2760 -1342 -2234 2534 855 -3088
1439c088L890K031n058P71M708l314k860M907J62m893K447L458m151j207M722
$$ -3088 802 2833 -2225 -1454 3254 -60 -2920 1987 2149 -2744 -297 3161 -990 -2197 2525
1454B525j437l726L083K044m015n1L854j843k962L103J530l830K75L861k207k925
$$ 2525 1088 -2638 445 2489 -1526 -1577 2277 434 -2528 575 2105 -1725 -1450 2411 204 -2721
1470b721L914J025m615J522M011l612k155M973n85m819L305K981m851k23M923
$$ -2721 1193 2218 -2397 -875 3136 -476 -2631 2342 1757 -3062 243 3224 -1627 -1850 3073
1485C073k578l439M301J080m698J290L713l171k015L922J17l845J678L008l214
$$ 3073 495 -2944 1357 2437 -2261 -971 2742 -429 -2444 1478 1595 -2250 -572 2436 -778
1500g78j418L958l92l900K414K831l972p65M662j680l849L828J816m860Q85M379
$$ -778 -2196 1762 1370 -2530 -116 2715 -1257 -2022 2640 960 -2889 939 2755 -2105 -1220 3159
1516C159l255k604M584O8m494K273L158l866j196M260r79l673K707K208l763l41
$$ 3159 -96 -2700 1884 1952 -2542 -269 2889 -977 -2173 2087 1108 -2565 142 2350 -1413 -1754
1532a754L891j499l206L144J786m147M22M198k664k742M191N22m586K023L537
$$ -1754 2137 638 -2568 576 2362 -1785 -1363 2835 171 -2571 1620 2142 -2444 -421 3116
1547C116l925j453M670j172l864L122K132m256l0M085k042k873L352J159l849
$$ 3116 -809 -2262 2408 1236 -2628 494 2626 -1630 -1660 2425 383 -2490 862 2021 -1828
1562a828P10L464k354k375L612O87m135J497L452l285j783M424o27m075K959K464
$$ -1828 -1118 2346 -8 -2383 1229 1916 -2219 -722 2730 -555 -2338 2086 1459 -2616 343 2807
1578B807m216k73M354k211l045L710J060m195J190L337k742j948L575J09l590
$$ 2807 -1409 -1682 2672 461 -2584 1126 2186 -2009 -819 2518 -224 -2172 1403 1512 -2078
1593b078J558K783k864j486L668j96l713K254K661l636q99M312j446l598L703
$$ -2078 -520 2263 -601 -2087 1581 1385 -2328 -74 2587 -1049 -1948 2364 918 -2680 1023
1608A023J502m555R86M009l230k074M323m26l976K449K394l573m87L555j316k769
$$ 1023 2525 -2030 -1044 2965 -265 -2339 1984 1558 -2418 31 2425 -1148 -1635 1920 604 -2165
1624b165K504J537k994j91K988j115k612K418J656l342o9L662j876k835L633J074
$$ -2165 339 1876 -1118 -1309 1679 564 -2048 370 2026 -1316 -1385 2277 401 -2434 1199 2273
1640B273m424J457L681l658j546M529j082l979L327J948m255M22L851k555k364
$$ 2273 -2151 -694 2987 -671 -2217 2312 1230 -2749 578 2526 -1729 -1307 2544 -11 -2375
1655b375L632L67l546J310K607k417j490L097J55l071J302K544k513j491L491
$$ -2375 1257 1624 -1922 -612 1995 -422 -1912 1185 1340 -1731 -429 2115 -398 -1889 1602
1670A602k45l477K116K528l638n35M099j679l364L679J190m239J097L530l074
$$ 1602 1357 -2120 -4 2524 -1114 -1649 2450 771 -2593 1086 2276 -1963 -866 2664 -410
1685d10j740L820l66l443K015K292l128o87L339r08k800K218J779l003l80L321
$$ -410 -2150 1670 1304 -2139 -124 2168 -960 -1647 1692 784 -2016 202 1981 -1022 -1402 1919
1701A919j139k901K723J638l661L98L507k413k295L753J91l852J882K816l509
$$ 1919 780 -2121 602 2240 -1421 -1023 2484 71 -2224 1529 1720 -2132 -250 2566 -943
1716i43q61L829j257l033K776J462l410K62L075j707k177K697Q22k939N84K772
$$ -943 -1804 2025 768 -2265 511 1973 -1437 -1175 1900 193 -1984 713 1535 -1404 -820 1952
1732A952j881j904K901N73l332J325K770k858j346L615n62l475K496K044l660
$$ 1952 71 -1833 1068 1641 -1691 -366 2404 -454 -1800 1815 1253 -2222 274 2318 -1342
1747a342n3L623j870k550L267N28l386J128K699k446j405L147k08k895J578K076
$$ -1342 -1395 2228 358 -2192 1075 1603 -1783 -655 2044 -402 -1807 1340 1132 -1763 -185 1891
1763A891k523r00L022n09k737J961J880l048l29L284j377k568K827J066l575Q40
$$ 1891 -632 -1532 1490 981 -1756 205 2085 -963 -1292 1992 615 -1953 874 1940 -1635 -795
1779g95L045k511j667L412k92l240J926K095k898n82L144j116k399K214J395k843
$$ -795 2250 -261 -1928 1484 1192 -2048 -122 1973 -925 -1507 1637 521 -1878 336 1731 -1112
1795a112J04K734j363k105K488R29k982N72K795k078j755L081P3l135J537K394
$$ -1112 -1008 1726 363 -1742 746 1675 -1307 -735 2060 -18 -1773 1308 1381 -1754 -217 2177
1811B177k989o63L264j081k753K501J356l207L89K874j895j820K784L72k770R16
$$ 2177 -812 -1475 1789 708 -2045 456 1812 -1395 -1006 1868 -27 -1847 937 1309 -1461 -545
1827e45K335k058j265K729n6k664J343K152k465r52L050o36k806K110J708l066
$$ -545 1790 -268 -1533 1196 1140 -1524 -181 1971 -494 -1446 1604 968 -1838 272 1980 -1086
1843a086kL082j738k221K854O48l219J115K501k421j208K956l24k683J720J760
$$ -1086 -1088 1994 256 -1965 889 1537 -1682 -567 1934 -487 -1695 1261 937 -1746 -26 1734
1859A734k502n42K856p90k354J912J439k695r7K829j362k087K402R03k992O25
$$ 1734 -768 -1310 1546 756 -1598 314 1753 -942 -1039 1790 428 -1659 743 1646 -1346 -721
1875g21K742k175j533K841Q5l000J594K059k736n74K951r22k407K174J171k699
$$ -721 2021 -154 -1687 1154 1239 -1761 -167 1892 -844 -1418 1533 611 -1796 378 1549 -1150
1891a150K90K590j547j810K427N56k584P81K166j820j285K476J02k568J308J799
$$ -1150 -860 1730 183 -1627 800 1356 -1228 -447 1719 -101 -1386 1090 1192 -1376 -68 1731
1907A731k257q25K746n87k405J892J295k676M9K729j538j915K509N58k803J020
$$ 1731 -526 -1351 1395 808 -1597 295 1590 -1086 -1037 1692 154 -1761 748 1306 -1497 -477
1923d77K250k071j205K713k56k446J563J714k436m32K594q60k065J856J098k452
$$ -477 1773 -298 -1503 1210 954 -1492 71 1785 -651 -1083 1511 651 -1414 442 1540 -912
1939i12J37K351j330j715K124N96k443O25K138j755j264K361J40k566J323J833
$$ -912 -775 1576 246 -1469 655 1251 -1192 -567 1571 -184 -1448 913 1053 -1513 -190 1643
1955A643k217o85K631p40k200J898J295k626J57K614j531j745K414M55k582Q72
$$ 1643 -574 -1259 1372 632 -1568 330 1625 -1001 -844 1770 239 -1506 908 1363 -1219 -347
1971c47K084j963j026K371k58k260J368J527k133m30K267p08j941J662J181k267
$$ -347 1737 -226 -1252 1119 861 -1399 -31 1496 -637 -1067 1200 492 -1449 213 1394 -873
1987h73J8K246j171j609K044O85k484O72K178j797j208K423n1k410J306J714k266
$$ -873 -855 1391 220 -1389 655 1340 -1144 -472 1706 -91 -1299 1124 1073 -1337 -31 1683 -583
2004e83m98K475q18k065J808J061k336J49K221j381j456K058N27k307O73J921
$$ -583 -1081 1394 576 -1489 319 1380 -956 -807 1414 33 -1423 635 1162 -1145 -472 1449
2020A449j635j059K170K4k193J150J734k097n67K366o43k078J677J238k338oK269
$$ 1449 -186 -1245 925 949 -1244 -94 1640 -457 -1024 1342 699 -1379 298 1536 -802 -808 1461
2037A461j190j685K072N98k361O12J989j713j154K251m4k143J150J545j920n01
$$ 1461 271 -1414 658 1256 -1105 -493 1496 -217 -1371 880 836 -1307 -157 1388 -532 -1033
2053a033K199o23j800J531R71j984N9K035j011j550J858N05k032M61J792j363
$$ -1033 1166 543 -1257 274 1245 -739 -680 1355 344 -1206 652 1157 -875 -414 1378 15
2069A5j125J925J60k033Q34J601j773o60K015l44j903J376J152j984j27K160j037
$$ 15 -1110 815 975 -1058 -224 1377 -396 -1056 959 615 -1288 88 1240 -744 -871 1289 252
2086B52j524J841N58k120O79J767j609q43J940j32j809J157J108j720l53J852
$$ 252 -1272 569 1127 -993 -314 1453 -156 -999 941 809 -1000 157 1265 -455 -808 1044
2102A044n44j460J175Q00j644k1J571o12j401J415O62j826K73J761j135j254J863
$$ 1044 500 -960 215 1015 -629 -650 921 309 -1092 323 985 -841 -568 1193 58 -1196 667
2119F67L23k081Q95J694j936n21K086n25j820J629Q83k090J81J876j157j197J783
$$ 667 990 -1091 -196 1498 -438 -959 1127 602 -1218 411 1294 -796 -615 1261 104 -1093 690
2136F90J76j782O68J332j259p23J500Oj482O70J236j237o71J615j21j567R33J200
$$ 690 866 -916 -248 1084 -175 -898 602 608 -874 -204 1032 -205 -876 739 618 -949 -16 1184
2154A184j625l57J906o44j508J538O97k036M44J698j299j035J892n3j788Q93J234
$$ 1184 -441 -798 1108 464 -1044 494 1191 -845 -401 1297 -2 -1037 855 802 -986 -93 1141
2171A141j561l62J630m70j393J123Q16j486j45J578o45j163J194O86j558J29J594
$$ 1141 -420 -782 848 378 -1015 108 924 -562 -707 871 226 -937 257 943 -615 -486 1108
2188A108r67j105J575L08j803P70J294j356o04J760m37j507J181P62j500k3J499
$$ 1108 141 -964 611 919 -884 -114 1180 -176 -780 980 543 -964 217 979 -521 -544 955
2205I55q04j014J173M10j315J37J283p40q83J204L90j466K65J448j135p25J555
$$ 955 151 -863 310 720 -595 -458 825 85 -798 406 796 -670 -405 1043 -92 -817 738
2222G38L5j640Q82J197j506m12J715o77j294J379N21j615L26J309r81q67J442
$$ 738 773 -867 15 1212 -294 -706 1009 332 -962 417 938 -677 -351 958 -23 -890 552
2239E52O8j339N55R28r20n53J229j10r82N21Q97j008m02J286k34j210Q61Q41j380
$$ 552 620 -719 -164 764 -156 -709 520 410 -572 -51 846 -162 -564 722 488 -722 139 980 -400
2258d00QJ329p28j045J233L57j457N03J077j022n73J290j33j185P52O90j017k01
$$ -400 -392 937 209 -836 397 754 -703 -200 877 -145 -718 572 439 -746 6 696 -321 -522
2276e22J145k60j041P77O95j200L8J120m99q39R78L79j240K79J129q91p28J281
$$ -522 623 363 -678 99 794 -406 -368 752 253 -586 392 771 -469 -190 939 48 -680 601
2294F01Rj274P08P94j117k59J194l85j001Q90N00j173J09R83m85o94Q55L31j012
$$ 601 610 -664 44 838 -279 -538 656 271 -730 160 660 -513 -404 579 94 -600 255 586 -426
2313d26J51J030o20p28R96K35j116M29R38r63n14J211j06j140P93O14j209k8J254
$$ -426 -275 755 135 -593 403 638 -478 -49 889 -74 -588 623 517 -623 170 784 -425 -453 801
2332H01o51q17J007K30j098K80Q71o46n15R04M9r09L69P84p40l73Q83M4r86M68
$$ 801 150 -667 340 570 -528 -248 623 -23 -538 366 415 -494 -125 659 -81 -454 429 473 -513 -45
2352d5Q20r45k60J064k38r88P97N17j068K0J006n69o57R58J40j171N37P04p55
$$ -45 775 -170 -430 634 396 -592 205 722 -346 -326 680 111 -546 412 552 -619 -82 622 -133
2371a33l33Q92j84o97N43M74p14j93Q85k61o89N40N35q50q1Q41l53o91P30L57
$$ -133 -466 426 242 -455 88 562 -152 -345 540 279 -410 130 665 -185 -266 575 222 -469 261 618
2391F18r41P7R42o80n04R11j2r18M62O69q13k67R42k96p07O40M43q76QQ77m05
$$ 618 -323 -246 696 16 -488 423 411 -507 -45 624 -189 -456 486 190 -517 123 566 -310 -302 575 170
2412A70n60O23K76p60J05P02l93n26O53J95p14J55O06m53m56O81M8p50K84O34
$$ 170 -390 233 509 -251 -146 556 163 -363 290 485 -229 -74 532 79 -377 304 352 -398 -114 520
2432E20o32k92Q44k30p10O64L47p85N2P71n38m95Q39K9o71K60N25n10k24O75j84
$$ 520 -112 -404 440 210 -500 164 511 -274 -222 549 11 -484 355 384 -287 -27 498 -12 -236 439 255
2453B55m81K84L87m84j95N56r7m84L14L89n26k04O70k51n82N77K90p29P8P24n48
$$ 255 -226 58 445 -39 -234 322 225 -259 55 444 -82 -286 384 133 -449 128 418 -311 -233 491 -57
2474e7l53P36Lp80N12N26p02j12P40k86n50N46K14o48J73M39k98l28M05J61n05
$$ -57 -410 326 329 -451 61 587 -115 -227 513 227 -323 223 437 -211 -38 401 103 -225 180 341 -164
2495a64J04L84k42l67M63J87n80O9N90m28m20P28M2p55M33N58p44j24Q21l16o24
$$ -164 -60 324 82 -285 178 365 -215 -146 444 16 -404 324 366 -389 44 602 -142 -266 555 239 -385
2516c85O64J38p21K06N96m73k73M66J2m22J81K99l30j50L57P4m25M6M86l28l21
$$ -385 279 417 -304 -98 498 25 -248 218 230 -192 -11 288 -42 -192 165 239 -186 -140 346 18 -303
2537c03M98J82p30L58M80n59j70O92j92o31O12K48p04J75N45m67k91O20o4n81
$$ -303 195 377 -353 5 485 -74 -244 448 256 -375 237 485 -219 -44 501 34 -257 363 299 -282
2557b82K95K97m05j17M93j09m32K05L93m44j34N48j62m50L69L50n58j7N58k12
$$ -282 13 310 -95 -212 281 172 -260 -55 338 -106 -240 308 146 -304 65 415 -143 -160 398 186
2577A86m34N30J17n55J32N12m56k32M92L5m90J20L72k92k24M91o1n18K81L76m71
$$ 186 -248 282 399 -156 -24 488 32 -200 292 327 -163 -43 329 37 -187 304 243 -275 6 382 -89
2598h9j92N93j76m10L69L54o73P8O08l89k94M70L7n11L09L73n00n6M21j55k72
$$ -89 -281 312 136 -274 95 449 -224 -146 462 73 -221 249 286 -225 84 457 -43 -99 322 167 -105
2619a05J99J42k65q4L04O2m31J94L17m05k26O18j78m84M04L57n84P3N22m23k68
$$ -105 94 236 -29 -113 191 253 -178 16 333 -72 -298 320 142 -342 62 419 -165 -92 430 7 -261
2640b61O05K0o24L30L81n65n6N27k38k94L74J28m32M2L32j86l29L28J51m22O0
$$ -261 344 364 -260 70 451 -114 -170 357 119 -175 199 327 -105 -63 269 83 -246 82 233 -189 -129
2661a29M13k14l45M20J94o15J98N44n09k03N73j0o45M69K92n83J0O31m12k74M47
$$ -129 284 70 -275 145 339 -276 -78 466 -43 -246 327 317 -328 141 433 -150 -140 491 79 -195 252
2682B52O1m31Q6L09k45k30K89J39m07O9M09k64l20M20J39m98J73M74m59k76P19
$$ 252 313 -118 -32 277 32 -198 91 230 -177 -108 301 37 -283 137 276 -222 -49 425 -34 -310 409
2703D09j26o44N03M00p24R0O02m09l18N48k3n21K59L55m52r4L83r5l04J24L26
$$ 409 283 -361 142 542 -182 -92 510 101 -217 331 308 -213 46 401 -51 -145 238 143 -161 -37 289
2724B89k93k35M22M1m42J71M04m57j40N85j65n55N04K74n96J15N25l72l90O56
$$ 289 -4 -239 183 224 -218 -47 357 -100 -240 345 180 -375 129 403 -193 -78 447 75 -315 341
2744C41l6n75L17L74m78j03M54j50m04L58J93l48q1M23j65l24K92L00n83o4P19
$$ 341 305 -270 47 421 -57 -160 294 144 -260 98 291 -57 -138 285 120 -204 88 388 -195 -259 460
2765D60l93l31M59J28n55J99M94m28l09O75j46n27M02L12m92q8N06k14l63L38
$$ 460 67 -264 195 323 -232 -33 461 33 -276 399 253 -274 128 440 -52 -140 366 152 -211 127
2785A27J81m26j06N41k34l85L70K89n40L7N72l68l69N66P8n56K39N01n72j56O27
$$ 127 308 -118 -224 317 83 -302 68 357 -183 -146 426 58 -311 255 333 -223 16 517 -55 -211 416
2806D16j81m90M28K30n45L9M69l20k89M10Q3m55L6N01l29k61L91J01m27R5N03
$$ 416 235 -255 173 403 -142 -103 366 46 -243 167 250 -205 -169 332 3 -258 133 234 -193 -98 405
2827D05l99l21O55o4n95M21L43n62j16O88k33m71N13J22o34J66N39m32k99O06
$$ 405 6 -315 340 276 -319 102 445 -117 -233 455 222 -249 264 386 -248 -82 457 25 -274 332
2847C32o8m83J93M09m70k24N50J0n09K88L33m73j55N99j70n56N37K88o40P4O63
$$ 332 264 -219 -26 383 -87 -311 239 249 -260 28 361 -112 -267 332 162 -394 143 431 -209 -135 528
2868E28m51l89O73L2o76L32M70n48k11O06j61n11M23K71m29k05O12k63m36M20
$$ 528 77 -312 361 393 -283 49 519 -29 -240 366 205 -306 117 388 -41 -246 366 103 -333 87
2888H7K59n34l5N99k44m94N16K38o76J42P03n47l09O81J9p81M28N28p66p0O93
$$ 87 346 -188 -223 376 132 -362 154 392 -284 -142 561 14 -295 386 405 -376 52 580 -186 -256 437
2909D37k32n14M66K22o38R2N63l50l50N02M7m77J58M58l65l10O05Nn21J73N07
$$ 437 205 -309 157 379 -259 -167 396 46 -304 198 245 -232 -74 384 19 -291 314 319 -202 -29 478
2930D78n00k88O67qo50M05L87o47m3O66l36m90O15J85p29K26N46n23k46O21j23
$$ 478 -22 -310 357 349 -301 104 491 -156 -199 467 131 -359 256 441 -288 -62 484 -39 -285 336 213
2951B13n50L43L72n53nN22j65m24L30L43n27p7N80j96n56N63K46o14J7O34l96
$$ 213 -337 6 378 -175 -180 342 177 -247 83 426 -101 -178 402 206 -350 213 459 -155 -138 496 100
2972A00m08O09Q0p13L19M71n71k56P71j58o96N68L45p15M6O38l91m18N67K35o92
$$ 100 -308 301 381 -332 -13 458 -113 -369 402 244 -452 116 461 -254 -208 430 39 -379 188 423 -269
2993b69J03O14m39k05M45O1n15K70L97m34k74O08n8n95L62L43m76j82O43k11m88
$$ -269 -166 448 9 -196 249 310 -205 65 462 28 -246 362 304 -291 71 414 -62 -244 399 188 -300
3014c00M38K78o22N3O47m74l87O26J17o99K97N67o06k47P18j65n33L88L87o23
$$ -300 138 416 -206 -153 494 20 -367 259 376 -323 -26 541 -65 -312 406 241 -292 96 483 -140
3034a40m7O64l48m18M66K03o42J58N56l96l15M56R2n62J95M67m11l23P21q0o54
$$ -140 -187 477 129 -289 177 380 -262 -104 452 56 -259 197 289 -273 -78 389 -22 -345 376 296 -358
3055c58L85N24p01j48P63k64n70O13K39p08J12O42m61m15O67R2o96K84N58o38
$$ -358 27 551 -150 -298 465 201 -369 244 483 -225 -113 529 68 -347 320 412 -284 0 558 -80
3075h0k55P13q6o42L19M90o18j41O50j82n30N01K46o16K1N86k76m78O79J21o78
$$ -80 -335 378 292 -350 -31 459 -159 -300 350 168 -362 139 385 -231 -210 376 100 -378 301 422 -256
3096b56K19N48n11l08O72Mo77L34M67n88j35O02j73n64M14L92o93J6O84l33m98
$$ -256 -37 511 0 -308 364 368 -309 25 492 -96 -231 371 198 -366 48 440 -253 -237 447 114 -384
3117c84O35N5o35K11N96m85l68P86j26n81L85M25o78o7O57j96n15M79J89n61J3
$$ -384 251 306 -329 -118 478 -7 -375 411 285 -296 89 514 -164 -231 426 230 -285 194 383 -178 -165
3138a65N96l78m11N73J26n45P0O10m67l72O45P2p70M56M84o61j39O73j62n75N20
$$ -165 431 53 -358 215 341 -204 -134 476 9 -363 282 354 -416 40 524 -137 -276 397 235 -340 180
3159A80K43o54O1O35l59m50N72K12o75J08N63m17l35O27K9o30K81M92n60k35O54
$$ 180 423 -231 -170 465 106 -344 228 440 -235 -127 436 19 -316 311 340 -290 -9 483 -77 -312 342
3180C42j31n67M52M33p52k8P09l44n31O73J82p35K87N36n05l04O47m3n77L10M13
$$ 342 211 -356 96 529 -223 -251 458 114 -417 256 438 -297 -10 526 21 -283 364 321 -256 54 467
3201D67n08j52N30r4n20K86L85n15j21O27k30n41N76K43p49J36O61m39l74O93
$$ 467 -41 -193 337 243 -277 9 394 -121 -242 385 155 -386 190 433 -316 -180 481 42 -332 361
3221C61L6p98M59N38o64j75P46k69n84N34K80o33J7O22l78m16N23J20o04J21N34
$$ 361 397 -401 58 596 -68 -243 503 234 -350 184 464 -169 -152 470 92 -324 199 319 -285 -164 370
3242C70l55l78N74J39o31J92N56m99k63O75q1o59M51M10o71NO50l33m70N32K17
$$ 370 15 -363 211 350 -281 -89 467 -32 -295 380 299 -360 91 501 -170 -165 485 152 -318 214 431
3263D31o42J35N28m72k68N88L5o05K42M37m95k00N90l0n81L36M32o98k9O79k51
$$ 431 -211 -76 452 -20 -288 300 335 -270 -28 409 -86 -286 304 274 -307 29 461 -237 -266 413 162
3284A62n40N51K43o69J38O55m75l90O75K0p07L53M90n42k52O57j84m85L57L41
$$ 162 -378 173 416 -253 -115 540 65 -325 350 370 -337 16 506 -36 -288 369 185 -300 57 398
3304C98n43r4N76k08m22M25K68o37R6N78l89l99N97J45o41K05N68n35k75O71j24
$$ 398 -145 -239 337 129 -293 132 400 -237 -141 437 48 -351 246 391 -250 -45 523 -12 -287 384 260
3325B60n84L74M01o33q3O93k41n54N19K80o85J06N75l45m55O17J01o34K21N12
$$ 260 -324 50 451 -182 -265 428 187 -367 152 432 -253 -147 428 83 -372 245 346 -288 -67 445
3345D45m62l09O65m9n81L56M43n34k09O69j89n36M55K52n98M6N82l35m55N42J85
$$ 445 -17 -326 339 290 -291 65 508 -26 -235 434 245 -291 164 416 -182 -136 446 111 -344 198 383
3366C83o46J49N09m23k82N89l7n49K87M97o49j19P33k60n95N46K84n80L7N94m10
$$ 383 -263 -114 395 -28 -310 279 242 -307 -20 477 -172 -291 442 182 -413 133 417 -163 -126 468 58
3387E8l83O15Q7o02K77M31n09j53N29o3n46K84L83n51o3N84k26m33L68L52n60
$$ 58 -325 290 377 -225 52 483 -26 -179 350 287 -259 25 408 -143 -206 378 152 -281 87 439 -121
3408a21p9O05k66m78N06J91n76J06N97n12k70O21p3n63L12M82n44j36N43k12m34
$$ -121 -200 405 139 -339 167 358 -218 -112 485 -27 -297 324 251 -312 0 482 -62 -198 345 133 -301
3429c01M18K60n83P1M80k46l56M61J13n16O6N30l78k78N14M2n60K98L95m77j48
$$ -301 117 377 -206 -135 345 99 -257 204 317 -199 -133 397 19 -259 255 297 -263 35 430 -47 -195
3450a95O15j50n83M58L02o03j6N78l17m31N45J34o22J97N12m16k98N61m9n00K93
$$ -195 420 270 -313 145 447 -156 -172 406 89 -342 203 337 -285 -88 424 8 -290 271 222 -278 15
3471A5L70m45k06N38q4m69M17K66n12o2N79k51l82M44J42n47J62M55l40l75N70
$$ 15 385 -60 -266 272 188 -281 136 402 -110 -172 407 156 -226 218 360 -187 -25 430 90 -285 285
3492B85K0n70L23L71n54j63N79j42n11M69K84o37P6N40l20m09N61J12n01J42M59
$$ 285 305 -265 58 429 -125 -288 291 149 -362 107 391 -246 -170 370 50 -359 202 314 -187 -45 414
3513D14l81k86N24J4m83J98M29m00k10M24Om94L33K84m40m3M75k47m51M73K31
$$ 414 33 -253 271 285 -198 0 429 29 -181 243 249 -245 88 372 -68 -111 364 117 -334 139 370
3534C70n41J5N91l83l71N74K4n42K04M63m46j69N27j10m63L35K87m12l5M13k42
$$ 370 -171 -156 435 52 -319 255 279 -263 -59 404 -42 -211 316 206 -257 78 365 -47 -82 331 89
3555H9l80M75J56m93J4N55l79l18M56J40n45K00M30l98k29M90m7m53K85L92n41
$$ 89 -291 184 340 -153 -139 416 37 -281 175 315 -230 -30 400 2 -227 263 216 -237 48 440 -101
3576a01j04N44j87m11M00K35n09M3M92l27l54N14Q6n00J45L58l17j74M09k9m69
$$ -101 -205 339 152 -259 141 376 -133 -90 402 75 -279 235 321 -179 -34 324 7 -167 242 213 -256
3597b56K45L82m75q5M54q5m27L86J99m83O2M96k86l30M28R6m71P6M05k78k20M33
$$ -256 -11 371 -104 -189 265 180 -247 139 338 -145 -83 413 127 -203 225 321 -150 -74 331 53 -167 266
3619B66L3m81K26L25m14j18M65j32m51L94K57n55k4M96j74l61M54R1m71Q8M14
$$ 266 299 -182 44 369 -45 -163 302 170 -281 113 370 -185 -209 287 113 -248 206 297 -174 -86 328
3640C28l03k07M34J1m35K35L19m40l1M18j18m09L05K98m56p1M60k26l25L81J83
$$ 328 25 -182 252 263 -172 63 382 -58 -89 329 211 -198 107 405 -51 -122 338 112 -213 168 351
3661C51n22O6M88l52l07N16k2m54K17L29l59j41M67o7l87K66K55m06NL74k02k84
$$ 351 -171 -105 383 31 -276 240 218 -236 -19 310 -49 -190 277 210 -177 89 344 -62 -57 317 115 -169
3683a69L16R4l50LL85k55j51L66M6m75J70L26l32j60M54m1n24L96K23m49N1M12
$$ -169 147 241 -109 -106 279 24 -127 239 285 -190 -20 306 -26 -186 268 227 -297 99 322 -127 -76 336
3705C36k47k81M05J17l99R4K87k61k28M31l9l95J59L73l99j21L74o2l13J90K56
$$ 336 89 -192 213 330 -69 25 312 51 -177 254 215 -180 -21 352 -47 -168 206 144 -169 21 277
3726B77m30o0M33o0l78L20K13m57J00L95k53l45M55N2l70R5L73l20j79M09q0l75
$$ 277 -153 -213 220 160 -218 102 315 -142 -42 353 100 -245 210 262 -108 -13 360 40 -139 270 190 -185
3748a85K65K68m03m5L54j59k73L10P1l56P2L37j93k50L67M4m34J73L37l32j25
$$ -185 80 348 -55 -100 254 95 -178 132 203 -153 -81 256 63 -187 180 224 -210 -37 300 -32 -157
3769a57L63Nl78K89J93l18r9M00j59k81K89J65m30N9L26k43j44L11R3m32J55K59
$$ -157 206 211 -167 122 315 -3 -102 298 139 -142 147 312 -118 -59 267 24 -120 191 284 -148 7 266
3791B66k52j98L95m9l54K03K97l40j46M74j49l11K63J29k95m3M50k04k91L35N8
$$ 266 14 -184 211 162 -192 11 308 -32 -178 296 147 -164 99 228 -67 -110 340 136 -155 180 238
3812B38m20J56L31l16q0L08pl60J51L39l57j07L92j42k25J80J78k41r0L68k13
$$ 238 -182 -26 305 -11 -91 217 210 -150 1 340 -17 -124 268 126 -99 81 259 18 -72 296 83
3833H3j87K64J19l74J03L18l34j30L65l8l93K38K13k38q6K93q6l17K45J83k92
$$ 83 -104 160 279 -95 8 326 -8 -138 227 189 -204 34 247 9 -77 216 130 -187 58 241 -51
3854e1j17M36j80k14K52Q0l20R9K47k31j38L17K4l61J88K51k51j56L93j22k75
$$ -51 -168 268 88 -126 126 206 -114 -15 232 1 -137 180 204 -157 31 282 31 -125 268 146 -129
3875a29K73J36l05l8K51j34k11J79J64k59LK77j37k58L35N0l46J25L00l15j01
$$ -129 144 280 -25 -63 188 54 -157 22 186 -73 -70 207 70 -188 147 197 -149 -24 276 -39 -140
3896a40L77o4l18J85K40l16o9L99j36k13J86J21l04Q0K13k17j63L11j0k73P7K59
$$ -140 237 173 -145 40 280 -36 -105 294 158 -55 131 252 -52 28 241 24 -139 172 162 -111 -34 225
3918B25j72j91K80M1l23J55K57l40m2L21j05k55K60J66m09J56K22j98j30K62l6
$$ 225 53 -138 142 183 -140 15 272 -68 -110 211 106 -149 111 277 -132 24 246 48 -82 180 144
3939A44k45J10K18k67q0K85Jk01O3J72j71o2J90p6j99J86R5j47o7K23n9k24K58
$$ 144 -101 9 227 -40 -120 165 166 -35 28 200 29 -33 157 81 -118 68 163 16 -51 172 113 -111 147
3962A47R8l31J7L20j78j54K50O1l63J54K36k87q7K98p4j80J72J78l57P3K30j40
$$ 147 245 -86 -69 251 73 -81 169 230 -133 21 257 -30 -117 181 107 -73 99 277 -80 -7 223 83
3984H3k00K20J11l15N1K44k17p5K20J9k20J53J33j38j86K97K1l45J98J47k07q4
$$ 83 -117 103 214 -101 -50 194 -23 -98 122 141 -79 74 207 69 -117 180 201 -144 54 201 -6 -90
4006i0L47j15k12J90J18l15P6K25j79j33K26j4j97N0K37j82j54K81p0k16K16J69
$$ -90 257 142 -70 120 238 -77 -1 224 45 -88 138 124 -73 -23 214 32 -122 159 89 -127 89 258
4028B58l24L3K39j17j85J83J51k51N6K00j57k23L17n2k00Q6J92j21j82K73L1l18
$$ 258 -66 -33 206 89 -96 87 238 -13 43 243 86 -137 180 128 -72 14 206 85 -97 176 207 -111
4050a11J84J48k68J4K32j15k25K67N8k62L3K20j22j35K09N1k62R4J56j27j27K00
$$ -111 73 221 -47 -33 199 84 -141 126 184 -78 -45 175 53 -82 127 178 -84 10 166 39 -88 112
4072A12Q2k70R2K62k04r6K74j07k26J70Q9k21OK28j26j53J97J05k69M6K47j64
$$ 112 194 -76 16 278 74 -22 252 145 -81 89 178 -43 -37 191 65 -88 109 214 -55 -9 238 74
4094G4j06K34n2k12J44R5j65m0K00o1j89J32J29j86m4J72p1q7J67Q1k38K9K15
$$ 74 -32 202 150 -62 82 177 12 -28 172 111 -78 54 183 -3 -47 125 54 -33 134 215 -23 6 221
4117B21j45j71K17N2k51R0J76j07j23K70o0k27J12J92l18J0K47n8j94K22Rk32
$$ 221 76 -95 122 174 -77 13 189 82 -41 229 169 -58 54 246 -72 -62 185 127 -67 155 164 -68
4139f8P5J68j10k58K93M0k15N6J89j25j61K31j7j64J15J27k14nK99j47q9P8J13
$$ -68 7 175 65 -193 100 140 -75 -19 170 45 -116 115 98 -66 49 176 -38 -43 256 109 20 98 211
4162B11j93M7J56j38j19J77P6k23L6J82j80n6J88pk07Q9J40j86l4K00j01j70J58
$$ 211 18 65 221 83 -36 141 217 -6 30 212 32 -24 164 157 -50 39 179 -7 -41 159 58 -112 46
4185D6J36k36N1J92j03r0J92o9j23pJ88j75k1K42p4k04J00J62j67j04K38o3k16
$$ 46 182 -54 -3 189 86 -4 188 119 -4 -11 177 2 -19 223 149 -55 45 207 40 -64 174 111 -105
4208a05J46J33k02L4J98j41j10J25Q0j16j0J38j09j22K30J7j95J3K04k25oK25
$$ -105 41 174 -28 6 204 63 -47 78 158 42 32 170 61 -61 169 186 -9 4 208 -17 -23 202
4230B02q3j53P5K01k45p6K38n9j64J42K1q6m5K49j39j48R6J34j78P6J46j31r1
$$ 202 119 -34 41 242 -3 -79 159 100 -64 78 99 13 -32 217 78 -70 26 160 -18 58 204 73 -18
4253a8K13n9j13M6R4j24m1K36j31j34R0J08j91k3J86j25j14K08mj91P2J92j30
$$ -18 195 136 23 69 163 39 -2 234 103 -31 59 167 -24 -47 139 14 -100 108 104 -87 -15 177 47
4276D7j21K60n1j93J33J05j80m6K03r5j63J73Q0j75RK23q8j96J86P9r6l4J75j93
$$ 47 -74 186 135 -58 75 180 0 -46 157 62 -101 72 152 -23 -14 209 121 -75 111 190 94 60 235 42
4300D2l9J37p1j23K2J36r4o2K03n2j81J70P8k14L9J50j27o3J49L9j38L0J55p1
$$ 42 3 140 69 -54 -32 104 10 -52 151 99 -82 88 166 -48 -9 141 14 -49 100 139 1 31 186 115
4324A15j96J94J9k09J02J74j57q1J85l7j50Q8Q1j48J0J32r5j08J81Q7k44Q4J78
$$ 115 -81 113 132 -77 25 199 42 -39 146 109 -41 47 128 -20 -10 122 27 -81 100 187 -57 27 205
4347B05j91j25K26k3j27O4J45j69QJ77p6j91J59J16j87M4R5q8j25J59J6j43L9
$$ 205 14 -111 115 92 -35 29 174 5 13 190 114 -77 82 198 11 55 150 62 -63 96 112 -31 8
4370HK02j25j82J72J34k02O5J34j43q2K19p7j56J38J10k21J9K17j63q1R0R2j78
$$ 8 210 85 -97 75 209 7 72 206 63 -19 200 123 -33 105 215 -6 13 230 67 -14 76 168 -10
4393a0M7J27j46r5J88J9k56J47J51j89n8J96j3j63P7J81j84q7K06l0j48P7Q5j47
$$ -10 37 164 18 -77 111 130 -126 21 172 -17 -75 121 108 -55 22 203 19 -68 138 108 -40 37 122 -25
4417b5L6K17r8j40J33K7j95J42J14j10o4R4k9j78R5J27j88OJ85k2j52P8J11j96
$$ -25 11 228 130 -10 123 150 -45 97 211 101 37 131 102 -76 19 146 -42 -36 149 127 -25 53 164 -32
4441c2j8J59m4j64K18L1j59NJ68j06r9J92Mj83J19J15k12N0O1Rj42J50M8j44J8
$$ -32 -50 109 65 -99 119 150 -9 -4 164 58 -41 151 155 -28 91 206 -6 44 105 114 -28 122 170 26 44
4466D4Q8p6p7J01O4j92O8J54j24j27K25M9k75J22J59j62q3K36j14j45P3J66j72
$$ 44 132 56 -21 80 144 -48 20 174 50 -77 148 197 -78 44 203 41 -42 194 80 -65 8 174 2
4489Bl4K22j15p3J13L9j59OJ56r6j31J49M3j16J4J72j62j39K29lj40O3J13q0o1
$$ 2 -32 190 75 2 115 154 -5 1 157 61 -70 79 122 6 20 192 30 -109 120 117 -23 40 153 73 12
4514A2J53p6j21J02Q5j60O2J28q9j89J40P3j75Q2P8j54m0J52J9r3L4J26j81k4
$$ 12 165 89 -32 70 155 -5 57 185 96 -93 47 120 -55 27 105 -49 -89 63 82 -11 23 149 -32 -56
4538e6K34o0j44P3J44j90L5J64r4n7L2Q1j30qJ49j64o1K24m1j42J9J54j18j24
$$ -56 178 118 -26 47 191 1 36 200 106 49 81 162 32 24 173 9 -52 172 131 -11 8 162 44 -80
4562h0K48p5j54N5P7m4k3J66j07j59J89K1j54O8J34j14q8J70j5j88Q5J45j26l0
$$ -80 168 93 -61 -6 71 27 4 170 63 -96 93 114 -40 28 162 48 -40 130 115 -73 12 157 31 1
4586AJ53o3j04P4J00j50J6K07n9k35J81K1j41kJ71j56n8J03J08k18P9J09j37k6
$$ 1 154 91 -13 61 161 11 27 234 175 -60 121 142 1 -1 170 14 -44 59 167 -51 28 137 0 -26
4610b6J39Oj56M9J54j76rJ56p1j55J01J16j35J3J66r4r6J34n7j28N8J47q2l5R8
$$ -26 113 119 -37 12 166 -10 -19 137 66 -89 12 128 -7 6 172 78 -18 116 59 -69 -11 136 54 19 117
4635A17N8j21L2L9o5r4K04j09j01Q4J63j83k1J32m0j01J10K2j85R0J72k32o7K20
$$ 117 175 54 86 125 60 -34 170 61 -40 44 207 24 3 135 95 -6 104 126 -59 31 203 -29 -96 124
4659A24l7j45Q7J31r1p8J31n4j02J21Lo7l6J95j24j1R0Nj41jJ64r6j38J80J20
$$ 124 87 -58 29 160 69 -9 122 68 -34 87 90 23 -13 182 58 47 137 142 1 0 164 68 -70 110 230
4684B30k48K6J64j50m7J54J8k08J55P4j43n0J85j01p1R1P5k26J12R6q4o5J07%
$$ 230 -18 8 172 22 -25 129 147 -61 94 168 25 -25 160 59 -12 79 154 -72 40 136 52 -13 94 94
4708I4r8K5N1j0q6K04j16q5R0O2r0J1P4jj43J10N1j33rJ45j21o9J84l2j29L6J24
$$ 94 -4 21 72 62 -24 180 64 -21 69 131 41 52 126 125 -18 92 143 10 1 146 25 -44 140 108 -21 15 139
4735A39j27n7J76Jj44J9J29j85N2P1K6p5J9P9j29O7Q6j15p2J82pj56O5L1p5o9
$$ 139 12 -45 131 132 -12 7 136 -49 3 74 100 25 44 123 -6 61 147 32 -40 142 135 -21 44 75 0 -69
4761f9J80J1j69R5J34j89m4K42k5j71J00P3j65rJ56p1q7R0K0j05K1Q7j5q7J13
$$ -69 111 122 -47 48 182 -7 -51 191 166 -5 95 168 3 -6 150 79 -8 82 102 -3 18 105 90 3 116
4786A16o0q6O5R5j55K4P1L1j43M0J28j10oJ44p1p0J01J11k04J6J28r8o9J11M3
$$ 116 56 -30 35 130 -25 -1 70 101 -42 -2 126 16 10 154 83 13 114 225 21 37 165 67 -2 109 152
4811A52j83J05J04j40J3N7L5j23R2L7j55N3R3q3j36J80R8k22K9J31o0j01J58m4
$$ 152 -31 74 178 38 51 108 143 20 112 149 -6 47 140 57 -79 101 199 -23 6 137 77 -24 134 90
4835I0r0L3P7n7n7J00M9k06J15Q1q0n1J75l1j59J09P1j13qJ00m7j53J96Lj20j
$$ 90 0 33 110 53 -4 96 145 -61 54 135 55 4 179 148 -11 98 169 56 48 148 101 -52 144 147 27 26
4861B6J14q0n3J37j3j66R1J14j84K2Q7L3j49J13M6j27L5J27p5j23J54L6j25L1
$$ 26 140 60 7 144 131 -35 56 170 -14 8 95 128 -21 92 138 11 46 173 98 -25 129 165 40 71
4885G1J02j24k3J22q4q6O2J11j18l2J36l7j16J66k6j06nJ66j34n1J54J8j85J09
$$ 71 173 49 26 148 64 -22 40 151 33 1 137 100 -16 150 124 18 13 179 45 -6 148 166 -19 90
4909I0Q1j60n8J52J4j50J00K9l6j11J31k4o1K6J16j15j0O5l6p0J38O1k02P5J23
$$ 90 171 11 -47 105 119 -31 69 98 62 -49 82 58 -3 23 139 24 14 79 43 -27 111 172 -30 45 168
4934A68l9j55J91r5p9M7J11j24mP2j3r6J04mj13O5R8j04q4J84k1j46Q0P9j33Q
$$ 168 129 -26 165 70 -9 38 149 25 21 93 80 -16 88 84 -29 36 134 30 -54 130 109 -37 43 122 -11 -3
4960cJ29k6j64J81J8r7q8J85o8j12J43K3j22P7O4j9j32J04K4j10P4P8o4j09J54
$$ -3 126 100 -64 117 135 38 -50 135 67 -45 98 121 -1 76 140 121 -11 93 117 7 81 159 95 -14 140
4985A40r0j07N3J11p1o8J74oj82Q8K5o7k1J46Qj53J14Mn7j1J45j13m6O0Q6k43
$$ 140 50 -57 -4 107 36 -32 142 136 -46 42 67 0 -21 125 133 -20 94 98 41 30 175 62 16 76 162 -81
5011h1J16J66j66l1J07k6j36J15M8n1n2J31ok00K15K3j76K6J35o0j09J36J8j43
$$ -81 35 201 35 4 111 85 -51 64 112 61 9 140 134 -66 149 172 -4 22 157 97 -12 124 142 -1
5035aM5J09p7o8J06Jj12N6O7j39m3J41K7j29Q7L5q8MJ21q0n6J40k2j15L4R1r5
$$ -1 44 153 76 8 114 115 3 59 126 -13 -56 85 112 -17 70 105 17 21 142 62 6 146 124 9 43 134 39
5062C9j3J20J6j39O3M6r0m7J49j6j22O1P6j31p2K26o9p2N2M3j38M7Q3o8o9J89
$$ 39 26 146 162 23 86 132 42 -5 144 128 6 67 143 12 -60 166 97 25 77 120 -18 29 112 44 -25 164
5088A64l1j70O4R3j07kJ43r5j44J46J28j40j8J28q2j43K22p0o3lJ02o5o2J31k0
$$ 164 133 -37 27 120 13 11 154 59 -85 61 189 49 31 159 77 -66 156 86 23 20 122 57 -5 126 106
5113A06p0K5L7l2l8J12k1j37R4O9j25K9J31j30k1L8J14k17Q1N0n5k3J01l5n3N
$$ 106 36 61 98 66 28 140 119 -18 76 145 20 49 180 50 29 67 181 -36 45 95 40 17 118 83 30 35
5139C5J12j53k8K12r4o3%J15r1K3O4k2j37J25Q5k16R9J20r2j11J08K2j14L7J32
$$ 35 147 -6 -34 178 84 21 21 136 45 68 132 110 -27 98 183 -33 66 186 94 -17 91 113 -1 36 168
5164A68j39k7J56r4o3LJ35j72%J62p8r7J44J8j49P0R5p8l5J14m2p4L9N4m2n7J59
$$ 168 29 2 158 64 1 4 139 -33 -33 129 51 -46 98 116 -33 37 132 54 19 133 91 17 56 110 68 11 170
5191A70o4k26J66J19q4j05J86n6p8O9Q5j62o4J58l8p5R3N5j96L2J57j57P1rK4
$$ 170 106 -120 46 165 81 -24 162 106 28 97 182 20 -44 114 76 1 94 149 -47 -15 142 -15 56 47 71
5216G1j24J04O8p2JL8K0j60J63L9j03k3P0J7r2M6R2j27N9K9q1l2J29l5o2P2N3
$$ 71 -53 51 119 47 48 86 106 -54 109 148 45 22 92 109 17 63 155 28 87 116 35 3 132 97 35 107 160
5243A60j85M9R5L3j63R3O4r9pJ06o2r7N8M9p3J7J23j52J0O8J3j04N5N0l3p3N2
$$ 160 -25 24 119 152 -11 82 146 47 40 146 84 -13 45 94 21 38 161 9 19 87 100 -4 51 101 68 -5 47
5270D7K4j35J58N9j50M8P5p5j29J66J0p0J3J41j30r8K23n3j27J5R0k4m6P3qq2
$$ 47 71 -64 94 153 3 51 126 51 -78 88 98 28 41 182 52 -46 177 124 -3 12 102 78 32 105 97 15
5296A5M0K1r7K5J21p3r0J02R2j67J2J25o9o5J45j0j17kO2k6m7J42j08m9O8J01
$$ 15 55 76 -21 4 125 52 -38 64 156 -11 1 126 57 -8 137 127 10 8 70 44 -3 139 31 -18 50 151
5322A51j02lQ9l6j14R9O6j71N7O4m6m8N2N6j10L3R9j40LR0j9q5O9J7k5o8J32o7
$$ 151 49 46 135 99 -15 84 150 -21 36 100 54 6 58 114 4 37 136 -4 -1 89 70 -15 54 71 46 -22 110 43
5350D3o7J76j1j48J20jj5r4P7O6j49P9N6r7J8K8L2j20N6M4j4j17J67m0j30J17
$$ 43 -24 152 141 -7 113 112 97 3 80 146 -3 76 132 35 53 81 113 -7 49 93 79 -38 129 89 -41 76
5376G6Q0j53M5M4p5j8J31m5j8PN0j07o7J52n7m6J05J6p3j5Q3q2k3Q7nl9m3J09
$$ 76 156 3 48 92 17 -1 130 85 67 74 124 17 -50 102 45 -1 104 120 47 32 115 33 10 97 92 53 10 119
5404A19j3j21N2O1r3M9R5p4n1R7n7o2J01K1j15k3J10n0m0N9M5q4j6R1k6m3K6L8
$$ 119 106 -15 37 98 5 54 149 75 24 121 64 2 103 124 9 -14 96 46 6 65 110 26 10 101 75 32 58 96
5432I6j24k3J36J0r6R4l6p7O2O2q3l2J60m0r5P6O4k00Q7Q3n5N5l2On6Pkk3l3N0
$$ 96 -28 -51 85 95 -1 93 57 -20 42 104 21 -11 149 109 14 90 154 -46 41 124 69 124 92 98 42 49 47 24 -9 41
5462D1O8j38K2J52j08qO3l8l8M7Q4j28K7L1jq5R1R3q9L2k4n4k1L6R0q5NR1j07
$$ 41 109 -29 -7 145 37 29 92 54 16 63 147 19 46 77 76 -9 82 175 86 118 94 40 19 55 145 60 65 156 49
5491D9n0J48o9o8L7M3j07L7J01o6n9Q9P5j29J4L9m6n8J02M4j08MQ3r0j7J18N9
$$ 49 -1 147 78 10 47 90 -17 20 121 55 -4 85 160 31 45 84 38 -20 82 126 18 22 105 15 -2 116 175
5518A75j83P6L2r1k3J27l4p3P1M5n9q6J78j33qJ51n8m4K2J3k4r9J24j8j05O5J45
$$ 175 -8 68 100 9 -14 113 79 6 77 122 63 -23 155 22 14 165 107 63 85 98 74 -25 99 81 -24 41 186
5545A86j48J4O9K6j69O5M4j10J2K1M4p7K3J26j25k1Q9kr2J50l8p0O4k0m8mJ08
$$ 186 38 52 121 147 -22 43 87 -23 -11 10 54 -23 0 126 1 -20 69 67 -25 125 87 17 81 61 13 9 117
5572A17j4j24J37k5n9M2N2m8p0R0L2j00J0J18j00j7L4jm7N6L1p4j06J76l7l0m
$$ 117 103 -21 116 91 32 74 126 78 8 98 130 30 40 158 58 41 75 74 27 83 114 40 -66 110 73 43 39
5599C9O5o2nQ1o4m5JJ22j24N0j6K7n1P7J7j15M5J23j08PO7p1o4L5J36j72l5R8
$$ 39 104 42 37 118 54 9 10 132 8 58 42 69 18 95 112 -3 42 165 57 64 131 60 -4 31 167 -5 -40 58
5627E8k5OP8Pj30KJ26r5l5J28j2j18P0Jm3jJ00l2n3L3N5j20J3J00o8k2L6L0o4
$$ 58 33 39 117 124 -6 -4 122 27 -8 120 108 -10 60 61 18 17 117 85 32 65 120 0 13 113 45 23 59 89 25
5656B5kJ02n9m6N6L2q0KR7m1n6O7k1o9L7N6Qr4P7l7o4R0P2j06m0P7oj24J14Kq2
$$ 25 23 125 66 20 76 108 28 30 127 86 30 97 76 7 44 100 108 14 91 54 -10 80 152 46 6 83 77 -47 67 69 -13
5687a3O4O7o5q3J36l8JJM1l5r4J35n4%M9l6j2l1O2o6J0N4jm0%J4Ln1J9N9o8K8
$$ -13 51 118 53 -30 106 68 69 70 111 76 -18 117 63 63 112 76 64 33 95 29 39 93 92 52 52 66 69 18 37 96 28 56
5719E6J00j06l6J11j14N3J2L0j24K1P7m4O4mM0q0q3J25j9nK7m4j3J4N9Lq6O9m8
$$ 56 156 50 14 125 11 64 76 106 -18 3 80 36 100 96 136 56 -27 98 79 74 101 57 44 58 117 120 34 103 55
5748E5m5O1Q0p3k3N9N2j39O7K9o9qJ9m1J9N7J8j31Q4K7r3JQ9J9j08Q2pn1L0L1
$$ 55 10 71 151 78 55 114 166 27 94 123 54 46 65 24 43 100 118 -13 71 98 5 6 95 114 6 88 81 30 60 91
5778I1lq0L3P8j63R7J17j09q9J19K5q4NP5n5k7N3L7j51P6R3r5RMk8j3M8L3l7J
$$ 91 88 8 41 119 -44 53 170 61 -28 91 116 32 37 112 57 30 83 120 -31 45 138 43 52 56 28 15 63 96 59 60
5808F0L1j47M6M4J0nj1Q9q1o7J22k5q1O2L7q0MP2J6r2M0Q3o3MP8o7m2N0M9o4o1
$$ 60 91 -56 -10 34 44 39 28 117 36 -31 91 66 -15 47 84 4 8 80 96 4 44 127 64 68 146 79 37 87 136 72 11
5839A1R9m1q6J15j3j2n8J20j09pN3K3m4p9J44j01j6J01k6r6K7J20j05J4J12n3
$$ 11 110 69 -17 98 85 73 15 135 26 19 72 95 51 -28 116 15 -1 100 74 -22 5 125 20 34 146 93
5865I3q8P7J9r5K6M6k6j5R0l4j01O5jK8l7O5o9l3N2K1n6m7J08m3qL7K6n3M8K7
$$ 93 5 82 101 6 32 78 52 37 127 93 -8 57 56 84 47 112 43 10 62 83 27 -20 88 45 37 74 100 47 95 122
5895A22r1NN0pn3OR1o0l9N4k0n4J08l3o0OO6l6k9P1%p2L7M9l6n4J24m6jp2J04
$$ 122 31 36 86 79 26 32 123 63 24 78 58 4 112 79 19 25 91 55 26 97 97 25 62 111 75 21 145 99 98 26 130
5926A30r4m5R8K4q4MO6p5j6K9L%KL6q9KQ8k9rL5l1lk9Q0Lo9M6J2m4L9M1q2k7J17
$$ 130 36 -9 89 113 29 33 99 24 8 37 40 40 42 78 -11 -9 79 50 41 76 45 42 13 93 96 27 73 85 41 80 121 39 12 129
5960A29n5p0Q4l6m6L8Q5n8m2K9L6q9J2O4L8l4M8k0j05P9%m5j1M9p2j2N5j2k1K0
$$ 129 74 4 88 52 6 44 129 71 29 58 94 5 17 81 119 85 133 113 8 87 87 42 31 80 8 -4 51 39 18 38
5990C8N9m2q9J11M9j15K7L9k2N7o9R8m2J6j3j02N8Q1q4k2M4K0j5n1R9k8j40P3
$$ 38 97 55 -34 77 126 11 38 77 55 112 43 141 99 115 102 0 58 139 55 33 77 97 82 31 130 102 -38 35
6018C5R5j02QO5n0m2R4J1o7nL1q4RN9J5p3R8N7j17K3M3Ko3M3j8k8nJ36j13lP5
$$ 35 130 28 36 101 51 9 103 114 47 42 73 -11 -2 57 72 -1 97 154 37 60 103 105 42 85 67 39 34 170 57 54 129
6049A29r0KL8J4no1Q4l8m5P9p7L4k0J06j23n1M4Q0j22M6O2o2k0R3%q9L7PL3j2
$$ 129 39 41 79 93 88 27 111 73 28 107 30 64 44 150 27 -24 20 100 -22 24 86 24 4 97 97 8 45 52 85 73
6079G3L6Kk4J2k4n2L0O6ln0K3J4m9k6Q2n9k4N3O3o7KL8m6k9M3%p8N7K4o6k9Q3
$$ 73 109 111 87 99 75 23 53 119 116 66 89 103 54 28 110 51 27 80 143 76 78 116 70 41 84 84 6 63 87 21 -8 75
6111G5nl2O2m2j3J0J00q6k9K0Po1Q4M8r1qP1n8M5j0Mk0k7N4p2QNQ7r9kM9K0q6
$$ 75 70 38 100 58 45 55 155 69 40 60 67 6 90 138 47 39 110 52 97 87 91 71 44 98 26 34 39 126 27 25 74 94 8
6144HO9N2j56rJ66j15J6M6J4m3k6M3j3l2M8m8K1L0J9q1K8O3m3o4J06l8K0n3M0
$$ 8 77 129 -27 -36 130 15 31 77 91 48 22 65 52 20 68 20 41 71 90 9 37 100 57 -7 99 61 81 28 68
6173F8K0q0P9M3j27M9J35q2q0NJ6nJ7R9j16jN1k8j0j5N4r9N4O0l1l1j6Q2r2jQ5
$$ 68 88 8 87 130 3 52 187 105 25 30 46 41 58 157 41 40 91 63 53 38 92 -7 47 107 76 45 29 111 19 18 103
6204A03q3K6MO2p7K8J6o7Q1K1p7j7O1M4o1jR4q6k5L0ol4P0o3J4k4M8j5l2oK8j8
$$ 103 20 46 50 112 35 63 79 12 93 114 37 20 81 125 64 63 157 71 46 76 70 36 106 43 57 33 81 66 34 28 56 38
6236C8O3L7l5p9J12m8p4KP5m8o4J13k7L2k4O9q7JJ5J9q0M6L9K4j17P2ko0P7Oj17
$$ 38 101 138 103 24 136 88 14 16 91 43 -21 92 65 97 73 142 55 56 71 90 10 56 95 119 2 74 72 12 89 95 -22
6267b2J30n5j8kL5k2N3q8J01o8J3J7L7n4n3N5m3l0J09Mq0l6P4m7j1R3k5o8O2J4
$$ -22 108 53 35 33 68 46 99 11 112 44 57 74 111 57 4 59 16 -14 95 99 19 -17 57 10 -1 92 67 -1 61 75
6297G5k9%jL7m0L7Rq8O9M5l4qJ9Qp0K0N7n2k4O5ko3N1L9q8K0M6n9m9J20m1l7K5
$$ 75 46 46 45 82 42 79 88 0 69 114 80 72 91 99 29 49 106 54 30 95 93 30 81 120 32 52 98 39 -10 110 69 32 57
6330E7J4k8p7O3K1p9Q0L0o6k7P9K8l3L8%Jm0O7n7l4Ok1k4P8j9L0K8j3l1l3M0L0
$$ 57 71 43 -34 29 50 -29 51 81 15 -12 67 95 62 100 100 101 61 128 71 37 43 22 -2 76 57 87 115 102 71 38 78 108
6362A08n9j7M2K8q4R1%q7l6P0mp6J18k7k7M5m9kQK2J9k5L9k7L6j20P0O8m5jL2
$$ 108 49 32 74 102 18 109 109 22 -14 56 52 -24 94 67 40 85 36 34 42 64 83 58 97 70 106 -14 56 124 79 78 110
6393A10n3Rk6K3n2M8oj4k9P2l6j6K7j1l8M6L5o7l8J29Kj30R8l1Nj2P4r4j5N5J18
$$ 110 57 66 40 63 11 59 53 39 10 82 46 30 57 46 8 54 89 22 -16 113 115 -15 83 52 57 45 119 25 10 65 183
6424A83j71PM4Rn1L0N0n6K9M2o3K7k9K3n5J8K7j8j0R5n1p6K6k1O3k1P6j3r3K0
$$ 183 12 19 63 72 21 51 101 45 74 116 53 80 51 74 19 37 64 46 36 131 80 4 30 9 72 51 127 114 21 41
6454D1M8r4P4M3k7q6O1N1n9K4J0m2JM1p9j9P6K3l4lP0n5J4L4l2M6o2KNj9L0j9
$$ 41 89 -5 69 112 85 -1 60 111 52 76 86 44 45 86 7 -12 64 87 53 50 120 65 79 113 81 127 65 67 72 53 83 64
6486F4m7J4K6j3j9N0m9l5J12L7j49N9K5p7m0J20j4%n2O4k1J0J2j5j8j0Q3j05J7
$$ 64 17 31 57 44 25 75 26 -9 103 140 -9 50 75 -2 -42 78 64 64 12 76 55 65 77 62 44 34 117 12 29
6515B9N2KLm2O8r6J1N6pl0J05n2o9OL1pn9J16n5q9M1O1o8N6rj3l5P4K2l6j6L4
$$ 29 81 83 86 44 112 16 27 83 76 46 151 99 30 36 67 60 1 117 62 -27 14 75 7 63 54 41 6 80 102 66 50 84
6547H4o8K5L1N7j12R9m7lq6J42o7n9L6L8l4j7L2K3j7J9R1o3p0J01p9j2O8j7J2
$$ 84 16 41 72 129 17 116 69 66 -20 122 55 -4 32 70 36 19 51 74 57 76 167 104 34 135 56 44 112 95 107
6576A07l3k1J1n1R2p4QN5m3n7n9J47l2rK2l9j4N3O5l6q2J23n4n4kP4k5j1N3l9
$$ 107 74 53 64 13 105 31 39 94 51 -6 -65 82 50 41 63 24 10 63 128 92 10 133 79 25 23 97 72 61 114 75
6606G5l2Q6p1l3Q4K5Mn9K9l6n1N3Ll6n9N2Q5p6N2o2j5J3P4J5j05j0O4n1K1P4k8
$$ 75 43 129 58 25 109 134 138 79 108 72 21 74 77 41 -18 34 119 43 95 33 18 31 105 120 15 5 69 18 39 113 85
6637H5o1rN6K6l8N0mm8L0N3q1j2R5j10oR8l5k2j6L4m6k7R3k2q3J01nj06O5NO1
$$ 85 24 15 71 97 59 109 105 57 87 140 59 47 142 32 26 124 89 67 51 85 39 12 105 83 0 101 96 -10 55 60 121
6668A21j49Q7N4j21J3J01o9mM3L2q3O7Nk4k0N2l1Pl9N3k4m4N9l0J1J5NJ5q1M2
$$ 121 -28 59 113 -8 5 106 37 33 76 108 25 92 97 73 53 105 74 81 42 95 71 27 86 56 67 82 87 102 21 63
6698F3O4k6j21J09p2K6K5m0k7J01ln8L8N9r0nP5q5j8P4n4K3l0J6L8o5O6%rJ4J0
$$ 63 127 101 -20 89 17 43 68 28 1 102 99 41 79 138 48 43 118 33 15 89 35 58 28 44 82 17 83 83 74 88 98
6729I8o8J7k4jnN0N3o6pO1m2m3J06Pn3J0k2l0LJ7Qk7pK4l6l1J13l8n2K5L7j8l2
$$ 98 30 47 23 22 17 67 120 54 47 108 66 23 129 136 83 93 71 41 44 61 69 42 35 59 23 -8 105 67 15 40 77 59 27
6762B7M0n8K9L4mj9L3J2j2j3kRn2N6M2r3p6J24Mq2L1Q0j5k8j6qj2nPj3J1P2n4
$$ 27 67 9 38 72 68 49 82 94 82 69 67 76 24 80 122 29 -47 77 81 -1 30 110 95 67 51 43 31 26 33 20 31 103 49
6795D9m4N1M3jp6M3L1q5R0m8n7P1M8Mr9J27o2p1Q9Op3K1K8J0n9L3O4j08J6M7m4
$$ 49 5 56 99 98 22 65 96 11 101 53 -4 67 115 119 20 147 85 14 103 109 36 57 85 95 36 69 133 25 41 88 44
6826D4K8k4J6m1N1J2l1j3mL0k1J9J1J2m1Nlm%L0o6%N6mJJM6p7n6P4pJJ17o9l4
$$ 44 72 48 64 23 74 86 55 42 38 68 47 66 77 89 48 53 50 46 46 76 10 10 66 62 63 64 110 33 -23 51 44 45 162 93 59
6861E9L7Pnj2N3l5l8j9M0j6k0O4p4j2P2n5M7j8m5O9p7M5mlJ0j2j2j0K3nl4M6K
$$ 59 96 103 98 86 139 104 66 47 87 71 51 115 41 29 101 46 93 75 30 99 22 67 63 60 70 58 46 36 59 54 20 66 68
6894F8j3k1L3Pm3K5L0l6P0m3l1m4Q8k6O3q4K9Lm7L8k0n1L4M5k6K6J4m1JJ9K2p3
$$ 68 55 34 67 74 31 56 86 50 120 77 46 2 90 64 127 43 72 75 28 66 46 -5 29 74 48 74 88 47 48 67 89 16
6926A6j7J05q2O2M0n6L9Qm2m2pj5M1M9k4%rm4O6k6j5O5Oo9l2O9K2l0N5o3Pk9L6
$$ 16 -1 104 22 84 124 68 107 115 73 31 24 9 50 99 75 75 66 22 88 62 47 112 118 49 17 86 108 78 133 70 77 48 84
6959H4m9L3Lk8qM9m0m7R5o8L3m4lO7m0l1N5j4k0PN2q2nP1p6O0M9K1n4K1p2M9o6
$$ 84 35 68 71 43 35 84 44 -3 92 24 57 13 10 77 37 6 61 47 27 34 86 4 -1 70 -6 54 103 124 70 91 19 68 2
6992BP3K4j2J2K1l0k8N6l4L0M8k1j46N4J07j13K4MK6o1j7N5o3lQ7K8j19K8Q0p4
$$ 2 75 99 87 99 120 90 62 118 84 114 162 141 -5 49 156 43 67 71 97 36 19 74 11 8 95 123 4 32 112 38
7022C8N4L1l6kk3lJ8j1M7l1k4J5M5j18M7j6K4L3n2O7m0L0l9J9o3P9j7o0J1J2l0
$$ 38 92 123 87 85 62 59 77 66 113 82 58 73 118 0 47 31 55 88 36 103 63 93 54 73 10 89 72 12 23 35 5
7053EL9O5j0o9J7J7m6N2mK5k4n2N9m1LK5j9kJM0n2P0Qm2K2j1J2r5R4L6j00RO2
$$ 5 44 109 99 30 47 64 18 70 66 91 67 15 74 33 36 61 42 40 41 81 29 99 107 65 87 76 88 -7 87 123 23 32 94
7086I4l8n0R5J9j13J3J2j0j0Q9J0q0nK4j4RN8j7KOl1k7K6K1J0p7R5p3j6M4Kj0
$$ 94 56 6 101 120 7 20 32 22 12 101 111 31 26 50 36 45 103 86 88 94 63 36 62 83 93 16 111 38 22 66 68 58
7118E8k7J19k9o5L6k0L6p7K5J6l7K1J1on2M1L1j6qok6J9J4p6O0oN0p5K5L5l9k9
$$ 58 31 150 121 56 92 72 108 31 56 72 35 56 67 61 9 50 81 65 57 51 25 44 58 -18 42 36 86 11 36 71 32 3
7150CO5l1K9J3M8r5LR7o7O8k5p5M1oM8p5o0P7M1m7J9Qn1j3Q6p2PN5L1o7p0N4Q
$$ 3 68 37 66 79 127 32 35 132 65 133 108 33 74 68 116 41 -19 58 99 52 71 79 28 15 101 29 36 91 122 55 -15 39 47
7183D7n9P5j1qL6op4K6L6NlKK1k3j8N6m7Kj7K5J1o9Q5j2mJ1J4p6P5k5k9M2k8l5
$$ 47 -12 63 52 44 80 74 0 26 62 67 64 66 87 64 46 102 55 57 40 65 76 7 92 80 76 87 101 25 100 75 46 88 60 25
7217B5MM3O6p8J4J0k7m0RQ1p2L4k3L6j0jMl6O9m1m4l1J03Pj25P7J4l6N7l0J8j06
$$ 25 29 72 138 60 74 84 57 17 26 107 35 69 46 82 72 71 75 39 108 67 23 -8 95 102 -23 54 68 32 89 59 77 -29
7249b9J31k7k1K0J7po8P1K9j00O8J5k5l9N5n4j2R1p2L5p2P1M9p0J6J0o0J7K9R
$$ -29 102 75 54 74 91 84 16 87 116 16 84 99 74 35 90 36 24 115 43 78 6 77 126 56 72 82 22 39 68 77
7279G7m8O7qJ6k2qn3M1N8k6q9M3J1kK9J4Lj02Q1j1j0n6O1N1r7JP1n6qN1kl8OL7
$$ 77 29 96 88 104 82 74 21 62 120 94 5 48 59 57 86 100 103 1 82 71 61 5 66 117 20 21 92 36 28 79 77 39 45 82
7313H2k4J3j4m1M3L2j5p8O9Rl5k3M5m8ON2jl2M8m5J4j0J7J1j6Ll7jM3M1m5jk9
$$ 82 58 71 57 16 59 91 76 -2 67 76 41 18 63 15 21 73 72 40 88 43 57 47 64 75 59 62 25 24 67 108 63 62 33
7346C3Q1q0K4noj1P3o7K5pK0j01P2L4o0k3P4K8n1L3l%ql0O1L7m6J3m7%K1j2L6
$$ 33 114 34 58 53 47 36 109 42 67 60 80 -21 51 85 25 2 76 104 53 86 83 83 75 45 106 143 97 110 63 63 84 72 108
7379A08k3rK6m0J05j2q5MM7j9o4k6L2k6K6pj8L9L5j3r4P1Q3r4P7n5o6P4jQ9j29
$$ 108 85 76 102 62 167 155 70 74 121 102 38 12 44 18 44 37 19 58 93 80 -14 57 140 46 123 68 2 76 75 164 35
7410C5J02q8K0Lm7K4J4K2kM5r4QQ4j09O2J9qk8K8l2K0n0N2jl4M3o0K7k5J0k5O3
$$ 35 137 49 69 72 25 49 63 85 83 128 34 42 126 17 79 98 90 62 90 58 78 28 80 79 45 88 28 55 30 40 15 78
7442G8J5r5N2K4J4l2LpO2q6N6l7l6O6J8k9j2M6j8j5M8q1J3j8mJ42n7ko6j2n7J14
$$ 78 93 -2 50 74 88 56 59 52 114 28 84 47 11 77 95 66 54 100 82 67 115 34 47 29 25 167 110 108 42 30 -27 87
7474H7l3J4J8m5N6j4K3j24R0l2lJK6J6n0L2kM9r2K1O1l2n6QM8M6%o5M3l5K3J3
$$ 87 54 68 86 41 97 83 106 -18 72 40 37 38 64 80 30 62 60 109 17 38 99 67 11 19 67 113 113 48 91 56 79 92
7506I2n9Q1m2rK0klj2P7o9k8N6m6o3M5M7j8lJ2%o8P8m9l2J6P4o0%kJ9l0P4n6L0
$$ 92 33 114 72 63 83 81 78 66 143 74 46 102 56 -7 38 85 67 64 76 76 8 86 37 5 21 95 35 35 33 52 22 96 40 70
7540G0K1l2N7o5K5K9k6K1n4L2j8L8j1k8L7K9o1k0K9j0l1M3k7l4K4O3po0k1J8O
$$ 70 91 59 116 51 76 105 79 100 46 78 60 98 87 59 96 125 64 44 73 63 32 75 48 14 38 101 94 34 13 31 37
7571C7KN1k8p1P3Jl3QJ%Mm0P0l7K7J1O8n3L6o6L9LM5j19l0J01r8N2J6M4r4R0p6
$$ 37 39 90 62 -9 64 65 32 40 41 41 45 5 75 38 65 76 144 91 127 61 100 103 148 29 -1 100 2 54 70 114 20 110 34
7604C4L4p2N5N1o8J5L9n5m9R4K5p7L1j7j8K8O9r2M8jr1N7M4o1PK4K0N7n0L6k4
$$ 34 68 -4 51 102 34 49 88 33 -16 78 103 26 57 40 22 50 119 27 75 74 -17 40 84 23 30 54 74 131 81 117 93
7635I3%N1n5k0L5k4L8j00PJ2K2k8k1pK2NPK2j6MnNM7k7pn1Q5Rm9N0q1J11q1L1
$$ 93 93 144 89 69 104 80 118 18 25 37 59 31 10 3 25 30 37 59 43 47 42 47 94 67 60 9 94 103 54 104 23 134 53 84
7669H4o0RL6O5m3l2L4PNp2R3n1jJ9l8L3n5N1l6Nr2kJ04j2k1pK1R1r6JM4n1L6J6
$$ 84 24 33 69 134 91 59 93 100 105 33 126 75 74 93 55 88 33 84 48 53 -39 -41 63 51 30 23 44 135 39 40 84 33 69 85
7703H5m6jN4K2o2J9%O3o4k5J08p4j3O2o6J8L1O6q4k8M5m4J7K3Mp1M0l4O6l5J2
$$ 85 39 38 92 114 52 71 71 134 70 45 153 79 66 128 62 80 111 177 93 65 110 66 83 106 110 39 79 45 111 76 88
7734H8k3m2QK5%njpQJ6j9J4k2N3l9J5k4k1L9LML4l6Mk7N6mM1l2J5l1m6M0QK7q2
$$ 88 65 23 31 56 56 51 50 43 51 67 48 62 40 93 54 69 45 24 63 66 70 104 68 72 45 101 97 138 106 121 90 44 84 92 119 37
7770C7PJ8LM6p7PL2n0M5l2k9J6N2j1m8on8J10k5j5N6k3N2j5j4L9r1k0K8L2n1R1
$$ 37 44 62 65 111 34 41 73 23 68 36 7 23 75 64 16 10 -48 62 37 22 78 55 107 92 78 117 26 6 34 66 15 106
7802A06m6%N3r2Q8k7m0N4n2k1P1K8j16M5N5n6%o0J10r6L5N1k0rK9K9o8K9j4O1
$$ 106 60 60 113 21 109 82 42 96 44 23 94 122 6 51 106 50 50 -10 100 4 39 90 70 61 90 119 51 80 66 127
7832A27p0kj5L6Pn5J3Q8o7K7l3R0n9n2M7RJ4l2M8o7N5j02J23j12P8nk2l1O3l0
$$ 127 57 55 40 76 83 28 41 129 62 89 56 146 87 35 82 91 105 73 121 54 109 7 130 18 96 91 69 38 101 71
7862G1p5M5P6m0L2p8J2K0Km1L8m9N9K7l1pk6Ol2L8m4N0L1m1J2J7o6M4mN4K9p6
$$ 71 -4 41 117 77 109 31 43 63 65 24 62 13 72 99 68 61 35 41 9 47 3 53 84 43 55 72 6 50 46 100 129 53
7894E3%K7j2k6L2k2k1K5M8m9Qk3J6j2N4ko8Q2m7ql0k5MN6K1l4n1Q7L9q1JLL2j5
$$ 53 53 80 68 42 74 52 31 56 104 55 63 40 56 44 98 96 28 110 63 55 25 0 4 60 81 47 -4 83 122 41 42 45 77 62
7928F2rpLN7n4L2pKl3L7l1oN9r5K6N3l4K7j4J7o6K7L9lj3jj12O0J10p9n0R8k3
$$ 62 53 46 49 106 52 84 77 79 46 83 52 46 105 10 36 89 55 82 68 85 19 46 85 82 69 68 -44 16 126 47 -3 95 72
7961G2j0NrJ6o2P8L4n8l5O4n6L4J7m9L5k6N1j22R1J6KK4n1K9j5kL7j23O4L4l8
$$ 72 62 67 58 74 12 90 124 66 31 95 39 73 90 41 76 50 101 -21 70 86 88 112 61 90 75 73 110 -13 51 85 47
7992D7J5rRok1K7Qoj2j1J0j9M4l1m2Q4J4J3Jp1J4K9nOQJ4q0M8j6M9K0p7K2M3o2
$$ 47 62 53 62 56 35 62 70 64 52 41 51 32 76 45 3 87 101 114 115 44 58 87 82 88 96 110 30 78 62 111 131 54 76 119 57
8027E7MkK1l5J4J6J2k1j1K9m4L7K2j5n8J7L8k7mK7n8Q2j0j5j3K2l8J2j5L7rqo1
$$ 57 61 59 80 45 59 75 87 66 55 84 40 77 99 84 26 43 81 54 50 77 19 101 91 76 63 85 47 59 44 81 72 64 3
8060CO6O6j3m7L0o9O0Kj6k1K6o8K1K0KL2J5p3m1P0J3o9K5PP0n4j6OM1k1k4M2l0
$$ 3 69 135 122 75 105 36 96 98 82 61 87 19 40 60 62 94 109 36 -5 65 78 9 34 41 111 57 41 47 88 67 43 85 55
8093E5j8N0n3L1L4o2MM3m6M4J1jl0L5oK2o7KJ01p9oL8k3n6L4j9K9J1k5j3L0l1
$$ 55 37 87 34 65 99 37 41 84 38 82 93 92 62 97 91 113 46 48 149 70 64 102 79 23 57 38 67 78 53 40 70 39
8125C9Qj5J4J3nNk6j4RkN0Rm7M5Ok9K3lJ3Km8R8q6N3n3K3k2J9l8M9RJ7l9qm1M2
$$ 39 47 32 46 59 54 59 33 19 28 26 76 85 38 83 89 60 83 80 93 95 47 145 59 112 59 82 60 79 41 90 99 116 77 69 28 70
8161G0j2M8p9k2O7PL0r1N2j5k5l1M8n0N1j7MM2L9m3m5j4O3Qn5O6qn3NL3
$$ 70 58 106 27 5 72 79 109 18 70 55 30 -1 47 -3 48 31 35 77 116 73 28 14 77 85 30 96 88 35 40 73
8191G3
$$ Imaginary data points
##PAGE= N=2
##DATA TABLE= (X++(I..I)), XYDATA
0@%%%%%%%%%%%%%%%Nj4J8j8J8j8K7l6L6m5N4o3P2q1R8j08J18j35J53j76K03k26
$$ 0 0 0 0 0 0 0 0 0 0 0 0 0 0 0 0 5 -9 9 -9 9 -9 18 -18 18 -27 27 -36 36 -45 53 -55 63 -72 81 -95 108 -118
37a18K53k85L17l53L93m35M82n35N90o52P19p91Q72r60J059j166J284j420J573
$$ -118 135 -150 167 -186 207 -228 254 -281 309 -343 376 -415 457 -503 556 -610 674 -746 827
56H27j745J942k169K433k751L140l624M247n085O274q108J1314j8469O0876k1273
$$ 827 -918 1024 -1145 1288 -1463 1677 -1947 2300 -2785 3489 -4619 6695 -11774 49102 27829
71B7829j10531J28260O143j23291M7778R5386r3460k5966R4970k0744p9025N2638
$$ 27829 -82702 45558 51701 -71590 -23812 71574 -21886 -47852 47118 26374 -52651 -13
83a3L8593o1662j0572O4596j5291n5148L5179M3409n8743j6357P5660j6478p3373
$$ -13 38580 -23082 -33654 30942 15651 -39497 -4318 39091 -19652 -36009 39651 23173 -50200
96e0200N9306M3515r0871L138R3885n6437o1544R3777R194r8510M5086O7862q0947
$$ -50200 9106 52621 -38250 -35112 58773 2336 -59208 34569 43763 -54747 -9661 58201 -22746
109b2746k0393Q6449k6253o4948N5825L0170o5237L710N8177k7946m1067M3991
$$ -22746 -43139 43310 17057 -47891 7934 38104 -27133 -23423 34754 6808 -34259 9732
121I732J9860n3961K952N4673k8940m2826N4346J7559o8162J8402O1718n4607
$$ 9732 29592 -24369 -21417 33256 4316 -38510 15836 33395 -34767 -16365 45353 -9254
133i254l3403P5979q269p1664M8799M3114p2291k023P0481l5588m6326N7804J2389
$$ -9254 -42657 33322 25053 -46611 2188 45302 -26989 -29012 41469 5881 -40445 17359 29748
146B9748o0449J7893M6032l8435k3823M7061J326m5580J8829L6251l5769k0454
$$ 29748 -30701 -12808 33224 -5211 -29034 18027 19353 -26227 -7398 28853 -6916 -27370
158b7370M7316j486m8564K7262L7119m9131j2491N8136j9215m8740M7440K2985
$$ -27370 19946 18460 -30104 -2842 34277 -14854 -27345 30791 11576 -37164 10276 33261
170C3261o0995J0369N3868m0183l0308N5235l64n2398K7258L5113m3439j1460
$$ 33261 -27734 -17365 36503 -3680 -33988 21247 20883 -31515 -4257 30856 -12583 -24043
182b4043M6354j1365l8282K9306K3629l9577m685M1855j5435l4981L4001J9176
$$ -24043 22311 10946 -27336 1970 25599 -13978 -18663 23192 7757 -27224 6777 25953
194B5953m5153L797M4458k8216l0330M5659N806m9629K1341L7508m2081j3949
$$ 25953 -19200 -15403 29055 839 -29491 16168 21974 -27655 -6314 31194 -10887 -24836
206b4836M8428j2765m0259L3571K0941m2811J882L9666k1613k7256L4166J0260
$$ -24836 23592 10827 -29432 4139 25080 -17731 -15849 23817 2204 -25052 9114 19374
218A9374l7797P947L3605k3977k2234L5503N615l9069J4187L3085l2053j7156
$$ 19374 -18423 -10476 23129 -848 -23082 12421 18036 -21033 -6846 26239 -5814 -22970
230b2970M2202n078m0572K7085K6183m1580l729M3228j9969l2108L6408J1936
$$ -22970 19232 14154 -26418 667 26850 -14730 -18459 24769 4800 -27308 9100 21036
242B1036m1355R936L4458k7259j9421L5672J360l4625J5528K6014k7342j2261
$$ 21036 -20319 -10383 24075 -3184 -22605 13067 14427 -20198 -4670 21344 -5998 -18259
254a8259L3010l425l1166J8765K2202k9942p157L4102j0433k9218K5738J5728
$$ -18259 14751 11326 -19840 -1075 21127 -8815 -15972 18130 7697 -21521 4217 19945
266A9945l4251K598L2651k0377k1664L1458M387l3199J3276K5082k6222j0715
$$ 19945 -14306 -11708 20943 566 -21098 10360 14747 -18452 -5176 19906 -6316 -17031
278a7031L0826n474k6744J8975J6223k6375k343K7105j1025k0767K1331R861k5990
$$ -17031 13795 8321 -18423 552 16775 -9600 -11943 15162 4137 -16630 4701 14562 -11428
291a1428L658K4277j6093j6056K4295L252k5985J0479K0492k1764r091K6229n116
$$ -11428 -7770 16507 414 -15642 8653 11905 -14080 -3601 16891 -4873 -13964 12265 7149
304G149k3513J7458J3667k4705n31K4582j2388j7634K1442O058k4165O736K0562
$$ 7149 -16364 1094 14761 -9944 -10475 14107 1719 -15915 5527 11585 -12580 -5844 14718
317A4718j6971j1320K2830m95k2156J2258J5938k0307n271K2980o581j9586J6824
$$ 14718 -2253 -13573 9257 8762 -13394 -1136 14802 -5505 -10776 12204 5623 -13963 2861
330B861J0682k2595Q99K1950j2550j5483K0380M611k2950P031J9193j7020j0315
$$ 2861 13543 -9052 -8153 13797 1247 -14236 6144 10755 -12195 -5164 14029 -2991 -13306
343a3306K2235j404k1507J2619J5097k0298m289K2481p302j8378J7120R601k1860
$$ -13306 8929 7525 -13982 -1363 13734 -6564 -10853 11628 4326 -14052 3068 12669 -9191
356i191J972K0720j2740j3701J9799L178k1201P790J6702j6343p957K0068k559
$$ -9191 -7219 13501 761 -12940 6859 10037 -11164 -3374 13328 -3015 -10972 9096 6537
369F537j8637J1803J2111j7812l135J9172o729j5769J4644Q379j8918J324J8373
$$ 6537 -12100 -297 11814 -5998 -9133 10039 3310 -12459 2185 10564 -8354 -7030 11343
382A1343j0771j2913J7900L817j9943O865J6337j5485p897J9941k809j8290J2512
$$ 11343 572 -12341 5559 9376 -10567 -3702 12635 -2850 -10747 9194 6385 -11905 607
395F07J1260j8322j270J8596q665j3812J5466N329j7744L765J5348j1422r612
$$ 607 11867 -6455 -7725 10871 2206 -11606 3860 9189 -8555 -4790 10558 -864 -10476
408a0476J5969J669j6528O339J3481j2910p189J6806r78j6392R291J1893j5643
$$ -10476 5493 7162 -9366 -3027 10454 -2456 -9645 7161 6183 -10209 -918 10975 -4668
421d668l737J7854n636j4945J3624P352j7468K332J5762j1013r410J5624N74j5322
$$ -4668 -8405 9449 3813 -11132 2492 9844 -7624 -5292 10470 -543 -9953 5671 6245 -9077
435i077P640J0533j2957l329J4064l744j1481R182O622j1991p63J2336m885j0005
$$ -9077 -1437 9096 -3861 -7190 6874 3130 -8351 831 7453 -4538 -5301 7035 2150 -7855
449g855R682N469j2475O90J2587p096r245J2043K864j3896M868J1256j1526m719
$$ -7855 1827 7296 -5179 -4489 8098 1002 -8243 3800 6664 -7232 -2364 8892 -2634 -7353
463g353J4069l628j1820J0486N384j3710K724J1767r366o035J2483j000j1472
$$ -7353 6716 3088 -8732 1754 7138 -6572 -3848 7919 -1447 -7482 5001 4001 -7471
476g471P118P465j0410j852J0868l209q924P311N606r611j276J0141l392q802
$$ -7471 -353 7112 -3298 -5150 5718 2509 -6415 896 6502 -3109 -4385 5756 2364 -6438
490f438P799N226j0833N2J0935o204p854J0813J786j2386N174R575j0907l478
$$ -6438 1361 6587 -4246 -4194 6741 537 -7317 3496 5282 -7104 -1930 7645 -3262 -6740
504f740J3216m051j1129J0384N675j3369J618J2473p930q125J2011K176j2771
$$ -6740 6476 2425 -8704 1680 7355 -6014 -4396 8077 147 -7978 4033 6209 -6562
517f562M163J0348q793n890J1501K46j1455N164Q548r416l796J1090j955j0144
$$ -6562 -2399 7949 -844 -6734 4767 5013 -6442 -1278 7270 -2146 -5942 5148 3193 -6951
531f951P180O195j0519o98J0918n293q208R779L181j1492L006J0138q386n807
$$ -6951 229 6424 -4095 -4793 6125 832 -7376 2403 5584 -5908 -2902 7236 -1150 -6957
545f957J1684Rj1739O054Q735j0410l297J2179k910j0559Q178N957j1108J9J0684
$$ -6957 4727 4736 -7003 -949 7786 -2624 -5921 6258 3348 -7211 967 6924 -4184 -4165 6519
560F519n798p300R249J825r774L403P447p338l277Q733j223p819N120N268p673
$$ 6519 721 -6579 2670 4495 -5279 -1876 5571 -1767 -5044 3689 2466 -5353 -233 5035 -2638
575b638j564Q621k184p878O201N317r010j022J0172m130q552Q785M116j1391K099
$$ -2638 -4202 4419 2235 -5643 558 5875 -3135 -4157 6015 1885 -6667 2118 6234 -5157 -3058
590c058J0399q066o012J1190n64j0632O529O379j0000m87R690m839o396P995J618
$$ -3058 7341 -725 -6737 4453 3889 -6743 -214 6165 -3835 -4322 5368 529 -5867 2128 3746
605C746q113K598O370n346l329O630L85o582K521N715m915l761O948N74p699L340
$$ 3746 -4367 -1769 4601 -745 -4074 2556 2941 -3641 -1120 4595 -320 -4081 2867 3441 -4258 -918
621i18O444p155k848Q866k252p879O883L725r311J805Q036o541m032Q743j238
$$ -918 5526 -1629 -4477 4389 2137 -5742 1141 4866 -4445 -2640 5396 -1145 -5177 3566 2328
636B328p636N467M374p473n7P168l488m854N593K279o280N39O053l284m754N610
$$ 2328 -5308 159 4533 -2940 -2997 4171 683 -4171 1422 3701 -2579 -2040 4013 729 -4025 1585
652A585K399p239J079P024m919m859P839O09q759M271O480q211j829R338l569
$$ 1585 3984 -3255 -2176 4848 -71 -4930 2909 3518 -5241 -970 5510 -2701 -4530 4808 1239
667A239p285P659K951q965K140P506n959m081P901J70p628L549N682o032k817
$$ 1239 -6046 1613 4564 -4401 -2261 5245 -714 -4795 3106 3276 -4352 -803 4879 -1153 -3970
682c970P316m28p264L805N519o654k415Q061j739p541N672M547q337o0Q377m498
$$ -3970 3346 2918 -4346 -541 4978 -1676 -4091 3970 2231 -5310 362 4909 -3428 -3488 4889 391
698C91n936P717J716q437K875O697o204l258P709n49o957L919M958o198j906P058
$$ 391 -5545 2172 3888 -4549 -1674 5023 -1181 -4439 3270 2721 -4236 -317 4641 -1557 -3463 3595
714C595j465o347M557M162o836p56P307l208n711O140K342p548J753O497n410
$$ 3595 2130 -4217 340 4502 -2334 -3090 4217 1009 -4702 1438 3780 -3768 -2015 4482 -928
729i28l481P185n64o485M059M062n888q68O177k190m669M448K395n324J56N227
$$ -928 -4409 2776 2212 -4273 -214 3848 -2040 -2908 3269 1079 -3590 858 3253 -2071 -1915 3312
745C312k499m132M541J977n682P91N527l888l790N950N23o497L072M818n876j679
$$ 3312 813 -3319 1222 3199 -2483 -1692 3835 -53 -3843 2107 2630 -3867 -795 4023 -1853 -3532
761c532O801k215n341N138K333o161J152N359l808k976N171K45m903K260L655
$$ -3532 3269 1054 -4287 851 3184 -2977 -1825 3534 -274 -3250 1921 2166 -2737 -477 3178
776C178l748j848M614l53m413K330L355m117j522M929j066m611L583K742n281
$$ 3178 -570 -2418 2196 1843 -2570 -240 3115 -1002 -2524 2405 1339 -3272 311 3053 -2228
791b228K0N210k910l629M948P69n273K194L991m211j513M958j177m004L309K259
$$ -2228 -2208 3002 92 -3537 1411 2180 -3093 -899 3092 -1119 -2632 2326 1149 -2855 454 2713
807B713m223q2M242j970l068L423J315m105O07L823k614k655L912O45m469J583
$$ 2713 -1510 -1592 2650 680 -2388 1035 2350 -1755 -1148 2675 61 -2594 1318 1963 -2506 -923
823i23L607l570j827M661p41m321L181K539m474k7M440k255l148M162Q94m374
$$ -923 2684 -886 -2713 1948 1207 -3114 67 2606 -1868 -1895 2545 290 -2858 1304 2198 -2176
839b176J381L719l246j893M087j66l987K103K735l346j140L822q70l488K457K232
$$ -2176 -795 2924 -322 -2215 1872 1706 -2281 -178 2557 -789 -1929 1893 1023 -2465 -8 2224
855B224l552n95L877j398l322L129J746l977K38M030k341k745L908P63m268J689
$$ 2224 -1328 -1923 1954 556 -2766 363 2109 -1868 -1630 2400 59 -2686 1222 1985 -2283 -594
871e94L307l337j367M044p71l528K674J792l430M9L137j724k082K433O96k601
$$ -594 2713 -624 -1991 2053 1282 -2246 428 2220 -1210 -1161 1976 252 -1830 603 1299 -1302
887a302M30K191j377j615J996P59k305J96K372j373j727K503N44k852J074K446
$$ -1302 -872 1319 -58 -1673 323 1082 -1223 -1027 1345 -28 -1755 748 1292 -1560 -486 1960
903A960k519q50L098r63k523K559Q16k959J077K060k353n39K435j135j586J922
$$ 1960 -559 -1409 1689 726 -1797 762 1578 -1381 -304 1756 -597 -1136 1299 164 -1422 500
919E00J45j652O79J003j062k05P08L9n11j18P28J65j175N65J282j419n70K054
$$ 500 645 -1007 -328 675 -387 -592 116 155 -356 -474 254 419 -756 -191 1091 -328 -898 1156
937A156o41j838K041O04k517J156J768k561m9K534j822j301K620n29k165J900
$$ 1156 515 -1323 718 1322 -1195 -39 1729 -832 -881 1653 -169 -1470 1150 621 -1544 356
953C56O02k156O77J479j524k27J293n08n54N89J99j78j41mN69k73p30R88K57j363
$$ 356 958 -1198 -521 958 -566 -793 500 -8 -562 27 226 48 -93 -97 472 199 -531 457 714 -649
973f49P45R22j502M4J535j240p60J898p44j541J721J89j822J068J019j727R7J506
$$ -649 96 1018 -484 -440 1095 -145 -905 993 249 -1292 429 618 -1204 -136 883 -844 -747 759
991G59r81p21J359j05r13N69N45n25k20M50K55n23j55Q15k74q46Q88L46j383N63
$$ 759 -222 -943 416 311 -602 -33 512 -13 -233 217 472 -51 -206 609 335 -511 377 723 -660 -97
1011i7J033j432k50J711j058j131J809j48j723J352O80j675M41J287j165k78J111
$$ -97 936 -496 -746 965 -93 -1224 585 437 -1286 66 746 -929 -488 799 -366 -644 467
1028D67l61m59M38O4q3k3r0M86j76o81P86L04j319O91J040j805J14J897j629r90
$$ 467 106 -353 85 149 66 43 -47 439 263 -418 368 672 -647 44 1084 -721 -607 1290 -339 -1329
1048a329K467q98j986K395L07k736J649J524k639L54K300j757r00K304o88j378
$$ -1329 1138 240 -1746 649 956 -1780 -131 1393 -1246 -892 1408 -349 -1249 1055 367 -1011
1064a011J447K94j200N21M58m32m8j5L25O6q89M29J049j584k59K161j382j708
$$ -1011 436 730 -470 51 509 77 29 14 339 405 -484 -55 994 -590 -849 1312 -70 -1778
1082a778K840j42l044K252J673l517O09L267k829j359L715j065k702K807Q98k943
$$ -1778 1062 920 -2124 128 1801 -1716 -1107 2160 -669 -2028 1687 622 -2080 727 1625 -1318
1098a318R58J916j761o62J596j11j025J37Q52m4j304L54J723j655j259K866l96
$$ -1318 -360 1556 -205 -867 729 618 -407 -270 582 538 -766 -412 1311 -344 -1603 1263 867
1115H67l155K410J871l921O35L800l107j818M322r56l568L275J427l964J106L038
$$ 867 -2288 122 1993 -1928 -1293 2507 -600 -2418 1904 948 -2620 655 2082 -1882 -776 2262
1131B262k743j058L017p51k076J488J148j636l93J354J25j540J23J827j034j875
$$ 2262 -481 -1539 1478 727 -1349 139 1287 -349 -742 612 737 -803 -680 1147 113 -1762
1147a762K330Q44l271R60L144l081j417M309j200l684L604J492m474J386L500
$$ -1762 568 1412 -1859 -899 2245 -836 -2253 2056 856 -2828 776 2268 -2206 -820 2680
1162B680l350j368M010r44l160K640J453l047L7K631j181j930J792J133k250m84
$$ 2680 -670 -2038 1972 1028 -2132 508 1961 -1086 -1049 1582 401 -1529 263 1396 -854 -1338
1178a338K547o21k532J964J827l281j70L744k046k685L709O97m199J867L218l698
$$ -1338 1209 588 -1944 20 1847 -1434 -1604 2140 94 -2591 1118 1815 -2384 -517 2701 -997
1194i97r61M187j383l211L068J441l607M59L111k006j965K684P33l067N40K807
$$ -997 -1958 2229 846 -2365 703 2144 -1463 -1004 2107 101 -1864 820 1553 -1514 -974 1833
1210A833j874k105K944Q23l615R66L464l069j875M248l96m191K983K554m286j7
$$ 1833 -41 -2146 798 1621 -1994 -1028 2436 -633 -2508 1740 1344 -2847 136 2690 -1596 -1613
1226a613M276k453k793M021M67m030J660K939l087j218L386l64l114J696K180
$$ -1613 2663 210 -2583 1438 1905 -2125 -465 2474 -613 -1831 1555 1191 -1923 -227 1953
1241A953k773j018L263m08l310J994K560l481q54M208j397l694L667J819m762
$$ 1953 -820 -1838 1425 1017 -2293 -299 2261 -1220 -2074 2134 737 -2957 710 2529 -2233
1256b233R16M354l303k445M738k67m457K720K859m115o48M270j606l326L126J557
$$ -2233 -1317 3037 -266 -2711 2027 1760 -2697 23 2882 -1233 -1881 2389 783 -2543 583 2140
1272B140l771J77L585j794k865L093J488l969M41L974k519k864M164P83m712J878
$$ 2140 -1631 -1454 2131 337 -2528 565 2053 -1916 -1475 2499 -20 -2884 1280 2063 -2649 -771
1288g71L766l908j681M905r36m296L370K427m583Q0M413k362l102L801J084m246
$$ -771 2995 -913 -2594 2311 1375 -2921 449 2876 -1707 -1627 2786 424 -2678 1123 2207 -2039
1304b039R61L649k891k286L878L98m101J615L397l317j856M443l73m359K759K979
$$ -2039 -1078 2571 -320 -2606 1272 1670 -2431 -816 2581 -736 -2592 1851 1478 -2881 -122 2857
1320B857m401n88M908k067l703M120J468m866J143M151l278k321M424j35m281
$$ 2857 -1544 -2132 2776 709 -2994 1126 2594 -2272 -1129 3022 -256 -2577 1847 1712 -2569
1335b569K245L079l718j342M271q35l851K661K538m009n81M408j627l607L577
$$ -2569 -324 2755 -963 -2305 1966 1131 -2720 -59 2479 -1530 -2111 2297 670 -2937 640
1350F40J788m626O67M418k918k895M607L88m745K155L715m122j428M721j137m066
$$ 640 2428 -2198 -1531 2887 -31 -2926 1681 2069 -2676 -521 3194 -928 -2356 2365 1228 -2838
1366b838L167K374m381k10M433k069l421L769J479m625Q34M187k909k619M272
$$ -2838 329 2703 -1678 -1888 2545 476 -2945 824 2303 -2322 -1488 2699 -210 -2829 1443
1381A443M76m597J985L682l824j646M732q43m261L106K667m452l06M484j922l489
$$ 1443 1919 -2678 -693 2989 -835 -2481 2251 1408 -2853 253 2920 -1532 -1838 2646 724 -2765
1397b765L677J601m661Q03M152k964k717M370L85m656K004L633l923j623M762
$$ -2765 912 2513 -2148 -1345 2807 -157 -2874 1496 1881 -2775 -771 2862 -1061 -2684 2078
1412B078q44m219L091K610m405k11M484k044l314L768J376m351Q30L948k775k568
$$ 2078 1234 -2985 106 2716 -1689 -1900 2584 540 -2774 994 2370 -1981 -1151 2797 22 -2546
1428b546M061N00m334J593L526l557j807M531n02m479K883L020m590o24N085k182
$$ -2546 1515 2015 -2319 -726 2800 -757 -2564 1967 1465 -3014 -131 2889 -1701 -2325 2760 578
1444E78l960M327J617n118J246M369l486k341M614r4m291K261L025l701j013M037
$$ 578 -3382 945 2562 -2556 -1310 3059 -427 -2768 1846 1752 -2539 -278 2747 -954 -1967 2070
1460B070r51l479K517K192l593n73L902j252l546L052K100m365J75M467k654l220
$$ 2070 1119 -2360 157 2349 -1244 -1817 2085 833 -2713 339 2439 -1926 -1751 2716 62 -3158
1476c158M558R12n152J993M078m251j642N121j098m348L462K374m600K08M212
$$ -3158 1400 2312 -2840 -847 3231 -1020 -2662 2459 1361 -2987 475 2849 -1751 -1543 2669
1491B669k282k916L596R70l930Q51L507k586k296L592N73m013J370L527l307j978
$$ 2669 387 -2529 1067 2037 -1893 -1042 2465 -121 -2417 1175 1748 -2265 -895 2632 -675 -2653
1507b653M516l84m428K817L002m525m93M852k045l641M023J463m693J094L952
$$ -2653 1863 1479 -2949 -132 2870 -1655 -2148 2704 659 -2982 1041 2504 -2189 -1095 2857
1522B857l099k227M143O9m062J900K977l296j445L928o17l661K428K552l815p09
$$ 2857 -242 -2469 1674 1743 -2319 -419 2558 -738 -2183 1745 1128 -2533 -105 2447 -1368 -2077
1538b077M255j525l577L632J682m550P23M320l108k533M479J41m464K238L255
$$ -2077 2178 653 -2924 708 2390 -2160 -1437 2883 -225 -2758 1721 1862 -2602 -364 2891
1553B891l906j030M165r79l663K790K185l847k55L766j628l000L031J617m056
$$ 2891 -1015 -2045 2120 1141 -2522 268 2453 -1394 -1649 2117 489 -2511 520 2137 -1919
1568a919L66L952k488k687L977O11m421J876L468l689j397M540j084l805L092
$$ -1919 -1553 2399 -89 -2776 1201 1812 -2609 -733 2735 -954 -2351 2189 1105 -2700 392
1583C92K124m104J06L953k065k744L280J058l675O46L285k193k363L378O92l862
$$ 392 2516 -1588 -1482 2471 406 -2338 942 2000 -1675 -1029 2256 63 -2300 1078 1770 -2092
1599b092J140L306k931j904M134l12m117K710K713m204l62M570k259l249M070
$$ -2092 -952 2354 -577 -2481 1653 1341 -2776 -66 2647 -1557 -1919 2651 392 -2857 1213
1614A213R29m397J562L314l112j554L777m90l248J942K066k756q41L048m97k921
$$ 1213 2142 -2255 -693 2621 -491 -2045 1732 1242 -2006 -64 2002 -754 -1595 1453 956 -1965
1630a965J774K180k923r19L618q45l516K839K046m121K60M173k675k639M272L26
$$ -1965 -191 1989 -934 -1853 1765 920 -2596 243 2289 -1832 -1572 2601 -74 -2713 1559 1885
1646A885m473K349L138m086p06M280j621l150L136J333l685N34L155k074k040
$$ 1885 -2588 -239 2899 -1187 -1893 2387 766 -2384 752 2085 -1600 -1066 2089 15 -2025
1661b025K742Q16l097N59K866j979k024L014O88l561J220L126k967j657M138o59
$$ -2025 717 1533 -1564 -1005 1861 -118 -2142 872 1560 -2001 -781 2345 -622 -2279 1859 1200
1677A200l797K771K350m068l9M051k117k722L512O93l778J253L014k792j463L270
$$ 1200 -2597 174 2524 -1544 -1583 2468 351 -2371 1141 1834 -1944 -691 2323 -469 -1932 1338
1693A338j63l119J544K386k714j196L250l88l097J993K273l330n04L732j403l035
$$ 1338 1175 -1944 -400 1986 -728 -1924 1326 938 -2159 -166 2107 -1223 -1727 2005 602 -2433
1709b433L159J386m031R40L490k824j853L879l72l506K095K279l185n88L294j105
$$ -2433 726 2112 -1919 -979 2511 -313 -2166 1713 1341 -2165 -70 2209 -976 -1564 1730 625
1725F25k652K323J411k973m6K909j281k362K511J203l276L76L253j990k253L330
$$ 625 -2027 296 1707 -1266 -1312 1597 316 -2046 465 1668 -1608 -1232 2021 31 -2222 1108
1741A108N08l633J512K895l179j061L762r81l167K726J623l555L07L181j970k091
$$ 1108 1616 -2017 -505 2390 -789 -1850 1912 931 -2236 490 2113 -1442 -1135 2046 76 -2015
1757b015K885N48l032Q20K594k111j505K786K34l032J308K442k521j171L278m75
$$ -2015 870 1418 -1614 -794 1800 -311 -1816 970 1204 -1828 -520 1922 -599 -1770 1508 1033
1773A033l048K121J974l264j28L411j794k415L121O94l423J133K663k507j305
$$ 1033 -2015 106 2080 -1184 -1312 2099 305 -2110 1011 1705 -1718 -585 2078 -429 -1734
1788a734L070k89k875J634J966k588o84K866p97k474J965J570k725j86K925j271
$$ -1734 1336 1047 -1828 -194 1772 -816 -1500 1366 569 -1905 60 1630 -1095 -1281 1644 373
1804C73k418K665J057l266P80K911k326j701L332j17l197J834K129k982m79L076
$$ 373 -2045 620 1677 -1589 -809 2102 -224 -1925 1407 1290 -1907 -73 2056 -926 -1405 1671
1820A671j123k487K348J161k919K80K679j554j873K430P33k902P55K525j969j561
$$ 1671 548 -1939 409 1570 -1349 -1069 1610 56 -1817 613 1346 -1556 -801 1724 -245 -1806
1836a806K872R3k975J524K336k744q80L308r28k785K391J486l199K59L053j987
$$ -1806 1066 1159 -1816 -292 2044 -700 -1580 1728 800 -1985 406 1892 -1307 -1048 2005 18
1852A8j881K809L78k994J050K349k201j209K751j57k607J443J906k345q18K827
$$ 18 -1863 946 1324 -1670 -620 1729 -472 -1681 1070 913 -1694 -251 1655 -690 -1508 1319
1868A319n51k491J867J562k750j62K987j401k182K506Q87l061Q30K603k336j343
$$ 1319 768 -1723 144 1706 -1044 -1206 1781 380 -1802 704 1591 -1470 -640 1963 -373 -1716
1884a716K858j51k822J703J837k552n26K702q67k283K082J159k646J74K573j409
$$ -1716 1142 991 -1831 -128 1709 -843 -1369 1333 466 -1817 265 1424 -1222 -1048 1525 116
1900A16j659K147P17k656O25K390j808j379K583K8k649J309K003k372p55K802
$$ 116 -1543 604 1321 -1335 -710 1680 -128 -1507 1076 1104 -1545 -236 1767 -605 -1360 1442
1916A442q29k307J930J298k687J14K618j575j762K417N27k700R25K206k040j105
$$ 1442 613 -1694 236 1534 -1153 -1039 1579 4 -1758 659 1186 -1514 -589 1617 -423 -1528
1932a528K573k09k386J454J668k277m31K485q01k022J738J209k356J4K304j225
$$ -1528 1045 836 -1550 -96 1572 -705 -1136 1349 548 -1474 264 1473 -883 -869 1435 210
1948B10j725K131O51k533N94K225j838j262K515o1k576J413J872k368n73K599
$$ 210 -1515 616 1267 -1266 -672 1553 -285 -1547 968 907 -1669 -256 1616 -752 -1325 1274
1964A274p80k202J998J160k549K71K348j433j568K233M31k421Q25J949j769j053
$$ 1274 494 -1708 290 1450 -1099 -828 1520 87 -1481 752 1183 -1238 -413 1536 -233 -1286
1980a286K268j07k260J205J552k019n51K363o53k119J718J227k340m5K441j207
$$ -1286 982 875 -1385 -180 1372 -647 -1198 1165 512 -1607 111 1338 -1002 -1047 1394 187
1996A87j815K273O00k558P77K101j806j175K438j62k276J351J599k222m07K318
$$ 187 -1628 645 1245 -1313 -536 1565 -241 -1416 1022 860 -1416 -65 1534 -688 -1095 1223
2012A223o97k014J757R92k188P1K195j259j595K013N42k261O83J909j635j153
$$ 1223 526 -1488 269 1261 -927 -856 1339 80 -1515 498 1040 -1221 -538 1371 -264 -1417
2028a417K215O4k272J247J676k050o87K432n47k141J703J169k284J4K248j162
$$ -1417 798 862 -1410 -163 1513 -537 -1224 1208 661 -1480 223 1392 -892 -878 1370 208
2044B08j610J980N36k309O52J874j604j073K109K4k110J052J537j885n32K178
$$ 208 -1402 578 1114 -1195 -543 1331 -273 -1346 763 787 -1323 -271 1266 -619 -1151 1027
2060A027n52j835J471J090j973n1K050r73j467J690N90j948L48J897j382j185
$$ 1027 475 -1360 111 1201 -772 -823 1227 254 -1213 477 1067 -881 -533 1364 -18 -1203
2076a203J965J54k060Q60J691j852p79K219m97j917J505J062k038M2K047j131
$$ -1203 762 916 -1144 -284 1407 -445 -1224 995 498 -1419 86 1148 -890 -848 1199 68
2092F8j354J878L08j953O76J532j448p21J785j12j592Q48J233j511n33J751l18
$$ 68 -1286 592 900 -1053 -377 1155 -293 -1014 771 659 -933 -85 1148 -363 -896 855 537
2109E37j592J129J048j618l60J782o09j668J641P86k099L13J960j421j138K081
$$ 537 -1055 74 1122 -496 -856 926 317 -1351 290 1076 -1023 -710 1250 -171 -1309 772
2125G72j9k084J178J441j854l92K037p39j501J517O40j740K11J568r36j065J414
$$ 772 753 -1331 -153 1288 -566 -958 1079 340 -1161 356 996 -744 -533 1035 99 -966 448
2142D48M06j628K85J398r60r52J479K51j686M71J547j382p72J818j82j734J171
$$ 448 854 -774 -489 909 -51 -1003 476 727 -959 -488 1059 -323 -1095 723 541 -1193 -22
2159b2J243j935j07J949r01j427J666N31j881N28J489j312p72J671r2j534P41
$$ -22 1221 -714 -821 1128 227 -1200 466 997 -884 -356 1133 -179 -951 720 628 -906 -165
2176a65J050j240m63J524l38j353Q61J088j504k60J660o32j408J373P75j770K50
$$ -165 885 -355 -818 706 368 -985 -124 964 -540 -800 860 228 -1180 193 968 -802 -552
2193e52J661j191r73J765Jj668P96J261j410m40J527l66j320J050P09j299j65
$$ -552 1109 -82 -1055 710 711 -957 -161 1100 -310 -750 777 411 -909 141 850 -449 -614
2210f14J373n57j169R88P50j346n9J477q29j077J339M30j511L99J401j210o75
$$ -614 759 202 -967 21 771 -575 -634 843 14 -1063 276 706 -805 -406 995 -215 -890
2227h90J641j41j567R67R93j505j08J573p44j093J133N17j399K50J157p83q21
$$ -890 751 610 -957 10 1003 -502 -610 963 219 -874 259 776 -623 -373 784 1 -820
2244h20J072L33j276L57J039q34o92J192J42j338N88J075j193l81J476l85j150
$$ -820 252 585 -691 -334 705 -129 -821 371 513 -825 -237 838 -355 -736 740 355 -795
2261g95R54O78j378R1J253p28q89J207K52j349M70J018r76n20J172k1j112N49
$$ -795 159 837 -541 -450 803 75 -814 393 645 -704 -234 784 -192 -712 460 439 -673 -124
2279a24Q43j063l23J169k09j081P53P17j115r9J253n30r88J130L34j330M22J043
$$ -124 719 -344 -667 502 293 -788 -35 682 -433 -532 721 191 -797 333 667 -663 -241 802
2297H02r65m79J242j93j098P11O64r88j35R64k70r33O66N15r37n4J033m65p94
$$ 802 -163 -642 600 407 -691 20 684 -304 -439 525 255 -678 -12 503 -434 -488 545 80 -714
2316g14Q17M29j090J15J194p48p14J084J74j203M83J024j083l79J189k97j025
$$ -714 103 532 -558 -443 751 3 -711 373 547 -656 -173 851 -232 -611 578 281 -744
2333g44Q90N47j045k8R77n27p18Q73K84j025J53Q88n84o31Q58K44r76K97Q25o73
$$ -744 146 693 -352 -380 597 70 -648 225 509 -516 -363 525 -59 -690 168 412 -564 -267 558 -115
2353a15n32J060m9r50N47P22r20k17J068l65q77Q46L87j061K01Q65o34n83Q66
$$ -115 -647 413 364 -586 -39 683 -237 -454 614 249 -628 218 605 -456 -255 610 -24 -607 259
2372B59J73r70L44P02o44m16Q56r9p17L91O41p34k52Q40j04q29N55N75q36j19
$$ 259 432 -538 -194 508 -136 -552 304 205 -512 -121 520 -214 -466 374 270 -559 -4 571 -265 -384
2392c84R43m44o78P81L46r93K06P88o69m73R18j8q93M80N67p14j71P29j81o53
$$ -384 559 115 -563 218 564 -429 -223 565 -104 -577 341 323 -570 -90 477 -237 -408 321 140 -513
2412e13N17L98o38j09O75k66n68N76L44o62j1O75l13n17O15K31p94J94P37o38
$$ -513 4 402 -236 -345 330 64 -504 72 416 -246 -257 418 105 -412 203 434 -360 -166 571 -67
2432f7l57O95j4q03N08N30p59j24P93l33o46P26J78p44J16O48m28l33N98P1o07
$$ -67 -424 271 257 -546 -38 492 -267 -391 402 69 -577 149 327 -417 -301 347 -81 -414 184 255 -352
2453c52K77M84m88j55M94L0n32K39M33n10l19O50l1o33L63M62o47j43Q23m31n70
$$ -352 -75 409 -79 -234 260 290 -242 -3 430 -80 -399 251 220 -413 -50 412 -235 -378 445 14 -556
2474e56P05J94p58J74P18o51k84Q08j63o52N02L59o48Q6N18k35l70L08K76m65
$$ -556 149 343 -415 -241 477 -174 -458 350 187 -465 37 396 -252 -166 352 117 -253 55 331 -134
2494a34m0M80j69m70L35K84n23p6O66k74o16O68K35p97K47O19o36l17Q26r0p13
$$ -134 -174 306 137 -333 2 286 -237 -313 353 79 -537 131 366 -431 -184 435 -201 -518 308 218 -495
2515d95M98M02o88MO84l28m08M82J37m58N6L88k43l07L06J65l91mM53k04l92M02
$$ -495 3 405 -283 -279 405 77 -331 151 288 -170 -114 274 31 -276 30 195 -196 -200 253 49 -343 59
2537E9K48o64J61O01n06l09O10Lp13M37M13o12k4O46l17l94N46J19n57J61M31
$$ 59 307 -357 -196 405 -101 -410 200 203 -510 -73 340 -272 -296 350 33 -361 185 304 -253 -92 339
2558C39l72j94M33Om64J52L69l06k13M57o0m92K37L82m35j56N85j13n30L75L52
$$ 339 -33 -227 206 212 -252 -100 269 -37 -250 207 147 -345 -108 274 -161 -317 268 155 -375 0 352
2579C52n64K8N10k78l86M79J20n60K21L91l51k46M69N7m69J24M88n05k17N94r9
$$ 352 -212 -184 326 48 -338 141 261 -299 -78 313 -38 -284 185 242 -227 -103 385 -120 -337 257 158
2600A58n63L93L08n10q0N89k64m46M97J55n87J89M72m13j50M39K8m50K12L31k31
$$ 158 -405 -12 296 -214 -294 295 31 -415 82 237 -350 -161 311 -102 -252 187 215 -235 -23 308 77
2621G7k15K63O6l80J33L40l26k52M89K1n28K51L61n30j28O49k33m64N22J97p04
$$ 77 -138 125 191 -189 -56 284 -42 -294 195 216 -312 -61 300 -230 -358 291 58 -406 116 313 -391
2642c91K46M11l80k13N65j07m01K82K32l64j8L15n3l21J86K99l48j17L63o8m76
$$ -391 -145 266 -114 -327 238 131 -270 12 244 -120 -138 177 124 -197 -11 288 -60 -177 186 118 -358
2663c58L28L15n49k8O12k83m53N22J24n94K67M32m66j59N81j81m31M36J56m66
$$ -358 -30 285 -264 -292 320 37 -416 106 230 -364 -97 335 -131 -290 291 110 -321 115 271 -195
2683a95K0L53j47k69L03J57m02M8L56j45l57K76K40n32N9N32l34m49O33R3o74
$$ -195 -175 178 31 -238 65 222 -180 -132 224 79 -278 -2 238 -294 -235 297 -37 -486 147 240 -434
2704d34L08N30o52p5O15j62m57M21K12n84J82M48l00k64L76K5m36J87L15k07k44
$$ -434 -126 404 -248 -323 292 130 -327 94 306 -278 -96 352 52 -212 164 189 -247 -60 255 48 -196
2725a96K27J81m77J8N38l06l16M41P7n99L26M24n87j10O78k12n12M91J99n76J67
$$ -196 31 212 -265 -247 291 -15 -331 110 187 -412 -86 338 -249 -359 319 107 -405 86 285 -291 -124
2746a24N15m10k95M60M4m37K47L25m16k16M23m5l81K95L29m84j48N68j29n65L93
$$ -124 391 -19 -314 146 190 -247 0 325 -91 -307 116 71 -310 -15 314 -170 -318 250 121 -444 -51
2767e1L64n41J0N49l56l71N20J11n54J89M14l53j50M66m9n26L28L51l83j81M64
$$ -51 313 -228 -218 331 -25 -396 124 235 -319 -130 284 -69 -219 247 198 -328 0 351 -32 -213 251
2788B51j44m45L32K93m71m7N21k66n06N31K67o55J18N56l58l79O69p2n60K87L93
$$ 251 107 -338 -6 287 -184 -231 290 24 -482 49 316 -339 -221 335 -23 -402 267 195 -365 -78 315
2809C15m62j28O01k06m31M01J78m80O8M10j41m69M09K05n16M2M99k86l93N45J38
$$ 315 -147 -275 326 120 -311 90 268 -212 -144 266 125 -344 65 270 -246 -204 295 9 -384 161 299
2830B99o38J55M99m88j98O31q5n64L91L46n93j8O33l29l99N45O8m93J11M31k76
$$ 299 -339 -184 315 -173 -371 260 175 -389 2 348 -245 -263 370 41 -358 187 255 -238 -127 304 28
2851B8l53M63O9n21J57M48l71k81N36Oo04L06M79n44j95P43k93n80O28K90p46
$$ 28 -325 138 207 -314 -157 291 -80 -361 175 181 -423 -117 362 -182 -377 366 73 -507 121 411 -335
2872c35J71O50n12l43O24J5o26L79L78m68j34M18n5m48K71L29m35k04N84j67m83
$$ -335 -164 486 -26 -369 255 270 -356 23 401 -67 -201 217 162 -286 -15 314 -121 -325 259 92 -391
2893c91L26M01n86j07O93l47m80N38K78p31K69N75n49k76P22j17o48M40L65n72
$$ -391 -65 336 -250 -357 336 -11 -491 47 325 -406 -137 438 -111 -387 335 218 -430 10 375 -197
2913a97r5O34l08l81M46J64m46l5N22k96l19L40K02n04P1M98l66l58N67L7n59
$$ -197 -292 342 34 -347 99 263 -183 -218 304 8 -311 29 231 -273 -202 296 -70 -428 139 176 -383
2934c83K95N05n98j70P07k17o25N88L60p03L7N83l77l87N76R3o35K38M06m07k25
$$ -383 -88 417 -181 -351 356 139 -486 102 462 -241 -204 379 2 -385 191 284 -351 -113 293 -114 -339
2955c39N19mn38L24L21m46k14O42j27n20L95L07m94j14O01j50n85N76L05p12P8
$$ -339 180 176 -362 -38 283 -163 -377 265 138 -382 13 320 -174 -288 313 163 -422 154 459 -253 -175
2976a75O49n16l49O08K5o24K89N28o04j61O84k32n51M34K88n93rO36l43m13N66
$$ -175 474 -42 -391 217 242 -382 -93 435 -169 -330 354 122 -429 5 293 -300 -309 327 -16 -429 137
2997A37J26n42Q9N46l68l06M81J27o02K08N07n13k23O22l5o00L05M76o21j18O45
$$ 137 263 -279 -190 356 -12 -318 163 290 -312 -104 403 -110 -333 289 254 -346 -41 435 -186 -304 341
3018C41k52n69N58K76p10J30O35n44l49P20L4p28L55N26n54k03P06k47n40M63
$$ 341 89 -480 78 354 -356 -226 409 -135 -484 236 270 -458 -103 423 -131 -334 372 125 -415 48
3038D8L05n22j03O59k91m33M66J75n59N1O50m49m05N28J25o30J70O53n13l47P30
$$ 48 353 -169 -272 387 96 -337 129 304 -255 -204 446 -3 -408 120 245 -385 -215 438 -75 -422 308
3059C08q0p03M49M49o94p2P33k98n48N98K54p23J28P09n07l67O60No76K52N20
$$ 308 228 -475 -26 423 -271 -343 390 92 -456 142 396 -327 -199 510 3 -364 296 301 -375 -123 397
3080C97m89l09O93o7o71M54L29n01j36O16k59n48N39K77o11L9O62l96m95O74P6
$$ 397 -92 -401 292 225 -446 8 337 -164 -300 316 57 -491 48 325 -286 -247 415 19 -476 198 274
3101B74o12K45N60n81k66O29K8o59L82L85n78p7O21k35n51M67L27o47jO78m09
$$ 274 -338 -93 467 -114 -380 249 277 -382 0 385 -193 -270 351 116 -435 32 359 -288 -289 389 -20
3122b0m30O27M9o21K67N52m90l62P27r1n41K96M60n49j46O26j87n50L97M11o51
$$ -20 -450 177 226 -395 -128 424 -66 -428 299 208 -333 -37 423 -126 -272 354 167 -383 14 425 -226
3143b26l4N91k49n36N68K06o59J41N79m65l83O78Jo61M32M08o28p9O00j46n84
$$ -226 -260 331 82 -454 114 320 -339 -198 381 -84 -467 211 212 -449 -17 391 -237 -316 284 138 -446
3164d46M85L16o02j6O04k91m25N28K43o86J10O21m75m10O49Q6p29K81O23o60j83
$$ -446 39 355 -247 -263 341 50 -375 153 396 -290 -180 441 -34 -444 205 291 -438 -157 466 -194 -377
3185c77O57j25o67N51L98p26J8O37l21n17N94J88o64K37M92m14k72N42on41L26
$$ -377 280 155 -512 39 437 -289 -271 366 45 -472 122 310 -354 -117 375 -39 -311 231 225 -316 10
3206A0L75m14l18O03o9o26L99M41o72p8P17l27n39N29L28p22J91O21n28k83O41
$$ 10 385 -29 -347 256 187 -439 -40 401 -271 -349 368 41 -498 31 359 -363 -172 449 -79 -362 279
3227B79Jp00L75M69o71o0O86k71m57M03L07n58m0N82l03m60M81K33o37Q9O01l84
$$ 279 280 -420 -45 424 -247 -307 379 108 -349 54 361 -197 -237 345 42 -418 63 296 -341 -252 349 -35
3249c5m17N52J39o33K31N64n77k23P13j11o15M74L44o70JO02k59m98N37K50o71
$$ -35 -452 100 239 -394 -163 401 -176 -399 314 203 -412 62 406 -264 -263 339 80 -418 119 369 -302
3270c02J30N65l69m36O56K1o67L55L95m82k85O74l5o90M39L97o44j0O10k19n33
$$ -302 -172 393 24 -412 244 265 -402 -47 348 -134 -419 255 220 -470 -31 366 -278 -288 322 103 -430
3291d30N66K21p05J45N72l53l68O26Mn65K46L84m00k03M76j2n86L79L83n91j12
$$ -430 136 357 -348 -203 369 16 -352 274 278 -287 -41 343 -57 -260 216 204 -382 -3 380 -211 -323
3312c23O54j85n63N05K41o63J14O21m28l64N90J38p20K99M55m76k14O30p8o26
$$ -323 331 146 -417 88 329 -334 -220 401 -27 -391 199 337 -383 -84 371 -105 -319 311 233 -393
3332c93L90L27n11j06O27k98m09M22K68o24L4O16l65l61N62M7n64J95N46n62j81
$$ -393 -3 324 -187 -293 334 36 -373 49 317 -307 -273 343 -22 -383 179 226 -338 -143 403 -159 -340
$$ [...]
8191C7
##END NTUPLES=NMR FID
##END=
