##TITLE=1H_B1d3010-2
 CDCl3
 8 sc, 
 30.10.2024
##JCAMPDX= 6.0         $$ Bruker NMR JCAMP-DX V2.0
##DATA TYPE= NMR FID
##DATA CLASS= NTUPLES
##ORIGIN= UXNMR, Bruker Analytische Messtechnik GmbH
##OWNER= root
$$ XWIN-NMR		Version 3.5
$$ Wed Oct 30 15:52:48 2024 Russian Standard Time (UT+4h)  she@DPX200
##.OBSERVE FREQUENCY= 200.1318
##.OBSERVE NUCLEUS= ^1H
##.DELAY= (6, 6)
##.ACQUISITION MODE= SIMULTANEOUS
##.ACQUISITION SCHEME= undefined
##.AVERAGES= 8
##.DIGITISER RES= 18
##SPECTROMETER/DATA SYSTEM= spect
##.PULSE SEQUENCE= zg30
##.SOLVENT NAME= DMSO
##.SHIFT REFERENCE= (INTERNAL, DMSO, 0, 15.7039)
##AUDIT TRAIL= $$ (NUMBER, WHEN, WHO, WHERE, WHAT)
$$ ##TITLE= Audit trail, XWIN-NMR		Version 3.5
$$ ##JCAMPDX= 5.01
$$ ##ORIGIN= Bruker BioSpin GmbH
$$ ##OWNER= she
$$ F:/spectra/data/she/nmr/H-F/1/audita.txt
$$ ##AUDIT TRAIL=  $$ (NUMBER, WHEN, WHO, WHERE, WHAT)
(   1,<2024-10-30 15:51:28.71 +0400>,<she>,<DPX200>,
      <created by zg, POWCHK disabled, PULCHK disabled
       configuration hash MD5:
       00 E9 B6 7A A2 85 ED C7 34 08 36 98 17 FE 4E 26
       data hash MD5: 16K
       AC 7A 76 1C 80 F8 D6 D9 18 99 AD 3F CE 1E 07 03>)
$$ ##END=
$$ 
$$ hash MD5
$$ 7B C5 AB AF 94 0B F3 62 07 E7 B4 AC D1 02 10 C6
##$RELAX= 
##$RELAX= 
##$RELAX= 
##$RELAX= 
##$RELAX= 
##$RELAX= 
$$ Bruker specific parameters
$$ --------------------------
##$DU= <F:/spectra>
##$EXPNO= 1
##$NAME= <H-F>
##$PROCNO= 1
##$TYPE= <nmr>
##$USER= <she>
##$AMP= (0..31)
100 100 100 100 100 100 100 100 100 100 100 100 100 100 100 100 100 100 
100 100 100 100 100 100 100 100 100 100 100 100 100 100 
##$AQSEQ= 0
##$AQ_mod= 1
##$AUNM= <au_zg>
##$AUTOPOS= <>
##$BF1= 200.13
##$BF2= 200.13
##$BF3= 200.13
##$BF4= 200.13
##$BF5= 200.13
##$BF6= 200.13
##$BF7= 200.13
##$BF8= 200.13
##$BYTORDA= 1
##$CFDGTYP= 0
##$CFRGTYP= 5
##$CHEMSTR= <none>
##$CNST= (0..31)
1 1 145 1 1 1 1 1 1 1 1 1 1 1 1 1 1 1 1 1 1 1 1 1 1 1 1 1 1 1 1 1 
##$CPDPRG= <>
##$CPDPRG1= <>
##$CPDPRG2= <>
##$CPDPRG3= <>
##$CPDPRG4= <mlev>
##$CPDPRG5= <mlev>
##$CPDPRG6= <mlev>
##$CPDPRG7= <mlev>
##$CPDPRG8= <mlev>
##$CPDPRGB= <>
##$CPDPRGT= <>
##$D= (0..31)
0 1.2 0 0 0 0 0 0 0 0.06 0 0.03 0 0 0 0 0.0002 0 0 0 0 0 0 0 0 0 0 0 0 
0 0 0 
##$DATE= 1730289088
##$DBL= (0..7)
120 120 120 120 120 120 120 120 
##$DBP= (0..7)
150 150 150 150 150 150 150 150 
##$DBP07= 0
##$DBPNAM0= <>
##$DBPNAM1= <>
##$DBPNAM2= <>
##$DBPNAM3= <>
##$DBPNAM4= <>
##$DBPNAM5= <>
##$DBPNAM6= <>
##$DBPNAM7= <>
##$DBPOAL= (0..7)
0.5 0.5 0.5 0.5 0.5 0.5 0.5 0.5 
##$DBPOFFS= (0..7)
0 0 0 0 0 0 0 0 
##$DE= 6
##$DECBNUC= <off>
##$DECIM= 24
##$DECNUC= <off>
##$DECSTAT= 4
##$DIGMOD= 1
##$DIGTYP= 9
##$DL= (0..7)
0 120 120 120 120 120 120 120 
##$DP= (0..7)
150 150 150 150 150 150 150 150 
##$DP07= 0
##$DPNAME0= <>
##$DPNAME1= <>
##$DPNAME2= <>
##$DPNAME3= <>
##$DPNAME4= <>
##$DPNAME5= <>
##$DPNAME6= <>
##$DPNAME7= <>
##$DPOAL= (0..7)
0.5 0.5 0.5 0.5 0.5 0.5 0.5 0.5 
##$DPOFFS= (0..7)
0 0 0 0 0 0 0 0 
##$DQDMODE= 0
##$DR= 18
##$DS= 0
##$DSLIST= <SSSSSSSSSSSSSSS>
$$ [...]
##$SUBNAM2= <"">
##$SUBNAM3= <"">
##$SUBNAM4= <"">
##$SUBNAM5= <"">
##$SUBNAM6= <"">
##$SUBNAM7= <"">
##$SUBNAM8= <"">
##$SUBNAM9= <"">
##$SW= 24.0689170037331
##$SWIBOX= (0..15)
0 0 2 0 0 0 0 0 0 0 0 0 0 0 0 0 
##$SW_h= 4816.95568400771
##$TD= 16384
##$TD0= 1
##$TE= 0
##$TE2= 300
##$TE3= 300
##$TEG= 300
##$TL= (0..7)
0 120 120 120 120 120 120 120 
##$TP= (0..7)
150 150 150 150 150 150 150 150 
##$TP07= 0
##$TPNAME0= <>
##$TPNAME1= <>
##$TPNAME2= <>
##$TPNAME3= <>
##$TPNAME4= <>
##$TPNAME5= <>
##$TPNAME6= <>
##$TPNAME7= <>
##$TPOAL= (0..7)
0.5 0.5 0.5 0.5 0.5 0.5 0.5 0.5 
##$TPOFFS= (0..7)
0 0 0 0 0 0 0 0 
##$TUNHIN= 0
##$TUNHOUT= 0
##$TUNXOUT= 0
##$USERA1= <user>
##$USERA2= <user>
##$USERA3= <user>
##$USERA4= <user>
##$USERA5= <user>
##$V9= 5
##$VALIST= <valist>
##$VCLIST= <CCCCCCCCCCCCCCC>
##$VD= 0
##$VDLIST= <DDDDDDDDDDDDDDD>
##$VPLIST= <PPPPPPPPPPPPPPP>
##$VTLIST= <TTTTTTTTTTTTTTT>
##$WBST= 1024
##$WBSW= 4
##$XGAIN= (0..3)
0 0 0 0 
##$XL= 0
##$YL= 0
##$YMAX_a= 133486
##$YMIN_a= -150229
##$ZGOPTNS= <>
##$ZL1= 120
##$ZL2= 120
##$ZL3= 120
##$ZL4= 120
##$ABSF1= 10
##$ABSF2= 0
##$ABSG= 5
##$ABSL= 3
##$ALPHA= 0
##$AQORDER= 0
##$ASSFAC= 0
##$ASSFACI= 0
##$ASSFACX= 0
##$ASSWID= 0
##$AUNMP= <proc_1d>
##$AZFE= 0.1
##$AZFW= 0.1
##$BCFW= 1
##$BC_mod= 2
##$BYTORDP= 1
##$COROFFS= 0
##$CY= 11.3945322036743
##$DATMOD= 1
##$DC= 2
##$DFILT= <>
##$DTYPP= 0
##$F1P= 15.6554695791079
##$F2P= 12.8336369535428
##$FCOR= 0.5
##$FTSIZE= 0
##$FT_mod= 4
##$GAMMA= 1
##$GB= 0.15
##$INTBC= 1
##$INTSCL= 1
##$ISEN= 128
##$LB= 0.24
##$LEV0= 0
##$LPBIN= 0
##$MAXI= 10000
##$MC2= 0
##$MEAN= 0
##$ME_mod= 0
##$MI= 1.114404
##$NCOEF= 0
##$NC_proc= 0
##$NLEV= 6
##$NOISF1= 3.799351
##$NOISF2= 2.8
##$NSP= 1
##$NTH_PI= 0
##$NZP= 0
##$OFFSET= 15.70392
##$PC= 1
##$PHC0= -26342.83
##$PHC1= 6.987431
##$PH_mod= 1
##$PKNL= yes
##$PPARMOD= 0
##$PSCAL= 0
##$PSIGN= 0
##$REVERSE= no
##$SF= 200.130013532006
##$SI= 16384
##$SIGF1= 3
##$SIGF2= 2
##$SINO= 400
##$SIOLD= 16384
##$SREGLST= <1H.CDCl3>
##$SSB= 0
##$STSI= 0
##$STSR= 0
##$SW_p= 3612.71676300578
##$SYMM= 0
##$S_DEV= 0
##$TDeff= 0
##$TDoff= 0
##$TI= <>
##$TILT= no
##$TM1= 0
##$TM2= 0
##$TOPLEV= 0
##$USERP1= <user>
##$USERP2= <user>
##$USERP3= <user>
##$USERP4= <user>
##$USERP5= <user>
##$WDW= 1
##$XDIM= 8192
##$YMAX_p= 0
##$YMIN_p= 0
$$ End of Bruker specific parameters
$$ ---------------------------------
##NTUPLES= NMR FID
##VAR_NAME=  TIME,          FID/REAL,        FID/IMAG
##SYMBOL=    X,             R,               I
##VAR_TYPE=  INDEPENDENT,   DEPENDENT,       DEPENDENT
##VAR_FORM=  AFFN,          ASDF,            ASDF
##VAR_DIM=   8192,          8192,            8192
##UNITS=     SECONDS,       ARBITRARY UNITS, ARBITRARY UNITS
##FACTOR=    0.0002076,     1,               1
##FIRST=     0,             0,               0
##LAST=      1.7004516,     0,               0
##MIN=       0,             -150229,         0
##MAX=       1.7004516,     133486,          0
$$ Real data points
##PAGE= N=1
##DATA TABLE= (X++(R..R)), XYDATA
0@%%%%%%%%%JrJ6j6J6k4L2m0M8n5O3p2Q8j04J20j37J58j83K11k38K67l04L44l88
33b06M36m85N42o07O76p51Q32r21J022j133J253j388J538j705J891k103K345k624
51a388K952l340L810m393N136o119P487r526J2937k8755J54685j32462j17290
64a16266K38503j17717j38946K18403j1363j86033J49874L2195j73379R6672J05803
75I7746j49427J4297J09179r4145l4348J16766l4729q3665P2118K9489r4228L2520
87a8427Q3556r1005k8038J19936o1936p7111J32624k5435j20754J26059K0603
98F0072j49159R8509O6589j56685O7085J06549j55051K1265J34589j33410j4466
109e4113J47887j09861n7127J44784o9576p5741J31541l3919r7334J01883R716
$$ y = [0, 0, 0, 0, 0, 0, 0, 0, 0, 0, 1, -8, 8, -8, 8, -16, 16, -24, 24, -31, 32, -40, 48, -56, 64, -73, 85, -98, 113, -125, 142, -162, 182, -206, 230, -255, 287, -320, 356, -395, 437, -484, 538, -595, 658, -730, 808, -897, 994, -1109, 1236, -1388, 1564, -1776, 2034, -2359, 2777, -3342, 4145, -5381, 7556, -21199, 133486, 1024, -116266, 122237, 4520, -134426, 83977, 72614, -113419, 36455, 68650, -104729, -8057, 97746, -51681, -37384, 71795, -22350, -56698, 60068, 25339, -58326, 13792, 43281, -50947, -18427, 65129, -25876, -53914, 66022, 4086, -73025, 59599, 34164, -86590, 39469, 60072, -89087, 9422, 76011, -80674, -13589, 92960, -62091, -40826, 93763, -39647, -54113, 93774, -16087, -73214, 71570, 1994, -73747, 57794, 23875, -73459, 28424, 38140]
120C8140r3125O7775L7360r1046K3970O2467o2600j2315O6732l4287m7746O1625
132A6950J2754o6466L4623M9873p7730p53R0293o8227m6356J11515m6671q6074
144g6269J23683q647j21479J10678L4108j40975Q3032P7516j46971L9041J12662
155H6379j31434o243J34179j01987n0411J37757n8344q1094J19777j5288r9619
166f6328Q6609K7521r7333M1644N7794p9005k779P6763m5446m3340P4348o632
178B3816o9919N6296L4304q2555K1584O8494p6154j6184R4702n6650n6275J05291
190D6750k4764q8157J00724R470j11371Q0742M4460j17986N1583P3140j10959
201d6368J6793R4251q9749j7669J01960o2736m7782R7592l1227o7727Q0256n71
$$ y = [38140, -54985, 12790, 50150, -40896, -16926, 45541, -17059, -29374, 37358, 3071, -44675, 16950, 29704, -36762, -2139, 47734, -29996, -30749, 59544, -8683, -55039, 56476, 9805, -76269, 47414, 38767, -82712, 27966, 62074, -78901, 4131, 81647, -65324, -26283, 86379, -45055, -51298, 82881, -19106, -69517, 68240, 9896, -71198, 48579, 33291, -66328, 20281, 47802, -49531, -7887, 49907, -29098, -31877, 44886, -560, -43900, 30448, 23816, -46103, 10193, 44497, -38058, -16474, 52020, -24134, -40318, 54384, -2266, -58541, 46750, 21986, -66171, 34553, 44023, -67348, 13394, 57854, -60132, -8549, 64591, -46368, -29575, 64676, -25073, -42742, 59218, -3518, -51300, 46292, 15065, -52662, 27594, 27023]
213B7023p4782N5244K7445o9603K5244M6234n2856o655N5669k9282l5798N3087
225B0970j943n4921M0882K6881o3862J9646N2649o0171p441P1194m6940l7929
237d0985P9948k5158o4549P8435J094q3649O7527K9245r1843M6996N4342q9273
249c7870J9712P2389p5948j0888Q0731n3721l7312P8878k4957n6399O6841L874
261B5330o4911M5754K8061o2271J8045M5459m8221j1677N2713k4606l7139N0593
273A7130L332n4833L7493L1063o2404J5680N3829n8035j1310O8647m3651l7994
285d1053P4068j9313o0977O9524P100p5613N5048L2862q1499L3402N2582p5700
297b9569Q277O5474o0167j5991O8985l7085l5969O2692j1707m9663M8733J1159
$$ y = [27023, -47759, 7485, 34930, -34673, -9429, 36805, -16051, -22706, 32963, 3681, -32117, 20970, 19027, -35894, 4988, 31869, -31993, -12347, 40302, -19869, -27310, 43884, -3056, -40985, 38963, 13805, -50744, 27691, 28785, -54864, 12663, 41908, -49935, -2939, 51403, -37870, -18158, 54231, -21717, -32605, 48126, -5595, -42907, 35971, 11014, -45385, 21456, 25330, -39581, 6173, 34234, -28037, -9992, 35467, -12754, -24431, 28282, 3676, -33463, 17130, 20462, -34371, 3122, 34185, -28219, -12539, 41290, -16745, -28055, 40592, -3059, -41053, 33015, 13702, -47275, 22249, 29349, -46264, 8784, 41646, -39853, -6451, 46131, -29569, -21292, 44182, -15985, -31976, 37009, -76, -36045, 26647, 14940, -34723, 14010, 25169]
309B5169n4508K8300L0153m9678O088M2003l5330j5659M6030j5461l4327M0750
321A3530P017m7531K7916K8438n2751J0440M6327m8671r667N8115l5975k9772
333c2584O1520j7555m7553N6298K792o0157M4755K3691o5117K8007M1613o0922
345b5212Q544N3591m9537j1911N7272l2081l0095N2344j0835m2887M0838J0814
357B0845m7818K4224K9115m3953M187M1336l3104j6617M5013j6516l3894M0250
369A3068M822m6132K8757K6068m9670J2013M3318m5963p520N3736l5004k6739
381b9246N6178j8344m2494N0410K262n2201L8643K2396n4665K1159L8219n0163
393a7846K160M7136l8877j6051M8306k2160l0120M2986k490l8744L1053J6035
$$ y = [25169, -29339, -1039, 29114, -20564, -14476, 27527, -7803, -23462, 22568, 7107, -27220, 13530, 20547, -26984, 932, 29370, -23381, -12941, 33386, -15285, -24952, 33163, -2812, -32584, 28936, 11381, -36172, 20126, 22918, -37239, 7516, 31207, -33910, -5903, 35710, -25212, -16668, 36923, -12614, -24525, 32747, 666, -29429, 22915, 12080, -30807, 10031, 20845, -26973, -2749, 26366, -17587, -13400, 27936, -5168, -21785, 23228, 6712, -27182, 13068, 17890, -28242, 515, 26583, -23087, -11074, 32244, -13719, -21239, 32497, -2507, -29246, 26932, 8588, -33906, 16504, 18766, -33435, 5208, 27604, -27061, -5902, 32317, -17846, -15686, 31450, -7427, -23478, 24828, 2668, -27452, 15534, 13044, -25700, 5353, 21388]
405B1388m1021J4494L0201l6616l697L8670k5944k0118M0401j0198l2944L5453
417A0069P083m0269K3613K4047m2384P962L7313l8064q988M5227k7557k4208M7157
430B1001j3012l6031M1900L498m3420L0343J9661m5016J4671L2481m0453j550
442a5927M0863l0076j6580M2792j6176k8710L8128m86l6071K6717J5113l7916
454a8329J1808K8291l3441l765L7045k3696j8674L8924j0415l0381L3979M349
466A5695l7736K3633J9152l8621R293L1645l3652n744L9299k3788k0473M0758
478A9461j1042l2238L5689L417l8253K5214J7614l8608J1415K9943l3186m050
490a4624L7066k3688j8617L7972j1192k9159L2677L028l5152K2914J7302l5314
$$ y = [21388, -19633, -5139, 25062, -11554, -15251, 23419, -2525, -22643, 17758, 7560, -25384, 10069, 17152, -23117, 496, 24543, -17841, -9879, 27434, -10630, -19618, 25609, -1948, -26156, 21001, 7989, -28042, 13858, 17356, -26064, 4279, 23940, -21076, -6405, 26076, -14377, -15927, 24936, -5140, -21720, 21072, 4896, -23814, 14314, 13828, -22243, 4474, 19587, -18329, -6521, 21770, -11671, -15436, 21609, -2087, -20761, 18163, 7748, -22633, 11346, 15695, -22041, 1592, 20744, -17877, -8584, 23061, -10591, -16335, 22964, -824, -21297, 19461, 8419, -23819, 11870, 15287, -22966, 2248, 19862, -18746, -7331, 22612, -10574, -14624, 22442, -1246, -19863, 18109, 6917, -22242, 10435, 13463, -21689, 1225, 18527, -16787]
502a6787R995K8013k9986n119L4353k0655j8919L4970q497k8862L0161N014l4031
515b0350K0966J7996l3680Q136K7709k8109o388L2900j9009j9461L3638o884k8609
528b1145K8626O195l3046K0013J7882l2775P685K6697k7339o253L1645j8314j8551
541a8680L2255o757k7242K8380N440l1729J9728J6567l1507P608K5096k6983m894
554a2718K9780j8316j6147L0470p075k4913K6921M700k9386J8412J5163k9646
566a2755O769K3385k4838n091K7747j5695j6403K8849m430k5327K4660P125l0049
579a6053J5610J7818l0263N044K5807k4981p023L0528j5692j8274L0681m879k6782
592a8459K5579P073l1471J7455J6916l1060O986K4819k5554m590K8724j6477j5146
$$ y = [-16787, -6792, 21221, -8765, -13884, 20469, -186, -19105, 15865, 7368, -21494, 8667, 13681, -20350, 616, 18612, -15068, -6932, 20777, -7332, -13720, 19180, 171, -19290, 14348, 7464, -21145, 7481, 13676, -19370, 643, 18525, -14250, -6565, 20132, -7207, -13460, 18185, -129, -18680, 13575, 6818, -20424, 7956, 13396, -18333, 1395, 17962, -13545, -5937, 19159, -7824, -12718, 17062, -1254, -17401, 13069, 5994, -18919, 8002, 12702, -16684, 1728, 16891, -12755, -5986, 17399, -7439, -12530, 15217, -478, -16881, 11968, 7538, -17789, 6871, 13996, -16053, -443, 17375, -12888, -7844, 17963, -7018, -14041, 16487, 795, -17479, 13202, 8323, -18459, 7120, 14193, -17278, 177, 17093, -13967, -6981, 17838, -7716, -12306, 16418, -59, -15205]
605a5205K7974n949k3247K3018N386k7445J4957J5040k6260N085K1667k0440n502
618a0921K4758j1795j5916K3496j675k3423J8730R132k6611J1326J8345k5839
630a0393K046K4658k0408q318K7365j2949j7557K6056k903k4281K1601P196k7698
643a5585J4749J6278k6970N760K2499k3047l842K4810j5181j2916K3741n263j9770
656a4737J9637M872k2869J2690J3694k2086L558J9550j8118o282K1657j0411j4392
669a3237K0968q08k0884J6325R478k3912R279J8115k3257j39K3766j9188r366
682a2860K5965j1400j7099K4410j532k2873J9738Q189k5885J2428J5708k4696
694i907L269K1145k0105n028K3021j2524j2481K1595l532j7364J6033N897k0345
$$ y = [-15205, 12769, 6820, -16427, 6591, 11977, -15468, -511, 14529, -11731, -6646, 15021, -5419, -10921, 13837, 2042, -13874, 9622, 7947, -15476, 3254, 12386, -14225, -2899, 15446, -10393, -8347, 16311, -4097, -12415, 14950, 2001, -15556, 10500, 7597, -16684, 4917, 12113, -15585, -836, 15442, -11528, -5768, 16731, -6316, -10158, 14652, -529, -13445, 10296, 5033, -14737, 4900, 9772, -13097, -407, 13287, -8799, -5241, 14309, -3809, -10091, 11566, 1155, -13237, 7731, 6923, -13961, 2364, 11842, -12070, -2791, 15324, -7933, -8072, 15694, -3494, -12860, 13105, 1705, -15394, 9016, 7484, -15389, 4349, 12538, -13347, -919, 14789, -9907, -6638, 14507, -5598, -10626, 12395, -129, -12610, 8985, 5453, -11911, 4122, 10019, -10326]
707a0326R134J2864j9087P77J8017j4141p529J9708o760j4443J8130J696j9351
720a1311J2665J0331k1332N604J7057k0014k021K2149j5653r839K4185q998j6362
733a3539K2077p53k1286J7172P064k2817J0231J4431k1694K608J9450j7390m635
746i081K0770j1137j0946J9019l936j5600J4152M469j6902P413J1524j5645O5
759e835J6289j2065p001J7613n726j3838J6017J575j7783J1088R501j8972N110
772d027J6092j7583k568K0919j4025j0100K2325q153j6218K0732p31j9889J6254
785C028O600k0967R924J3476j9491K096J7557j5713n279J8914r510j1232J6972
798F375k207j4433J2676N203j5464O007J1338j3618j737J5206r652r139J6366
$$ y = [-10326, -1192, 11672, -7415, -6638, 11379, -2762, -10291, 9417, 2657, -11786, 6344, 8040, -11311, 1354, 11685, -9647, -4043, 13014, -7000, -9021, 13128, -2525, -12364, 11821, 2823, -13539, 8538, 7785, -13501, 3671, 10735, -12082, -1851, 12580, -9114, -6506, 12944, -4446, -9081, 11689, 552, -10394, 8625, 4689, -10911, 3241, 7710, -9192, -1779, 9745, -5900, -5835, 10454, -1611, -8612, 9001, 3275, -10563, 5454, 7029, -10754, 334, 9835, -9137, -4027, 12065, -5518, -8086, 12833, -1192, -11292, 11033, 2880, -13338, 7394, 6663, -13226, 3028, 9628, -11339, -1415, 12061, -7430, -5334, 12223, -3490, -8769, 10145, 635, -10597, 6375, 4168, -10265, 2411, 7614, -7850, -1843, 9495, -4123, -5860, 9346, -306, -9445, 6921]
811F921l138j4656J4854L633j7486R920J0473j8093L392J6214j6411m127J9796
824A1292j2060j0934K0713n850j5665J8774P38j8616J4364O971j8982P945J1553
837A0243j6580J044J4861j2284n305J5756o456j0077J4150m06j2776R493N195
850F858j2641L246J0206j0885l126J3082o198q943J4007r78j3889J2370M676j6359
864h574Q294R989j6798K714J4622j4782k804J7548j0904r115J8299n073j3939
877a0523J6503L46j6611J2404N951j7226P444J0548j4646J284J3213j0462m845
890f620J3707m923j0016J2004N57j2778Q508O048j2287L073J0338j0314l120J3073
904G250n907r286J3589j002j3794J1464N165j6476P877J0283j6246K998J4274
$$ y = [6921, 3783, -10873, 3981, 7614, -9872, 48, 10521, -7572, -4180, 12034, -4377, -8504, 11292, -768, -11702, 9011, 3161, -12504, 6270, 7008, -11608, 2756, 9727, -9255, -1310, 10243, -6337, -5293, 9568, -2716, -8021, 7735, 1279, -8798, 5352, 4946, -7830, 1663, 6858, -5783, -2537, 7669, -3216, -6342, 6740, 542, -8401, 5606, 4628, -9261, 3109, 7785, -8574, -280, 9709, -7089, -4375, 10247, -4535, -7339, 10209, -695, -9810, 8489, 3416, -10523, 5980, 6326, -10285, 2119, 8070, -9156, -1712, 8836, -5810, -4526, 8687, -1775, -6620, 7087, 2164, -7852, 4152, 4709, -8069, 439, 6487, -5800, -2727, 7611, -2703, -5823, 7250, 1343, -7943, 5646, 4644, -9150, 2314, 7479, -8997, -1120, 9163, -7083, -4085, 10189]
917A0189j3693l115J6304r881q666J6216m437j2852J4412J094j4769J0284O321
930G407j4471N582R970j2418k21J1464q520n220J1682l039r416R730K397j1564
944f637O249P409j1223J183J0632r365m155J2078n361q972J2490k78j2601J0487
958A936N077j4345O762R650j4654J956J2636j2469k667J3962q515p416J3984l292
972B605j0709J1711J823j2650Q140O087j2949M025R043j0897p93J0639o595n416
986e936J0528k127q637Q585K787j0823M971P080j0762Q11J0260r042l846J2117
1000E966m859q261J1814p87j1070R660M016j3289N893Q674j3115J457J1759j1055
1014c197k618J3192p406o723J2440k722r823R739K162j1899O866O057j1106K289
$$ y = [10189, -3504, -6619, 9685, -196, -8862, 7354, 2917, -9935, 4477, 5571, -9198, 1086, 7407, -7064, -1482, 8488, -3930, -4151, 7313, -1207, -6427, 5255, 2216, -7200, 2530, 4927, -6637, -388, 7021, -4202, -3019, 7613, -1752, -5907, 6171, 810, -8162, 4328, 4050, -8551, 1936, 7013, -7332, -570, 9080, -5574, -3618, 9018, -3451, -6118, 7844, -671, -8087, 5897, 2605, -8104, 3607, 5430, -7220, 920, 7007, -5942, -1917, 7126, -3771, -4564, 6075, -520, -5936, 4592, 2465, -6172, 2413, 5200, -5623, -652, 6428, -4334, -3523, 6737, -2305, -6151, 5966, 1107, -7154, 4660, 3873, -7197, 2463, 6479, -6810, -917, 7757, -5358, -3901, 7858, -3197, -5815, 7377, -29, -6752, 5688, 2966, -6857, 2882, 5044, -6855, 11, 6068, -5038, -2749]
1028b749R142q945k081J0815n905n958J0030j534r223Q155L024j0247M098P511
1042F133j0267P27J0131p897l975J1347n023p555J0428o76j0270Q406L780j1440
1056f151N190P759j1102J107J0298r112k811J1133n907o720J0783k135q923Q321
1070A730K437r883N485O149r750J432Q391p589k826R570m707o118R018q07q224
1085e692O950L240r372L992O586q696P5Q695p014m101J0468m363o963R916n85
1100C136r061P702L015r974M814O526r978P59R066p999l192J0267m598o781J0319
1115D021j439q152P719K443r438M377O026r310P51Q329p350k606R565m242o154
1130e460R234n73q480O850L136r273L627O169q649L40Q329o279m010R806l507
$$ y = [-2749, 6393, -2552, -4633, 6182, 277, -5681, 4349, 2815, -6408, 1747, 4771, -5476, -1378, 6133, -4134, -3407, 6724, -1173, -5148, 6199, 1176, -6379, 4049, 3373, -6897, 1509, 5289, -6151, -961, 6798, -4304, -3197, 7101, -2011, -4822, 6311, 404, -6316, 4467, 2332, -6591, 1730, 4167, -5716, -231, 5918, -3832, -2400, 5991, -1598, -4424, 5146, 439, -5679, 3339, 2532, -5692, 1258, 4498, -4874, -882, 5704, -2992, -2917, 5778, -1236, -5337, 5131, 768, -6195, 3721, 3136, -5925, 1777, 4792, -5182, -368, 6158, -3820, -3061, 6005, -1994, -5186, 5081, 483, -6298, 4021, 2582, -5570, 2149, 4592, -4846, -469, 5557, -3753, -3002, 5327, -2023, -4629, 4936, 694, -5460, 3774, 3201, -5279, 1571, 4707, -4566, -939, 5230, -3419, -3079, 5250, -1029, -5039, 4767, 1260]
1145A260o658Q714q1q504O675K940r109L707O504q727J0Q388o312l154R063l324
1161A392o391Q431n44q460O587L050r084L962N921p883L33P764o076l186Q571
1176D387l214o099P632j38p920O338K944q308L478N760p664M02P405n849k950
1191c796Q223l236o124P613p3p925O062L182q365L949N433p663L09P322n816l162
1207d067Q073l196n781P569L7q093O370L446q600L564N725p712J39P527n945l158
1223d102P800k747o059P741L8p642O066L000p867L305N259p594L72O832n167l114
1239c879P211k643n329P168L42p003N045L249p618K594N412o900o42P216n164
1254i41l298P705k020n832O622Q23p297N108L607q055K307O104p524j05P012n246
$$ y = [1260, -5398, 3316, 3235, -5269, 1406, 4346, -4763, -1056, 5448, -3279, -3269, 5119, -1193, -4347, 4716, 1392, -4999, 3432, 2888, -5572, 1015, 4065, -5019, -1057, 4864, -3019, -2686, 5078, -998, -4184, 4387, 1173, -4926, 2706, 2568, -5352, 986, 3930, -4378, -900, 4860, -2804, -2402, 5003, -846, -3796, 4427, 1191, -4933, 2680, 2607, -5318, 744, 3926, -4439, -490, 4943, -2720, -2411, 4911, -905, -4067, 4006, 810, -4971, 2598, 2635, -5458, 912, 4358, -4242, -678, 5047, -2665, -2526, 5001, -944, -4102, 3698, 951, -5108, 2633, 2671, -4971, 1095, 4095, -3772, -467, 4792, -2802, -2430, 4402, -765, -3879, 3332, 689, -4640, 2528, 2870, -4133, 912, 4161, -3457, -863, 4549, -2351, -2993, 4223, -941, -4239, 3466, 1446, -4386, 2236, 3059, -4238, 870, 4477, -3578, -1271, 4833, -2691, -2796, 4216, -1030]
1270a030l061P779k639n227O668K00p023N283K781p508L045M545o205K14O006
1285C828m501k432O550k458m684N468Q46o386M051L075o656K030N272n813o88
1300b498O577m101l492O578j653n428O131M56o742M366L700p709K354N890o647
1315b218j58O784n207k600O868k492n189O387o1o350M919K515o596K860M486o112
1331b164K44N616m274k352N921k288m278N130P47n538K997L421n703J001N498
1346C978n519r36O155l891l595O401j283n664N823J407o609M060L667p109J790
1361a325N891o489n44O557m937k641O618k338m666O238l81n184M018K621n990
1376b552J689M478n517k87N076l368k578N381j370m036M387Q15m859K569L625
$$ y = [-1030, -4091, 3688, 1049, -4178, 2490, 2690, -4333, 950, 3731, -3777, -732, 3813, -2392, -2178, 3828, -673, -3105, 3445, 987, -3697, 1771, 2617, -3769, 282, 3357, -3299, -1269, 4003, -1810, -2498, 4079, -22, -3514, 3064, 1411, -4017, 2114, 2570, -4172, 194, 3894, -3815, -1461, 4429, -2218, -2376, 4408, -799, -3399, 3469, 977, -4212, 2175, 2114, -4236, 683, 3198, -3398, -538, 3948, -2164, -1920, 3696, -578, -2930, 2991, 703, -3575, 1555, 2302, -3236, -239, 3182, -2521, -1520, 3978, -1541, -2477, 3678, -213, -3808, 2593, 1310, -4354, 1469, 2876, -3733, 327, 3994, -3115, -1325, 4566, -1923, -2467, 4090, -847, -3488, 3130, 792, -3874, 2364, 1983, -3201, 817, 3438, -2552, -863, 3615, -1902, -2189, 2887, -481, -3059, 2322, 952, -3084, 1303, 2118, -2741, -172, 3453]
1391C453n484L33M988m748j552N852k601l741N841p25n175N035J296o088L475
1406A59L182o147J222N197n444p76O277m214k505N910k134l938N299q4n538M005
1422D71J908n061J767L709m300m52M803k993k163M449j072l894L849J201m818
1437b596K169L193m748L65N150m401j962N904k689l813O078j170n051M973R33
1452B335n790L382L414n743J081N129n011q16N435l685k523N561k017l884M647
1467A515q0m548L424K189m736J539L671l723j112M307k213k831M256n56l935L360
1483E27J550m572K189K888m148l0M828l843j992N062k026l769N347n32n249M784
1499A014J607n666L437K792n499J402M094m620p26N033l567j815M716j682l429
$$ y = [3453, -2031, -1698, 3290, -1458, -3010, 2842, 241, -3500, 2341, 1616, -3559, 1476, 2772, -3316, 159, 3341, -2806, -1584, 3613, -1831, -2607, 3670, -544, -3049, 2861, 727, -3211, 2088, 2004, -3534, 471, 2379, -2682, -915, 2794, -1506, -1958, 2845, -148, -2311, 2138, 1066, -2828, 1021, 2222, -2596, -427, 2766, -1982, -1617, 3533, -868, -2830, 3074, 385, -3428, 2650, 1480, -3571, 1402, 2335, -3455, -73, 3341, -2402, -1321, 3808, -1203, -2019, 3416, -269, -2792, 2769, 752, -3132, 1515, 1435, -3113, 311, 2500, -2236, -697, 2974, -749, -1861, 2446, 233, -2598, 1658, 1102, -2833, 527, 2077, -2495, -306, 2582, -1566, -1596, 3232, -611, -2603, 2459, 433, -3336, 2011, 1479, -3770, 1014, 2621, -3045, 392, 3184, -2315, -913, 3181, -1439, -2165, 2868, -699, -2514, 2202, 520, -2909]
1514b909M718l5m220K950J559l844R27K902l048j007M044j836k460M113m28l948
1530b522L211J474m132J188L367m162J56M085l342j949M936j536l979N199k47
1545A747m847M308J207n417K754K878m848R57L911m297j32M374k563k313M372
1560B091j084l614L927K56m197K629J993l878J174K936k638j162L632j500k613
1575b048L265K82l993K692J777m202J525L042l706j77M080k998j566M688j846
1590H15l761M760l47m359L666J211m746K934K273m556J378L115l413o87M108k802
1606d11j741L524p81k802K741Q18l106J918K060l364L18K710k124j270L076j306
1622B60k194K610M11l376K246K400m148J117L411l880k63L828k995j675M299j808
$$ y = [-2909, 1809, 1774, -2446, 504, 2063, -1781, -854, 2048, -1000, -2007, 2037, 201, -2259, 1854, 1426, -2522, 689, 2163, -1969, -781, 2586, -1576, -1420, 2665, -677, -2626, 2310, 774, -3205, 1994, 1747, -3100, 1208, 2415, -3002, -248, 2630, -2218, -1261, 2650, -1647, -1779, 2595, 32, -2281, 2091, 1007, -2607, 1320, 1576, -2621, 8, 2001, -1877, -703, 2233, -405, -1567, 2065, 565, -2048, 1217, 1499, -2494, 198, 1975, -2227, -702, 2340, -1366, -1543, 2537, -461, -2027, 2661, 815, -2946, 1814, 1467, -2892, 774, 1985, -2761, 173, 2446, -2110, -732, 2383, -1030, -1717, 2391, -411, -2152, 1372, 591, -2211, 530, 1348, -1758, 160, 2220, -1144, -826, 1884, -240, -1510, 1566, 260, -1934, 676, 1087, -2289, -43, 2357, -1791, -674, 2737, -1143, -1406, 2422, -573, -2248, 2051, 243]
1638B43k852M202pm251L412J491m711K585K362m121P18L239l536l38L495k059
1654a28j617L103n96k606K625P05l222J690J770k711j30K855k103j331L147p08
1670G43k843L203K85l297J800K263l681O83K950l389j89L772l057j107L831j499
1686D68k439L504k09l574K710J157l780J756K437l599M79L137k703m92L208j876
1702A84j950L039l97k558J741J302k803R46J967k340l08L053j702j559K870p15
1718G70k639K659N74l360K036J845l285L99L071k875n18L547k177j898L884j758
1734B75k402L318l94k785K347J339l299J275K422l204K00K756k325q06K691j245
1750A63j767K721m71k217J835J301k645R30J810k268o12K938k043j456K892n93
$$ y = [243, -2609, 1593, 1586, -2665, 747, 2238, -2473, 112, 2474, -1647, -929, 2310, -1226, -1564, 1931, -128, -1745, 1358, 762, -1844, 781, 1486, -1736, -46, 1724, -987, -1117, 1738, -365, -1696, 1451, 743, -2100, 1103, 1388, -1909, -109, 2154, -1527, -844, 2106, -1283, -1472, 2300, -757, -1864, 1967, 468, -1971, 1533, 1324, -2250, 460, 1617, -2163, -407, 2030, -1569, -1090, 2047, -656, -1148, 2060, 184, -1766, 1273, 876, -1682, 59, 1361, -1442, -496, 1471, -869, -1177, 1876, 174, -1385, 1485, 770, -1869, 790, 1364, -1996, 40, 1885, -1400, -1001, 2070, -805, -1323, 2224, 47, -1851, 2033, 275, -2127, 1191, 797, -1988, 359, 1698, -1601, -326, 2096, -1108, -908, 1848, -477, -1283, 1408, 163, -1604, 1117, 646, -1571, 264, 1565, -1080, -150, 1660, -608, -1220, 1718, -325, -1781, 1111, 518]
1766E18k502K797L37l005J947J819l015M61K427k678l80L064k160j395L319p13
1782H41k763K739L54k973K219J098k838R70J936k619r8K680k037j050K738q58
1798C39j904K607k4k355J792Q06k352N51K022k077l87K419j345j681K892n45k431
1815a673K476K67k764J785J220k638O84K113k288n64K883j723j179K599o03k327
1831a732K457P5k472J871J097k834J411J711k366r3K167j117j475K602p54k236
1847a688K456K62k521J566J159k255N50K007j951n35K513j218j717K274k75k295
1863a668K451K08k860K014J106k157L20K081k049m36K463j246j530K359n14k278
1879a736K470K67k356J440J202k159O82J655k081l64K267j099j586K512n73k416
$$ y = [518, -1984, 813, 1150, -1855, 92, 1911, -1104, -643, 1784, -894, -1274, 1790, -370, -1765, 1554, 841, -1922, 817, 1171, -1802, 417, 1515, -1323, -353, 1583, -1036, -1134, 1546, -491, -1541, 1197, 339, -1565, 1042, 1018, -1337, 455, 1261, -1091, -540, 1482, -595, -982, 1437, 92, -1589, 1303, 758, -1673, 803, 1070, -1694, 91, 1311, -1327, -643, 1470, -818, -1382, 1501, -222, -1401, 1198, 595, -1732, 725, 800, -1672, 199, 1296, -1538, -127, 1584, -782, -875, 1292, 175, -1300, 1302, 548, -1688, 768, 1030, -1491, 75, 1234, -1021, -471, 1536, -415, -950, 1563, 345, -1372, 902, 627, -1668, 783, 991, -1869, 145, 1251, -906, -586, 1495, -554, -990, 1473, 227, -1303, 1056, 542, -1736, 734, 1001, -1355, 85, 1287, -872, -190, 1465, -616, -980, 1287, 188, -1398, 1114, 541, -1875]
1895a875K613L19k366J216J519k362L64J783j729m87J982p51j532K235l31j976
1911a378J876O78k358J110J546k144r0K330j894p17K327j472j333K272K7k309
1927a529J860O87k248J284J423k477K53K033j941n00K267r97j252K012l66j915
1943a406J888N59k313J065J319k061N3K200j861k72K056j141j162J768Q9j984
1959a203J682O70k248R06J227j991M72J938j842n48J979q37j289J703K86k142
1975a237J614P89k429R02J802k324K70K030j721n92K105j000j552K418n47j730
1991a202J456R72k463J086J524k336M82J912j727p27K033r53j398K198m35j685
2007a263J494O94k072P50J665j786J34J512j329o90J892p62j332J383J80j684
$$ y = [-1875, 738, 1057, -1309, -93, 1426, -936, -572, 1211, -518, -1005, 977, 226, -1306, 929, 598, -1378, 498, 1176, -1182, -72, 1474, -670, -760, 1570, -324, -1041, 1286, -186, -1519, 753, 780, -1529, 331, 1018, -1230, 54, 1477, -1000, -747, 1286, -655, -1155, 1112, 115, -1137, 875, 509, -1406, 482, 1041, -1272, -207, 1112, -949, -896, 1304, -557, -829, 1227, 86, -1076, 692, 781, -1203, 479, 1149, -1099, -193, 1034, -957, -485, 1453, -389, -937, 1042, 205, -1084, 619, 905, -1237, 377, 1166, -1263, -361, 1441, -883, -613, 1417, -304, -896, 1209, 209, -1343, 1075, 528, -1202, 254, 1226, -1237, -151, 1373, -963, -481, 1431, -296, -1023, 1010, 57, -1341, 857, 422, -1263, 231, 925, -1147, -397, 1268, -518, -384, 1128, -201, -891, 1001, 239, -1093, 290, 470, -1214]
2023a214J273J019k102O66J554k146O00J644j648o51K028p93j482J979j49j759
2039a181J525N43j779Q88J209j754O8J845j913k99J920j160j005J714k4j244J026
2056C79N30j721N53J235j563q0J874j539r38J954l77j450J965N2j954J428P34
2073A082k058Q33J305j721k66J994j438p88K182r70j124J813j25j450R62Q22j885
2090h32P36J135j949M22J460j219n98J788o37j221J483K5j470R41O53j280J25
2107d38J451j477l52J800j118q59J764m56j231J357L14j802J081P63j570M23J404
2124A054j443j79J704j124r76J872p45j439J913J1j812J411N53j546O51P90j125
2141d30k95J751j074m68J268o76j072J321L30j542J021N89j258J43J478j506k31
$$ y = [-1214, 59, 1078, -1024, -358, 1196, -950, -350, 1294, -354, -1005, 1023, 230, -1252, 727, 578, -1181, 344, 887, -892, -4, 1205, -549, -481, 1364, -549, -848, 1072, -88, -1093, 621, 597, -647, 379, 909, -812, -259, 976, -587, -667, 1207, -332, -1270, 684, 307, -1143, 822, 874, -1080, 348, 1082, -976, -143, 1162, -559, -825, 1169, -269, -1057, 1125, 155, -969, 844, 719, -731, 231, 1053, -832, -96, 1039, -910, -488, 972, -247, -845, 943, 306, -915, 568, 593, -877, 64, 717, -563, -438, 1013, -464, -816, 984, -134, -993, 771, 315, -916, 441, 755, -1047, 34, 797, -773, -350, 1054, -389, -568, 1136, 12, -964, 908, 163, -1276, 637, 648, -1164, 247, 800, -746, -95, 695, -430, -725, 1026, -48, -516, 752, 76, -996, 325, 655, -887, 134, 723, -535, -392, 1086, -420, -651]
2158f51J476p98j082J968n32j329J307J02j460J028N66j400O86J057j277j86J608
2175A083j123j103J864m84j358J274M84j425J133N70j793J022O15j137l08J698
2191A012j150p62J385l0j403J185M49j458Q77R22j615K84J391j559k86J619q07
2208E4q58J312p3j418J337M39j733J063Q49j874M78J372j625J4J612r41j146K040
2226I02m83j354J449p9j315J022O12j513L88J055j217k15J641p23n87R36r1j145
2244g17J230k7j076P41O77j283jJ230j015m68J479p10o05J033K48j549J018N46
2262G51j751R23R50j468R6J414j316j3J216p58o00J247p49q84J005O12j602R57
2280C0O77j612M54J217j274K36Q37k39r01J184m51p56Q29M23j178N64P99j409
$$ y = [-651, 825, 27, -1055, 913, 381, -948, 359, 461, -999, 29, 595, -805, -119, 938, -339, -525, 1083, -40, -1143, 721, 237, -1121, 153, 637, -788, 345, 915, -878, 144, 759, -378, -686, 1012, -138, -900, 485, 455, -948, 237, 686, -772, 105, 1027, -588, -304, 1087, -472, -758, 861, 54, -804, 508, 435, -983, 354, 793, -940, 123, 972, -902, -424, 948, -677, -663, 949, 8, -1138, 902, 419, -935, 514, 435, -880, 142, 754, -759, -371, 684, -533, -748, 893, 170, -417, 519, 428, -717, 513, 486, -590, 151, 828, -455, -456, 774, -241, -709, 770, 60, -545, 488, 736, -813, 205, 751, -1000, -77, 873, -595, -499, 915, -401, -414, 802, 44, -556, 691, -58, -942, 63, 675, -927, 30, 707, -905, -451, 766, -508, -272, 565, 326, -575, 609, 158, -598, 231, 654, -524, 40, 839, -570]
2298e70L41J249j124n14J245m99j066J254J62j453J053O24j443P25J030j716L25
2315c77J213j121m82J432q16m86J390n64r38J166Q1r27L89Q26j221K59R51j200
2333d25k63J424r50o77J247n8r88Q34M08r07J35J015j234l9J192r52p10J447k53
2352B46j023J380Oj466J200L07j349L82J094j350L0J127r26l92J507n39j319J673
2370E88j75j153J016L45j035L28O55j221L58J276j038k48O89j97n66Q03j9r03
2388d97M58L53q34R5J148r71l93J437q68o44J289n63q11J131n6r53J027K78j219
2407e93M87R18j008R2Q05r17m64J374n41p64J051N8j432J126L6p29P03L21p78
2426b55kQ58r10k03J150p71n00Q70J14q54O84O19j208M45P32r86k8R16r43m28
$$ y = [-570, -229, 1020, -104, -618, 627, 128, -938, 316, 478, -975, 78, 702, -741, -16, 1014, -702, -377, 836, -285, -767, 665, -151, -637, 753, 189, -749, 417, 498, -429, -40, 786, -435, -176, 775, -425, -688, 736, -214, -891, 356, 298, -690, 144, 552, -355, -220, 795, -439, -478, 714, -238, -948, 499, 246, -777, 603, 609, -857, 343, 650, -699, -317, 777, -573, -543, 584, -342, -734, 773, 234, -1085, 588, 413, -740, 276, 621, -414, -86, 569, -652, -294, 982, -56, -304, 385, 188, -378, 425, 406, -497, -39, 314, -520, -425, 723, -248, -641, 796, -72, -716, 573, 10, -801, 330, 274, -679, 348, 626, -593, -106, 812, -196, -104, 701, -216, -680, 694, 153, -611, 440, 498, -934, 192, 228, -501, 202, 523, -255, -257, 601, -309, -512, 638, -133, -633, 237, 351, -503, 181, 800, -408, 37, 769, -217, -245, 671, -272, -700]
2446g00J280j84j104J074o9q00Q38M08j150L86Q49j389q5J279q52m44J411n61
2464A87r05J154l49q04J170n1p59L68N65j097K4J207o99o48J130m61o55R41K61
2483E79j011O16K84r69M85O30j037m5P78k05p60J163k51q99J124r2j070Q82J96
2502C98j126N66Q76j193J03R44l97o42P86j54l50N79J01j098O58L56q46K48N40
2521C49m98l73R72o15k60Q99j07r65J077j33j006P69L32j030M86P67q59r5Q13
2540E23o28j64R27m84o86P67Q6j177P15P97j483P01Q73j202J76O30k75l95P86
2559D87l27p92Q18p6o52M05L31o82L89Q14j133J24O97o99k01O52N0o75Q55O2j072
2580f25P34O12j065K94N79q39pJ020m94n65Q68m64q49J081N4p82M80M13q97M50
$$ y = [-700, 580, 396, -708, 366, 297, -503, 335, 743, -407, -21, 828, -561, -646, 633, -219, -663, 748, 187, -718, 436, 87, -717, 453, 402, -357, 11, 576, -521, -497, 710, 11, -637, 493, 32, -623, 318, 579, -432, 184, 468, -501, -16, 614, -423, -468, 310, 105, -655, 508, 257, -642, 482, 390, -680, 202, 398, -728, -162, 714, -479, -376, 568, 171, -471, 315, 161, -189, 390, 491, -607, 51, 407, -439, -191, 349, -149, -522, 450, -165, -425, 474, 367, -598, 479, 346, -660, 109, 441, -589, -103, 664, -195, -290, 523, -105, -269, 658, 174, -512, 255, 341, -836, -121, 676, -807, -106, 767, -435, -259, 371, 96, -299, 487, 160, -632, 186, 110, -542, -137, 194, -488, -99, 715, -418, -294, 403, -296, -497, 155, 205, -470, 385, 447, -625, 109, 721, -344, -50, 529, -310, -317, 703, 209, -356, 512, 48, -801, 280, 334, -448, 32, 445, -452, -2]
2600bO51r66J72M99l55l22Q44l13p10Q67N1j175J011L50p87J07N37p22P7O24m91
2621e3m19Q11k01n82O56J84q09K70N03o96P7N73l56l20R08o00k85O25J04r68O81
2642A03K94p10L69M96r78J33R34p12k01Q53p06m01Q78q9o82O20Qo58N04N55j169
2663e59L05O32n80j16N83j89m56Q07m19j27J50L16r75P43J97m89K68M47o24k04
2683b90Q42p77l13R90k28m51M76K73p67J19N94q07J23Q13q63J79N41n26l43P07
2703B92j69p29Q09O0r65O13O62j068K52Q39r73j43J041m22n49P05j09n49O50J73
2723D20r04N29K69n19J41L21k91j02M23m88j32O62k45l20K72J02n37N82K03m38
2743e2k42O30m81l01Q01m31k27O04mn18K14K91o67L71L96o13q5P01n60k12Q46
$$ y = [-2, 649, -317, -145, 354, -1, -323, 521, 208, -502, 365, 416, -759, 252, 602, -185, -78, 459, -263, -186, 438, -53, -472, 339, 138, -444, 212, 396, -413, -143, 360, -336, -259, 314, -42, -362, 546, -54, -339, 286, 390, -578, 103, 397, -313, 56, 552, -426, -293, 641, -71, -272, 581, -125, -526, 352, 263, -419, 201, 209, -449, 55, 610, -559, -254, 378, -202, -318, 265, 76, -380, 427, 8, -119, 31, 347, -628, 115, 312, -177, 91, 538, -86, -290, 552, -225, -538, 452, 224, -227, 249, 522, -245, -126, 468, -339, -216, 597, -266, -87, 454, -72, -415, 292, 123, -606, 203, 263, -702, -89, 573, -495, -243, 596, -377, -520, 521, 99, -450, 255, 146, -403, 247, 420, -484, 45, 314, -205, -64, 257, -34, -136, 287, -201, -333, 329, 84, -236, 36, 138, -399, 183, 386, -52, -294, 336, -145, -446, 355, -76, -303, 301, 297, -221, -7, 284, -383, -12, 384, -229, -314, 387, -173, -385, 461]
2764D61o54j70P32m80j24K38L45o75L99J19p28L03M98l21j45M90k59k99O80l52
2784E8m85N63m2l00R3N09o35J59N55n25n70J085m39k86N69p2o10M83K82q60K97
2805a71J96l81J97N98m70l27P41m06l58O09q8k87K45K84q19M12N69q12J22O36
2825D90l31l37M76k61l83O27k05o87O88K87p23K80L31l33m3O57o87k19P96l16
2845A07m70O16j80n07N43M6m98K32N17o61R2N88l78l24N53m94N8L23j4k71K52
2866A30J56p22N11J90m07j5K98k32l15M87q7m75O97J55o58L15K69n08J25O12n59
2887c3j50J08n0J5J90N4m58N43J32q08O51L21p07L21J16o33M52L67n94j98P24
2908C63p9o88P14l5m57J91P1l62K46K06l81J24M65k58m09M66n33J14L86J38m37
$$ y = [461, -193, -363, 369, -111, -235, 3, 348, -327, 72, 191, -537, -234, 264, -57, -202, 288, 29, -270, 410, 58, -427, 136, 94, -206, -113, 396, -239, -80, 475, -50, -620, 465, 26, -260, 309, 237, -373, 110, 392, -468, -171, 25, -356, -159, 439, -31, -358, 383, -23, -381, 228, 140, -147, 98, 382, -437, -25, 544, -268, -146, 490, 159, -178, 298, 37, -346, 281, 76, -611, 77, 364, -359, -79, 252, -81, -124, 533, -154, -373, 423, 107, -363, 253, 73, -434, 109, 155, -343, -111, 406, -255, -163, 425, 47, -277, 276, -218, -160, 163, 149, -122, 130, 286, -436, 75, 265, -142, -157, 141, -91, -406, 81, -6, -481, 216, 371, -287, 28, 297, -211, -86, 526, -33, -183, -75, -125, -110, 80, 134, -324, 219, 351, -457, 194, 515, -192, 129, 245, -388, 64, 431, -163, -361, 363, 284, -404, 310, 275, -182, 9, 80, -282, -36, 170, -211, -87, 378, 120, -289, 177, -356, -242, 144, 282, -155]
2929a55M10j45j20k81L84m50K94K69k31m45N83q2m02Q61n13n65O05nn45L31K62
2950F0l08J10K67l60L1K86Jm14L43J17l45J26M16o80L82J25k63j0N07l38O7k4
2972I6J8j74o2L14m39L17K27l32M5K36n61L19J27k83j6P3Q6l14M52q1k49L7N48
2995C84n65J89K50k32q8M79l84k63M23k54j89M58J01m28J34M86m52k25L26l63
3015b13j05P14n30N9L46k82k99M82Q1o14O95Jn03q3N15k08k21M60k59k46N56m43
3037i7M4K49r7l16J70K65l78P3L55o20K74M64n19L1o1K59k3m26N30o65M83J46
3059A41m56J27N96m02n9K30l44j89O28j96m12M34k2j98J09J47k77k15N81m37j84
3080c98N94j80r1L29l34L1K7R9k17mK12l79N59j05ml50Q11m51n38L41J4n9J88
$$ y = [-155, 255, 110, -10, -291, 93, -357, -63, 206, -25, -470, 113, 31, -371, 490, -23, -588, 17, 12, -533, -202, 60, -248, -138, 129, -231, -200, 86, 87, -327, 16, 133, -212, -86, 330, -350, 32, 157, -106, -116, 391, 53, 120, 96, 114, -60, -122, 192, -247, 70, 297, -35, 10, 246, -315, 4, 131, -152, -168, -95, -9, -323, 129, 48, -201, -164, 384, -181, 8, 258, 26, -62, 417, 33, -230, 193, -61, -250, 208, 309, -119, 15, 501, 49, -176, 150, -213, -318, 396, -134, -75, 271, -11, -310, 172, 253, -361, 334, 335, -168, -251, 264, 56, -165, 295, 36, -210, 346, -97, -53, 196, 99, -217, -47, 218, -160, -87, 268, -352, -78, 386, -133, -102, -163, 96, 73, -353, 177, -488, -5, 141, -315, -188, 408, 6, -53, 177, -167, -356, 272, 76, -336, 98, 76, -122, -13, 134, -143, -358, 223, -214, -398, 196, 16, -75, 254, -80, -49, -22, 77, -140, -144, 68, -311, 248, 143, 139, -211, 600, 149, -389, -48, -34, -93, 95]
3103I5J57o18L42J62J02l06K61k62K4L58k96L8L0qm66O94k90l94L46L17m27k22
3125c63N69j47o3J06j91j87K31j39j3K13J63m12O2K63m77N16J26m12j02L77k88
3146a68k67N52l8l87K73j41n2K87J58n99K02K82l58j96N55j00j21J76J15k72J41
3167D2K16n75K96J09k71m1K91k85k77O81l90lM43n13L1K24J90m39O07j67k75J17
3189A1j04q9K25K04j13j55J12kn04O00j81k40L81J46l38J83r2j61J99J34k1m33
3211b38K70k4r0J87r9J45j07p6m8J6J66l29J43L40l17q3K34J58m85K78J58n47
3233c48K36K81m35J99L13l75OL76j63J2o8k37M8k2O2N3o6K99q5k29K13j17J1J92
3257A56k87j17K31K3l82N26J27l78K30k67K60q1r1j09j47M08j14J22q5j99N4j38
$$ y = [95, 252, -366, -24, 138, 240, -66, 195, -67, -43, 315, 19, 57, 87, 79, -387, 307, 17, -377, -31, 286, -141, -363, 206, 59, -4, 102, -89, -276, -45, -184, -197, 16, 179, -233, -171, 92, -385, 131, 257, -155, -257, 120, -168, -435, 117, 79, -308, -35, -176, -228, 59, 217, -382, -180, 102, -256, -452, 103, 3, -118, 58, 173, -99, 42, 258, -317, -21, 88, -183, -224, 67, -218, -495, 186, -204, -207, 236, -277, -246, -22, 168, -271, 336, 169, -106, 11, -93, -182, 43, 247, 134, -21, 91, 89, -415, 185, 4, -236, 145, 291, -47, 136, 44, -117, 82, 216, 195, -238, 32, 8, -82, 105, 6, 151, 44, -32, -80, -64, 102, -227, -84, 256, -61, -144, 90, 248, -237, 41, 199, -348, -112, 169, -266, -67, 246, -129, -123, 253, 90, 102, 34, -203, -155, -177, -115, -62, -128, 171, 86, -143, 70, -47, -36, 156, -131, -248, -17, 6, -376, 150, 277, -101, 129, -138, 122, 41, -50, -159, -306, 102, -12, 110, 25, -174, -120, -258]
3279b58N11l38O5K96l08o5K94l52J60J2j8j05R3M5j25m0K25l18K84J49k08l6k21
3302b58K54k25N52j37j98R8Q8j03O0K66l98J51J54k70j24O15o04r3L96l35J9j40
3324b32M13l29P7K89m04L52j03l22MM92m48O7K94j42n61M85J65k04J98k27J31
3345ek13K73M1l41K62P5l0J35j86j29k0J24k73K30Q6l12K06M13l31j26L84l16
3367e3J10J73m44j35M04K08n54M27m4m58L35K32l22j32K98j23o8M28l73O2K22
3388A93K0n9j13q2L3j98K53j64P8J73k96l4J79J87l99J17J52k08L0L16j37k60
3410b19L16k27R2m2K4N0L1J93k92K13j91j61L75R8k47O2m7j7k18L27k64J74L31
3433C61j83m37K46K56m37L9L49k01N5K21m75k99Q09k99m06N58o7j41N8j3r5J70
$$ y = [-258, 253, -85, -20, 276, -32, -97, 197, -155, 5, 17, -1, -106, -13, 32, -93, -133, 92, -226, 58, 207, -1, -37, -258, -4, -229, 323, 186, -12, 86, 174, 71, 131, 397, -1, 150, 304, 34, -90, 525, -79, -172, 224, -111, -92, -232, 181, -148, -71, 218, -186, 166, 63, -259, -255, 237, -211, -144, 150, 8, -553, -68, 97, -107, 91, -136, -5, -218, 55, 96, -245, 17, 92, 62, 197, 11, -118, -138, -14, -287, -57, 29, -283, -77, 336, 5, -121, 263, -53, 57, 230, -214, -349, 55, 263, -291, 136, 92, -366, -31, 201, -121, -253, 45, -78, -146, 282, -91, -29, 193, 213, 154, 41, -41, -8, -206, 47, -117, -39, 134, -162, -196, -17, 170, -229, -112, 40, -168, -138, 178, 41, -219, 97, -130, -38, -80, -56, -6, 25, 218, -74, 139, -52, -213, 162, 260, 13, 75, 28, 11, -207, 120, -144, 30, 361, 178, -259, -13, 243, -194, -155, 194, -7, 48, 269, -206, -505, 304, 5, -401, 157, 90, -51, 7, -6, -101, 69]
3455F9l9j7k19L14j82J72J73l31J22J53k07j06K52p0m98M31j0j49M9J86k1j55
3477h3L05k22Q4N5j99j63K46J94m43J54K41k84n6M34l19j5L16m58K83K5M1l42
3499b06J45J01M3k54L12l07J28J61l42J60L21l09j56L65j95k63N07j18k37L27
3519A83K1j66Q6P0j18k36K65j81Jk1N9J64l48J93p3K8K81j94r7O1j42J30J67k58
3543a25j64N17k46J6q0Q9J40l78M46k02l13M59j48j43J12J14J6j34J23j53K2K08
3565A76l7k51J82mk8j55k7p7J51K54j14j54J70k63K18J33l70L30p2P1n7j38K4
3588c8J12Mn07J90M99j67k13J05O3k54K57j07K0J20K12m37n3K55p3j77L80m4l48
3611b01J78R6j18Q0q9L4j63L40l31k6O16n14j07J53K62l18K61j6j49J08l30K41
$$ y = [69, 30, 13, -206, 108, -74, 98, 271, -60, 62, 215, 8, -98, 154, 84, -414, 17, 7, -142, -93, 93, 72, -83, 222, 0, 84, 139, -60, -223, 23, 217, -226, -72, 169, -115, -171, 263, -56, -71, 245, -213, 70, 95, 136, -206, -61, 40, 83, -171, 141, -166, -38, 123, -219, -59, 262, -47, -203, 162, -33, -296, 211, 93, -144, 183, 204, 38, 124, 194, 76, -160, 105, -76, -75, -96, -37, 127, -221, -28, -101, -73, 208, 14, -83, -22, -164, -34, 133, -125, -289, 228, -18, -2, -82, 7, 147, -231, 215, 13, -300, 159, 11, -132, -20, 94, 110, -24, 99, -54, -32, 176, 139, -112, 70, 66, 38, -117, -144, -221, -70, 184, 70, -84, 86, -177, 41, 174, -196, 134, 62, 133, 76, -62, -38, 74, 78, -429, -239, 260, 93, -120, -15, 48, -206, 51, -56, -36, 84, 296, -141, -194, 61, -12, -189, 191, 147, -201, -23, 73, -45, 35, -54, -20, -183, 157, -174, -200, 416, -98, -205, -52, 210, -108, 153, 137, -12, 96, -234, 7]
3633GJ42q4M9l3J10k19j47K68j7j30j6L67k66j15M00m39kK04K17l61J82l52J25
3656a10M33l75m7M6J49o7j17J92Lm29N11j60m61N15k16q1J22J95j63K56J29l15
3678A0K3mj00K3J05j02lQK01j49O8l7o8l4jj12M23n9k04J53k4p1j21j25L05l7
3704F8J03j86J91R3m13K32OK72n77M68j47j27k06J21K0J14Pm0k18L06J19l56M6
3727a04J57J81l62J14J5j75K80p4m5K3r4k62M61j30k07P7J92j13K6J09k79J46
3749f4J23m9K3r0Q8l37L79j77P2NKJ8r5L53l89m2K65K61m38K35j12j25O0P9l07
3774b62P0J18J80m3j0n6j56J32J91j73j07n2M2K07N0l80J10J48Q1m6o6P6k84K82
3798E2n2k36L40P7k58J88j74r7L28K02k33k63L69k61L96j75n26O06k11Np8j50
$$ y = [7, 149, 65, 114, 81, 191, -28, -175, 93, 76, -54, -70, 297, 31, -84, 316, -123, -125, 79, 296, -65, 117, -235, -110, 323, -52, -99, -53, 96, 29, -88, 104, 107, -322, 189, 29, -432, 83, -133, -214, -92, 103, -60, 196, 325, 10, 33, 29, -71, -48, 57, -45, -48, -40, 161, 12, 80, 43, -25, -59, -60, -172, 251, 192, -12, 141, 117, 46, -75, -200, 105, 68, 171, -15, 176, 269, -144, 88, 94, 366, -211, 257, 110, -17, -223, -102, -82, 32, 39, -1, -219, 87, 206, -150, -104, 53, 234, -128, -14, 1, -174, 106, 32, -13, 10, -84, -346, 115, -15, -222, -145, 47, -66, -40, 69, -210, -64, 59, 10, 33, -57, 31, -306, 73, -104, -32, -27, -25, -7, -102, 251, -138, -180, 85, 346, -92, 143, 31, -94, -34, 45, -262, -192, -74, 106, 63, 53, -3, -159, -27, 164, -9, -116, -168, -126, 81, 131, -249, -139, 9, 90, 44, -22, 54, -230, 52, 0, -236, 104, 181, -77, 111, -63, -160, 168, 370, 137, -126, 243, -18, 378, 203, -323, 283, 72, 77, -1, -151]
3820a51J74j4j33N20n80mJ90n9Q3M7qj88Q1K8j87J59k7n8J02l3K55o35M24j54
3844a68K18m8r4J44j4M7j66K07k51J61J05m63K72n7R0j63L09k42J90n5nL0j68
3867a21o8O3K06k30J25l53M63k8q4j8J76o8k49J92Q4k32J79Q0k40j55M41k70K
3890a05r4J83J07J1k01J82L7k9k76j00L75j70M9P5k43J42PJ79k81Q8J05K00j97
3913D4k25O2O5L9M1n9K57k55k7P7O6j17J2J80k5k33J10l7q4L69k69mj18k87M68
3938E0O3j73R6N2q0P2rp6q9K93j82l8m2R9Ln4j70P5K07o4j46LL57j98n7J8Q8j05
3966gq0K78o7r5M1m2PJ21k97K54L6l75K08k58M00k58J55R5l13K18p7M3J36j55
3990c2J17n6n3K1L2q6O0O5j39J66N0j58L12k60k48J82J10j3j00J76k11m0K61n13
$$ y = [-151, 23, 9, -124, 396, -184, -188, 2, -57, 26, 73, 65, -123, -42, -14, -201, -42, -69, -127, -25, -58, 197, -438, -14, -168, 50, 2, -92, 52, 38, 85, -81, 126, -125, 36, 141, -322, -50, -107, -17, -180, 129, -113, 77, 22, 17, 47, -121, -189, -126, 80, -150, -25, -378, 85, 57, -27, -45, 131, 63, -186, 6, 90, -142, 37, 117, -123, -278, 163, -107, -105, -199, -16, 91, 102, -99, 83, 120, 91, -185, -285, 90, -80, -31, 44, -199, -57, -50, 129, -152, -64, 41, 241, 44, -181, -119, -54, -15, 26, -33, 224, -31, -58, 19, 85, -32, -20, 160, 135, -98, 12, -25, -109, 260, -9, -13, -131, -418, 50, 113, -60, 36, 88, 8, 80, 71, -5, -94, 199, 17, -21, -63, 36, 39, -15, -185, -110, 97, 33, -113, -110, 247, 49, -8, 10, 98, -7, -87, 191, 124, 29, 70, 28, 35, 156, -141, 113, 149, -226, -18, -276, 124, -134, 21, 116, -197, 21, -56, -13, 123, -32, 85, 29, -24, -3, 29, -57, 3, 68, -71, 95, 145, -13, 299, 39, -209, -27, 83, 70, -30, 146, -65, -105, 156, -357]
4014c57M43J4j84O0Q6j40J06j84JK99K15k98n0j86O9k3O1L42l55P1j02L14j33
4037F9j44M6k54L47k39K98n5L3j09r3J73m2j45K23k20p6J74L8k11J33J18j16K45
4060A93k97O9K16l58P2j77K81Q7j18N9J70k79R5j45ml1M38k70N9O8j83K83l16
4083h8Q4o2J8J62J0J19k29j52P4L23k05k76K87r9L06n7k2m81L03r9O2J57k1k43
4107a29J32k6J08o2p0r4n2L35n6n15K69J70M2J44j01r9l3J41j96K20r9n9O5j1
4131B4k25J88l8K03j43J6J93m05O6K55j44m8K6Q9j90K10L5o9j16L3j09j57N61
4154B55l00K70j16k93K59J0j77Q7K4k0j00M2J92j33N6m6J18j32P6l29J29J42n6
4177d2jJ21j1j69O8M6J33Lo8k40K39j00qr3O9pk03L70l08P9M5o0R1J53n8o2J00
$$ y = [-357, 86, 100, -84, -24, 62, -78, 28, -156, -155, 144, 359, 61, 11, -175, -106, -129, -68, 274, -81, -10, -112, 202, 69, -75, -29, -283, 64, -175, 123, 68, 101, -8, -101, 72, 30, -115, 108, -112, -188, -14, 24, -187, -54, 64, -52, 193, -104, -35, 181, -177, -105, -282, -1, 86, -32, 27, 197, -82, 13, -132, -136, -167, 271, 1, 60, 128, -55, 228, -88, -4, -66, -48, 114, 124, 243, 14, -138, -64, 259, 54, -222, 65, -34, 272, 215, 193, -288, 15, -84, -22, 135, 114, -129, 3, -23, 85, 23, -47, -141, -193, 142, 86, -429, -160, 10, 52, 196, 95, -4, -37, 104, -92, 128, 29, -30, 35, 24, -201, -13, -51, 152, 9, 25, 218, -187, -121, 134, -10, -58, -32, 57, -133, 77, 112, 43, -73, -40, -149, -306, 255, -45, 225, 109, -184, 75, 85, -92, -5, 19, -1, -101, -59, 133, 0, 56, 10, 128, -4, 72, -257, -128, 14, -42, -43, 78, 67, -102, -34, 12, 145, 148, 80, -160, 79, -21, -29, -122, -53, -60, -263, 107, -201, -122, -77, -137, -46, 107, 49, -13, 87]
4204H7j29K76m78K23L7L5K5j8j69n3K1Q7L3J16j19m0K37l17k17K27P6M9K09j83
4228A5O6K04l11l5J45k62K69Mp4k08K35pJ19k80O1Q5N7k84M73m71J26K88m04K36
4252D7J3O0Qj2K8k70L29m34K57n2j28J18l5J47j40pj40J78r2K6O1J06k52J86N
4277Gr8J7r0J38P8%j47K47j49k32J83R9k69K33J65l61K97k40K95j57N6o9j8P9
4301F4k05J03L2J10Jk04J61l31K39%l27N44j60j14J37O9P8k29q8N3j27J96j10
4324a08J65k70J30m0K70k79K26j30LQ8r9O7j01j23O8r4K67r0j20K43j97m4J4Q1
4348g3Q2J6k35K73j89K52k01P1o7L1k08K89q1J30k15Q1J31q6j05L7j01K51j57
4371g4J80j9J85k36P7k79J21Q9j85J66jJ63k37J06q3P5j09K2J23j63j03J74l0
$$ y = [87, -42, 234, -244, -21, 16, 51, 76, 58, -111, -164, -143, -56, -23, 93, -26, -66, 171, -146, -363, -136, -60, -11, 198, 15, 81, 285, -26, -61, 84, -178, 91, 95, 21, -187, 48, 41, 160, -120, -59, 26, 83, -201, 272, -199, -73, 215, -189, 47, 60, 120, 128, 116, 144, -126, 203, -231, 26, -26, -154, -36, -71, 76, -64, -71, -211, -33, -125, -99, -38, 68, -184, 2, 7, -91, -74, -164, -26, 52, 52, -95, 152, 3, -229, -46, 53, -216, 17, 182, -179, 118, -122, 173, 16, 72, 3, -15, 64, -141, -38, -6, 104, 105, -99, 62, -269, -30, -30, -357, 187, 27, -87, 50, 119, 197, -32, -120, -67, -194, 2, -108, 57, -213, -83, -123, 147, -132, 94, -36, -33, 55, -44, 23, -78, -201, -133, -227, 40, -50, -170, 73, -124, -168, -154, -73, 9, 25, -210, 63, -126, 126, -75, -4, -71, -40, -248, 41, -40, 90, -125, -44, 87, 1, -104, -67, -168, 83, -74, 106, 87, 272, 36, 113, -166, -45, 44, -141, 25, 24, 187, -50, 56, -27, 48, -61, -39, 84, -79, -182, -8, -38]
4394c8K2P8j09j10L91p4k75J34J8l5j04K70J6q3j51K00m10K73J41l34J2K40j07
4417c5k19L35q9K38j12K1k68M07k58O1M3J7k38r6J87J12o9J26j84j47K22j97J98
4440E5j00k95J09R8K90r7J5J58m22J02J64j46l10K65J83O0j15K53l43K10q6j41
4462i3j55K5K33j78J17P9km5N2Q1k75N6K84q3kj82L8k06K85K28m12J68j30M1O4
4487a2J25j27J51k50o8L07l12K47k48L29j81K2k4P5k01J37R0k19L66p3k40J05
4509ap3R0j4K7J03k91J51k6J4J21Q0q0J0NK05k33j74N4P4k20J78JJ37n7p0l6K1
4536dJ03j06o2o4Q1L0k3k2j11K18p5j80J79K8rj12J5p3J4K98l34J93l2jN3On5
4563d5L2J76k20J18mL4K9k57K15j47j26K47M8j75J6J95J18k63j72M08l13K6J56
$$ y = [-38, -16, 62, -47, -157, 234, 160, -115, 19, 37, 2, -102, 168, 184, 101, -50, 150, -260, 13, 154, -180, -168, 72, -35, -254, 81, -8, 230, 118, 139, -129, 278, 20, 81, 124, 141, -97, -193, -6, 106, 37, 163, -21, -168, 54, -143, 55, -45, -340, -231, -133, 157, 60, 75, 233, -189, -87, 77, -69, -379, -114, 69, 129, 14, 267, -76, 134, 48, -93, -248, -223, 10, -168, -51, 28, 26, -19, 33, 114, -161, -105, 179, 96, 94, -88, -50, -256, 29, 257, -155, 13, -117, -76, -12, 113, -14, 137, -113, -181, 126, -186, 61, -187, 142, -39, -17, -41, 34, -167, -30, 60, -159, 207, 134, -106, -1, -74, 16, 2, 29, 132, -159, -8, -34, -20, 101, 181, 101, 111, 116, 321, 88, -86, -32, 42, -178, 0, 1, 138, 81, 11, -25, -4, 99, -7, -69, -133, -52, -22, -45, -67, -178, 40, -35, -215, -36, -8, -17, -129, -114, -187, -173, 125, -209, -16, -48, -49, 4, 10, -45, -13, 163, -57, 61, 57, 91, 120, -137, 78, -69, -195, 52, 100, -75, -59, 136, 254, -9, -181, 227, -86, -60, 96]
4586I6k54K39j84J28j34N5R0j47K01j53p8k1K62j05k30N11j65l0j17R5p1o4J1
4609f5n2o2J04qQ2q6K5M3L9%j04m4K27j68J65M4q3o8o0k3J25R2j19k6j40K06l73
4636c29L80j42j20L6J61q8J76J38j18n1j3J18l96K43mP4k10J70Q8M1j5j38L3k3
4660A1J72l26J62L0j56P4j16N54l79q7K30o5p1j34j22R6k05K97J19n7l04J73J31
4683B7n4mN8K6n8l24J52K51m5J59j71J5r0K66l05K06l9q5Q2q4J00K0o4k0l5j55
4709a71N3QK53k67J25K4J27m4M0j31K22l08j67L32q5m8R1O1k55K33j19j18Q1j66
4733b29j7K72q6O8j25o4L50k25jJ70l55jL01p4m3J75k63o4K52m1m0k1N9j13K11
4758I6j9k91M10r9j4k2l4M3J1k22J76L5J29l2l05J07K11k00J14L8K6p5R3j66l4
$$ y = [96, -158, 81, -103, 25, -109, -54, 36, -111, 90, -63, -141, -162, 100, -5, -235, 276, 111, 81, -36, 59, -12, -76, -65, -117, -179, -75, -83, -1, -87, -62, -19, 20, 20, -84, -128, 99, -69, 96, 140, 57, -11, -71, -94, 31, 123, 4, -22, -162, 44, -329, 51, -91, -211, -175, -14, -102, 74, 212, 94, 43, 30, 148, -248, -5, -9, 65, -145, 25, 113, 154, 139, 1, 34, 11, 183, -143, 19, 49, -107, -33, -149, 405, 26, -61, 169, 104, 33, -101, -223, -127, -332, -35, 84, 27, -277, -104, 27, -27, -31, 27, 53, -5, -329, -177, 74, 29, 188, 17, 32, -58, 208, -97, 109, 70, -15, 67, -17, 83, 103, 39, 19, -16, -171, -118, -110, 143, -124, 1, 25, 152, 108, 148, 17, 239, -69, -236, 96, 11, -37, 54, 115, -140, 93, -26, -144, -63, -229, -246, 26, -60, 8, -117, -181, 169, -56, -57, 113, -242, -243, 58, -16, -59, 116, -147, -211, 41, 0, -40, -61, -2, -115, 96, 77, -214, 196, 97, 83, 61, 27, 70, 81, -141, 35, 70, 199, 167, -138, -31, 180, -20, 94, 132, 158, 83, 176, 10, -24]
4783b4k3R7m1q8K06j81j3mK2o1K36j44j37M5K66k50q9L4J84j04Q4k55N47j42J2
4808A77j86R6j7j48K15J27j63k53L64k51o0r5J5nJ20K03j8Jj60J5J52R8l14J18
4832C1o1r9J22j5L5o7M95n37J58j07q5J84n2l0K7m3r3P1N9j26K48k22J02R8N0
4857A43j85k45L93k73K30j12l7J68J5K1K21m55K9K51Kj2k16j16K61P7k94J84N1
4880A01j64K05q9J42j71J54o3j31q1N0n6J39J38k72o6oJ29L9k06oL66p5j0k02
4904a35J57r0q4j9K58k5j63K27j5J1J1m6M4j99j60M33o9L4l29K64j04J7j59N0
4928i1KJ04J24l31J96J08J3l03K80q0P5J8j66R3k18L56O3j42k82M47k77M2M7k26
4952a48q4K44j34J08n7M3J85l40O9K04P1q1k74L01J45j57j0o4O8o0k25K95q8K4
$$ y = [-24, -47, 50, 9, -79, 127, -54, -67, -71, -49, -110, 126, -18, -155, -110, 156, -94, -183, -149, 35, -69, 15, -240, 307, 165, 177, -9, 87, 70, -78, 137, 264, 101, -152, 212, -39, -99, -194, -179, -184, -64, 139, 121, 122, -38, -23, 129, 227, -87, 31, -30, -129, -7, -22, 13, -54, 441, -96, 62, -45, -130, 54, 2, -28, -1, -44, -137, -66, -7, -133, 115, -107, -5, 93, 143, -42, -287, 106, -167, 63, -49, -86, 82, 97, 118, 339, -116, -87, 164, 166, 154, -62, -178, 83, 160, -134, 50, 101, -63, 142, 53, 195, 24, 178, 115, -16, -97, -47, -103, 36, 174, -98, -164, -170, -41, -2, -208, -214, 152, 77, 67, -135, 22, -68, -152, -171, 87, 62, -101, 126, 111, 122, 133, 87, 131, -68, -228, 205, 136, 170, -159, 105, 1, 18, -141, -91, -89, 15, 139, -192, 4, 112, 125, -178, 102, 22, 97, 115, -51, 42, -176, 180, 243, 101, -181, 266, -11, 31, 78, -148, -232, 12, -122, -14, -71, -28, 157, -183, -114, 90, 161, 80, -194, 107, 252, 95, 85, 21, 89, 29, -196, 99, 11, 35]
4976C5r8j6j35K48l8K28k27r2N2L78l02j04o5m5L55l00J63l44L39j50j33J89L73
4999C11l75J51J06n11N29k22N7J31j47lj48K09mQ1k88M4J96k03K6R0J28l24J21
5022d5L7J7m7k33L35k94K8L19r4k30L83l01J88j45K80k19l2K20j10j39j92J52
5044a22J73k52N8L13k30O3j59j4J82k03L33j71k06K89k33J20K35j44J67j58k52
5065b11K71rj56O9Lj42j5J34J90r8k25J78j31M57k89o8o7j4Kj05O2J30J2j73J68
5090b7nJ6k20J01N4j09K68K77m13J48j09j30m4L22o5q0R7k71L60j64o4J31p7M8
5114D4k42K21j12K06L8r4M9j75r4J74q0J0J71J05k46j3M4P6J05K4r2j92n2J45
5138B0K7j02K7p5J04m4J9p0J30k14J0N5J77Q7O4j58J6k6pJ3k50p6J44O4Q0Nk1
$$ y = [35, -63, -79, -214, 34, -4, 224, -3, -95, -43, 335, 33, -71, -136, -181, 174, -126, 37, -307, 32, -118, -251, -62, 311, -64, 87, 193, -318, 211, -11, 46, 177, 30, 27, -121, 88, 84, 165, -123, -79, 117, -86, -60, 30, 158, -166, -45, -8, 9, -38, -271, 64, -230, -202, 117, 23, -207, 176, -125, 63, -82, 198, -21, -53, 167, 57, -82, -274, -122, 51, -201, -143, 170, -60, 3, -156, -170, 12, -191, 142, -29, -235, 54, -179, -59, 176, 32, 199, 41, -211, 60, 51, -105, -36, -33, -175, -190, -56, 134, 36, -189, -11, -142, 315, 26, -42, -109, -123, -121, -226, -164, -34, -22, -195, -27, -32, -16, -236, -135, -81, -190, 78, 355, -58, 90, -19, -149, -193, 129, 64, -16, 81, -190, 170, 6, -58, 73, -4, 44, -198, 23, -89, 117, 155, 61, 110, -65, -159, 15, -65, -55, 116, 221, -25, -38, 6, 82, 187, 211, 119, -73, -125, 20, 47, -55, -28, -103, 1, -43, -24, -94, 36, -178, -168, -113, 64, 151, 215, 57, 73, 47, 40, 53, -197, -273, -129, -65, 15, 20, -1]
5165aM9R7k0k64K10J23k17RO7j47K20J2k15M5p5J36p4J36l99K07P8R7J57m15J80
5190dJ07J00l50r9L98j24l5p4M52n23J70r4L2R9k73Q9J5L42k68m6k05K54K42l91
5214a86K01N1q3r3K44k85J03L84k89P9l57K01R8K38k44k57K88l07M29k02n9K62
5236B16l40P6J55j56J47p9j50J50R5k33j6K17R2j43j9k90L75j27j53Q6J04J53
5258A60m00o7L12m5j41L06J35k57J04j08j67K09Ll6j79O7J97nk08r1K45r3N5o1
5282f5J94l69K59r8J10K23m36R7J50m6n4Q0K05k39K9lN8j04J5J67n7N2k10J1M
5307b7R6L3J01l03K8OQ1r7k44J78p7O6O6K21nk90k4M72m62L07j71J45j61L59l5
5332B63l31j4j23j9M5J08P7R4J6j01k50J91J55Q6l04K46k14J20q1K8j0j02J07
$$ y = [-1, 48, 145, 125, -139, 71, 194, -23, -14, 53, -94, 126, 138, -77, -32, -107, 29, -45, 91, -308, -101, -23, 74, 231, -184, -4, 103, 203, -147, -246, 152, 28, -7, -81, 371, -152, 18, -76, -44, 55, -218, -129, -114, 228, -40, -86, -291, -37, 205, -186, 15, 66, -17, -110, 134, -151, -48, 336, 47, 126, -231, -30, 68, 306, 62, -195, 93, -214, 215, 13, -46, 216, -124, -48, 107, -49, 98, 19, -131, 19, 114, -119, -135, 82, 174, 31, 12, -278, 97, -30, -183, -97, 7, 160, -240, -307, 5, -40, -181, 125, 260, 3, 107, -1, -168, 41, 44, 8, -171, -104, 93, 88, -120, -211, 34, -59, -4, -65, 129, -240, 19, -79, 31, 254, -182, -85, 65, 19, -35, 45, 250, 11, 40, 37, 95, -9, 6, 173, 116, 168, -42, -31, -27, 69, 102, 203, -100, -72, -66, 15, -82, -326, -148, -225, -159, -93, 128, 123, -167, -191, 281, -181, 126, -45, 100, -61, 298, 263, -68, -82, -205, -224, -179, -71, 6, 100, 116, 15, -235, -44, 111, 197, -107, 139, -75, 45, -36, -8, -18, -120, -13]
5355a3m7K82Q8k89l17L63Q8l90L64k96K12J92r8Ql60J09p2j13K52l9L62k50j55
5378a19L30o0j46L43m54l6J70k32L70j13Q6k02K07k78j1P3K1o1L83m79N9M0J94
5401H5k09K8J66Q5J77m12J18J30R1j10k46K35q1j68L07k26p0K38o8jm1P6Nr5J74
5426A88o7O3q0j66j06N18m59M5J09Q9Q9k85L30j08Kr9l9r8J14j45L00k67k25O4
5450b33K20M5L5j45N1j09j12l2K53j99L89j71l8rK59l19q7L35o3j20k4K01j18
5473Io2Q9m6n5J06L4J25o0j65j5m4K15m2k14J45p6L3M7L0r2K1O6k12K58rk6Q1
5500A41m6K3n8K7J57l24j12O3L4Q5j00R5J97j42j38J00jl6J59q0k88K37M2k70
5524b35J80R5n0Q3P9j11J30k61J39j53o0K06j22J41k23J31k63O04k62j56n5J9
$$ y = [-13, -60, 222, 310, 21, -296, 67, 155, -235, 129, -167, 45, 237, 139, 147, -213, -104, -176, -289, -37, -76, 286, 36, -119, 211, 151, 5, 348, -106, -142, 28, -204, 166, 53, 139, -63, 144, -134, -145, -72, -51, -112, 271, -208, -149, -109, 85, -124, -96, 70, 155, 332, -80, 38, 168, 259, 149, -97, 138, 57, -111, 196, -30, -100, 138, 70, 69, 28, 104, 109, 14, 188, 121, 184, 104, -62, -168, 350, -109, -64, 45, 134, 223, -62, 268, 160, 162, 63, 24, -74, 40, -105, 195, -72, -297, -233, -13, 32, 67, -78, -27, -136, -248, -280, -27, -226, 163, -8, -46, -55, 204, -115, -202, 133, 70, -50, -74, 127, 9, -53, 36, -10, -65, 41, 75, 200, 140, -25, -40, -84, 131, 89, -125, 20, -56, -23, 24, 54, -38, -17, 49, -163, 95, 86, 60, 141, 95, 118, 60, 87, 244, -80, -192, -129, -95, -10, -110, -15, 182, 40, -98, 2, 1, -35, 124, 44, -244, -7, 35, -235, -55, 40, -10, 73, 152, 41, 171, -90, 49, -104, -164, 42, -80, 61, -162, -31, -294, 310, 48, -108, -163, -144]
5546a44Q7j37K32j56J24j73J88j8j79L16j33J46j0k03n1Q3J23n2K7k32L49N3j31
5569A09n9N4j68R6J01j32j2J00k96K94k92M34l11L49j53j18K57M6r9l30K07K4
5591A01j10Rj41K21j42r0Q9k0j10K73Q3k50L63l68o4P4K04j96J81j55N7n7j16
5614a64O3J07lO4o7Or4N6j80J26K98k16J12k66Q0J17j77K8K34r7q6O4P8J81k48
5639A6o6J34j56J95Q0l51O2L1N2P3j17Q8O2k66K65k40J46J07K1L1l2J33k56p9
5663f7r2K54j86K76m17J38M6J37j95K3J33r4J81l36J42J46k87J08J20M9j07M7
5685A9J3k33J02J35j11L06m6j98n5j57J90lj09J83N6j64M9k3l9M08r3k37K07k39
5709c9n1O5j95J69M1O9nQ6k20J23J39o19L46L4J59j15n1J86K5K6j90J94j23J5
$$ y = [-144, -57, -194, 38, -118, 6, -167, 21, 3, -176, 140, 7, 153, 143, -60, -111, -28, 95, 43, 70, -162, 187, 240, 109, 50, 104, -64, 32, 133, 1, -11, 89, -207, 87, -205, 229, -82, 267, 114, -4, 253, 299, 200, -130, 77, 101, -9, 0, -141, 80, -62, -152, -63, -83, -193, 80, 163, -87, 276, -92, -156, -82, 122, -74, 107, -48, 9, -48, -164, -101, 6, 3, 67, 0, 6, -88, -32, -212, -86, 212, -4, 108, -158, -78, 39, -138, -110, 124, 27, -59, 5, 83, 264, 16, -50, 84, -72, 123, 203, -148, -86, -55, -3, 70, -47, 41, 103, -163, 102, -138, 8, 115, 136, 167, 135, 268, 12, -67, -159, 95, -91, 185, -232, -94, -48, 89, -106, -83, 50, -44, 137, -199, -57, 89, -198, -90, 30, 79, -28, 19, 32, -201, -99, 36, -75, 231, 185, -13, -68, -225, -35, -38, -147, 36, 92, -72, -23, -46, -85, 323, 230, -7, 200, -39, -90, -25, -220, -51, -10, 59, 54, 140, -80, 43, 182, -437, -91, -57, 102, -13, -64, 122, 147, 173, -17, 177, 54, 69]
5733F9L9l27L92k26R5J75j36J30j5l82J99k27K50Kp1J21l64K29N5J39j10R6J52
5756B85k69N5J88j17q5l1K52k15Ql17K56q6j38J39J44q7p6K59j05O9j43J9L7j46
5780a04K08mj05J80k23J33rP1j79K51j02j47j37R1K14j59J98k87K97j38k3p5M6
5803cJ13k07J25p4J7m1r6K23k14M01l14J18nk25J98K82m38q2J98N6k20K65j0l3
5827C4J32r0k04J13j38J68n0p5P2N8Ml22J74k1J92Q7J03m02J79j16J20L6p5O0
5851C9J28j93j84L62m16J50J3J09Kj7K13p1j05P3J86k81k4j93J18L49l04M7p3
5874g2J19j48J44j26Q2p6R8j97O2J76l7J12k03N6j12K8J76k3P4j46j3o5o4J86
5898C1j56K17j96j28J71J11l16J21J38j73J37j60p2M17m9j18R0n8J33k00Pq0J48
$$ y = [69, 108, -219, 173, -53, 42, 217, 81, 211, 196, -186, 13, -214, 36, 38, -33, 88, -276, -47, 8, 147, 37, 133, 285, 16, 71, 259, 142, 57, 26, 278, 63, 71, -246, 10, -76, -214, -75, 69, -18, -94, 165, 60, 129, -14, 5, 42, -104, 104, 100, -5, 175, -48, 85, 76, 147, -32, 219, 117, -30, -167, -76, 138, -21, 177, -110, 187, 49, 26, -49, -3, 110, -97, 28, -46, -29, -70, -166, 57, -157, 244, -70, 48, 43, -182, 16, 298, -140, -222, -24, 32, -188, 77, 67, 34, 166, 76, -128, -15, -153, 15, -35, -110, -38, 20, 24, -298, -124, -145, 47, 134, 237, -165, 14, -102, 18, 54, -21, 39, 167, -26, -210, 152, -264, -114, -101, 8, 10, -7, 206, 135, 30, 103, 289, 8, -16, -209, -91, 258, -46, 1, -72, 47, -101, 43, -83, -1, -77, 21, -176, -114, 62, 25, 137, -66, -10, -122, -94, 82, 59, 133, -13, -26, -91, -155, 31, -125, 92, -104, -232, -61, 50, -266, -145, -7, -180, -43, -203, -275, 142, 93, -25, 65, 7, 140, -60, -53, -133, 15]
5921A5K4N1j38j24J41J51q2m1Qk03K54Rr1j4M8N2p2k92M67k13Q7J10j28m9j50
5946a80J54P7J02k59K15m9r5j40J12o5J75j07J96j33J3j34J1l7K19l01L00k60
5968a86L61k83j2K46k91K46j33j35J21J79n2k74J85Q8l31J80J38j16l8J60J12
5989A65R0o5m18n8L72lP4J08l44P2P3j51P4j29K04R7k5j74j18R0k3k4M2J45p3
6014AO7j2j01J7Pn1q7K76r6P6p3j08p0L8o3L08j78R5k1K40k48n9P8j12M4J52R0
6041B10p4j27j7O7M8k11J23p2J42J49m61Q6K21k10J64K2n8j27J20pj15J38N8j18
6065d9O8m5j86N55n56J51J15j31K25j62o1N7n4J94o2q2J39k51L1P2j28J04P7r4
6089g3M7J03k21L22j41P7k31Q7R8j06l5K63n2k78L00j44j15j66L32j83J16j34
$$ y = [15, 39, 90, -48, -172, -31, 120, 38, -3, 5, -198, 56, 65, -26, -40, 8, 60, -12, -304, 163, -50, 37, 147, 19, -30, -180, -26, 51, 153, -106, 109, 60, -35, -175, -63, -128, 47, -60, 136, 3, 16, -118, -107, -144, 75, -226, 74, -186, 175, -108, -120, 126, -165, 81, -52, -187, -66, 113, 61, -213, -28, 60, -271, -91, 47, -69, -107, 53, 165, 255, 190, -228, -286, 86, 83, 157, 265, -79, -7, 66, -85, -11, -140, 64, 161, 136, -38, -156, -66, -89, -113, -71, 74, 1, 68, 56, -45, -28, -21, -72, -159, 117, 21, 97, 24, -84, -154, -116, -179, 129, -49, 46, 25, 265, 17, -42, 36, -76, -32, 120, 210, 136, 9, -8, 59, 107, -104, 19, -53, 89, 238, -223, -137, 84, -126, 38, 60, 2, -125, -5, -12, -127, 11, 69, -49, 19, -26, -212, 343, -213, -62, 53, -78, 147, -15, -76, -19, -73, 121, 59, -23, 116, -135, -104, -32, -160, -56, 21, -73, -26, 77, -144, 178, 37, 114, -117, -30, 68, -38, -73, 190, 138, -140, 160, 16, -99, -265, 67, -116, 0, -134]
6111a34J00l72N31J12k02j63L86j19r7o5mk7Q4j69J99J1r3J48rj4l3p3J58q8k39
6136a72L84m32P1j02M61k46j69M28l88J61R4k7k30MJ93k00M4J62K63n97J60J04
6158c4K4k08R9R5J06J54l13K20P2k88j65L01m8m0J57j19m5p6J65m06L57k51L7
6181b06J97N4J91l59J69j48J76o6K91m19O5K65m31L59k31l2K01Q8k02L3k4lK62
6204B30k11J14l52K16j19K16j47K2J48j03J7k0LP0r8JJ56j94J99O1q7l5j07P6
6228E6j47m2k0J09K5k83K81O6N4j7j79J96K6k69l5J78J10R6m81Q5L39M4j16m8
6252B8J16l02J56j38J79J15k17j8J83k05J18N1j43R0o8K1j28J22M2r6l08K59j2
6275a55L39k19J82k05K04m5j56K33k58O4P9k17K02j90J36J28N2k32J32k03K60
$$ y = [-134, -34, -406, 125, 237, 35, -128, 258, 139, 42, -23, -27, -54, 30, -139, 60, 71, -22, 126, 117, 103, 70, -3, 155, 67, -172, 212, -220, -149, -251, 210, -36, -205, 223, -165, -4, 90, 63, -167, -163, 30, -170, -126, 36, 299, -298, -138, -34, -10, -218, -119, -24, 82, 236, -77, 143, 215, -73, -238, 63, 15, -25, 132, 13, -32, -108, 57, -349, 8, -243, -206, -9, 45, 236, -123, 46, -102, 74, 8, 299, -120, -55, 210, -221, 138, -93, -125, 76, 164, -38, -5, -29, -32, 230, 19, 133, -219, -3, -122, 94, -53, -31, 117, 14, 31, 11, 14, 84, -14, -13, 143, -51, 148, 209, 122, 87, -20, 56, -91, -133, -153, -44, -19, -302, -21, 45, 99, 82, -97, 99, 125, -144, -179, -1, 109, 205, -276, -191, 148, 192, 76, 28, 144, -158, -2, -140, 39, 154, -63, -81, 102, -103, 15, 66, -77, 13, -55, -34, -162, -40, 2, -94, -402, -143, -155, 184, -35, 147, -58, 146, 101, -55, 178, -80, -16, 63, -154, 48, -142, -6, 122, 174, -58, 74, -129, 131]
6296A31j1m28L85J86k64q1J44l02M09l9o8p8J46l9k3kk20L3m6L84j79J97j71Q2
6320A46k07m6L4J82j7J1p9l8K07k86j27R7j92P7J84j39J39oK03p8k3j2k16J11
6344g5J72l7q1K30j07j59j54J88j72M56q0j43k20M38k74k4J47j54O4J77k47k40
6366b95M26j48l93N79l49K21M7L5j76J08j8J37m1l15P4L17q1Q1p5m80N21k26R6
6389D5j80J40p3M2P7L7oJ18r1j07q0J28Pl18K72P5j42K21l36J40k43K59K7J4K56
6414B82l08J81j41M0r7k9O9o4J14J6j10l7l4J83o2k45L46k36K3J50K24l15m8J17
6438A9j05k0O6P9Q5k18K53j55k33K53j60Q5J20l63K58J05j99K74j1l74J02J67
6460B8O3p8j69J96j4r1J00P5M8M7k62Q9j13j0J18J20k30kL4Nk9r6Q7L07m21L35
$$ y = [131, 120, -308, 77, 263, -1, -82, 62, -240, 169, 130, 62, -16, 130, 91, 68, 66, -154, -121, -167, 217, 38, 235, 64, 146, -61, -107, -73, 109, 92, 103, 24, -14, 193, -93, -220, -123, -315, -238, -54, -193, -54, -60, 143, 65, 42, 30, -186, -75, 97, 60, -21, 209, 102, -57, -211, -23, -195, 261, 181, 38, -182, 256, -18, -42, 105, -49, 15, 192, -55, -295, 131, -17, -410, 169, -180, 41, 88, 123, -53, 55, 37, 174, 133, -182, -108, 209, 128, 209, 134, -346, 175, -51, 45, -135, 5, -68, -26, 51, 88, 82, 200, 109, 2, -78, 50, 57, -261, 11, 86, -56, 165, -171, -31, -274, -15, 12, 26, 282, -26, 155, 14, 54, -43, -72, -3, -67, 47, 63, -47, -84, -118, 65, 3, -242, 104, -132, -109, 41, 265, -50, -98, 19, -86, -106, -40, 39, 124, -94, 159, 4, -229, 24, -136, -51, 69, -294, -36, 69, -130, 144, 133, -241, -139, 28, 91, 13, -156, 40, 26, -65, 35, 110, 158, 205, -57, 32, -81, -91, 27, 147, -83, -85, -51, -46, -75, -171, -84, 223, -198, 137]
6486A37k44M0K1o9r4M7j52L11k55K85j83J68j4q6K1R9j52K03n7R7r2P8j08l1J25
6511I5k43K51o8l26K16m0j02K82k45L01M1R1j24l32J3J02J72N6j74n2K94l95M63
6534B76K1k16j86J61j66mJ32J6L8j09j7J47q0q4M6j52J79J18k13j60K68o4o1K36
6558A26j17J4j45J34j7m02L96k41M56l02J65N9j28r9P4M5r3P6k05J74K14p7r6
6581A1r7J43N2k34Q1K83L0k74m4J64r1k3K5K38l84L07l1k91L3JK91k01jj2m3k3
6607i0J31O9k55L40l54K42k6p0N4J03m2J14k46M2R3r7p9Q2J03J18q2j17k3J88
6631A98k90P7O6q8j8j65K4K12O0j29J75m72M08k54N6k9J48k2P3j0M6l22J95K00
6655A39k91L67k96J71j14o7K0P4K41j42l8n5j24q6l1J05J94K78k73j81J29j91
$$ y = [137, -107, -67, -46, -115, -209, -162, -314, -3, -258, 27, -156, 12, -2, -88, -67, 32, -120, 83, 26, 123, 31, 109, 1, -30, 95, -148, 103, 35, -291, -75, -115, -217, 65, -180, 121, 162, 253, 129, -203, -190, -88, 84, 140, -34, -86, 208, -187, 276, 297, 81, -105, 56, -110, -114, 18, 34, 72, -37, -54, 93, 13, -71, -25, -177, 2, 120, -93, -253, 15, -49, -110, 126, 9, 23, -122, 12, -5, -407, -11, -252, 204, -98, 67, 126, -2, -101, -27, 18, -75, 1, -204, -30, 184, 107, 11, -86, 57, 109, -125, -44, 239, 269, -5, -49, 115, 24, 1, 26, 264, -120, 187, 156, -135, -102, -101, 190, -11, -12, -24, -67, -90, 41, 110, -145, 195, -159, 83, 57, -13, 41, 144, 102, 216, -30, 12, 105, 8, -71, 11, 114, 232, 150, 33, 10, 198, -92, -15, 51, -37, -55, -220, -196, 16, 76, -53, 122, -350, 58, -196, -140, -169, -21, -43, 30, 20, 66, -256, -61, 139, -152, 215, -81, 90, -24, -91, -71, 3, 244, 102, 64, 9, -115, -201, -232, -127, 67, 345, 72, -109, 20, -171]
6677a71J88j86K61q3J07O2k6ljj90OJ2k9J28j25J28P8k75j0m1R9J50k6j25J73
6702A01j01j0P8j24J66j39l6q4NJ29J52l55L80k11P8j8K25r1j03p5O5Mp7k9R1
6727B1m1J34j53j8O4K3Q7k51j8j07L67R3j79l88K73L54l77J74j10J6lp4j68M04
6751A23j5l39L28K73j81j65q1Q6j42M2J98k08q2M28l63K39r3R2q6k4J90k08J67
6774A79m4l3j81q1K18m97J89K04k1k1M5j8L50m23J1K88p2j73k54M37r0J01j55
6797d1O8J78n0k57K16j21J88k1l64L70j40K4j50J71r2p9L8K41r9j4p6J01o6N2
6821G7Q6j85J46J13k52q3k10L55n7l16M27J13k57J29l20K40j0J67l25j02K55q9
6843i8K33j21n3J22p6O1m8L5J79j00k85K36k41m0K22l7K4L4N8j75J21j50J85j28
$$ y = [-171, 17, -169, 92, 9, 116, 178, 152, 149, 148, -42, -36, -24, -53, 75, -50, 78, 156, -119, -129, -170, -71, 79, 53, -72, 101, 0, -10, 68, -56, 110, -29, -65, -149, -144, -15, 137, -218, 162, -49, 29, 11, 236, 145, 42, -33, 32, 36, -41, -70, 21, -20, 114, -39, -57, 7, 30, 117, -134, -152, -259, 108, 201, 22, -366, -93, 261, -116, 58, -52, -36, -39, -113, -281, 123, 108, -231, 97, 370, 189, 24, -57, 29, -113, -71, 127, -81, -163, 265, -98, 141, 48, 140, 54, 30, 220, 12, 179, 135, 102, -79, -160, 58, -439, -250, -46, -67, -88, -43, -61, 289, -134, -123, 165, 93, -80, -334, 103, 13, 114, -41, 27, 205, 155, -102, 114, -7, 181, 160, -204, 166, 26, 50, -100, 71, -21, -100, -62, 179, 80, 66, -10, 91, 25, 77, 163, -22, 124, 237, -15, -98, -308, 47, -10, -326, 101, 214, -43, 86, -234, 6, -4, 163, -162, -264, -9, -98, 135, 14, -39, 83, 7, 68, 20, 55, 234, 134, -151, 85, -156, -196, 26, -11, 13, 47, 105, -70, 51, -99, 86, -42]
6867d2j8j27J45Q8M7n8J27r0k41O1K04j35J01NJ04n3K2j03j32K43j77J16j39J02
6891E0rq5o3jm9K86k46N5J4lK10O1k57J25j16K01J5o7N4j07j03K74k41j23L10
6916A85k94K30k98J81m2J0J57r3j39J41j57L01k05J63k58J45J32j88M3j54m7J41
6938d6Q2o8j33L95l05R6p4j00K97L3j55k5j2o3K05k90L02j08l2R7O6k06N8k2J52
6963A44n38M03R4J33j83n6j64J07R8j4J79l82K49j6k96M34p7m18K50K15j59j13
6985a10K04KQ0r4N4k11j07J99Q6j34N4n8P2m4r5J76mk74K50q3l35M05q8Q8N2k83
7011a98N72m67K22j34J22j82N8KlN4r2j94K17pm4J86j51P4M3R3J18m83N4j47M30
7036A43m6j77K02J30k55O5n0j07j59K80m7m6J02L3KK2J7j83J76j08r8j3K75j68
$$ y = [-42, -60, -187, -42, 46, 93, 35, 162, 72, -169, -108, 96, -39, 62, 67, 171, 118, 140, 37, -95, 148, -29, 87, -52, 50, 41, -44, -107, -108, -157, 129, -117, -62, -48, -51, 159, 220, -37, 88, -28, 173, 188, 121, 175, 68, -35, 239, -2, -125, 185, -109, 121, -177, 4, -38, -28, 129, 36, -103, 38, -119, 182, -23, 140, -118, 27, 159, -29, 14, -140, -187, -46, 36, -32, -165, 230, -75, 21, -53, -153, 144, 177, 22, -3, -15, -78, 127, -163, 139, 31, -1, 96, 162, -44, 14, -8, 144, -394, 9, 103, 236, 53, -3, -167, -60, 38, 24, 203, -179, 70, 54, -242, 192, 115, -303, -53, 162, 3, -110, 94, 96, 176, 82, 136, -75, -182, 17, 103, -31, 23, -35, 37, -7, -102, 74, 70, -204, 46, -37, -372, 33, -55, 33, 85, -198, 374, -93, 129, -5, 117, -65, -7, -5, -8, 46, -46, -240, -23, -30, -74, 112, -39, 35, 78, 171, 289, -194, -140, -287, 143, 97, -80, 122, 252, -3, 62, 12, -95, -254, 26, -21, -67, 35, 68, 70, 92, 109, -74, 102, -6, -104, -117, 158, -10]
7060a0J70k86Q2M68o21J84j32K19r0k14K31J04p6K23j84j00QJ04k03J1J97j94
7082a09Q0n6r0K12j88M2K04j06J2k2nK33k52p7J91J36j90O9J1m37L13J13k27L3
7106a10K17l8M4j09k65K81k12O7j4J19j47J96k7Q5j64O5j2N1J24k53J51m4j53
7129a48Q8K53j79j46P5M7R1l3j43J61Qk7l25L11r1J07L3r2JLn5P0J05m3j15j97
7155b41L15k69J78P4K07k20l83M22j58p1J09j84M27o3q6k43K99k25O6J4l5J40
7177G3R1m55qJ38K16J03kk86O3M7J45q1j18J95j20P7j92L58k84K7K1Rl62L59J78
7202A92j87K01k83J13j25K27j66N9K72k52Lp8j61L18o0j28J36k40R7J08q4j7j49
7225b04K35q4j77M3J95k18K42j30L0K8J14j5l93J18K31k2J33j70j2K53k90k5j32
$$ y = [-10, 160, -126, -44, 424, -197, -13, -145, 74, -16, -230, 1, 105, 29, 252, 68, -32, -24, 80, -123, -112, 85, -109, -29, -85, -175, 37, -151, -109, 95, -11, 1, -21, -26, 207, -45, -122, 69, 205, 15, 84, 95, -342, -29, 84, -143, -110, 107, 69, 113, 4, -261, 20, -192, -125, -139, -20, -167, 29, 2, 87, -77, -12, -24, 27, 151, -102, 49, 5, -148, -60, 193, 14, -132, -57, -10, 81, 48, -95, 66, 74, 47, -278, 33, -58, 49, 82, -10, -9, -6, -61, 9, 114, 71, -44, -241, 74, -195, -17, 57, 264, 44, -339, 83, -75, -146, -37, -221, 206, 143, 57, -186, 113, -112, -46, -32, -67, 73, 164, -291, -299, -161, 55, 158, 156, -130, -67, -20, 125, 44, -74, 121, 1, 78, -114, 244, -40, -13, 8, 17, -345, 14, 192, 5, 206, -77, 36, -89, 138, -28, 31, 303, 51, 54, -24, -185, 133, 73, -55, 81, -159, -62, 46, -38, -55, -204, 31, -53, -230, -187, 8, -210, 32, -98, -68, -40, 74, 59, -334, -216, 15, -7, 126, -44, -56, 197, -93, -118, -250]
7248b50L4R0J72k38N7J70p1O6m0q2L13m3j03O3j41J86k03N8l4l6j47K06P0o9l9
7273a1q6M1j48K35j69K35K7j05k91J52K28m2P2K4j05j08jq9K31j85J05K13j14
7296A09M42n14j75M33l79J07o6J98n5k57K36m7j05o4M9J28RJ9J03o9j1j41J85
7319A35m66K59j1M4qJ02P0q4J45k7j29P0j10Pk5r2J15J20o1p3QJ12k15K22l05
7344a97K76Q0n7Q3j09j34o4j00J91J24j60J96j63J05k73M63l39q5J21j44L41l16
7366a61J15J14n0m7P9j39OM3K02m67K83p6jN1J99k69P5M3k25K19q5n4J17j03J94
7391F3o6J17k3J36l49J62j08J25j02K16m1j32k7Q7k89K61m5J2pK10k16p3J27k72
7415b34R0L20k26M7Q0k08l9J93j01J12r4J59m3j39K48j83J3L20k84j52m4J77m3
$$ y = [-250, -216, -126, 46, -192, -135, 35, -36, 30, -10, -92, 221, 178, 75, 138, -3, 183, -20, 38, 4, -32, -179, 27, 97, 28, -11, -97, -56, -204, 31, -138, 97, 124, 19, -272, -120, 108, 66, 138, 162, 57, -51, -52, -141, 90, -95, 10, 223, 109, 551, 37, -138, 295, -84, 23, -43, 155, 100, -157, 79, 32, -73, -137, -88, 40, 49, 68, 171, 102, 91, -50, 135, -331, -72, -83, -39, -47, 55, 125, 41, 186, 159, 30, 100, -10, -3, -28, -120, -5, 115, 54, -19, -11, 101, -114, 108, -197, 79, 159, 102, 185, 76, -58, -122, -222, -31, 93, -67, 129, -34, 71, -202, 261, -78, -163, -42, -186, 155, -161, -46, 68, 18, -29, 50, -89, -83, -40, 162, -305, -22, -98, -99, -48, 151, -118, -43, 0, -225, -6, -91, -145, -28, -131, 63, -3, 114, 91, 227, -122, 40, -68, 57, -45, 171, 130, -2, -29, 58, -231, 30, -15, -3, -10, 200, -16, -89, 38, -234, -144, 176, -50, -3, 77, -131, -170, 23, -78, 34, -60, 99, 56, -83, 165, -18, -5, 315, 31, -121, -165, 12, -31]
7438c1R9K4l06L02k16N5j8N3j5K0j0j05j09rL38j48K45j30k3j25J94J33k8k17
7462b7l7L34l63N6j61J64K57l10K25j52j20P8P1Q0k11J91N9J95l26n3K58n39J42
7485a89L04j44j79L04m5l14L92j32j16P9O7N6k27M4J98j22j23J1J61J00J39l79
7507a15L53l80n7RJ92j83PL0K15Pj56rJ53k01R4r6J09j48M3K96k35j08Q0J01R
7532A0q8K14j79K16j88n1Q8oo3Q5k54K14m0n8n3MK47j08L12o2p1m28L89J2k68
7557a26J8L3J87K8k66k4M22k10o8M5J5mq3M2j21K20j43L8R4j28J73J37l81J63
7581F1N5m9k50K69L8o3k38K10M5j67j5J10R1k35J84j04J51j95j33K90p5J59l52
7604b13M58j75n3k07J3L81j07l61K95J65j89o7L51j68j51J06R4r1r9j16K2K19
$$ y = [-31, 68, 92, -214, 88, -128, -73, -91, -38, -53, -33, -43, -148, -257, -266, 72, -76, 169, 39, 16, -109, 85, 218, 190, -27, -64, 270, -93, -37, -198, -34, 223, -87, 138, -14, -134, -56, 15, 95, -116, 75, 134, 329, 3, -50, 208, -331, -189, 115, -29, -208, 96, 51, -263, 129, -3, -119, -40, 27, 83, -144, -100, 98, -24, -147, -136, 25, 125, 264, -115, 238, -142, -199, -190, 2, -181, -174, -144, 71, 78, -78, -87, 66, -135, -41, -137, -28, -176, -133, 163, -72, -180, -100, 1, 10, -78, 136, -43, 173, -15, -66, 22, 16, -47, 38, -216, -2, -42, -100, -153, -149, 98, -10, 302, 240, 169, -259, 130, 142, -126, -108, -75, 112, 140, -126, -150, 272, 62, -6, 39, 54, 50, -33, 9, -112, 108, -35, 3, 97, -31, 142, 279, -102, 61, 116, 67, -183, 86, 124, 61, -177, 33, 78, -89, -104, 6, 97, -138, 46, -58, 93, -102, -235, 55, -20, 139, -213, 245, 70, 17, -190, -177, 204, 97, -264, 31, 196, 7, -60, 291, 123, -28, 78, 172, 81, -18, -134, -112, 107]
7626A07k2j06k7j29J30N3l6J37q3q1J36k00K6M00k53l3p8J18j16J56n8J27p2o7
7650B9m0L7J3O6J62k90P6n5O5j69J51k09K80j75M2N4j20J12k6L28j57o9J40m30
7674a85J96k6Mj23J3L8R3o1jL0j19L08j21k78K87j3k54Q9J76j14P5k5R6o8j42
7699a25N3j7J20oj76K65K5o9Rj07r0K49j63n5q9J54K18j46j52O2J80j28pj60K84
7724A29J9l35L0J5J02k23K92J6j29O6RJ37k33k58K63J24l27M34j6o0q0P3m9k3
7748b4J27j23J23J5J54o4k00K11j79k82L84j75J11k44J6M57k41lk34j65M20k1
7770F3n5j47K10nk72m7M17k6p8j33J52R8l22J58oj51J28k93K03o5K60K3Q4m65
7794b69M03j61J30J1J33k07q8L7M9nj75N9J73K83m52j40P8K52J25j39p3J93j94
$$ y = [107, 85, -21, -48, -177, -47, 6, -30, 107, 24, -57, 79, -121, -95, 305, 52, 19, -59, 59, -57, 99, 41, 168, 96, 29, -11, 26, 39, 105, 267, -23, 53, -2, 63, -106, 45, -164, 116, -59, -17, 37, -83, 29, 3, 331, 174, 105, 245, -185, 11, -15, -11, -134, -121, -83, 10, -51, -52, -22, -141, 167, 46, -232, 55, 42, -212, -123, 53, -61, 14, -11, 85, 17, -125, -72, -89, 31, 25, -151, 114, 139, 70, 79, -28, -118, 131, -32, -87, -176, -22, 196, 50, -102, -40, 140, 12, 5, -155, 129, 148, -187, -157, -142, -40, -263, 29, 45, -84, -18, -9, 128, -105, -363, -100, 24, -303, 131, 115, 55, -25, 48, -1, -24, 103, -20, 103, 118, 272, 208, 8, 219, 40, -242, 142, -33, 78, -166, -150, 307, 66, 63, -171, -336, 84, 63, 8, -139, 71, 66, -206, -253, 164, 138, 60, -73, 79, 177, -145, 13, 7, -144, -16, -309, -106, -171, 89, 112, 196, -269, 134, -27, 103, 114, 247, 40, -48, -11, 38, 33, -142, -83, 90, 373, -79, -219, -141, 111, 236, 97, 24, 217, 23]
7817B3N7Q4K63o54MM28k41j09N4N2j03J77J52o7N7l21M01j25k47K32N3l79K52
7840D3J10j09j26Pj09Q1L3J8j01K05K0J28k55L4K00p9j41K39j24k22J18k06M2
7863a94N25k37kl19K44J35k65J30j50K2J65j93L7J78j54M46l81j89L1K84j69k9
7885h5p5R4K34l88L37j45j23J03M0j68%K54j12J1j54n7O7J53Q1L9n2J13Kj86p6
7910i3J71k00O9P5J52Ml4J8n36J87Q6J28pJ49j94M3m9J91M2m23K09r4K47k02k6
7935h7Q1r5K13p6j80J58l7K75m58rP7L67m39J69K3k41P9K08k8j57J35l87L10L
7959i6N0k9K71l80K13j45J40r6J04k37K27j22K56O9k39L0J4K63l10J7j18K05k24
7982a37K88j58K6Q4j38k7o5J2J28N0k64J77m4j67K08J96j38j25N6j00L92k29j52
$$ y = [23, 80, 164, 427, -227, -223, 205, -36, -145, -91, -39, -142, 35, 187, 120, 177, -144, 257, 132, -115, 117, 170, -209, 43, 153, 44, -82, -75, -184, -103, -70, -52, -153, 52, 72, 200, -55, -21, 179, 100, -41, 198, 74, -148, -30, -236, -194, 331, 94, 92, -227, 17, 152, -113, 17, -133, -111, 54, -139, -102, 76, -78, 368, -13, -202, -171, 113, -56, -85, -160, -66, 168, -220, 117, -28, -151, -48, -8, -176, -176, 78, -34, -23, -177, -234, -167, -14, 67, 106, 54, 167, 169, -17, -93, 78, -122, -53, 22, 174, 178, 144, 162, -374, -187, -101, 27, 20, 169, -25, 18, -31, 160, 202, -221, -12, -106, 141, -61, -87, -6, -101, 112, 36, -144, 14, -23, 252, -206, -215, -138, 229, -210, -41, -18, -259, -180, 28, 0, -157, -22, -409, -99, -96, -46, -75, 196, -184, 29, -116, 24, -72, 32, -205, 22, -100, 156, 225, -14, 16, 30, 293, -17, 0, -118, 87, -137, 151, -7, 19, 103, -35, -62, -127, -115, 13, 63, -201, -24, -68, -235, -27, 169, 31, -94, -38, -138, 254, 25, -127]
8005a27K60j38R1K79l82j58J11J14L5jj1m2Mm8L05k64q3J55j16k7P4o4K11k89
8029a11R9qJ55J43l18P1r2q4L9K78j72k30L56k05O0Q7M2j43R2p6J43j38r2nn2
8054a61J02j2J08j68P5J07N9p4l74J57nL86n29J26K6J93j75R5M3j8O8n9N5J07
8078A32p9J92l87J82p4l9J53j29m1Q6J59l60L13k2j28J30j08O6J69l34J44JpK4
8102D3j8k66M94l99J95o9J73m0j01P3J41j96j00J2o7J27j30J30p4K02q9jm1Q3
8126H2n9j11J48K34k95J8q9j02L62k38K09j12k17J46j21J53J55J09j49p7k7j23
8148a04J35LJK6j14J19k62P4J44J28j07o7L0O1N5l90M52j92l2q8M2P9J32q0P8
8173A23k7o9k46J48J75j4O1l4j03j80J01j70J7K77j95R1k4O1
$$ y = [-127, 133, -5, 86, 365, -17, -175, -64, 50, 85, 84, 73, 31, 35, -13, 292, 28, -55, 100, -16, -43, 31, -33, 178, -111, -12, -20, 135, 278, -40, 31, -61, -145, -106, 172, 0, -230, 126, -79, -19, 68, 110, -33, 59, -17, 126, -12, -104, -109, -161, -59, -71, 37, -131, -56, 51, 110, 36, -338, -181, -186, 200, -329, -203, -177, 16, -159, -64, -21, -39, 29, -30, 25, 132, 53, 245, -142, 40, -34, -73, 80, -49, -90, -4, 155, -205, 108, 86, -42, 88, -20, 46, 215, -119, 25, 26, 19, 43, 25, -241, 253, -146, 49, -20, 153, 113, 12, 85, 226, 30, -70, -58, -125, 2, -128, 2, -72, 130, 41, 40, -1, 82, 23, -88, 60, 294, -1, 17, -72, -174, 188, -50, 159, 47, -170, -24, -145, 8, 163, 272, 123, 46, 19, -104, 31, 34, 35, 61, -53, 66, -196, -122, 22, 150, 43, -24, 6, 67, 122, -268, 184, -8, -40, -128, -86, -7, 125, 45, 123, 96, 27, -219, -71, 104, 90, 151, 117, 14, -166, -65, -235, -218, 59, -136, -45, -69, -8]
8191h
$$ Imaginary data points
##PAGE= N=2
##DATA TABLE= (X++(I..I)), XYDATA
0@%%%%%%%kJ0j6J6k4L2l2M0n6O4p2Q8j04J20j41J65j89K18k50K85l23L65m13M67
31B48n27N90o59P36q20R13j014J124j246J380j527J690j870K071k298K555k844
48a498L174l558M009m550N211o036P103q544J0602j3795J9429l2136J04893j5502
62F8802k19031K26975j8773j94583J77883P3717k27109R5630J10737j71769L6607
73d0914J53108j37432m3819J35608n9343p5427J14871n603j03656N4846N9439
84E1678q6432J837R3285o1702o2521J13111j5560j08088J03806L0600j40039Q1159
96A134P8556j50889M1546J20080j39753J04J45451j21923m7145J59667q5597q2447
108h1216J55353n4411j13346J41955q672j20385J12737K0810j24951P6845N6164
$$ y = [0, 0, 0, 0, 0, 0, 0, 0, -2, 8, -8, 8, -16, 16, -16, 24, -32, 32, -40, 48, -56, 64, -77, 88, -101, 117, -133, 152, -171, 194, -219, 248, -279, 311, -348, 388, -432, 481, -533, 591, -655, 725, -802, 888, -982, 1089, -1209, 1346, -1498, 1676, -1882, 2127, -2423, 2788, -3248, 3855, -4689, 5913, -7882, 11547, -20589, 84304, 68802, -150229, 76746, 57973, -136610, 41273, 114990, -112119, -16489, 94248, -77521, -40914, 112194, -25238, -69057, 66551, 7208, -68219, 46652, 41049, -62607, -7761, 51678, -34754, -32917, 60368, -1334, -63855, 49256, 33696, -74392, 29414, 60014, -80025, 1134, 79690, -71199, -29653, 90427, -49326, -49222, 96229, -25694, -72839, 86828, 1231, -81216, 74137, 19726, -93620, 48335, 39663, -80722, 32015, 52825, -72126, 4719, 60883]
119F0883j06295L3919O8667q7486n683Q1530m7005l8447O8366j2727n8790N1033
131G965L1765o6243J0043O1473n8364k9619Q9877l3704p6604R6849K431j08601
143g2732R1990M4872j34281O4152Q5991j37391K6073J19315j26174k1641J41908
154H2082r3333o4700J45713n2883r9729J31954n958j18660R8607L3248j19341
165f3000N7612O6055j00106R766Q2121o5097l0512Q2773k2822o2914O3195J9447
177C6518p6325L2812N5266p4014q084Q1180n1363m6424R1961k0107q2531Q7123
189B6012J9115j05704O7323N4443j16667L7980Q5942j09721M208J04879q9135
200b1325k9987J12282n8446o0522J05364k5610q2058Q8117P809r0322O1865L5409
$$ y = [60883, -45412, -11493, 57174, -30312, -35995, 45535, -1470, -39917, 28449, 15722, -43068, 7965, 39730, -26513, -16470, 45003, -13361, -42980, 46897, 13193, -63411, 33438, 35869, -72732, 19258, 64130, -70151, -5999, 79992, -57399, -31326, 87989, -38185, -59826, 82082, -11251, -75951, 69762, 16879, -82850, 49104, 43146, -75514, 23093, 56341, -63000, -5388, 60667, -39439, -29673, 52448, -12649, -43161, 39612, 16790, -46124, 17071, 36518, -39807, -6995, 48271, -25743, -33827, 47353, -4010, -50434, 41527, 21420, -61111, 26012, 45127, -60577, 6746, 61189, -55478, -17498, 68444, -41277, -37069, 67810, -21325, -51312, 60970, 2524, -57998, 47366, 21756, -60302, 27815, 35624, -54698, 7167, 42576]
212D2576q4660L2215N4113o7382N69O1463m2441k7108N7220j2651m8593M3241
224H562J8509n7855K1982M4802n5806m229O3375m2219l3233P0515k0234n9920
236d5751O8167P678p9379N5548L7008q8715L5959O2584q7142R947Q0231p4674
248a8539j9073Q8346n3154m4716Q5032k4007o3808P2764N689p3082N0987L2111
260C8550p1378K3890M9218n8763n014N7001l5941k9879N3596o894m7508L9597
272F475K2530n5754J7415M6846n3209r656O2810l9535l6312O8608j6565n8278
284d4625O3632J0674p3277M8301L7865p9293K5706N9492p4919M2P3305o0294k3795
297c7186P7082l7723m3572P0700j2247n6210N4661J2305o0922L3129L2438n6512
$$ y = [42576, -42084, -9869, 44244, -23138, -22569, 38894, -3547, -30655, 26565, 13914, -34679, 8562, 27071, -30784, -8802, 36000, -19806, -24035, 39340, -2879, -36112, 34403, 14169, -45751, 22416, 30094, -49285, 6263, 43271, -45444, -9485, 53099, -34043, -24096, 56135, -18539, -37612, 50734, -2420, -47136, 37896, 13889, -49919, 22845, 28534, -44548, 6439, 38550, -32828, -8938, 40280, -18483, -23497, 33504, -2437, -32316, 21280, 14386, -33122, 6475, 29005, -26749, -9334, 37512, -15697, -25353, 37457, -2078, -38390, 30218, 13653, -44625, 19007, 29681, -43596, 4705, 42570, -36723, -11017, 48475, -26444, -26402, 46903, -13391, -37186, 39896, 2173, -41399, 29301, 17054, -39156, 15505, 27810, -33112, 17, 32455, -24057]
309b4057R828M5139m2125j2070M8840k2360k9895M3364q7m2394K9094K2476m6715
322b0962R466M1938m3528j0853N4021l1015l1066N8452j4239m7565N3218O544
334B4411o0025M0389K7581o3862K2295M5918n9540K277N8748m8951j7489O3006
346C4758l2519l5078N8042j1970m7010M6250R253n1350K8164K8856m7497P696
358a2405M1178l6359j3349M5788k0173l1247M2000m10m2221K9872K0916m5487
370b1897J2253L8748m1300q147N0658l0764k8491N4222j4762m4690M9734M519
382B0083n3496L7252K4745n5433J9749M0413n0440n69N0283l9071j9586N2767
394B6697k3117l3736M7889m215m2113L6079J3953m3456J8657K8831l8585o89L7703
$$ y = [-24057, -14229, 30910, -11215, -23285, 25555, 3195, -26700, 16664, 16577, -25817, 3277, 25753, -20962, -11496, 30442, -13086, -23939, 30082, -933, -31999, 26453, 12214, -35351, 17867, 24411, -35614, 4775, 32356, -31506, -9211, 36707, -22833, -20556, 38192, -10759, -28248, 34758, 2239, -32839, 25203, 13233, -33777, 12473, 21726, -29624, -1460, 27396, -20101, -12405, 28773, -7586, -20935, 24853, 4680, -26567, 15433, 15023, -27198, 2674, 23590, -21897, -9644, 29104, -12196, -20343, 30315, -449, -28940, 25282, 10520, -34170, 15564, 20083, -33413, 3839, 28584, -26849, -7100, 33313, -17127, -17696, 32587, -6484, -26070, 26697, 3580, -30156, 17733, 13518, -28595, 7484, 21437, -22019, -3362, 25469, -13116, -13805, 23898]
407B3898k7516j8297M0267j1733l1777L5890N466l9330K4723K1872m0945Q764
419h718L4790l5766r183M3367k5531k5162M5441r908l7556M0808O005m5232L0526
432C881K1300m6851J5040L3601m1043k627M1608k9700j8059M4079j5847l0490
444b5108L9846N0l8627K9384J4709m0063J4517K7532l4811j813L5782k4321j7330
457b0253L8344j0794k9771L4036M151l7730K4027J8418l8717J0303L0526l3288
469a0748m952L7812k3233k0285M0269r799l2859L5007M827l9436K5284J8651m0270
482a9732J2575L0296l4436l062L6766k3975j7987L7719j0801l0006L3223L682
494A4262l6680K4027J7495l6617J0856K8396l1188l710L3914k1367j7903L4447
$$ y = [23898, -3618, -21915, 18352, 6619, -25158, 10732, 16198, -23132, 1591, 23463, -17482, -8718, 26072, -9694, -18877, 24490, -1041, -26203, 19238, 9330, -28226, 12582, 18587, -26645, 3881, 25181, -21670, -6630, 26971, -14072, -16699, 24909, -4791, -22850, 21229, 5382, -25108, 14738, 14788, -23839, 5545, 20254, -19809, -5292, 22240, -12571, -14384, 21398, -2923, -20253, 18091, 7297, -22474, 11562, 15713, -22017, 2010, 20428, -18289, -7986, 22540, -10748, -15700, 22112, -1121, -21406, 18863, 9064, -23795, 11212, 16039, -23397, 1887, 20538, -19732, -7157, 23139, -11297, -14359, 22407, -1568, -19555, 18164, 7363, -22643, 10580, 14262, -22418, 1609, 19104, -17513, -6657, 21739, -9449, -13159, 20755, -612, -18515, 15932]
506A5932q504k8987L0020N491l4790K1289J8584l4485Q630K8257k9493n260L2847
519A9531j9573j8422L2613o811k8338K8291O979l3741J9854J8775l3414P511K7526
532B0781k8413n524L1336j8775j7498L1413o480k7080K7457O773l2287J9113J7966
545A8782l2684P824K5572k7832m488L0546j9208j5794L0612p262k4904K6874M950
558A2988l0080J8512J5793l0394P250K4033k6234m284K8486j7317j5066K8516
570A2203n409k4069K3970O981k9299J5238J7959l0095M697K5611k4896o742L0150
583A6299j6016j7698L0214m567k6162K4908P329l1062J6271J8344l1811O110K6420
596A8579k6530n544L0667j7782j5427K9458o695k3461K3933M705k7702J5698J5078
$$ y = [15932, 7428, -21559, 8461, 13952, -20838, 451, 19035, -15450, -6820, 21437, -8056, -13316, 19531, -42, -18464, 14149, 7338, -21000, 7291, 14270, -19471, 383, 19158, -14256, -6745, 20781, -7632, -13156, 18180, -595, -18093, 13320, 6840, -20240, 7217, 13990, -18297, 816, 18782, -13902, -6078, 19494, -8338, -12826, 17720, -1488, -17282, 13330, 6068, -18836, 8038, 12988, -17092, 1420, 17213, -13181, -5931, 18102, -8132, -12416, 16070, -1247, -16313, 12203, 6794, -17275, 6695, 13676, -15623, -385, 17574, -12521, -7824, 17787, -7109, -13851, 16299, 283, -17415, 12799, 8232, -17930, 6978, 14307, -16755, -484, 17860, -13951, -7841, 18579, -7951, -13495, 17172, -610, -16037, 13421, 6726, -16735, 7198, 11903, -15799, -101, 14977]
609A4977k7196N318K2822k2146n219K6217j3941j4699K4438l442k1799J8744P637
622A1711k5441J0964J7505k4590J396K4495j9830q725K7184j2004j7959K5803
634A0509k801k4359K1056P792k7496J3439J7650k6992L969K4414k2500o063K7082
647A5700j5629j4467K5528n983k0499K0945M006k3442J3645J3458k2565L988J9820
660A4505j9146n152K2313j1812j3757K1318k283j9692J6832P825k2096Q695J6898
673A4448k1673m92K2696j7596j0140K5429j0261j8166K4765j289k3554J9901Q546
686A2614k5541J1642J6640k4882K379K2591k0528o474K4858j3399j3833K3664
698I731m201j9169J9010M458k0976J0791J2366j9906J915J7415j4877o771K0012
$$ y = [14977, -12219, -6901, 15921, -6225, -11444, 14773, 832, -13867, 10571, 7129, -14670, 4074, 11711, -13730, -2766, 14739, -9851, -8455, 16040, -3790, -12515, 14669, 2665, -15294, 10509, 7708, -16651, 4405, 12197, -15299, -1860, 15790, -11202, -7233, 17181, -5319, -11382, 15700, 71, -14396, 11132, 5149, -15350, 5595, 9601, -13841, -196, 13262, -9303, -5315, 14505, -4641, -9793, 12520, 708, -13049, 8269, 5986, -13706, 3126, 10951, -11145, -2450, 14448, -7225, -7717, 14979, -2617, -12757, 12672, 2411, -15755, 9010, 7721, -15833, 4068, 12614, -12927, -1285, 15355, -9527, -7148, 15443, -5085, -11559, 13299, -100, -13933, 9731, 5530, -13639, 5371, 9829, -11147, -356, 12010, -7896, -5981, 11434, -3443, -10214, 9798]
711I798p727j3918J8590L16j8155J3244Q607k0035N874J5749j8649k592K1015
724A2117j3578j1127K3424o978j7643K1645P31k2445J7062Q316k3401R752J5304
737A3179k2003J751K0432j7503o183K2674j1024j3204K1023l781j7232J6032L789
750G950j8460R746J0300j6474J717J5393j2355n725J6855o086j2888J5621Q05
763F399j6909J1387Q295j7999N164J5019j6649k266J9217j1842j0793K0683n510
776D196j7375J9794J267k1309J5562Q668k2261R524J4388k0074J856J8579j6044
789c229n828J9933r690j2760J8666k374j5952J4521M409j6663Q167J0311j4687
802e176M77J3811j0104p156J4933l748j2867J3519L428j6854R769J0092j7294
$$ y = [9798, 2071, -11847, 6743, 7059, -11096, 2148, 10755, -9280, -3406, 12343, -6306, -8898, 12117, -1461, -12588, 10836, 3858, -13785, 7860, 8591, -13854, 3208, 11524, -11877, -2125, 13179, -8824, -7073, 13359, -4144, -10327, 12347, 1323, -11881, 9142, 5361, -11871, 4161, 7950, -10510, -764, 9536, -6938, -5221, 10172, -2183, -7908, 8947, 2861, -10027, 5594, 6399, -10510, 877, 9172, -8827, -3663, 11356, -5293, -7559, 11658, -184, -10977, 9706, 4196, -13179, 6615, 7882, -13427, 2135, 10803, -11458, -1934, 12454, -7620, -5764, 12815, -3229, -9057, 10876, 1186, -11574, 7092, 4718, -11234, 3287, 7696, -8967, -800, 9511, -5176, -4699, 9112, -992, -8148, 6785, 3037, -9830, 3689, 7117, -9737, 32, 10124, -7170]
815g170L235J5426j5228m473J8586j0296j1463J9704m360j6725J8105K850j9911
828a1720J3261R306k0375P560J3504j8396Q38J6510j3309n994J7236p177j0679
841i435J5235o46j3827J1211M778j4148N345R550j2129j286J2381p411p117J2725
855E226j611j1734J1148M181j4948P200R919j5773J769J4266j3354l903J6949
868I335r385r509J7456l839j4503J5546K349j7794J2034P641j8467O804J2303
881I971j6003J060J4677j2078m312J4688o384r688J3049l97j2745R200N559j3228
895f631M252R974j1075j703J2380o772p406J2631j574j2279J0528M553j4863O627
909a358J0017j4938J623J4965j3357l884J6547r480r056J6144l783j3613J4030
$$ y = [-7170, -3935, 11491, -3737, -8210, 10376, 80, -11383, 8321, 3961, -12764, 5341, 8191, -11720, 1541, 10847, -9528, -1968, 11536, -6860, -6022, 10488, -2821, -8815, 8421, 1244, -9435, 5800, 5154, -8673, 2538, 7316, -6832, -1487, 8063, -4066, -5352, 7029, -382, -7499, 5226, 3615, -8119, 3029, 7210, -7738, -538, 9381, -6392, -4623, 9643, -3711, -7614, 9335, -50, -9559, 7897, 4058, -10445, 5101, 7450, -10344, 1690, 9331, -9136, -2332, 9971, -6032, -4972, 9705, -2373, -6685, 8003, 1619, -8069, 4980, 4583, -8162, 1038, 6597, -6631, -2379, 7595, -3480, -5183, 7197, 425, -6981, 5650, 4076, -8203, 2325, 6878, -7985, -1358, 8659, -6279, -4656, 10309, -3048, -6932, 9615, 135, -8921, 7223, 3440, -10173, 3857]
922C857K394j5775J0337P360j5697N203J1724j3932l42J3358r980n089J2600m503
936A515q971J0507J303j0838O423O660j1293J850J0288r617l273J1912n778p738
950g050J1359p83j1394R560M933j3148N504R341j3178O10J3359j1774m159J4843
964H023q043q319J4467l324j1623J2574J968j3040Q223O535j3299L317J0322j1649
978c868j131J1846p859n259J1616l111q443R264J715j0662N732O308j0612J079
992c385R763q461l574J1408n121p426J1367p03j0555Q836L876j2445N284Q472
1006G336j2342R24J1896j0439l813J3820o909p879J3057k318j0867J0753K036
1019E255j1954O621O307j1636K462R677r425k082J1472o520n996J0697k163r299
$$ y = [3857, 6251, -9524, 813, 8173, -7524, -2321, 9403, -4529, -4871, 8487, -1493, -6582, 6018, 1515, -7456, 3051, 4354, -6484, -61, 6599, -4694, -2844, 7444, -2173, -5446, 6466, 688, -7050, 4309, 3526, -7868, 1692, 6625, -6523, -1019, 8322, -4856, -4246, 9113, -2661, -6820, 8023, -20, -8339, 6128, 2804, -8819, 3755, 5723, -7317, 906, 7441, -5858, -2541, 7781, -3868, -4999, 6847, -1012, -6271, 5345, 2234, -6209, 3055, 4770, -5892, -160, 6148, -4464, -3385, 6378, -2083, -5657, 5751, 630, -6796, 4571, 3868, -6687, 2149, 6025, -6420, -1136, 7336, -5006, -4082, 7814, -2625, -6438, 7382, 473, -7406, 5651, 3333, -7534, 3219, 5255, -6699, -78, 6229, -5407, -2945, 6732, -2693, -4775, 6697, 177, -5819, 4878, 2715, -6584]
1033f584Q816K310j0518N477O207r356N39R520p329m104J1038m489p865J0299
1047C961m58j0648Q286M290j1343M728P772j0798N65J1010q894m006J1816n428
1061H53p689J1542k167r633R303K158j0515O219N991j0061J723Q643q109k877
1075d619J0224n270o076R456j396q154P585K740r444M884N559q385L04Q217o720
1090a095l931R907m097o996R587j36r493P958L515j0062M495O609r818P28Q648
1105E819p519l353J0134m721o736J0216o72r580Q589K708j0189N246N632r412
1119c838J096Q189p206k684R006l924o476R281m80q488P151L088r616M610N474
1134E183q564L77Q122o465l301R264l547o308Q409Q4q488O419L569r619L687O324
$$ y = [-6584, 2232, 4542, -5976, -499, 5708, -3648, -3109, 6411, -918, -5022, 6016, 1527, -6338, 3961, 3503, -7145, 1141, 5431, -5912, -1184, 6588, -4210, -3645, 7365, -1529, -5535, 6281, 853, -6836, 4706, 2539, -7094, 2209, 4367, -6148, 71, 6062, -3999, -2276, 6367, -1742, -4619, 5605, 335, -5741, 3715, 2319, -5835, 1750, 4490, -4954, -70, 5489, -2896, -2592, 5625, -1095, -5026, 4881, 784, -6212, 3375, 3239, -6254, 1704, 5219, -4843, -348, 6261, -3557, -2829, 5819, -1700, -5053, 5081, 360, -6376, 3840, 3168, -6412, 2177, 4885, -5304, -58, 5574, -3838, -2742, 5447, -1759, -4443, 4563, 639, -5837, 3444, 2964, -5524, 1627, 4715, -4901, -291, 5183, -3381, -3004, 5118, -1347, -4648, 4616, 1069, -5239, 3170, 3254, -5234, 1185, 4754, -4865, -1178, 5146]
1150E146q454K14Q348o265l691R315l308o607Q552J22q597O702K903r293L913
1165a000O044q389P48P459n882l171Q491l370n727P863k86q159O339L258q686
1180d468L674O025q392Q24P521o199k659Q094l543n602P459M9p915N716L533q346
1196d229L345N953p828N27P167n816l033P894k999n935P136K67p442N872L634
1211D513q876L536O040p833K84P218o112k927Q208l403n773P731n5p539N898L443
1227D353q365L485N350p588K59O921n684k582P392l088n018O889O04p432N313
1242H09L488p742K586N291o716l64O884m847l392P264j933n594O697Q36p413M573
1258D27L996q208K341O280p519m87P498n140l403Q028k521n651O973M08p111N075
$$ y = [5146, -3308, -3094, 5254, -1011, -4702, 4613, 1305, -5302, 3250, 3372, -5225, 1477, 4380, -4913, -1000, 5044, -3345, -2597, 4862, -1020, -4191, 4300, 930, -4797, 3066, 2780, -5379, 960, 4218, -4468, -794, 5231, -3161, -2337, 5184, -1015, -3674, 4420, 877, -4725, 2734, 2783, -5132, 584, 4117, -4229, -884, 5069, -2759, -2232, 4935, -881, -3914, 3980, 981, -4954, 2182, 2449, -4993, 879, 4513, -4363, -827, 5213, -2620, -2336, 4882, -1230, -4157, 4051, 648, -5125, 2606, 2551, -4988, 910, 4353, -4012, -527, 4823, -2765, -2506, 4415, -1269, -3851, 3541, 453, -4565, 2324, 2928, -4504, 809, 4297, -3445, -859, 4432, -2284, -2648, 4236, -611, -4003, 3261, 1328, -4266, 2431, 3267, -4146, 427, 4423, -3785, -1444, 4836, -2683, -3170, 4328, -812, -4215, 3813, 1292, -4359, 2614, 3022, -4089, 986]
1274I86K431p383K806N378p130J71O687m777k552P075k820m692O505n09n895M134
1290D15K951o617J553N736n939o45O343l831l208O512j705n515N595R53o805M079
1306a28L437o615J786N948o374p47P060m945l035P131k806n065O678j67o497M665
1322C26K942o692K664M640n609l02O103m848k404O353k406m487N425J29n434M101
1338E01K668n475J299M813n271j115O374l698l922O404j328n362N548R51o002
1353c615L959L443o626J466N727n964j141O845m854l393P510k526m911O345j0
1368B255n985M554K349n936K208M155n252m35N223l825k598N663j734l819M679
1383A502N56n026L257K670n028N63M411m055j472N412k721l391N848p19n643N284
$$ y = [986, 3417, -3966, -1160, 4218, -2912, -2741, 3946, -831, -3383, 3692, 872, -3820, 2685, 2176, -3719, 415, 3366, -3251, -1698, 4038, -1901, -2546, 3797, -34, -3242, 3270, 1565, -3950, 1645, 2598, -4207, -128, 3309, -3306, -1520, 4428, -1946, -2693, 4367, -578, -3613, 3518, 712, -4353, 2325, 2158, -4339, 326, 3268, -3424, -760, 3880, -1729, -2031, 4072, -776, -3180, 3173, 767, -3720, 1705, 1834, -3600, 501, 3169, -2306, -1007, 3806, -1465, -2580, 3794, 96, -3826, 2578, 1250, -4112, 1436, 2387, -3615, 344, 3787, -2839, -1373, 4354, -1610, -2751, 4094, -760, -4153, 3357, 831, -4080, 2265, 2255, -3730, 824, 3173, -2763, -555, 3600, -1652, -2087, 3136, -689, -3287, 2376, 642, -3177, 1502, 2058, -2968, 289, 2959, -2069, -1506, 2905, -1150, -2622, 2790, 69, -3322, 2526, 1807, -3836, 1448]
1399A448J358o261L406L497o222J135N441n293j312O356l949k763O412j981m746
1414c474N346L40n660M125J934n570K051L944m655m47N265l124k605N054j449
1429A075l983M307N68m876K782K787m875R97M290l863j574N491k392l611N094
1444B217l59n464M627J579n987L200L613o205J460N004m979r59N456l046l635
1459c478N958j498m587N100J79m973L739K335n023J561L459l794n97M078k412
1474D7k566M400j067l612L729J018m194K258K450m048K35M022l048j885M693j790
1490F42l804M617J30m938M260J571n617K910L568n421Q38M726m883j007N241l261
1506d28k539N359j251m271M790M20m704L185J690m398J594K978l832J30L251k030
$$ y = [1448, 2806, -3455, -49, 3448, -2774, -1639, 3802, -1491, -2803, 3553, -396, -3159, 3253, 1272, -3474, 1872, 2212, -3448, 677, 2611, -2959, -908, 3036, -1619, -2066, 3199, 75, -2530, 2524, 1075, -2908, 1399, 1967, -2909, -127, 2660, -2215, -1218, 3072, -791, -2365, 3126, 734, -2877, 2217, 1858, -3606, 1021, 2600, -3387, -187, 3426, -2779, -1319, 3685, -1294, -2253, 3203, 157, -3478, 2480, 982, -3605, 1495, 1674, -3299, 440, 2775, -2248, -687, 2772, -1022, -1619, 2459, 47, -2519, 1881, 814, -2798, 931, 1949, -2245, 13, 2463, -1585, -1350, 2672, -376, -2261, 2432, 642, -3162, 1455, 1585, -3353, 907, 2478, -3139, -229, 3339, -2082, -1244, 3482, -1401, -2408, 2833, -428, -2967, 2392, 1141, -3130, 1660, 2080, -2624, 561, 2251, -2147, -553, 2425, -1407, -1277, 1974, -56]
1522e6k084L744p19l026K912J377m323J696K767l797J27L915l099j855M590j625
1538E44l375M576Jm576L983J036n206K810L294n309P44M159m058n83M796l168
1554c32k209M777j332l599L926M39m269K596K099m097J079L400l421n68L509j659
1570C39k205L226j00l570K767J230l594J133L198l728k06M217k938j982M684k109
1586C62l120M390j81m346L349J640m573K180L205n005J152M029m016p05M212k811
1602b38k003M159j348k889L210N78l675K251K009l465M94L256l023p63L328j682
1618A99k242L042q5k999K414J600l530J083K806l189p02L944k717j660M074j743
1634B95l183M183Q1l985L400J283m340K040L022m627P93L648l770o71M317k613
$$ y = [-56, -2140, 1604, 885, -2141, 771, 2148, -2175, -479, 2288, -1509, -1382, 2533, -566, -2421, 2169, 544, -2831, 1745, 1746, -2830, 1153, 2189, -3017, -207, 3087, -2222, -1478, 2681, -1377, -1960, 2836, -332, -2541, 2236, 904, -2695, 1231, 1670, -2599, -3, 2096, -2001, -922, 2478, -943, -1511, 1998, 339, -1866, 1360, 1260, -2310, 457, 1687, -1907, -774, 2424, -1304, -1510, 2707, -231, -2213, 2471, 362, -2758, 1632, 1451, -2895, 454, 2094, -2479, -299, 2906, -2099, -947, 3082, -934, -1639, 2573, -238, -2241, 1918, 570, -2319, 891, 1469, -2206, 45, 2054, -1411, -917, 2339, -684, -1447, 1881, 199, -2043, 999, 914, -2085, 329, 1929, -1601, -518, 2288, -901, -1603, 2341, -376, -2036, 2038, 295, -2888, 1295, 1376, -2609, 791, 2074, -2266, -226, 2796, -1831, -1038, 2610, -1160, -1831, 2486, -127]
1650a27j798L597q81k807K997L70l031J774J706k809r8L050k327j273L005q67
1666D81k377L029J45k877J832J467l209M86L034l116o73L789k347j772M080j106
1682H66l209L860j64l509K642J395l844J334K589l193R5L400k876q78L447j821
1698A34j939L196m32k721K360N07k860J495J891k820J57K590j676j321K875j044
1714C92k107K375M22k992K018J639k936M46K702k754n44L400j973j901L469j130
1730E26k933L499j98l194K856J087l306J314K326l062J75K878k524j008L084j236
1746B84k297L139l47k730K307R14k579J226J752k330l08K674j965j351K743p14
1762D18k110K237M86l034K219J250k714Q69K256k460q88L146j728j568L056r98
$$ y = [-127, -1925, 1672, 791, -2016, 981, 1351, -1680, 94, 1800, -1009, -1107, 1943, -384, -1657, 1348, 481, -1896, 1133, 1278, -1599, 233, 1700, -1509, -1023, 2011, -1105, -1778, 2011, -336, -2108, 1972, 866, -2343, 1517, 1353, -2156, 486, 1881, -1963, -629, 1960, -1233, -1138, 2262, -614, -1492, 1955, 134, -1805, 1391, 959, -1762, 598, 1105, -1755, -260, 1631, -1189, -1032, 1558, -118, -1439, 1436, 392, -1715, 660, 1082, -1910, 108, 1747, -1189, -743, 1959, -795, -1339, 2061, 88, -1813, 1656, 526, -2407, 1092, 894, -2300, 556, 1643, -1663, -349, 1977, -1085, -910, 1968, -556, -1564, 1520, 284, -2013, 1126, 779, -1951, 356, 1270, -1309, -83, 1669, -661, -969, 1705, -260, -1611, 1132, 418, -1692, 545, 1031, -2003, 216, 1466, -1248, -379, 1877, -583, -1471, 1675, -53, -1621, 1435, 437]
1778D37k722L326K46l245K229J506l202J160K096k901Q0K633k078j149L059j119
1794C56j800K234L03k454J599J195k594P02J972k270j37K205j343j308K701n66
1810G95k216K341M23k900J458J476k691O66K225k214q44L035j764j491K993p13
1826E79k324K585J40k764J996J204k761Q04K184k347k93K601j641j202K549n50
1842G60k207J903N09k490J441J103k252J095J801k262k54K281j087j578J909p9
1858E93k088J980P25k525J303J451k705O69K385k394m64K511j806r71K186k27
1874F23k419K414P11k808J658J270k496O31K143k299j74J933j293j044K121o19
1890C52j810K042K62k409J446J630k415K36K068j819n97K316j293j510K327l77
$$ y = [437, -2285, 1041, 1287, -1958, 271, 1777, -1425, -265, 1831, -1070, -990, 1643, -435, -1584, 1475, 356, -1444, 790, 1093, -1361, 238, 1433, -1161, -459, 1513, -757, -894, 1311, -32, -1340, 1361, 795, -1421, 920, 1343, -1557, -99, 1377, -1314, -648, 1577, -637, -1481, 1554, -210, -1701, 1292, 579, -1745, 840, 980, -1784, 212, 1416, -1345, -541, 1643, -704, -997, 1604, -37, -1239, 1310, 760, -1447, 456, 965, -1525, -84, 1019, -1233, -138, 1663, -599, -853, 1428, 341, -1237, 672, 593, -1495, 485, 1210, -1315, -12, 1439, -1266, -597, 1788, -606, -1070, 1441, -365, -1336, 850, 623, -1796, 618, 1329, -1479, 179, 1449, -1047, -416, 1727, -572, -746, 1187, -106, -1150, 971, 352, -1458, 584, 846, -1563, -117, 1513, -902, -666, 1402, -417, -1014, 1302, 9, -1501, 826, 449]
1906D49j750J910L24j985R59J806k530j90K432k102n03K343j364j142K018j87
1922D88j887J711Q97k275P65J756k398N7K193j700q19K376r99j390K055j99j850
1939a219J648P25k214J109J204k272J94K391k361n05K450j056j028J822k85j571
1955i68J438N64k154J026J628k525M59J691j749m09K167r69j071J644L6j896J166
1972G8R03k176R11J547k225K8K238j555q31K309r71j562K116L61k359J132R74
1989I18j970P04J804k329J69K146j717q01K219r97j356J987l92j515J429L40j916
2006a277J085J281j659J13J704j423q17K067r41j173J559m5j638J333R00k133
2022a064P25J631j663k91J873j531p82K082r78j422K123l15j535J626M86j570
$$ y = [449, -1301, 609, 933, -1052, -93, 1713, -817, -1007, 1425, -677, -1180, 1163, -201, -1343, 675, 488, -1399, 312, 1209, -1066, -301, 1455, -943, -886, 1307, -393, -1212, 1164, 165, -1225, 830, 631, -1219, 429, 1154, -1060, 49, 1253, -1019, -825, 1566, -795, -1300, 1150, 94, -934, 888, 603, -968, 470, 1034, -1120, -94, 1534, -991, -532, 1159, -590, -999, 1168, 199, -872, 772, 808, -1088, 78, 981, -1195, -284, 1263, -962, -934, 1304, -251, -1082, 1227, 256, -1306, 810, 1171, -1188, -56, 918, -1052, -348, 1456, -873, -704, 1442, -275, -1076, 1143, 146, -1210, 777, 385, -1130, 299, 639, -1277, -192, 1089, -570, -457, 1247, -176, -993, 1074, 133, -1040, 519, 474, -1164, 169, 1069, -1064, -339, 1292, -371, -662, 1211, -320, -1102, 980, 2, -1420, 703, 388, -1147, 479, 965, -605]
2038f05N19J408j943R9J515j389m81J875j092j048J887j69j620J483N75j719N12
2055a93J231j651J28J496j044r20J829r33r85J664K48j797J144P82j809N32J561
2072A283j568m36J806j166r40K255j080j527J984m1j729J457N69j923R64J250
2088A158j960J34J478r47q23J676o84r77J570K32j819J388M51j613N66J108j428
2105d90r3J324q59o49J351j24j376J555J69j833J040Q66j668L79J401j561j39
2122g07J749j041j029J981m76j777J725M70j841J119O28j711P19J101j630K56
2138d64J589j235l82J278o42j235J371J82j455R70L84r82N60J024j242k42J527
2155A006r28q42J538m20j437J461L09j587N51J433j719K93J243j281l59J781j223
$$ y = [-605, -86, 1322, -621, -522, 993, -396, -877, 998, -94, -1142, 745, 576, -1044, 439, 1014, -705, -193, 1038, -613, -485, 1011, -33, -953, 876, -57, -1042, 622, 870, -927, 217, 999, -810, -278, 1283, -285, -721, 1085, -81, -1021, 1234, 154, -1373, 611, 570, -1159, 298, 867, -1056, -92, 1158, -802, -668, 810, -137, -960, 716, 32, -945, 625, 857, -962, 426, 877, -736, -170, 938, -490, -583, 741, -118, -767, 584, 460, -916, 639, 808, -1025, 15, 881, -787, -408, 993, -568, -707, 1042, 1, -1028, 953, 477, -1300, 425, 895, -946, 173, 801, -910, -191, 910, -720, -464, 1125, -110, -492, 786, 144, -1091, 280, 462, -993, -23, 361, -621, -61, 963, -279, -521, 1006, 78, -764, 774, 354, -1083, 378, 687, -900, -349, 1084, -635, -342, 901, -380, -739, 1042, -181]
2172a81q26J797l84j570J237M88j594J288P07j943R09R99j520J01J212r65m85
2189g30J471m48q75Q02M53j351Q63N87j407M9J456j401k07J418q65n22J270j37
2207D26j467J282N43j764J014Q99j671L90J643j935l09J538n78j200J859k35j470
2224a035J473L64j687J069P38k014Q31J216j606k4J572r70m03J174k03j224J082
2241C53J4j007L91R55j106R7J024q36l26J367o11r63J289j09j229Q47O47j580
2259g83P17Q84j510O0J654j395l09J714j046q55J833o16j223J272O1j585Q03J037
2277G13j266K98J100j025m08J301p59n53J123m46o25O78K13j103O31Q36j150K00
2295b42J183r16m62J012o53q28J457j77j266Q20P44j320M42J157j456K24J374
$$ y = [-181, -1007, 790, 406, -1164, 73, 561, -1033, 255, 962, -981, -72, 927, -593, -492, 720, -245, -730, 741, 293, -582, 220, 673, -678, 185, 772, -635, -586, 870, -531, -738, 680, -185, -707, 563, 426, -1041, 241, 784, -980, 34, 933, -738, -348, 1295, -640, -949, 589, 11, -1189, 670, 435, -1035, 438, 802, -885, 184, 922, -1092, -261, 955, -651, -675, 897, -73, -476, 698, 495, -729, 353, 367, -640, -249, 706, -400, -303, 721, -115, -441, 926, 315, -648, 641, 532, -697, 150, 797, -783, -66, 818, -692, -632, 1022, -373, -682, 1032, -14, -869, 964, 348, -875, 397, 458, -1127, -324, 713, -553, -255, 845, -180, -588, 713, -46, -599, 524, 78, -547, 131, 344, -759, -128, 708, -442, -242, 941, 25, -437, 575, -78, -906, 551, 374, -892, -72, 672, -648, -206, 951, -505, -281, 1093]
2312A093j530k24J663r96p27J474o04r16J196J63j328Q71O53j414L65J199j050
2329a12o02J240o22o74J504o97o61J001J91j171O58M46o75k60P64m36o64J080
2347C10j26p43Q55K8o51L45P06j404N00P77j212J85J023q35m66J719j096o58J568
2366H25m73j370J285K78j113Q43Q7q71K66R06j267K93R84r16m24J212l63q50J020
2385C52j19q40N21P15r06j10J244q09m77R86l75r02J063K2j234J089L08j320P66
$$ y = [1093, -437, -661, 1002, 6, -721, 753, 149, -767, 429, 592, -736, 135, 788, -626, -261, 938, -112, -714, 526, -96, -770, 734, 37, -624, 377, 568, -603, 55, 501, -174, -434, 330, -106, -770, 310, 184, -559, 296, 324, -327, 18, 724, -680, -180, 597, -615, -430, 593, -242, -708, 1011, -85, -743, 825, 352, -1018, 267, 545, -568, 275, 362, -509, -243, 663, -604, -311, 673, -243, -667, 545, 182, -668, 352, 233, -607, -86, 629, -277, -387, 857, 48, -429, 557, 182, -720, 343, 365, -869, 220, 528, -792, -26]
$$ [...]
8191g
##END NTUPLES=NMR FID
##END=
