##TITLE=1H_B1d3010-1
 CDCl3
 8 sc, 
 30.10.2024
##JCAMPDX= 6.0         $$ Bruker NMR JCAMP-DX V2.0
##DATA TYPE= NMR FID
##DATA CLASS= NTUPLES
##ORIGIN= UXNMR, Bruker Analytische Messtechnik GmbH
##OWNER= root
$$ XWIN-NMR		Version 3.5
$$ Wed Oct 30 15:58:27 2024 Russian Standard Time (UT+4h)  she@DPX200
##.OBSERVE FREQUENCY= 200.1318
##.OBSERVE NUCLEUS= ^1H
##.DELAY= (6, 6)
##.ACQUISITION MODE= SIMULTANEOUS
##.ACQUISITION SCHEME= undefined
##.AVERAGES= 8
##.DIGITISER RES= 18
##SPECTROMETER/DATA SYSTEM= spect
##.PULSE SEQUENCE= zg30
##.SOLVENT NAME= DMSO
##.SHIFT REFERENCE= (INTERNAL, DMSO, 0, 15.7039)
##AUDIT TRAIL= $$ (NUMBER, WHEN, WHO, WHERE, WHAT)
$$ ##TITLE= Audit trail, XWIN-NMR		Version 3.5
$$ ##JCAMPDX= 5.01
$$ ##ORIGIN= Bruker BioSpin GmbH
$$ ##OWNER= she
$$ F:/spectra/data/she/nmr/H-F/1/audita.txt
$$ ##AUDIT TRAIL=  $$ (NUMBER, WHEN, WHO, WHERE, WHAT)
(   1,<2024-10-30 15:57:24.31 +0400>,<she>,<DPX200>,
      <created by zg, POWCHK disabled, PULCHK disabled
       configuration hash MD5:
       00 E9 B6 7A A2 85 ED C7 34 08 36 98 17 FE 4E 26
       data hash MD5: 16K
       DA C8 FA A3 E1 E6 5E 4E E9 CB BC CF 4E D4 3C 04>)
$$ ##END=
$$ 
$$ hash MD5
$$ 98 CD 91 40 6E A9 28 39 46 9F 25 7C 9E 19 3B C7
##$RELAX= 
##$RELAX= 
##$RELAX= 
##$RELAX= 
##$RELAX= 
##$RELAX= 
$$ Bruker specific parameters
$$ --------------------------
##$DU= <F:/spectra>
##$EXPNO= 1
##$NAME= <H-F>
##$PROCNO= 1
##$TYPE= <nmr>
##$USER= <she>
##$AMP= (0..31)
100 100 100 100 100 100 100 100 100 100 100 100 100 100 100 100 100 100 
100 100 100 100 100 100 100 100 100 100 100 100 100 100 
##$AQSEQ= 0
##$AQ_mod= 1
##$AUNM= <au_zg>
##$AUTOPOS= <>
##$BF1= 200.13
##$BF2= 200.13
##$BF3= 200.13
##$BF4= 200.13
##$BF5= 200.13
##$BF6= 200.13
##$BF7= 200.13
##$BF8= 200.13
##$BYTORDA= 1
##$CFDGTYP= 0
##$CFRGTYP= 5
##$CHEMSTR= <none>
##$CNST= (0..31)
1 1 145 1 1 1 1 1 1 1 1 1 1 1 1 1 1 1 1 1 1 1 1 1 1 1 1 1 1 1 1 1 
##$CPDPRG= <>
##$CPDPRG1= <>
##$CPDPRG2= <>
##$CPDPRG3= <>
##$CPDPRG4= <mlev>
##$CPDPRG5= <mlev>
##$CPDPRG6= <mlev>
##$CPDPRG7= <mlev>
##$CPDPRG8= <mlev>
##$CPDPRGB= <>
##$CPDPRGT= <>
##$D= (0..31)
0 1.2 0 0 0 0 0 0 0 0.06 0 0.03 0 0 0 0 0.0002 0 0 0 0 0 0 0 0 0 0 0 0 
0 0 0 
##$DATE= 1730289443
##$DBL= (0..7)
120 120 120 120 120 120 120 120 
##$DBP= (0..7)
150 150 150 150 150 150 150 150 
##$DBP07= 0
##$DBPNAM0= <>
##$DBPNAM1= <>
##$DBPNAM2= <>
##$DBPNAM3= <>
##$DBPNAM4= <>
##$DBPNAM5= <>
##$DBPNAM6= <>
##$DBPNAM7= <>
##$DBPOAL= (0..7)
0.5 0.5 0.5 0.5 0.5 0.5 0.5 0.5 
##$DBPOFFS= (0..7)
0 0 0 0 0 0 0 0 
##$DE= 6
##$DECBNUC= <off>
##$DECIM= 24
##$DECNUC= <off>
##$DECSTAT= 4
##$DIGMOD= 1
##$DIGTYP= 9
##$DL= (0..7)
0 120 120 120 120 120 120 120 
##$DP= (0..7)
150 150 150 150 150 150 150 150 
##$DP07= 0
##$DPNAME0= <>
##$DPNAME1= <>
##$DPNAME2= <>
##$DPNAME3= <>
##$DPNAME4= <>
##$DPNAME5= <>
##$DPNAME6= <>
##$DPNAME7= <>
##$DPOAL= (0..7)
0.5 0.5 0.5 0.5 0.5 0.5 0.5 0.5 
##$DPOFFS= (0..7)
0 0 0 0 0 0 0 0 
##$DQDMODE= 0
##$DR= 18
##$DS= 0
##$DSLIST= <SSSSSSSSSSSSSSS>
$$ [...]
##$SUBNAM2= <"">
##$SUBNAM3= <"">
##$SUBNAM4= <"">
##$SUBNAM5= <"">
##$SUBNAM6= <"">
##$SUBNAM7= <"">
##$SUBNAM8= <"">
##$SUBNAM9= <"">
##$SW= 24.0689170037331
##$SWIBOX= (0..15)
0 0 2 0 0 0 0 0 0 0 0 0 0 0 0 0 
##$SW_h= 4816.95568400771
##$TD= 16384
##$TD0= 1
##$TE= 0
##$TE2= 300
##$TE3= 300
##$TEG= 300
##$TL= (0..7)
0 120 120 120 120 120 120 120 
##$TP= (0..7)
150 150 150 150 150 150 150 150 
##$TP07= 0
##$TPNAME0= <>
##$TPNAME1= <>
##$TPNAME2= <>
##$TPNAME3= <>
##$TPNAME4= <>
##$TPNAME5= <>
##$TPNAME6= <>
##$TPNAME7= <>
##$TPOAL= (0..7)
0.5 0.5 0.5 0.5 0.5 0.5 0.5 0.5 
##$TPOFFS= (0..7)
0 0 0 0 0 0 0 0 
##$TUNHIN= 0
##$TUNHOUT= 0
##$TUNXOUT= 0
##$USERA1= <user>
##$USERA2= <user>
##$USERA3= <user>
##$USERA4= <user>
##$USERA5= <user>
##$V9= 5
##$VALIST= <valist>
##$VCLIST= <CCCCCCCCCCCCCCC>
##$VD= 0
##$VDLIST= <DDDDDDDDDDDDDDD>
##$VPLIST= <PPPPPPPPPPPPPPP>
##$VTLIST= <TTTTTTTTTTTTTTT>
##$WBST= 1024
##$WBSW= 4
##$XGAIN= (0..3)
0 0 0 0 
##$XL= 0
##$YL= 0
##$YMAX_a= 264769
##$YMIN_a= -298344
##$ZGOPTNS= <>
##$ZL1= 120
##$ZL2= 120
##$ZL3= 120
##$ZL4= 120
##$ABSF1= 10
##$ABSF2= 0
##$ABSG= 5
##$ABSL= 3
##$ALPHA= 0
##$AQORDER= 0
##$ASSFAC= 0
##$ASSFACI= 0
##$ASSFACX= 0
##$ASSWID= 0
##$AUNMP= <proc_1d>
##$AZFE= 0.1
##$AZFW= 0.1
##$BCFW= 1
##$BC_mod= 2
##$BYTORDP= 1
##$COROFFS= 0
##$CY= 11.3945322036743
##$DATMOD= 1
##$DC= 2
##$DFILT= <>
##$DTYPP= 0
##$F1P= 15.6554695791079
##$F2P= 12.8336369535428
##$FCOR= 0.5
##$FTSIZE= 0
##$FT_mod= 4
##$GAMMA= 1
##$GB= 0.15
##$INTBC= 1
##$INTSCL= 1
##$ISEN= 128
##$LB= 0.24
##$LEV0= 0
##$LPBIN= 0
##$MAXI= 10000
##$MC2= 0
##$MEAN= 0
##$ME_mod= 0
##$MI= 1.114404
##$NCOEF= 0
##$NC_proc= 0
##$NLEV= 6
##$NOISF1= 3.799351
##$NOISF2= 2.8
##$NSP= 1
##$NTH_PI= 0
##$NZP= 0
##$OFFSET= 15.70392
##$PC= 1
##$PHC0= -26356.27
##$PHC1= 23.78743
##$PH_mod= 1
##$PKNL= yes
##$PPARMOD= 0
##$PSCAL= 0
##$PSIGN= 0
##$REVERSE= no
##$SF= 200.130013532006
##$SI= 16384
##$SIGF1= 3
##$SIGF2= 2
##$SINO= 400
##$SIOLD= 16384
##$SREGLST= <1H.CDCl3>
##$SSB= 0
##$STSI= 0
##$STSR= 0
##$SW_p= 3612.71676300578
##$SYMM= 0
##$S_DEV= 0
##$TDeff= 0
##$TDoff= 0
##$TI= <>
##$TILT= no
##$TM1= 0
##$TM2= 0
##$TOPLEV= 0
##$USERP1= <user>
##$USERP2= <user>
##$USERP3= <user>
##$USERP4= <user>
##$USERP5= <user>
##$WDW= 1
##$XDIM= 8192
##$YMAX_p= 0
##$YMIN_p= 0
$$ End of Bruker specific parameters
$$ ---------------------------------
##NTUPLES= NMR FID
##VAR_NAME=  TIME,          FID/REAL,        FID/IMAG
##SYMBOL=    X,             R,               I
##VAR_TYPE=  INDEPENDENT,   DEPENDENT,       DEPENDENT
##VAR_FORM=  AFFN,          ASDF,            ASDF
##VAR_DIM=   8192,          8192,            8192
##UNITS=     SECONDS,       ARBITRARY UNITS, ARBITRARY UNITS
##FACTOR=    0.0002076,     1,               1
##FIRST=     0,             0,               0
##LAST=      1.7004516,     0,               0
##MIN=       0,             -298344,         0
##MAX=       1.7004516,     264769,          0
$$ Real data points
##PAGE= N=1
##DATA TABLE= (X++(R..R)), XYDATA
0 0 0 0 0 0 0 0 -8 8 -8 8 -8 16 -16 24 -24 32 -40 48 -56 64 -78 92 -108 124 -142 164 -188 214 -244 274
30 274 -312 351 -394 442 -492 550 -614 683 -757 839 -930 1032 -1141 1265 -1398 1548 -1716
47 -1716 1908 -2126 2373 -2658 2996 -3402 3898 -4516 5315 -6388 7910 -10233 14194 -35119
61 -35119 264769 3023 -232782 241281 9481 -274386 164993 148248 -226941 74573
71 74573 141603 -210694 -16065 198937 -103335 -74953 146252 -47724 -120156 121466 50324
82 50324 -121756 33803 89655 -109414 -30148 134785 -59718 -101151 138981 -2678 -145877
93 -145877 124231 57465 -175839 89687 115461 -183786 31346 150052 -171167 -13006
103 -13006 190015 -137497 -73021 189688 -96311 -103648 196645 -45638 -146026 154015 -4383
114 -4383 -150604 130785 46842 -155637 68102 76283 -124255 32975 105606 -95034 -30861
125 -30861 98239 -44319 -58826 86982 2705 -93341 44979 58246 -85153 4383 98718
136 98718 -74940 -55678 125890 -33395 -105867 125853 7779 -150989 109926 66994 -170510
147 -170510 71671 116108 -169364 24286 158562 -148027 -35765 174952 -108669 -85225
157 -85225 174596 -59374 -126217 150462 -1364 -138602 112952 46729 -137680 59433
167 59433 83811 -110024 4774 96764 -75074 -45973 95901 -20901 -76902 72832 27791
178 27791 -92974 37329 75367 -87340 -12804 101843 -67385 -61642 117962 -29089 -104658
189 -104658 112315 16193 -131204 94347 63335 -144454 56681 100404 -139349 13641
199 13641 126183 -118410 -32129 137203 -81337 -68002 133950 -38971 -94722 113535 3509
210 3509 -106309 79557 37763 -103544 38958 63173 -82360 -1634 75553 -49825 -36052
221 -36052 74569 -10741 -62595 55923 25663 -76483 27272 58749 -75277 -8340 83115
232 83115 -57805 -42636 97016 -29728 -75625 95329 3682 -100633 80242 36991 -115392
243 -115392 54076 68840 -113672 23181 93804 -97999 -11270 107186 -71869 -43908 106141
254 106141 -40210 -71200 91426 -4977 -85381 66605 28739 -84347 35527 55058 -69853
265 -69853 81 67949 -45084 -34421 66980 -12699 -61042 53164 23173 -74086 29597
276 29597 56538 -73022 -1321 80812 -59125 -35992 91530 -34896 -68781 88851 -3280
287 -3280 -91639 74987 31450 -101459 51548 62143 -98773 20819 82379 -85155 -12067
298 -12067 90536 -61044 -40994 87306 -30243 -60498 74080 2413 -69638 51576 29948
309 29948 -68466 22574 48963 -56931 -7765 57715 -35499 -33648 57352 -7095 -52524 46773
321 46773 22248 -63163 26664 47548 -64470 196 65690 -55237 -26732 76372 -35269
332 -35269 -50625 77316 -8909 -69563 67395 18365 -81566 47649 42792 -83484 22236
343 22236 62170 -73452 -4291 74114 -53431 -28350 75193 -27785 -48582 64474 -499
354 -499 -61091 44213 24873 -62690 19236 45184 -52431 -6608 57042 -32845 -30831 57517
366 57517 -8670 -50546 46351 16913 -62053 27566 41033 -62469 4750 60358 -52184 -18801
378 -18801 70384 -34728 -41702 69633 -12852 -59690 58788 11328 -69373 41648 34471 -68411
390 -68411 20671 52519 -59158 -2887 61558 -43451 -25206 60817 -23033 -42755 51866 748
402 748 -51966 36626 24066 -52128 16350 41492 -45002 -6768 51182 -31133 -29169 51782 -11122
415 -11122 -46114 44775 12129 -54884 30269 34835 -55840 9720 51795 -49580 -14033 60573
427 60573 -35516 -35221 61446 -15037 -50601 54150 8579 -58849 38975 29713 -59659 17718
439 17718 45243 -52769 -5024 54030 -38139 -25250 55186 -17802 -39911 48065 4278 -48418
451 -48418 32942 23803 -49724 12632 38915 -43280 -8268 48061 -29083 -26388 49758 -10269
463 -10269 -40108 42889 9161 -48806 28638 27017 -50663 10206 41487 -43979 -8737 50602
475 50602 -30909 -25860 53059 -13612 -40163 46139 4699 -49707 32458 22564 -51118 14781
487 14781 37981 -44481 -3783 48015 -31702 -21943 49753 -15038 -36969 43393 2928 -46234
499 -46234 30452 21216 -47624 13947 36589 -40661 -4964 45914 -28575 -22830 47203 -13043
511 -13043 -37642 40679 4882 -45750 28538 22275 -45631 12791 37092 -39135 -5418 44589
523 44589 -27773 -23157 45075 -12385 -36531 39002 4842 -43350 28084 21922 -43363 12948
535 12948 35128 -37869 -4699 42135 -27761 -21724 43004 -13270 -34472 38569 3902 -41197
547 -41197 29058 19785 -42174 14585 32245 -37781 -2742 39172 -28271 -18949 41123 -14084
559 -14084 -30946 37592 2707 -37847 27741 17950 -39723 13140 29447 -35672 -3919 36887
571 36887 -25548 -19405 39263 -10794 -31358 35653 5633 -38910 25650 20542 -41069 10514
583 10514 31952 -36497 -5408 39413 -25773 -20381 42054 -11471 -31940 37906 3948 -39666
595 -39666 27678 17544 -41603 13974 28699 -36896 -705 36046 -26419 -14255 37844 -13146
607 -13146 -26089 33727 413 -33759 24315 13461 -35268 11919 24632 -30464 -1642 32359
619 32359 -21063 -15252 34008 -8959 -27181 29918 4170 -34975 21276 17402 -36614 10223
631 10223 29107 -32719 -3016 36819 -23863 -16960 38353 -12506 -29403 34603 756 -36546
643 -36546 26643 14635 -38419 15591 26124 -34330 2265 32907 -26397 -11786 34078 -14779
655 -14779 -23513 30627 -812 -30260 22810 12884 -31438 11868 23688 -28007 -2079 29536
667 29536 -19909 -15746 30667 -8452 -26381 27607 5307 -32278 20545 18395 -34301 9047
679 9047 28444 -31337 -3826 33894 -23808 -16289 35249 -12459 -25930 32701 584 -31889
691 -31889 25924 12302 -33906 15084 21378 -31780 2893 27133 -24662 -8667 29466 -13743
703 -13743 -17923 27287 -1040 -24234 20193 9971 -27312 9754 19402 -24959 -2067 25653
715 25653 -17746 -13040 28189 -7452 -22496 25797 4778 -29539 18850 15651 -32823 8609
727 8609 25334 -30061 -2516 31893 -23005 -13185 34371 -12663 -22850 31320 -1525 -29874
739 -29874 24094 9381 -32152 14744 18846 -29374 4265 25305 -22111 -6410 27301 -12832
751 -12832 -16164 24132 -2144 -22552 17107 8684 -24564 8212 18312 -21639 -1551 24427
763 24427 -15759 -12524 26059 -7102 -21621 23135 3206 -28029 17288 14670 -29710 8995
775 8995 24173 -27396 -943 29708 -21896 -11863 31211 -13725 -20781 28850 -3348 -26374
787 -26374 23187 7945 -27911 14672 17097 -26152 4046 22535 -20761 -6537 23909 -12288
799 -12288 -15199 21690 -1295 -19823 15937 9631 -21833 7353 18001 -19884 -3388 23176
811 23176 -14672 -13598 24749 -6058 -21373 22812 4442 -26089 16955 14448 -27715 8287
823 8287 21782 -26361 -1846 26811 -20756 -10573 28734 -12523 -17757 26866 -2860 -22458
835 -22458 21051 5770 -24337 12561 13585 -22967 3324 18650 -17229 -4962 20720 -9524
847 -9524 -12167 19122 -457 -17690 13361 7856 -19916 5404 15532 -18575 -3472 21163 -12976
860 -12976 -11523 23499 -5618 -18983 21830 2755 -24299 16384 10980 -26394 8672 18920
872 18920 -24515 629 24526 -19018 -7969 26220 -12255 -15216 24173 -4045 -20711 18650
884 18650 4663 -21769 11635 12415 -19716 3355 17499 -15183 -5182 18690 -8376 -12906 16803
897 16803 -597 -17295 12291 8003 -18659 5864 15743 -16733 -2338 20215 -12722 -10832 21664
910 21664 -6688 -18104 20404 1323 -22291 16288 9532 -23185 9902 16333 -21845 2013
922 2013 20704 -18087 -6687 22088 -11952 -13128 21278 -3921 -17144 17434 3945 -18761
934 -18761 10747 10641 -17538 2654 14922 -13679 -5444 16749 -7352 -12072 16269 447 -16291
947 -16291 12442 8162 -18028 5603 14335 -17079 -2211 18485 -13161 -9590 20662 -6527 -15682
960 -15682 20017 684 -19985 15928 7734 -21797 9549 13654 -20785 1794 17655 -16305
972 -16305 -4953 19945 -9988 -11048 19010 -3168 -15201 14977 3430 -17493 8825 9499 -16255
985 -16255 2020 13878 -11916 -4585 15987 -6042 -10871 14975 143 -15458 11319 6480 -17362
998 -17362 6054 12443 -16213 -151 17149 -12343 -7050 19178 -6925 -13434 18120 -959 -18147
1011 -18147 14549 5863 -19785 9574 11852 -18071 3316 15976 -14544 -3934 17653 -9614
1023 -9614 -10482 16427 -3159 -14761 13474 3629 -16070 8611 9448 -14936 2376 13724 -11636
1036 -11636 -4740 15363 -6567 -10907 14341 -409 -14810 11529 6643 -16246 6772 12054 -15518
1049 -15518 447 15359 -12611 -6130 16945 -7644 -11930 16319 -1169 -15458 13766 5156
1061 5156 -16883 9186 10383 -16741 2931 13799 -13852 -3452 15478 -8687 -8973 15324 -2470
1074 -2470 -12630 12504 4030 -14777 7741 8954 -14528 1710 12185 -11569 -4308 14310 -6721
1087 -6721 -9280 14114 -459 -13217 11413 5289 -15603 6379 10260 -15136 761 14057 -12253
1100 -12253 -4492 15915 -6898 -9815 15485 -1365 -13716 12118 4544 -16094 7501 9210 -15367
1113 -15367 2330 12920 -12340 -3099 14737 -7278 -8309 14064 -2044 -12346 11158 3216
1125 3216 -14378 6976 8535 -13622 2009 12346 -10743 -3292 13936 -6557 -8422 13064 -1642
1138 -1642 -12547 10754 3872 -14183 6621 9063 -13627 2035 12929 -11222 -3389 14020 -7467
1151 -7467 -8558 13293 -2133 -12335 11081 3521 -13897 7490 8804 -13409 2506 12048 -11163
1164 -11163 -3125 13516 -7544 -8313 12913 -2548 -11819 10949 3343 -13219 7098 8640 -12924
1177 -12924 2024 11685 -11015 -3534 12645 -7254 -7908 12463 -2155 -11205 10568 3851 -12581
1190 -12581 6842 8063 -12595 1760 11138 -10961 -3219 12696 -6863 -7464 12495 -1722 -10551
1203 -10551 10368 3188 -12343 6705 7609 -12606 1645 10823 -10565 -2930 12995 -6846 -7092
1216 -7092 12672 -1852 -10185 10500 2614 -12542 6669 6883 -12877 2308 10528 -10414 -2181
1229 -2181 12353 -7133 -6006 12342 -2531 -9790 10047 1873 -11802 6492 6502 -11296 2014
1242 2014 10013 -9801 -2220 11758 -5845 -6670 11527 -1936 -10089 9079 2643 -11836 5733
1255 5733 7358 -11580 1715 10615 -9713 -3028 12472 -6426 -7272 11944 -2348 -10581 9867
1268 9867 1956 -11889 6928 6817 -11766 2919 9600 -9937 -1444 11268 -7250 -5616 10987
1281 10987 -3379 -8883 9088 1103 -10250 6407 5480 -9808 2179 8657 -8281 -2396 10102
1294 10102 -5856 -6248 10048 -1750 -9040 8745 2700 -10512 5967 6824 -10748 1726 9872
1307 9872 -9329 -2875 11120 -6577 -6724 11555 -2677 -9682 10460 1781 -10759 7457 5603
1320 5603 -11128 3131 8471 -9718 -1275 10018 -6964 -4764 10574 -2912 -7588 9036 1055
1333 1055 -9052 5712 4670 -9313 1666 7404 -7868 -2125 9329 -4736 -5801 9955 -1169
1346 -1169 -8411 8113 2481 -10199 5394 5970 -10319 1656 8962 -8857 -2102 10819 -6284
1359 -6284 -5317 11148 -2981 -8534 9902 521 -10588 6882 4026 -10216 3798 7278 -9080
1372 -9080 -27 9515 -6310 -3500 9459 -3300 -6724 7843 358 -8724 5280 3881 -8429
1385 -8429 2316 7082 -7030 -1353 9101 -4400 -5416 9163 -1387 -8685 7491 2138 -10075
1398 -10075 5377 5979 -9844 1957 8886 -8741 -1734 10316 -6408 -5411 10000 -3245 -8140
1411 -8140 9445 274 -9523 7351 4055 -9352 4246 6550 -8468 47 7698 -6172 -3190
1424 -3190 7831 -2996 -5856 7168 469 -7170 5245 3945 -7456 1927 6262 -6826 -2126
1437 -2126 7880 -4483 -5306 8282 -1082 -7634 7810 2280 -9018 5664 5378 -9845 2231
1450 2231 7836 -9111 -1246 9145 -6731 -4225 10251 -3330 -7090 9248 -21 -8755 6918
1463 6918 2969 -9348 3772 5432 -8120 403 7018 -5658 -2477 7766 -2369 -5231 6634
1476 6634 360 -7069 4708 3788 -7652 1408 6125 -6268 -1463 8033 -4089 -4519 8458 -1259
1490 -1259 -7423 7263 1794 -9330 5219 4789 -9732 2903 7471 -8663 -109 9131 -6511
1503 -6511 -3450 9358 -3810 -6292 8079 -844 -7915 6320 2361 -8038 3776 4922 -7122
1516 -7122 1123 6232 -5067 -2262 6570 -2684 -5018 5463 391 -6785 4198 3732 -6858 1650
1530 1650 6253 -6062 -1542 7572 -4359 -4702 7838 -1680 -7164 7077 1558 -8704 5527 4662
1544 4662 -8878 2945 6911 -8452 37 8304 -6638 -3275 8391 -3832 -5356 7758 -643
1557 -643 -6419 6027 2358 -7357 3239 4311 -6755 508 5628 -4960 -2289 6392 -2211 -4378
1571 -4378 5421 958 -6037 3929 3717 -6661 1305 5797 -6161 -1515 7160 -4661 -4018 7677
1585 7677 -1470 -6429 7481 993 -7918 5310 3401 -8802 2937 5761 -8384 523 7382 -6211
1599 -6211 -1931 8010 -3959 -4137 7432 -1284 -5846 5286 1411 -6753 3035 3881 -6309 738
1613 738 5443 -4061 -1835 6007 -2033 -4143 5094 403 -5955 3381 3188 -6481 1385 5736 -5928
1628 -5928 -1118 6984 -4184 -3697 7583 -2258 -5870 6905 440 -7536 5091 2990 -7641 3234
1642 3234 5475 -7215 869 6453 -5812 -1856 6982 -4148 -4315 6220 -1340 -5338 5081 1296
1656 1296 -5754 2720 3914 -5278 464 5022 -4070 -2344 5333 -2238 -4479 5016 420 -5484 4022
1671 4022 3261 -6244 1876 5412 -5609 -1027 6936 -4792 -3334 7023 -2707 -5374 6810 -70
1685 -70 -6822 5538 2464 -7026 3172 4348 -7016 619 5738 -5846 -1737 6509 -3487 -3555 6224
1700 6224 -1003 -4701 4874 1492 -5395 2297 3458 -5017 -121 4694 -3733 -2259 5634 -1825 -3978
1715 -3978 5067 526 -5393 3985 2525 -6164 1649 4910 -5793 -479 6251 -4429 -2462 6863
1729 6863 -2531 -4358 6486 -520 -5857 5316 1728 -6720 3032 3388 -6075 1030 5306 -5090
1743 -5090 -1037 6187 -3128 -3190 5408 -1515 -4778 4308 1089 -5282 2611 3380 -4819 490 4719 -3524
1759 -3524 -1830 5369 -2196 -4166 5127 -84 -5449 4000 2383 -5952 2200 4447 -5327 -161 5809
1774 5809 -4289 -2139 6255 -3008 -4508 5828 -679 -5518 4805 1526 -5743 3132 3585 -5630
1788 -5630 929 4742 -4711 -1271 5238 -3079 -3427 5019 -827 -4365 4085 1223 -4947 2665 3191
1803 3191 -4741 496 4273 -3902 -1817 4877 -2216 -3773 5207 -28 -4962 4296 1880 -5515 2393
1818 2393 3749 -5318 295 4774 -4485 -1853 5743 -2861 -3350 5875 -403 -4879 4526 1207 -5576
1833 -5576 2950 3062 -5639 1047 4261 -4615 -930 4985 -2448 -2771 5057 -417 -4133 4281 1365
1848 1365 -5150 2368 3040 -4784 506 4171 -3487 -1381 5205 -1961 -3093 4939 -357 -5017 3993
1863 3993 1475 -5544 2373 3226 -5086 393 4641 -3896 -1164 5143 -2731 -3292 4875 -691 -4595
1878 -4595 4043 1166 -5165 2586 2875 -4654 1215 4242 -3877 -1010 4832 -2694 -2908 4622 -674
1893 -674 -4420 3972 1069 -4835 2634 3004 -4435 763 4181 -3894 -1222 4746 -2667 -3284 4423 -701
1909 -701 -4463 3748 1562 -4767 2653 3127 -4489 858 4260 -4087 -1224 4558 -2573 -3103 4633 -564
1925 -564 -4299 3838 1543 -4701 2746 2843 -4612 812 4055 -3734 -1203 4501 -2319 -2564 4580 -443
1941 -443 -3916 3873 1284 -4544 2597 2790 -4688 687 3805 -4001 -833 4198 -2428 -2513 4225 -788
1957 -788 -3728 3842 926 -4395 2231 2216 -4569 758 3810 -3712 -1121 4204 -2264 -2427 4199 -454
1973 -454 -3486 3552 978 -4572 2234 2484 -4892 600 3743 -3630 -614 4582 -2307 -2411 4538 -888
1989 -888 -3782 3619 698 -4635 2339 2410 -4676 980 3652 -3761 -375 4357 -2525 -1943 3913 -1079
2005 -1079 -3271 3283 609 -3832 2140 2573 -3827 883 3467 -2994 -788 3885 -1952 -2574 3723
2020 3723 -673 -3866 3172 1025 -4324 2247 2881 -4084 858 3793 -3590 -881 3992 -2779 -2209
2035 -2209 4225 -1182 -3181 3705 614 -3818 2570 1948 -3881 1295 3231 -3871 -442 3587 -2685
2050 -2685 -1946 3610 -995 -2854 3088 794 -3602 2024 2134 -3471 386 3202 -3126 -1003 3605
2065 3605 -1907 -2370 3851 -583 -3197 3384 1030 -4025 2003 2301 -4118 654 3108 -3754 -777
2080 -777 4140 -2514 -1904 4172 -1093 -3021 3743 259 -3801 2450 1325 -3978 986 2684 -3357
2095 -3357 -112 3458 -2299 -1324 3520 -945 -2366 2877 337 -3354 1779 1402 -3481 634 2865
2110 2865 -2770 -757 3657 -2035 -2098 3858 -503 -3253 2833 651 -3698 2320 2148 -3998 1160 3256
2126 3256 -3319 -357 4138 -2494 -1624 3907 -1388 -2913 3356 -29 -3329 2405 1226 -3294 1281
2141 1281 2369 -2865 -181 3290 -2251 -1425 3247 -1136 -2463 2744 106 -3073 1865 1865 -3000 676
2157 676 2771 -2669 -837 3429 -1755 -2296 3687 -768 -3127 3273 671 -3425 2516 1907 -3599 921
2173 921 2626 -3211 -551 3548 -2516 -1568 3555 -1584 -2334 3343 -127 -3185 2478 892 -3172 1324
2189 1324 2188 -2749 -336 2788 -1989 -1116 2839 -973 -1984 2693 176 -2781 1797 1453 -2966 449
2205 449 2485 -2436 -790 3198 -1747 -1663 3630 -757 -2765 3216 359 -3574 2120 1640 -3658 1185
2221 1185 2396 -3221 115 3308 -2306 -1339 3459 -1247 -2189 2908 -162 -2944 2309 809 -2915
2236 -2915 1055 1905 -2667 60 2710 -1555 -1163 2647 -742 -2451 2157 109 -3164 1765 1588 -2637
2252 -2637 503 2544 -2387 -499 3194 -1402 -1384 3386 -670 -2715 2895 146 -3253 2525 1330
2267 1330 -3408 1385 2348 -2919 80 3031 -2486 -1182 2939 -1611 -1929 2996 -280 -2530 2331
2282 2331 966 -2447 1352 1793 -2282 -134 2220 -1583 -1143 2401 -746 -2104 2178 361 -2510
2297 -2510 1874 1419 -2513 860 2198 -2714 -598 2830 -1918 -1777 3052 -493 -2551 2799 467
2312 467 -2982 2270 1450 -3310 1215 1959 -3193 187 2323 -2259 -854 3036 -1209 -1657 2775 -455
2328 -455 -2178 1980 601 -2799 1143 1566 -2399 40 2192 -1828 -1087 2321 -697 -1815 1993 250
2344 250 -2380 1575 1419 -2907 680 2020 -2355 -291 2715 -1670 -1252 3183 -870 -2033 2930 -75
2360 -75 -2960 2048 894 -3127 1327 1903 -2947 414 2662 -2194 -556 2737 -1521 -1507 2087 -431
2376 -431 -2182 1769 547 -2368 1035 1350 -2104 166 1948 -1479 -1019 2111 -870 -1631 1916 199
2392 199 -2519 1419 1408 -2621 971 2708 -2289 -113 2745 -1937 -1103 2895 -1378 -2005 2580 -140
2408 -140 -2587 2085 850 -2731 1528 1701 -2452 313 2093 -1918 -828 2269 -1269 -1186 2228 -235
2424 -235 -1914 1566 693 -2088 921 1396 -1946 -207 1716 -1826 -948 2256 -445 -1738 2179 646
2440 646 -2100 1539 1173 -2419 703 1830 -2542 52 2580 -1738 -989 2604 -1067 -1695 2578 -77
2456 -77 -2155 1862 651 -2491 939 1261 -2618 292 2122 -1754 -519 2230 -974 -1273 2133 -531
2472 -531 -2117 1461 591 -2254 892 1467 -1994 -114 1832 -1629 -830 2238 -782 -1714 1973 -116
2488 -116 -2136 1583 826 -2405 665 1604 -2385 127 2377 -1580 -605 2629 -969 -1445 2122 -426
2504 -426 -2185 1887 462 -2527 1233 1483 -2020 339 2096 -1858 -590 2164 -1234 -1311 1934 -84
2520 -84 -1721 1622 715 -1937 1004 1419 -1752 116 1765 -1416 -849 2078 -1034 -1803 1933 -135
2536 -135 -2053 1834 780 -1970 1040 1581 -2182 193 2121 -1771 -623 2090 -1101 -1246 2173 -350
2552 -350 -1802 1825 612 -1844 1108 1269 -2139 85 1787 -1719 -777 1887 -925 -1286 2100 -300
2568 -300 -1624 1442 660 -1882 1108 1003 -2004 -39 1711 -1479 -551 1809 -738 -1338 2096 -35
2584 -35 -1815 1538 658 -1787 508 1238 -2149 11 1930 -1535 -747 2178 -969 -1037 1950 -156 -1905
2601 -1905 1542 307 -2066 973 915 -1816 401 1663 -1311 -425 2015 -746 -1101 1937 -268 -1768
2617 -1768 1384 428 -1726 889 1293 -1674 433 1877 -1603 -571 1765 -787 -1469 1965 -211 -1641
2633 -1641 1548 382 -1849 1222 1127 -1699 466 1570 -1485 -630 1926 -1006 -1123 1813 -237 -1610
2649 -1610 1499 316 -1459 1137 827 -1700 305 1525 -1525 -562 1890 -1007 -1299 1486 -237 -1506
2665 -1506 1652 425 -1690 1108 1074 -1847 396 1357 -1686 -711 1681 -986 -1011 1874 -161 -1509
2681 -1509 1506 483 -1890 1018 877 -1706 211 1457 -1412 -606 1579 -982 -1018 1581 -238 -1829
2697 -1829 1157 415 -1689 760 998 -1964 106 1228 -1502 -258 1706 -754 -1153 1813 -199 -1479
2713 -1479 1512 393 -1813 802 991 -1708 595 1394 -1267 -433 1661 -832 -650 1661 -206 -1579
2729 -1579 1169 268 -1698 821 1075 -1530 287 1177 -1321 -440 1577 -474 -976 1517 -246 -1351
2745 -1351 1226 562 -1604 888 1067 -1639 525 1443 -1286 -315 1767 -909 -1044 1430 -206 -1387
2761 -1387 1283 91 -1734 1083 1062 -1274 554 1317 -1441 -88 1642 -949 -819 1193 -332 -1283
2777 -1283 1347 134 -1293 869 750 -1233 300 1296 -1158 -443 1253 -831 -1060 1315 -52 -1364
2793 -1364 1149 672 -1774 841 1161 -1591 631 1374 -1423 -306 1440 -1115 -653 1625 -576 -1086
2809 -1086 1279 376 -1485 955 665 -1326 345 973 -1362 -336 1316 -615 -472 1172 -262 -1123
2825 -1123 1090 349 -1153 778 812 -1306 154 1130 -1230 -622 1404 -523 -661 1677 -125 -1340
2841 -1340 1226 188 -1418 664 754 -1662 427 1335 -1061 -55 1472 -947 -639 1573 -464 -1018
2857 -1018 1344 6 -1499 852 520 -1497 302 746 -1011 49 1222 -641 -510 1131 -181 -764
2873 -764 916 79 -1105 552 891 -1436 477 1156 -905 -269 1317 -875 -700 1516 -425 -1293 1015
2890 1015 284 -1321 883 619 -1492 458 1384 -1433 99 1351 -1134 -408 1375 -739 -996 980
2906 980 47 -1103 1096 667 -1074 548 1010 -905 -171 1165 -970 -664 1287 -153 -919 995 286
2923 286 -975 727 814 -1377 364 1072 -949 -329 1354 -861 -793 1247 -271 -1039 1280 124 -1397
2940 -1397 867 517 -1327 371 1294 -1427 -33 1334 -813 -796 1304 -637 -861 1485 -164 -901
2956 -901 748 492 -1163 342 821 -1053 -100 941 -639 -259 953 -13 -749 747 315 -1232 324
2973 324 594 -1188 -162 1129 -997 -142 1411 -696 -981 1396 -237 -971 945 -59 -1132 749
2989 749 563 -1354 412 841 -1011 50 1161 -765 -350 1292 -471 -1062 990 -145 -965 725
3005 725 377 -904 178 840 -817 -75 981 -922 -658 990 -397 -892 849 -60 -939 589 607
3022 607 -1053 183 1034 -786 -163 1361 -876 -850 1105 -655 -1053 901 164 -1188 1039 427 -1181
3039 -1181 460 1074 -1008 231 762 -810 -680 691 -412 -704 1102 -120 -881 801 274 -914
3055 -914 153 845 -691 -316 784 -418 -636 1074 -223 -944 927 109 -1024 716 513 -892 193
3072 193 813 -972 -258 886 -810 -301 1264 -155 -710 1353 25 -1145 932 390 -1030 333
3088 333 619 -995 -51 1025 -691 -456 1106 -320 -913 880 -308 -842 641 427 -701 74 567
3105 567 -844 81 815 -538 -365 1055 -459 -863 650 -226 -1127 673 488 -988 426 695 -865
3122 -865 -111 1276 -664 -352 964 -225 -890 743 -199 -938 816 163 -930 620 762 -748 370
3139 370 883 -747 -439 945 -242 -514 868 165 -747 675 335 -720 507 633 -546 -1 789
3156 789 -437 -439 893 -260 -692 1035 -12 -677 773 442 -970 402 785 -970 23 914 -884
3173 -884 -323 899 -122 -775 932 -109 -873 943 191 -1015 331 724 -867 312 553 -627 -399
3190 -399 849 -146 -455 672 89 -753 670 245 -824 300 331 -727 42 711 -553 -469 912 -264
3208 -264 -522 762 87 -766 508 330 -921 143 472 -937 32 971 -665 -219 1215 -476 -826
3225 -826 831 -61 -753 684 235 -962 367 632 -865 168 679 -613 30 912 -387 -241 606
3242 606 -101 -686 425 341 -808 120 589 -822 -135 875 -619 -202 881 -342 -785 557 -159 -592
3260 -592 564 434 -627 353 666 -796 233 946 -750 -369 609 -488 -356 816 101 -920 660
3277 660 259 -791 417 362 -598 100 732 -612 -508 807 -362 -504 473 3 -660 505 400 -619
3295 -619 201 445 -685 -109 549 -768 -312 804 -464 -100 637 -8 -717 473 390 -705 405 670
3313 670 -826 -8 817 -725 -16 832 -260 -396 673 -216 -706 747 249 -710 173 453 -767 103
3331 103 598 -509 -189 1012 -288 -447 1073 -261 -688 380 238 -629 326 528 -993 -69 821 -659
3349 -659 -126 921 -280 -413 828 12 -597 527 145 -974 215 396 -839 18 771 -482 -34
3366 -34 774 -440 -345 715 -196 -406 289 238 -351 543 432 -587 103 655 -569 -303 682 -645 -614 454
3386 454 87 -804 477 179 -712 482 801 -689 165 791 -586 -179 747 -297 -369 422 37 -647 466
3405 466 183 -793 320 466 -657 -185 696 -771 -126 941 -493 -253 577 -377 -741 516 250 -830
3423 -830 481 424 -624 296 685 -613 -100 551 -175 -354 520 -79 -783 504 246 -467 270 325 -591
3442 -591 278 508 -365 0 715 -323 -217 427 -5 -454 587 99 -679 129 200 -632 89 559 -457
3461 -457 -41 692 -158 -393 466 -154 -535 253 49 -715 208 240 -553 91 503 -388 -76 521 -220 -421
3481 -421 610 -284 -685 300 178 -585 163 273 -590 88 587 -367 -130 666 -458 -293 758 -273 -762
3500 -762 312 123 -377 407 406 -339 28 474 -439 -260 560 -365 -430 396 -150 -593 365 232 -519 432 447
3521 447 -637 354 713 -610 -64 643 -408 -431 418 5 -495 379 -56 -535 449 363 -474 216 523 -615
3541 -615 -385 541 -381 -535 550 223 -419 275 180 -325 179 412 -607 74 267 -557 -230 472 -320 -112
3561 -112 533 -124 -391 526 106 -893 573 225 -629 147 513 -562 -128 504 -360 -185 739 41 -262
3580 -262 376 253 -579 371 73 -659 -56 371 -261 -141 590 -296 -199 703 95 -305 403 53 -423 301
3600 301 42 -681 -30 369 -93 -147 433 -191 -102 835 -185 -591 622 151 -544 434 415 -367 162 416
3620 416 -481 26 512 -407 -300 400 -101 -495 384 -71 -643 165 134 -366 28 170 -18 -5 155 -285 -301
3641 -301 244 -265 -271 497 99 -644 319 522 -400 365 486 -289 172 622 -233 -230 607 -16 -245 319 -6
3662 -6 -466 541 324 -580 242 180 -443 -336 379 -464 -381 600 50 -488 586 171 -467 463 129 -499 154
3683 154 350 -397 -352 318 -267 -290 519 38 -383 429 -78 -663 156 343 -428 70 277 -540 78 498 -325
3704 -325 -73 507 -98 -182 235 -26 -508 133 336 -645 81 495 -441 -228 356 -275 -69 346 -112 -1
3724 -1 368 8 -184 169 98 -519 -112 273 -372 186 489 -59 -126 500 -186 -429 210 124 -418 114 333 -455
3746 -455 161 342 -428 -138 417 -458 -336 444 -341 -438 366 76 -686 206 322 -280 224 389 -250 -114
3766 -114 380 -279 -206 481 68 -323 325 -47 -173 110 290 -359 -71 533 -124 -152 43 -320 -153 397 -192
3787 -192 -494 139 -51 -176 155 265 -171 -45 331 -382 -238 473 -479 55 484 -360 -287 428 80 -291
3807 -291 137 -203 -479 4 328 -446 22 236 -129 -87 346 -8 -67 370 -23 -518 269 117 -104 164 504
3828 504 -271 -260 428 -325 -127 557 22 -353 157 -165 -309 330 282 -471 174 162 -76 -1 497 -207 -185 397
3850 397 -205 -264 590 50 -262 513 160 -233 330 476 -322 152 136 -363 -163 407 -160 -373 150 -265 -122
3871 -122 243 121 -355 -87 377 -323 146 420 -261 -295 37 -65 -386 408 -54 -501 264 251 -397 113 283
3892 283 -583 128 252 -169 -417 236 -259 -355 212 -153 -232 183 165 -323 243 173 -158 -138 313 -80 107 212
3914 212 -197 -242 463 -122 -370 170 84 -364 401 281 -476 -46 235 -232 -172 376 -179 -215 514 -31 -217
3935 -217 390 238 -118 143 609 -364 52 412 -426 -205 147 -134 -84 293 -144 -395 272 197 -300 25 219
3956 219 -329 -25 312 -130 67 359 141 -336 170 168 -328 233 -5 -391 -2 320 -386 22 210 -181 -175
3977 -175 345 -33 -144 302 -72 -394 376 103 -371 144 206 -409 180 489 -127 -225 234 -158 -293 340 -75
3998 -75 -297 413 45 -347 -45 335 -319 93 406 -35 -144 502 -78 49 378 37 -365 210 74 -87
4018 -87 240 309 -280 -406 284 -189 119 335 11 -621 32 -110 -90 215 158 -239 42 340 75 -130 487
4039 487 -25 33 361 -321 -163 455 59 -360 204 63 -517 -46 393 -222 237 189 -334 -128 312 51 -147
4060 -147 230 -128 -342 253 42 -420 -176 182 -558 214 623 -266 106 540 100 -210 381 78 -138 236
4080 236 94 -439 111 42 -396 -8 198 -14 -191 292 -36 -332 198 40 -258 63 85 -489 -132 254 -274
4101 -274 39 223 -71 26 524 -264 -215 86 90 -221 124 261 -392 55 246 -220 185 362 -237 -129 338
4122 338 -53 -262 51 216 -167 252 54 -354 224 -17 -409 205 464 -356 43 389 -253 -131 162 -2
4142 -2 -75 68 150 -294 248 84 -214 -4 180 -118 176 268 -243 -161 195 -53 -275 -24 178 -233 74 31
4164 31 -77 84 115 20 95 198 -247 -1 299 -95 -236 345 -94 -307 12 15 -199 -131 219 -184 93 52 -246
4187 -246 -162 270 161 -119 126 8 -169 80 286 -473 -190 238 -30 -39 545 -207 -214 135 20 -94 339 -163
4209 -163 5 -92 -13 -315 -58 104 12 1 318 53 -65 284 -232 -268 87 -8 -503 70 153 -100 -21 327 -61
4232 -61 30 240 -160 187 148 -75 -13 368 -5 -403 271 -87 -282 -58 210 -238 -327 289 -38 -128 94 -173
4254 -173 -157 -40 -229 -79 208 335 -138 -173 280 -213 -146 65 -440 -148 90 55 -97 52 -1 -128 286 95
4276 95 -343 41 46 -70 -132 211 -61 -113 443 -110 -259 223 196 -193 47 243 -433 55 238 -335 -160 380
4298 380 -229 28 250 -65 -172 344 -46 -273 177 121 -176 -30 161 -256 -75 189 -222 -61 432 32
4318 32 -243 351 51 -312 11 -97 -191 96 32 -149 92 141 -7 -194 379 131 -334 211 101 -330 73
4339 73 133 -201 149 14 -159 -10 89 -171 -193 130 -90 -375 67 43 -97 285 52 30 58 304 -44 152
4361 152 188 -361 -146 296 126 -152 10 -8 -128 153 114 -379 140 5 -275 161 79 14 -126 206 -219 -234
4383 -234 47 -14 -390 -118 286 -48 231 169 25 11 397 -48 -93 73 -101 -221 282 -12 -343 192 175 -397
4405 -397 -155 150 -325 -65 240 16 -218 269 -136 -142 119 80 -51 292 161 -350 145 144 -238 60 346 155
4427 155 -194 171 147 -525 401 51 -507 24 64 -408 -177 -22 -184 -56 11 -89 -19 119 -127 -97 -51 -24
4449 -24 90 43 -325 -245 -61 188 -199 23 195 -171 -127 204 -44 -138 -47 14 -240 179 -87 -294 211 1
4471 1 -19 88 372 -22 -128 -72 277 -140 -116 -2 -324 170 -110 -30 144 121 -111 220 231 7 -32 39 -86
4494 -86 -153 -16 -188 -194 11 185 -99 -57 354 -317 -243 196 -122 -250 301 215 75 90 80 -136 293 37 -287
4517 -287 -219 -16 -171 -172 75 -245 -37 78 -11 67 338 288 64 210 167 -124 148 228 -89 -182 -20 -147 -209
4540 -209 141 251 -169 -33 -40 -188 210 161 -186 -12 26 -290 -19 182 -140 58 66 43 -80 351 -5 -37 -51
4563 -51 90 -364 0 -69 -146 -83 257 90 -89 33 -46 217 77 -131 -75 220 197 -240 51 -55 -51 151 158 -132
4587 -132 -228 128 -40 -209 120 -64 -250 82 119 -189 -136 188 221 -339 361 190 57 110 -298 -179 92 11
4609 11 -322 3 -142 -114 106 79 -40 149 124 29 20 248 -174 75 70 -79 -43 166 105 -389 200 259 20 65
4633 65 258 15 29 -45 -89 -92 262 125 -102 364 158 -262 55 -68 -43 140 360 -111 -16 108 -98 152 175
4656 175 118 -44 33 213 -244 35 122 -129 288 219 158 -78 146 124 -49 238 74 -237 132 347 -181 57
4678 57 124 -172 -165 -21 -227 1 321 -207 -215 125 37 -49 129 -60 -205 15 31 -201 105 147 76 103 181 15
4702 15 8 228 16 -195 10 22 -47 -66 -174 -191 19 275 -19 -109 84 -201 -72 -51 -49 -9 -27 184 -50 89
4726 89 195 -451 -184 -11 -78 107 34 -56 -306 41 36 91 211 34 -60 -120 36 -175 250 251 -127 -158 71 156
4750 156 -188 195 -122 -75 -21 137 -76 -31 181 18 -4 7 -62 -141 48 -207 -285 215 -89 -80 -98 20 47 282
4774 282 -187 -100 136 39 -98 -91 105 145 88 198 123 -265 16 207 4 129 -11 -165 156 -87 -38 -336 9
4797 9 -172 -88 159 153 -179 331 106 -74 -26 -268 41 133 285 -26 -53 241 -175 -139 194 -126 -25 100 78
4820 78 -306 -34 139 -155 79 121 -135 27 161 104 -9 148 -147 -156 194 39 -134 172 154 104 255 142
4842 142 122 171 230 -124 -81 213 -84 -140 -48 116 -88 115 101 -78 53 -106 163 -270 -3 -156 33 3 -96
4865 -96 -281 337 258 63 368 161 -213 -3 228 -210 -286 187 75 109 94 -50 141 387 232 -44 95 23
4887 23 97 201 82 -200 -147 257 12 -119 -93 -173 -170 171 -26 -124 -44 -5 145 91 355 -236 91 391 -385 -141
4911 -141 155 -12 197 308 42 -193 121 285 165 49 -57 -28 -170 62 -51 -54 88 12 134 192 22 -65
4933 -65 63 7 -58 53 38 -266 -88 -12 -15 -101 188 138 2 -117 34 -264 5 28 48 19 31 -3 -222 -148 59
4958 59 -155 55 93 -5 215 134 -308 -143 -106 -128 -171 177 -50 120 92 -217 -150 54 -109 -245 194 -97 -7
4981 -7 115 106 43 -39 75 7 -49 292 -157 -111 -49 128 -102 122 100 -108 96 214 13 -28 -23 -156 72 59 -179
5006 -179 199 74 -55 177 135 -40 -5 216 53 38 145 91 -52 -47 182 10 157 158 -18 69 160 5 -224
5029 -224 218 -88 -90 30 -138 -95 -26 -16 -65 -163 288 39 30 -123 -139 -52 -94 150 -69 102 -191 -176 79 177 -250
5054 -250 -159 -16 -18 -68 116 187 -106 49 173 -254 171 21 -167 232 317 15 -35 403 32 -114 86 38 35
5077 35 38 212 -289 15 12 78 -138 226 -270 67 123 -89 82 -304 -75 -69 -44 -35 21 -28 -12 -29 -99 118 -22 34
5103 34 -118 -38 -351 -187 203 -103 -59 180 39 226 78 159 245 193 96 -214 100 -73 -25 301 58 -197 -40
5126 -40 -54 -71 138 173 106 36 73 129 -59 -79 107 -120 -56 45 -66 282 -43 -19 -160 -115 -55 -254 69 -39
5150 -39 -312 92 123 -11 30 -57 12 124 9 -309 -181 -28 -195 2 -35 -52 95 56 -110 -21 -123 -19 -257
5173 -257 241 -124 -16 -43 -18 195 -35 68 -93 -129 35 403 -147 96 15 91 -44 -53 -140 114 38 45 206 -73
5197 -73 -120 -1 239 -3 -4 40 221 24 260 -282 -316 243 113 -23 -110 -58 3 -7 0 13 -47 324 61 -52 -175
5222 -175 -298 73 45 164 -142 30 106 -114 -43 210 134 -116 198 -192 9 3 127 -178 230 268 -17 -173
5244 -173 -55 -83 -39 -66 29 -303 -66 -99 -130 -5 174 -126 -33 -23 -105 -315 142 110 26 -118 -20 -82 140 230 103
5269 103 -3 -152 143 223 111 -147 -54 -13 -154 7 -74 -2 103 -287 -144 -100 159 74 -72 -46 -45 -125 -46 -105
5293 -105 -13 -220 450 -8 95 26 -116 109 -213 -163 145 -96 -1 -47 197 134 -156 217 -112 -119 -117 -154 75 -53
5317 -53 -174 143 -122 81 324 74 -203 54 -51 106 -96 80 42 -60 -44 -207 50 -160 -50 95 59
5338 59 100 31 27 133 -279 77 -30 -39 -1 81 -37 -32 -31 -145 118 -76 -71 30 -36 -80 23 -58 -105 57 29 -31 -3
5365 -3 28 31 -43 -89 145 -158 26 -219 -307 -117 58 37 -262 -150 227 -12 100 -193 -238 284 294 12 -175 262
5389 262 -128 108 -148 -247 -58 -214 -215 33 216 21 -148 -11 -67 62 9 221 -121 7 167 -225 14 153
5411 153 189 -26 129 51 28 81 -59 -220 -86 41 -265 -245 14 -74 -98 82 239 2 149 10 -186 -73
5433 -73 85 11 -108 61 -10 43 237 45 84 39 -3 58 162 -47 -24 -22 1 129 -114 -3 -144 12 301 -53
5457 -53 -170 183 110 49 211 211 -255 25 -294 44 -200 77 -315 30 153 -99 -176 -173 193 -37 -84 -44 87
5480 87 46 -17 -38 70 -108 18 -65 90 -11 16 -113 -161 75 60 -88 140 -58 93 -180 11 -62 -56 112 -71
5504 -71 -111 -53 258 -125 -61 142 -13 -100 11 21 73 77 65 175 -18 -92 146 71 76 139 -88 118 -163 140 161
5529 161 50 79 41 -181 43 12 98 -129 -118 53 -173 -79 178 -34 -151 -131 26 -35 6 -114 12 93 159 -231
5553 -231 187 318 -167 -8 -26 -9 -63 213 256 98 -138 141 29 244 -123 -57 -63 13 -79 102 148 -191 107
5576 107 69 89 61 232 -143 78 -87 -34 23 6 79 -73 -162 243 55 -94 147 15 82 -37 133 -233 -85
5599 -85 44 66 83 -1 -229 -200 53 -101 -15 7 -162 67 -98 -44 133 184 -287 -128 -123 -72 -51 -19 389 95 112
5624 112 39 -176 -78 23 36 79 62 68 -209 87 9 9 213 261 41 2 143 -65 -3 151 -3 66 31 11 -20 -12
5650 -12 30 -9 6 6 161 29 -250 96 -317 66 -81 -223 -162 -68 -21 -60 72 -58 -22 82 25 -180 165 189
5674 189 -132 -34 21 255 13 101 -90 99 -240 -136 46 204 216 115 69 78 -196 124 -104 106 -404 253
5696 253 16 -245 91 96 -95 185 -43 83 34 -17 -22 -62 -179 -278 91 -14 47 102 45 45 -10 -92 -80 24 11 215
5722 215 -7 175 126 139 -39 -216 32 83 120 -35 41 -62 -43 -25 141 183 -50 371 55 51 44 87 -6 -30 153
5747 153 98 158 258 -199 117 224 101 -80 -91 165 -141 -278 -112 257 -262 -8 -113 159 0 170 -368
5768 -368 -153 -25 -71 -39 -43 102 61 113 -64 -128 -57 -269 74 210 8 133 211 47 -105 101 75 -282 -177
5791 -177 -9 -98 60 71 -129 -134 92 90 -72 27 -164 74 -44 -44 -51 -241 -189 -6 -41 -32 110 -123 62 117 -24
5816 -24 130 36 -15 130 -166 -143 160 153 -58 -19 -149 6 -135 123 -136 -221 211 185 -290 -61 102 68 -21 15
5840 15 39 -55 314 -20 -68 -189 141 -228 204 -4 -48 -90 -107 111 79 25 -102 -92 17 19 -261 -33 -52 -274
5864 -274 -10 307 2 69 280 34 75 -160 13 -224 -2 -139 -146 -18 -38 -90 140 121 -1 15 157 29 -215
5887 -215 -127 51 -17 115 306 56 -121 27 -67 -144 67 -29 57 7 -28 -164 -89 -16 166 96 -13 20 253 116
5911 116 187 147 145 -159 46 90 7 93 -70 -63 -24 225 -23 -37 75 -34 -126 17 148 -206 -15 -2 147 39
5935 39 193 42 136 -121 -107 23 12 -175 74 3 21 229 -63 21 -137 150 68 -45 -21 54 197 86 -53
5958 -53 -62 -90 -138 75 -55 78 43 -251 12 49 -18 -13 17 -18 -125 257 109 191 33 4 -39 46 -30 119 -128 149
5984 149 289 47 65 -52 -134 -77 24 155 74 -144 34 -42 -6 -29 16 -246 23 -57 -149 -272 -3 43 -158 -10
6008 -10 23 -138 -25 93 63 -205 -66 208 81 -67 -178 128 -62 -45 -140 -33 -179 16 0 -206 -94 69
6030 69 -36 -77 -221 43 12 52 116 7 127 176 -6 -44 -103 179 110 18 -88 -50 -9 133 59 -26 -44 -116 -96 -72
6056 -72 21 184 -110 77 85 -228 -3 70 -234 -100 235 -194 137 -99 -66 68 -84 164 183 -81 -84 -22 162
6079 162 140 -3 267 208 -50 62 -146 -129 -246 -17 126 -27 -138 47 -1 -73 -129 26 30 13 55 158 77 -101
6103 -101 48 155 225 14 141 -167 -142 -73 -47 48 -201 -109 -148 56 48 -10 16 -89 75 130 418 -9 -191 86
6127 86 237 -23 -179 157 16 91 15 -322 272 56 122 88 -30 113 -65 -119 78 197 -143 150 -86 -142
6149 -142 69 189 -98 1 -6 16 -76 -43 158 -1 202 -36 266 -243 143 111 -98 9 -241 59 -193 53
6171 53 169 -96 -92 237 66 151 -62 399 -109 37 77 -65 219 34 -217 -187 147 64 94 -141 -70 -41 46 -45
6195 -45 -39 -78 -5 137 -25 -77 -111 -74 -167 113 -30 106 138 160 219 -217 -69 -61 45 -270 -171 -33 78 -146 -121
6220 -121 404 90 68 84 55 6 6 -66 91 150 -199 -40 16 23 -165 -71 -109 -324 -52 58 184 203 -135 208 -25
6245 -25 -145 -164 -52 -108 100 -232 142 187 159 -120 33 -124 165 125 -21 -37 -12 -238 -203 -71 16 111 -11 98
6269 98 -20 -131 -18 -103 137 75 113 -136 -104 5 -55 134 -35 65 55 320 220 -217 -132 181 248 67 -179
6292 -179 -173 -51 53 -157 106 -235 -80 -24 -29 -341 33 -20 186 -269 131 -84 42 -139 133 22 -69 -60 -32
6315 -32 -126 -55 167 -134 114 -18 104 180 -23 15 27 -57 -108 35 35 -276 63 148 205 62 55 -97 -110 67 231
6340 231 161 -29 165 2 -34 150 -108 -222 -87 -240 236 -73 -10 -95 -94 61 -64 -125 219 -134 83 127 265
6363 265 41 25 138 35 7 142 16 69 145 112 -66 -111 16 -26 -156 -110 -49 4 -109 50 148 24 203 52
6387 52 72 -72 25 -220 64 88 -133 162 89 133 -31 -32 38 17 73 102 -97 170 29 151 -99 -129 -155 -185 23
6412 23 43 24 79 22 133 244 57 -31 -27 184 -69 -88 38 -40 33 -199 -13 -109 90 162 -107 -106 54 -185 57
6437 57 -41 17 27 178 40 -95 221 176 151 10 184 82 -20 -144 -180 -48 -89 73 193 117 124 114 -166 29
6461 29 -195 105 32 -301 56 -55 -123 30 -84 168 43 69 22 -114 116 209 98 -157 136 1 147 125
6483 125 41 -94 -56 69 -200 196 143 -102 191 149 30 -134 88 98 36 41 41 18 -171 -176 -340 167 105 24 -73
6508 -73 -20 120 55 295 -233 43 6 -123 -201 225 -283 -92 326 51 24 -125 25 -154 60 -158 -59 37 -81
6531 -81 -143 107 281 40 -12 220 199 -102 -280 -8 63 95 -119 -171 84 -11 -39 268 102 128 97 -34 -116 -52
6555 -52 -161 -315 -124 221 37 -80 -61 186 -74 104 -65 26 45 -74 20 -50 -165 33 172 -17 37 -122
6577 -122 -302 -47 -14 79 138 -48 -144 -79 38 23 298 35 81 -67 -48 -189 85 156 -295 80 274 92 -128
6600 -128 71 -15 117 -45 212 11 134 52 -186 17 217 154 -13 76 9 -80 245 -57 -57 -117 89 56 -129
6623 -129 122 -14 8 -127 76 -9 -11 -114 -88 39 -105 231 87 -20 -26 -143 137 -390 114 55 63 -79 -75 -226
6647 -226 145 60 65 -136 171 -178 -55 201 -287 183 -21 152 -54 22 39 -50 -29 66 90 149 66 130 -75 0
6671 0 97 63 42 -225 -8 -13 -48 390 65 38 -255 3 -15 181 -184 111 -61 -91 -90 137 -196 29 -233 154
6695 154 -296 93 97 54 126 -47 -157 50 61 7 80 127 183 -91 101 -33 -87 1 16 -81 -29 86 -80 81 47
6720 47 -215 -224 98 119 160 4 13 208 48 -123 266 92 -25 102 -291 50 -53 -34 64 -65 261 49 -225
6743 -225 -27 74 92 238 -36 252 -80 -44 167 86 117 -28 -83 -33 -13 0 5 -1 135 -144 239 89 -144 -78
6767 -78 -73 -258 239 -120 -156 27 99 146 34 91 -62 245 95 -11 287 186 -49 -13 -208 181 -80 -162 39
6790 39 38 -280 -18 -184 -105 -170 -105 107 -59 -97 223 79 -86 -16 -291 -283 -48 178 -169 -30 33 251 -77 60
6814 60 50 -28 -55 -74 50 8 62 66 93 -58 -94 -77 -136 -138 10 119 189 -269 147 47 -88 -3 -93 253 5 2 47
6841 47 37 56 162 28 -11 -144 -22 -71 50 211 13 -14 -74 -38 28 109 -137 153 221 -96 -218 277 210 170
6865 170 -341 -64 -80 -212 -132 -40 58 273 -150 66 88 -122 56 -158 -90 0 -113 62 -174 -120 -15 -16 38 88
6889 88 22 44 246 76 407 52 93 -50 37 71 -98 -52 80 240 45 -7 -66 -18 35 108 157 319 -22 -32 -143
6914 -143 157 -84 -22 135 -69 24 -81 161 -45 121 63 155 49 146 11 62 -107 -183 296 51 92 -64 -103
6937 -103 -213 69 241 61 -171 -100 5 64 -91 -21 92 -27 86 -16 -100 -83 6 74 48 208 -65 -228 54
6960 54 -47 -158 -26 31 -172 31 -7 87 408 213 -152 218 -172 -121 18 -210 -90 -26 219 -24 46 -30 22
6983 22 -98 -199 49 250 289 -264 -58 -264 -21 -218 -170 -78 -168 3 -34 -20 160 232 6 57 -16 92 47 200
7007 200 143 -51 -21 -168 -16 209 -86 -21 -116 227 139 169 97 21 -39 -55 -175 19 247 168 -62 -122 25 96
7031 96 156 192 353 181 286 -116 27 -94 -253 -141 -45 47 103 -20 98 -158 -34 65 12 35 -88 213 126
7054 126 94 5 -141 -11 -269 78 11 74 285 56 61 47 127 35 148 43 -237 -28 80 -75 -42 254 -7
7077 -7 -228 -43 -16 -152 82 -192 339 55 106 -45 285 -120 161 124 -142 41 -97 -71 82 -79 292 116
7099 116 -80 -114 71 -58 271 56 13 142 -28 -58 -39 183 13 109 131 113 130 27 -161 112 112 -78 -116 110
7123 110 -151 -95 -151 -41 39 68 -152 5 60 134 30 -55 83 -152 -132 -40 -162 7 160 71 -176 -264 104 195
7147 195 -50 -150 49 -239 -89 -63 -181 -152 27 -28 -27 147 20 -143 43 187 -48 -311 -92 313 -147 -153
7169 -153 -69 27 -146 -41 -67 -186 238 133 -70 107 -35 117 90 136 -163 -64 -261 -121 -25 139 284 -2
7191 -2 96 -161 112 92 71 243 253 174 -122 71 23 249 -156 -37 -195 133 -130 179 64 -198 55 -111 313
7214 313 97 300 75 143 -99 -105 237 -20 10 -180 74 -102 -154 49 -49 -60 68 -13 8 117 -90 50 6
7237 6 -256 -53 11 65 -122 -324 218 98 87 -87 -238 126 175 4 75 8 231 -211 271 59 -92 -107 -74
7260 -74 -19 230 -133 -222 -121 -72 146 74 -56 -39 382 -46 111 156 -61 23 -181 -33 -18 15 -67 107 -140 -87
7284 -87 66 -79 -56 271 222 -13 84 -17 106 -168 129 46 -101 121 177 -14 84 -25 6 -141 25 -74 -72 17
7308 17 31 -1 -8 26 56 103 47 -207 -65 140 78 -133 -114 200 46 -182 93 -158 -135 145 227 27 159 33
7332 33 -56 229 60 145 145 153 6 88 133 -157 129 75 194 56 -33 103 205 161 -63 195 -100 97 64 146 -43
7357 -43 145 -10 -118 -65 -36 233 -62 139 -53 -427 242 33 144 -126 -49 -86 178 -26 -111 25 -94 65
7379 65 325 75 -154 -222 44 38 236 118 7 -226 64 28 -306 -59 105 53 57 104 -85 -250 -9 -71 -77 -107
7403 -107 135 106 -168 11 263 82 -64 44 77 55 -110 -8 -173 201 52 98 -184 204 282 -116 -47 -1
7425 -1 78 69 -120 9 65 40 -171 211 -77 208 -166 -61 -289 44 -24 142 88 29 -103 84 -124 -99 -35 -81
7449 -81 95 -76 -101 -182 163 -216 147 -138 -47 27 283 115 140 116 -118 137 -208 208 164 256 73 108 135 -55
7473 -55 45 -120 -97 38 -153 -43 171 118 -61 -81 52 -124 -16 442 -2 287 106 13 -118 92 144 -151
7495 -151 171 72 -195 55 83 -43 -94 -88 -3 -107 -25 -2 67 39 -91 -2 -57 144 240 -5 132 -77 184 -134
7519 -134 15 72 -116 -20 207 -79 -72 9 177 -112 -158 339 88 22 24 64 112 -166 -245 181 78 28 45 -60 134
7544 134 -50 -136 221 128 -58 -130 -59 51 54 134 -45 -118 -59 -33 245 340 2 -121 193 -112 -162 48 -174 -93
7568 -93 -252 27 163 262 131 -45 -41 -116 147 71 -11 -103 44 0 -40 67 -19 153 -35 100 -35 -188 16 -87
7592 -87 -34 -11 -26 216 35 -155 143 169 174 345 27 76 105 -26 -102 57 -238 -22 36 47 -31 24 32 45 -294 -200
7618 -200 -90 74 -135 182 -10 -69 0 78 82 -153 2 2 -92 -25 -330 -197 28 41 -19 -214 -373 98 -192 -34
7642 -34 42 -177 207 -180 8 71 93 104 -162 142 -224 62 212 46 -173 -62 26 -73 -21 -29 -15 101 -45 -118
7666 -118 -30 251 -9 -92 -167 -80 117 25 -171 -87 2 46 225 -132 228 115 -124 -90 -43 357 151 198 55 5
7690 5 -128 -52 8 370 179 67 64 28 149 -100 -53 114 131 61 -86 62 -83 8 -115 40 -41 -250 -129 248
7714 248 107 261 -233 -117 -123 246 -13 -157 -52 -56 21 -143 19 -76 -63 -298 -124 32 196 114 68 -61 293
7737 293 115 15 39 93 184 -152 239 130 -50 -89 -35 -86 121 81 -164 91 -202 -53 29 68 106 -42 -72 164
7761 164 13 -77 27 -55 -132 194 -3 305 -20 86 -52 158 -6 -116 138 -36 157 54 -10 91 146 82
7783 82 -145 -65 -31 -5 11 -58 -93 188 -1 49 -156 -35 -247 -27 -39 -94 82 99 -5 -79 -56 -143 -217 69 102
7808 102 141 17 67 207 -191 -196 -170 -8 94 -20 -158 -51 -141 242 168 14 61 10 -22 -112 -102 97 6 126
7832 126 41 8 -61 -24 80 214 175 23 354 -160 27 -4 150 -182 176 -77 -26 -163 -342 231 -249 -172 8
7855 8 103 204 -94 -80 150 -31 -110 297 50 -209 128 -136 -30 63 -7 -131 -11 -107 25 47 59 108 -23 121
7879 121 290 -112 32 -9 194 101 13 -31 2 -52 104 268 71 65 5 8 -25 17 -6 -65 -93 -20 -148 161 186 210
7905 210 -96 -82 41 198 48 10 -121 -225 50 48 46 80 -21 14 196 -244 -46 -139 -253 -82 106 39 31 -123
7929 -123 -62 44 -34 88 -247 -22 -185 -30 69 -153 73 -142 85 -86 -37 -58 -160 -186 -115 -103 -24 123 19
7952 19 188 -168 49 -22 -118 16 243 46 -14 -294 221 289 58 114 21 85 -21 -108 -17 -221 183 -226 5
7975 5 -22 116 -165 -18 -141 -43 -9 -227 71 56 36 183 112 -69 -33 -103 -70 88 42 -163 -86 -172 87 106 -55
8000 -55 51 -147 -13 -131 -7 -45 -79 -203 -166 -164 -56 -198 135 87 -68 47 88 -23 -72 -155 4 7 -61 -60 -48
8025 -48 84 115 -245 46 -21 -284 28 -24 97 -100 -88 33 87 1 38 172 126 282 244 28 -27 -98 45 -130
8049 -130 29 288 244 123 16 -189 81 -70 -24 171 145 52 13 -1 259 -239 191 113 -295 138 20 5 -50
8072 -50 29 118 -156 -124 9 -62 -140 -89 90 48 -74 11 128 -296 -154 -3 -54 -120 24 27 -65 -271 1 52 92
8097 92 -46 -154 123 261 -12 58 83 -52 71 -27 -63 103 -131 109 78 -158 73 -65 -10 23 -106 -143 -56
8120 -56 161 -194 -87 410 103 -173 255 -37 -254 -96 -53 128 48 116 116 -20 23 29 146 49 -8 -74 -5 -188
8144 -188 -201 -41 -147 67 141 14 -154 -101 194 44 -40 137 67 13 -81 -137 229 128 -206 -41 -209 21 -330
8167 -330 -200 147 90 -8 -402 207 -38 -107 -79 71 46 102 94 -219 14 -199 -39 34 97 -151 -236 29 209 221
8191B21
$$ Imaginary data points
##PAGE= N=2
##DATA TABLE= (X++(I..I)), XYDATA
0 0 0 0 0 0 8 -8 8 -8 8 -16 24 -24 32 -34 48 -56 64 -74 88 -104 125 -144 167 -192 219 -251 286 -323
28 -323 366 -414 468 -524 587 -655 730 -817 907 -1003 1114 -1234 1367 -1515 1676 -1854 2055
45 2055 -2281 2537 -2828 3162 -3551 4013 -4573 5261 -6135 7283 -8865 11189 -14931 21905
59 21905 -39107 159850 132087 -298344 148504 116771 -274995 81663 235855 -220803 -32905
70 -32905 192271 -156752 -83956 226972 -51798 -140644 133389 11263 -141995 95164 87303
81 87303 -127596 -10303 109021 -76896 -63525 128400 -11470 -127503 105743 56176 -153117
92 -153117 66963 113829 -163355 15209 159265 -150512 -49088 183652 -110551 -89889
102 -89889 199555 -67721 -144717 181598 -12501 -160928 162645 29804 -190609 110623
112 110623 75389 -168471 76840 106327 -157728 15208 125765 -105220 -19148 124202
122 124202 -72022 -72019 103216 -9825 -82986 70039 30692 -95481 22666 80956 -66480
133 -66480 -29056 97901 -39398 -84717 105807 14669 -126996 83258 63894 -151532 52939
144 52939 121252 -151921 1737 158391 -130600 -50596 179920 -94382 -106987 176085 -41468
155 -41468 -143082 155499 12952 -164309 116730 67323 -157298 65415 99155 -137337
165 -137337 9639 118017 -93710 -40766 109715 -45151 -74665 91471 12933 -90528
175 -90528 50269 55804 -86990 4674 89707 -65693 -49119 100122 -27970 -89338 98894
186 98894 19932 -120898 75623 68417 -131849 42164 107719 -130745 -4837 133943 -107860
197 -107860 -48276 145235 -73009 -86300 140479 -27315 -111066 119288 14945 -124410
207 -124410 84736 52165 -120419 42344 75959 -100722 2589 89119 -66629 -32528 85027
218 85027 -26472 -57943 66557 12872 -72680 34676 46797 -70923 -504 72192 -54587
229 -54587 -37022 85837 -24685 -68493 84193 9158 -94376 66932 43870 -107896 40075
240 40075 75705 -107378 8395 101584 -91661 -24514 114307 -66445 -56477 112921 -34227
251 -34227 -82618 96825 460 -96696 71938 34723 -95826 40150 61373 -81576 5782
262 5782 74900 -57213 -28306 73004 -25277 -54443 58878 10701 -68137 34459 45380
273 45380 -67141 3259 71079 -53974 -31969 83214 -30597 -64428 81040 956 -88060
284 -88060 66523 36443 -98320 42500 68147 -95901 11349 90107 -82383 -22405 98939
295 98939 -59219 -51602 95743 -28136 -71087 81729 5139 -79315 57956 33446 -77646
306 -77646 27904 53293 -65563 -3262 62199 -43828 -29829 61051 -15203 -48204 49772
317 49772 14708 -57925 28642 40643 -58777 1314 59488 -48844 -26878 70475 -29706 -51117
329 -51117 71522 -3875 -68867 61572 23742 -79822 41675 48022 -81721 15494 67549
340 67549 -72224 -11187 79357 -52312 -35355 81064 -27119 -54793 70774 -480 -66730
351 -66730 49928 24796 -68318 24231 45474 -57812 -2142 57959 -38258 -26901 59095 -14006
363 -14006 -47107 48396 11562 -58443 28838 35973 -58343 5088 56072 -47772 -19573 67229
375 67229 -30077 -42988 66772 -8416 -61513 56520 15307 -70736 38712 38362 -69597 17205
387 17205 56855 -59699 -6983 66234 -43519 -30189 65853 -22885 -47176 56570 376
398 376 -55994 40853 22936 -55571 19995 41020 -47335 -3529 50347 -33407 -26510 51250 -13657
411 -13657 -43626 44615 9672 -52629 30479 32207 -53149 9719 49017 -46463 -14207 58310
423 58310 -32273 -36253 59277 -11702 -52291 52838 11512 -60394 38374 32637 -60863 16836
435 16836 47754 -53790 -6719 56545 -38993 -27309 57728 -17984 -42608 51263 4137 -51018
447 -51018 36103 23508 -52148 15371 38312 -44935 -6442 47013 -30221 -25317 49170 -10839
459 -10839 -39702 43102 9284 -48267 28793 26768 -50077 10027 40404 -43339 -9276 49778
471 49778 -29155 -26842 51785 -11585 -41524 45684 7174 -50661 32221 23766 -52533 14800
483 14800 38647 -45621 -4182 48415 -32034 -22210 50359 -14732 -37718 44197 3442 -47272
495 -47272 31423 21118 -48764 14925 36509 -41665 -3377 45628 -28991 -22244 46986 -12833
507 -12833 -37421 40761 4822 -46275 28444 22918 -46690 12850 37120 -39888 -4890 44761
519 44761 -27847 -23072 45052 -12150 -37176 39074 5566 -44418 28097 22537 -44443 13147
531 13147 35530 -38617 -4598 42445 -27436 -21882 42848 -12706 -34956 38178 4517 -41944
543 -41944 28431 20945 -42992 14121 33224 -38304 -2886 39863 -28658 -19222 41355 -13968
555 -13968 -31385 37557 2838 -38641 28229 18471 -40705 13934 30090 -36775 -2682 36978
567 36978 -26548 -18079 39016 -11575 -30172 35210 5085 -37824 25223 20110 -40166 10612
579 10612 31583 -36247 -5546 39105 -25500 -20553 41227 -10354 -32271 36753 5450 -39983
591 -39983 26614 19412 -42198 12773 30742 -38110 -1881 37940 -27477 -15378 39700 -13939
603 -13939 -26643 35264 531 -34711 25557 13860 -36788 13094 25151 -32097 -597 32716
615 32716 -22850 -13756 34177 -10077 -25526 29524 3229 -33253 20359 16975 -35503 9303
627 9303 28431 -31442 -3780 35948 -22520 -17420 37764 -11226 -29493 33242 2104 -36772
639 -36772 25494 16227 -39090 14251 28179 -35196 1060 35261 -27581 -12779 36606 -15907
651 -15907 -24166 32332 -1952 -30956 24441 12102 -32487 13300 23348 -29033 -429 29405
663 29405 -21452 -13994 30559 -9932 -24590 26840 4248 -30543 19595 17543 -32067 8204
675 8204 27731 -29268 -5071 33713 -22323 -17935 34981 -10937 -27371 31940 1971 -33124
687 -33124 24651 14645 -35105 14080 24270 -32876 1314 29957 -25893 -10249 31913 -15120
699 -15120 -19104 29365 -2546 -25132 22157 8805 -27779 11310 18285 -25576 -366 24788
711 24788 -18745 -11544 27112 -8408 -20695 25095 3747 -27105 17634 14637 -30140 7204
723 7204 24246 -28028 -4163 31414 -20729 -14932 34113 -10593 -24088 31217 148 -31055
735 -31055 23989 11053 -33542 13795 21046 -30648 3402 27750 -23834 -7428 29741 -14593
747 -14593 -16636 26735 -3933 -23339 19711 6893 -25127 10541 16650 -22184 196 23310
759 23310 -15826 -10567 24968 -7514 -19775 22259 2696 -26124 15938 13677 -27638 7531
771 7531 23433 -25205 -2799 29638 -19702 -13866 31283 -11411 -23095 29052 -1248 -28484
783 -28484 23399 9577 -29659 14635 18939 -27763 4109 24318 -22402 -6912 26063 -14041
795 -14041 -15622 23823 -3293 -20744 18192 7318 -22044 9293 16096 -20017 -1351 21096
807 21096 -14677 -12325 22978 -6011 -19971 21139 4452 -24767 15432 14279 -26322 6794
819 6794 21942 -24553 -3647 26714 -19016 -13059 28671 -10625 -20375 27392 -979 -25324 21734
832 21734 7859 -26937 13093 15354 -25025 3681 20061 -19627 -5199 22367 -11074 -12339
844 -12339 21031 -2374 -17463 15534 6183 -19605 7523 13578 -17974 -1651 18816 -12197
856 -12197 -10261 21587 -4916 -17627 19819 3403 -23432 14806 11729 -25215 7160 19050
868 19050 -23485 -1132 24775 -17826 -9780 26941 -10699 -17492 24799 -2690 -23029 19754
880 19754 5802 -24511 12730 13233 -21812 4637 18608 -17046 -4462 20014 -10111 -12274 18097
893 18097 -2081 -17161 13554 6508 -18209 6986 13924 -16455 -1067 18345 -11784 -9937 19894
906 19894 -5394 -17385 18381 2435 -21962 14497 10610 -23285 8424 17503 -21719 358
918 358 21467 -17676 -7932 23161 -11115 -14943 22191 -3255 -18978 18478 5027 -20358 11986
931 11986 11656 -19460 3881 15489 -15488 -4335 16995 -8928 -11061 16427 -974 -15056 12881
944 12881 6947 -17152 6319 12916 -16499 -1608 17177 -12471 -9125 19117 -5616 -15405 18547
957 18547 2160 -19772 14489 9146 -21797 8185 14911 -20530 928 19207 -16775 -6006
969 -6006 21074 -9949 -12276 19906 -2714 -16963 15693 3914 -18737 10137 9779 -17578 2817
982 2817 14339 -13543 -3760 16116 -7485 -9745 14885 -743 -14674 11529 5936 -16661 5628
995 5628 11821 -15549 -238 16335 -11739 -6851 18150 -6267 -12971 16802 -72 -17772 13647
1008 13647 6846 -19883 8201 13036 -18474 2471 17382 -14861 -4414 18685 -9837 -10859
1020 -10859 17022 -3407 -15430 14058 3814 -16839 9274 9872 -15717 3083 13992 -12644
1032 -12644 -3942 15283 -7554 -10121 14324 -1088 -14116 11402 5944 -15513 6604 12019 -15062
1045 -15062 318 15253 -11963 -6329 16504 -7014 -12028 15633 -756 -15574 12799 6072
1057 6072 -16873 8609 11264 -16618 2024 14918 -14400 -4377 16369 -9095 -9168 15910 -2820
1070 -2820 -13090 13171 3468 -14794 8304 8575 -14817 2009 12288 -12497 -3796 14559 -7329
1083 -7329 -8797 13989 -1174 -12458 11338 4729 -14784 6297 9810 -14799 445 13808 -11855
1096 -11855 -5171 16143 -6926 -9892 15542 -1037 -13788 12399 4505 -16204 7177 9615 -15431
1109 -15431 1795 13617 -12632 -3615 15486 -7722 -8525 14622 -2357 -12558 11509 2791 -14329
1122 -14329 7123 8267 -13812 1924 12468 -11025 -3258 14241 -7053 -8466 13385 -2052
1134 -2052 -12292 10458 3493 -14095 6254 8805 -13282 1634 12595 -10840 -3856 14251 -6973
1147 -6973 -9007 13563 -2217 -12454 11137 3396 -13667 6989 8548 -13548 2230 12464 -11210
1160 -11210 -3264 13809 -7468 -8787 13265 -2456 -11945 11082 3259 -13103 7181 8460 -12803
1173 -12803 2047 11613 -11124 -3681 13144 -7256 -8423 12924 -2216 -11328 10763 3273 -12687
1186 -12687 6974 7938 -12618 1675 11076 -10737 -3373 13092 -7039 -7744 12791 -1640 -10504
1199 -10504 10536 3262 -12434 6524 7389 -12528 1780 10594 -10402 -3381 12468 -6724 -7724
1212 -7724 13196 -1814 -10727 10843 2687 -12715 6733 7082 -12677 2036 10324 -10643 -2530
1225 -2530 12469 -6856 -6795 12499 -2634 -9986 10517 1936 -12318 6826 6195 -11688 2165
1238 2165 9601 -9572 -2139 11716 -5969 -6705 11603 -1808 -10137 9239 2512 -11693 5915
1251 5915 6641 -11518 1726 10657 -9421 -3091 12084 -5834 -7342 11929 -1987 -10794 10134
1264 10134 2339 -12351 7000 6791 -11945 2983 10192 -9763 -1665 11742 -6992 -6282 11310
1277 11310 -3143 -9265 9760 1012 -10728 7057 5553 -10277 3050 8366 -8810 -1630 9965
1290 9965 -6039 -6017 10038 -2150 -9054 8629 2367 -10307 5883 6710 -10437 1749 9237 -9125
1304 -9125 -3034 10869 -6208 -7134 11366 -2078 -9844 10116 2467 -11340 7445 5987 -11635
1317 -11635 2979 8833 -10261 -1244 10453 -7017 -5093 10699 -3187 -7864 9530 835 -9639
1330 -9639 6678 4523 -9875 2603 7085 -8688 -1513 9020 -5074 -5178 9126 -1440 -8019
1343 -8019 8053 2426 -9930 5255 5955 -10272 1363 8533 -8580 -2513 10525 -5750 -5783 11103
1357 11103 -2373 -9206 9700 1299 -11169 7018 5110 -11278 3351 7879 -9687 249 9488
1370 9488 -7004 -3702 9846 -3551 -7198 8177 -45 -8796 5935 3707 -8827 2561 6416
1383 6416 -7210 -870 8221 -4592 -4553 8313 -1676 -8053 6907 2220 -9723 4639 6120 -9491
1397 -9491 1580 8904 -8031 -1965 10057 -5671 -5744 10181 -2661 -8675 8897 1113 -10245
1410 -10245 6822 4923 -10137 3926 7429 -8950 254 8673 -6982 -3363 8562 -3755 -6022
1423 -6022 7695 270 -7237 5710 3830 -7880 2532 5877 -6588 -1150 7081 -4694 -4581 7608
1437 7608 -1372 -7312 6854 2683 -8582 4858 5447 -9247 1439 8051 -8581 -1796 9363
1450 9363 -6242 -4829 10225 -2880 -7311 9185 637 -8955 6693 3791 -9915 3859 6391
1463 6391 -8994 437 7704 -6509 -2624 8369 -3441 -4647 7470 -140 -6925 4836 3024
1476 3024 -7474 2023 5448 -6491 -1138 7412 -4115 -4167 7952 -1410 -6557 6689 1782 -8962
1490 -8962 4374 4834 -9202 1750 7585 -8212 -1044 9303 -5780 -4226 9566 -3437 -6879
1503 -6879 8361 -445 -8615 6333 2451 -8934 4078 5553 -8024 852 7210 -5950 -1891
1516 -1891 7360 -3263 -4770 6081 -402 -6286 4503 2962 -6507 1997 5572 -5763 -942 7014
1530 7014 -4096 -4375 7357 -1317 -6801 6209 1634 -8194 4800 5110 -8369 2057 7201 -7912
1544 -7912 -994 8469 -6121 -4083 8789 -3748 -6151 8241 -409 -7569 6449 2731 -7766
1557 -7766 3877 4804 -7088 652 5938 -5707 -2154 6673 -2883 -4315 6065 252 -5399 4254
1571 4254 2933 -5953 1517 4980 -5514 -1501 6586 -4223 -3961 7394 -1499 -5951 6857 1180
1585 1180 -7576 4991 3853 -8300 2363 6355 -7888 -562 7994 -6208 -2823 8703 -3628
1598 -3628 -5214 7930 -900 -6656 5981 1552 -7413 3452 4005 -6647 934 5708 -4951 -1535
1612 -1535 6278 -2737 -3898 5631 -96 -5618 3741 2453 -6025 1426 5076 -5227 -870 6927 -3856
1627 -3856 -3622 7288 -1597 -5879 6497 620 -7461 4855 3333 -7504 2498 5913 -6836 77
1641 77 7165 -5537 -2737 7740 -3704 -4630 6963 -1158 -5948 5506 1217 -6215 3582 3491 -5704
1656 -5704 1187 5008 -4669 -1670 5697 -2542 -3933 5011 179 -5188 3997 2346 -5507 1912 4850
1671 4850 -5301 -783 6000 -4102 -3441 6727 -2114 -5378 6698 499 -6897 5331 2797 -7276
1685 -7276 3279 4805 -6847 470 6111 -5533 -2216 6688 -3521 -3870 6519 -1006 -5213 5480
1699 5480 1216 -5613 3119 3053 -5663 379 4739 -4075 -1682 5298 -1938 -3532 5190 367 -5318
1714 -5318 3946 2458 -5726 1739 3971 -5370 -816 5757 -4179 -2888 6645 -2099 -4578 6246 -52
1729 -52 -6460 5124 2109 -7105 3043 4141 -6363 821 5568 -5133 -1391 6224 -3407 -3459 6068
1744 6068 -1160 -4944 4723 877 -5561 3022 2902 -5088 1229 4830 -3657 -1439 5220 -2109 -3719
1759 -3719 4756 22 -4976 3659 2155 -5901 2394 4294 -5383 11 5584 -4104 -2352 5925 -2499
1774 -2499 -4415 5615 -412 -6108 4851 1780 -6147 3160 3752 -5839 970 5232 -4574 -1450 5615
1789 5615 -3401 -3140 5248 -935 -4680 4725 1133 -5137 2726 3290 -4796 911 4071 -3951 -1578
1804 -1578 4833 -2509 -3346 5010 -250 -4463 4090 2047 -5652 2482 3968 -5406 444 4992 -4483
1819 -4483 -2011 5487 -2711 -3695 5479 -386 -4984 4638 1516 -6043 3271 3156 -5733 931 4346
1834 4346 -4759 -1064 5407 -2852 -2748 5213 -480 -4378 4276 1152 -5207 2651 3014 -5147 724
1849 724 4539 -4039 -1142 5070 -2022 -3062 4754 -234 -4812 3762 1476 -5452 2107 3351 -5115
1864 -5115 309 4652 -4042 -1100 5324 -2533 -3366 4664 -959 -4543 4042 1029 -5123 2691 3137
1879 3137 -4947 1232 4527 -4020 -831 4833 -2935 -2641 4570 -1090 -4257 3792 1139 -4786 2512
1894 2512 3235 -4660 1009 4363 -3759 -1142 4534 -2516 -2910 4530 -693 -4258 3756 1437 -4721
1909 -4721 2447 3173 -4634 690 4235 -3855 -1316 4860 -2598 -2944 4703 -685 -3878 3881 1225
1924 1225 -4386 2540 3186 -4660 424 4201 -4134 -1094 4519 -2573 -2762 4592 -839 -3849 3634
1939 3634 1231 -4508 2566 2813 -4549 382 3901 -3878 -1169 4668 -2569 -2634 4524 -753 -3385 3765
1955 3765 1063 -4161 2278 2511 -4548 585 3613 -3798 -1119 4466 -2256 -2480 4553 -617 -3426
1970 -3426 3571 724 -4353 2118 2374 -4502 588 3732 -3710 -922 4795 -2376 -2532 4491 -933
1985 -933 -3839 3800 861 -4580 2384 2551 -4399 1156 3798 -3425 -466 4381 -2494 -2111 4194 -1230
2001 -1230 -3550 3189 668 -4075 2060 2101 -3829 1045 3584 -3228 -898 3717 -2285 -2558 3846 -718
2017 -718 -3489 3020 914 -4119 2336 2443 -3935 859 3978 -3392 -1070 4439 -2740 -2461 4299 -912
2033 -912 -3620 3743 551 -4060 2669 2337 -3896 1171 3321 -3645 -536 3981 -2844 -1665 3771
2048 3771 -1378 -3011 3526 412 -3268 2315 1775 -3645 841 3051 -3421 -1101 3546 -1792 -2492
2063 -2492 3601 -500 -3129 3111 990 -3770 2203 2224 -4060 572 3384 -3538 -1016 4042 -2224
2078 -2224 -2391 4193 -766 -3183 4021 231 -3881 2528 1718 -4144 1066 2841 -3531 -78 3445
2093 3445 -2502 -1276 3787 -937 -2565 3298 236 -3072 1778 1359 -3509 751 2627 -2693 -812
2108 -812 3462 -1674 -1728 3482 -721 -3173 3063 822 -3849 2051 1965 -4002 834 3380 -3340 -546
2124 -546 3946 -2248 -1941 4142 -1379 -3127 3637 -76 -4024 3143 1496 -3564 1537 2636 -3122
2139 -3122 -169 3173 -2429 -1371 2988 -1384 -2499 2759 231 -3023 2039 1708 -2994 869 2601
2154 2601 -2569 -774 3043 -2026 -2060 3117 -626 -3018 3010 788 -3299 2257 2042 -3544 964 3002
2170 3002 -3289 -381 3470 -2471 -1734 3787 -1367 -2761 3520 310 -3530 2733 1216 -3575 1355
2185 1355 2093 -3207 166 2478 -2276 -957 2860 -1037 -1964 2703 202 -2960 1861 1361 -3202 934
2201 934 2027 -2671 -609 2794 -1648 -1795 3169 -194 -2633 3008 656 -3605 1875 1958 -3625 904
2217 904 2681 -3517 -288 3484 -2453 -1434 3416 -1172 -2313 2968 0 -3202 2501 848 -3369
2232 -3369 1360 1950 -2751 260 2631 -2151 -1027 2606 -927 -2025 2469 134 -2825 1550 1305
2247 1305 -2734 754 2324 -2372 -466 3056 -1470 -1857 2671 -614 -2653 2538 315 -3130 1909
2262 1909 1532 -3260 1030 2700 -3000 67 3023 -2330 -1203 3253 -1748 -2262 2912 -274 -2819
2277 -2819 2207 1190 -2864 1477 1662 -2628 134 2319 -2004 -822 2302 -1137 -1876 2189 225
2292 225 -2276 1463 1450 -2635 763 2204 -2313 -554 2694 -1816 -1761 2742 -1022 -2253 2499 610
2308 610 -3074 2059 1700 -2884 1046 2269 -3155 164 2637 -2448 -892 2993 -1320 -1590 2757 -101
2324 -101 -2547 2111 755 -2377 1139 1500 -2554 155 2207 -1571 -476 2213 -627 -1765 2275
2339 2275 185 -2095 1298 1333 -2764 653 2017 -2403 -164 2723 -1566 -1323 2968 -810 -2159 2619
2355 2619 57 -2960 2047 1241 -3230 1243 2025 -3031 226 2606 -2101 -810 2814 -1305 -1726 2417
2371 2417 -451 -2487 1917 698 -2420 1184 1652 -2199 209 2280 -1617 -591 2291 -974 -1773
2386 -1773 1935 159 -2356 1473 1315 -2225 737 2280 -2214 -254 2709 -1768 -1447 2631 -924
2401 -924 -2138 2535 -111 -2632 2176 1002 -2591 1198 1816 -2672 186 2552 -2160 -620 2443
2416 2443 -1351 -1475 2225 -473 -1980 2063 691 -2086 1009 1416 -2032 -26 2098 -1535 -989 2304
2432 2304 -840 -1668 2189 284 -2033 1649 1088 -2240 712 1680 -2657 -462 2480 -1664 -1212 2645
2448 2645 -933 -1887 2602 -41 -2372 1931 899 -2498 799 1636 -2701 298 1980 -2011 -623
2463 -623 2490 -1213 -1495 2284 -279 -1705 1674 544 -2172 907 1294 -1849 105 2134 -1543 -504
2479 -504 2260 -424 -1474 2097 74 -2107 1811 472 -2156 750 1765 -2129 -167 2159 -1814
2494 -1814 -547 2602 -1052 -1280 2473 -225 -2326 2026 588 -2037 1195 1410 -1969 383 1985
2509 1985 -1846 -498 2302 -1318 -1377 2141 -321 -2080 1714 446 -2001 1135 1412 -1705 236 1796
2525 1796 -1338 -697 2182 -897 -1543 1926 -176 -2026 1533 1068 -2139 767 1635 -2044 -7 2078
2541 2078 -1490 -817 2007 -1239 -1732 2126 -134 -1917 1670 737 -1849 917 1633 -1977 168 1639
2557 1639 -1862 -437 2090 -877 -1473 2025 -112 -1669 1805 596 -1802 1052 1462 -1926 139
2572 139 1694 -1454 -695 1897 -531 -1312 1954 91 -1730 1908 465 -1905 943 1120 -2189 72
2588 72 1844 -1634 -604 1940 -996 -1275 2198 -184 -2133 1627 487 -2496 1040 1128 -1924 255
2604 255 1934 -1390 -428 2199 -930 -976 2049 -154 -1824 1382 403 -1908 759 1084 -1820 222
2620 222 1644 -1595 -502 2071 -766 -1133 1741 -99 -1810 1449 774 -1794 835 1217 -1753 503
2636 503 1684 -1391 -386 1717 -997 -1233 1882 -378 -1634 1406 796 -1705 1026 1089 -1956 312
2652 312 1837 -1436 -562 1739 -1110 -998 1774 -160 -1438 1131 527 -1762 894 1075 -1930 240
2668 240 1452 -1584 -373 1693 -817 -1282 1616 -137 -1302 1504 310 -1603 892 890 -1922 223
2684 223 1404 -1629 -645 1713 -906 -916 1551 -284 -1446 1356 502 -1612 610 1006 -1584 417
2700 417 1401 -1645 -387 1732 -974 -750 1761 -58 -1237 1149 263 -1766 1148 1077 -1812 261
2716 261 1164 -1386 -171 1709 -950 -781 1804 -299 -1414 1404 276 -1710 712 948 -1581 269
2732 269 1526 -1343 -229 1749 -589 -894 1785 -92 -1706 1062 554 -1707 658 1047 -1667 304
2748 304 1357 -1411 -574 1973 -581 -855 1463 -514 -1458 1268 111 -1850 807 1104 -1643 502
2764 502 1213 -1487 -93 1498 -878 -1155 1384 -462 -1354 1071 290 -1380 916 1103 -1357 164
2780 164 1359 -1179 -232 1297 -967 -948 1374 -181 -1387 1178 551 -1425 882 1002 -1743 227
2796 227 1504 -1347 -319 1531 -1085 -664 1446 -421 -1209 1485 349 -1558 896 743 -1565 258
2812 258 1138 -1594 -119 1497 -846 -488 1522 -192 -911 1302 450 -1291 727 688 -1364 -10 1393
2829 1393 -1422 -191 1420 -858 -605 1289 -273 -1182 1135 328 -1438 708 786 -1590 340 1239
2845 1239 -1455 84 1531 -1081 -833 1529 -570 -1069 1212 95 -1419 508 593 -1345 627 1248
2861 1248 -1151 -104 1310 -822 -787 1475 -568 -937 822 166 -1107 685 627 -1137 367 940 -1098
2878 -1098 -322 1371 -800 -919 1241 -342 -1117 1112 64 -1543 811 996 -1162 214 998 -1355
2894 -1355 -368 1275 -989 -994 1378 -474 -1094 1071 -9 -1227 888 730 -1328 648 832 -1506 67
2911 67 1062 -779 -753 1322 -342 -730 923 314 -1017 618 748 -1387 -8 931 -1108 -708 1337
2928 1337 -648 -822 1405 -264 -1192 1279 178 -1319 868 574 -1343 365 969 -1264 -209 1365
2944 1365 -844 -495 1412 -644 -974 1311 156 -1077 1081 354 -1279 460 676 -1187 35 1237
2960 1237 -759 -409 1196 -322 -852 980 372 -1132 638 400 -1019 274 663 -991 -473 1137
2976 1137 -568 -773 1222 -260 -1355 1102 -7 -1326 734 515 -1276 313 791 -1015 -48 1109
2992 1109 -789 -658 863 -373 -1082 1004 -117 -997 765 377 -1273 446 619 -1076 232 804
3008 804 -581 -479 834 -438 -1132 858 -7 -1033 659 730 -995 400 1113 -1036 -111 1054 -790
3025 -790 -614 1164 9 -1053 1010 177 -1139 897 528 -1217 451 962 -1217 -122 966 -961
3041 -961 -381 1084 -520 -694 1233 -18 -888 902 509 -954 281 621 -806 -92 785 -579 -519
3058 -519 963 -188 -716 974 289 -1083 624 414 -950 172 936 -1137 -154 1211 -693 -510 1027
3075 1027 -61 -803 1400 55 -1063 572 108 -1274 507 539 -1026 -16 1103 -978 -186 949
3091 949 -400 -647 1120 20 -809 779 147 -995 228 607 -963 141 857 -576 -455 999 -152
3108 -152 -734 827 259 -892 495 400 -967 176 839 -920 89 941 -340 -310 1078 -212 -700
3125 -700 840 117 -973 444 333 -1083 487 767 -891 -56 995 -747 -351 885 -374 -603 801
3142 801 61 -763 665 320 -867 466 908 -774 58 685 -275 -222 733 -229 -603 740 58 -900 578
3161 578 362 -807 257 942 -996 193 1019 -841 -401 837 -370 -799 1100 50 -759 705 410
3178 410 -975 448 825 -1228 152 777 -776 -310 827 -360 -462 644 242 -723 719 469 -815
3195 -815 382 442 -877 4 672 -564 -363 957 -407 -631 741 19 -707 445 190 -837 106 775
3213 775 -930 -207 1048 -917 -350 895 -481 -572 1053 -7 -651 580 290 -1074 527 608 -649
3230 -649 103 872 -611 -294 972 -196 -498 707 -143 -552 357 198 -872 110 576 -625 136 945
3248 945 -457 -227 609 -381 -810 569 -149 -820 313 202 -704 223 607 -967 175 750 -463 -209
3266 -209 764 -442 -491 959 -90 -686 573 310 -713 448 535 -576 -36 641 -586 -242 652 -391
3284 -391 -696 614 52 -601 722 281 -909 230 613 -966 -100 298 -597 -280 1000 -423 -633 814
3302 814 40 -370 719 172 -797 169 187 -833 -138 540 -450 -171 576 -183 -514 635 12 -690 524
3321 524 -221 -775 190 350 -893 -5 626 -670 -254 874 -399 -521 1011 -2 -469 445 115 -717
3339 -717 512 503 -592 20 796 -546 60 934 -184 -391 786 -250 -546 594 110 -767 447 735
3357 735 -578 180 418 -553 -302 835 -177 -588 731 -172 -1033 465 49 -790 370 413 -524 -28
3375 -28 532 -451 -273 735 -341 -299 823 -173 -612 489 -218 -737 454 554 -667 74 466 -641
3393 -641 -37 542 -461 -674 826 -143 -844 308 215 -440 442 368 -588 124 571 -362 -413 662 -214 -427
3413 -427 746 48 -521 339 151 -417 246 459 -584 -6 512 -601 -227 534 -81 -175 594 -199 -727
3432 -727 813 -133 -674 420 118 -691 -68 497 -554 -62 420 -446 -285 510 138 -506 415 -11 -635
3451 -635 379 260 -586 65 446 -531 -8 771 -412 -249 703 -69 -481 428 89 -554 352 531 -559
3470 -559 59 616 -231 -170 421 -269 -438 702 84 -612 557 -28 -659 123 467 -648 -72 635 -310
3489 -310 -170 573 -238 -554 524 -36 -435 320 265 -197 152 373 -514 -17 774 -434 -216 474 -375 -325
3509 -325 506 -108 -526 486 234 -602 208 470 -587 77 317 -307 -91 491 -298 -411 504 -376 -286 356
3529 356 194 -301 408 531 -525 192 421 -481 69 619 -403 -301 444 70 -605 300 276 -361 327 185
3549 185 -542 151 410 -358 -76 752 43 -225 432 -125 -647 549 428 -659 153 375 -627 -270 504
3568 504 -662 -168 415 -345 -281 459 -157 -9 434 302 -605 142 224 -637 -129 37 -790 -15 754 -117
3588 -117 -306 517 53 -553 359 176 -504 180 458 -371 -23 377 -369 126 1067 -290 -51 500 -214 -485
3608 -485 353 422 -677 282 163 -581 128 351 -401 -75 311 -374 -91 491 -204 -813 174 26 -384 195
3628 195 355 -505 323 360 -233 -111 410 -355 -271 472 -410 -728 293 180 -530 351 547 -464 117 732
3648 732 -176 -28 308 -213 -559 486 -481 -405 463 70 -504 281 443 -365 105 532 -467 116 349 -588
3668 -588 -73 547 -192 -413 269 16 -492 392 410 -560 -3 388 -596 -10 434 -387 -161 336 9 -179
3688 -179 289 -72 -360 353 428 -390 423 331 -521 -105 654 -382 -320 379 -227 -564 704 167 -383 145
3708 145 153 -465 -5 649 -383 6 597 -296 -64 594 -135 -344 462 40 -216 140 185 -189 -151 296 -285
3729 -285 238 303 -362 -331 266 -107 -329 541 -26 -221 183 204 -412 119 656 -339 -153 396 -205 -276 683
3750 683 -132 -492 346 -8 -393 163 325 -453 -11 475 -535 146 638 -345 -273 607 -282 -419 377 66
3770 66 -262 217 -46 -440 115 222 -152 26 269 -52 -127 708 -58 -110 363 340 -493 181 226 -89 462 381
3792 381 -230 -209 346 -343 -169 331 -23 -194 505 15 -272 262 178 -324 162 74 -272 -164 172 -244 66
3813 66 154 -214 -128 248 -117 -663 234 210 -708 -31 233 -402 -179 89 -363 -261 384 37 -480 417 26
3834 26 -413 140 226 -420 49 280 -298 -260 601 -23 -169 626 -234 -399 586 277 -338 367 189 -599 210
3855 210 401 -241 186 685 -53 -72 266 -112 -409 446 7 -298 98 8 -393 -18 204 -455 -4 173 -109
3876 -109 -171 303 -28 -311 270 162 -376 106 270 -305 249 440 -367 141 361 -126 -17 355 -309 -137
3896 -137 238 35 -272 306 268 -359 363 247 -391 49 545 -326 -102 392 -163 -153 243 8 -314 357 172
3917 172 -340 59 -2 -250 -210 120 -9 -240 434 -74 -292 335 83 -201 344 81 -454 246 324 -435 89
3938 89 419 -116 106 155 -14 -407 330 87 -583 405 16 -311 -24 149 -180 -3 255 -151 -150 299 46
3959 46 64 287 53 -359 499 70 -428 -118 407 -287 -135 361 -238 138 333 25 -200 271 218 -291 264
3980 264 487 -486 24 520 -254 83 429 -485 -269 267 -109 -412 435 -188 -311 13 212 -444 18 410
4000 410 -339 31 307 -232 -130 399 -444 -466 344 -7 -389 99 -12 -214 98 610 -138 -226 421 -366 -158
4021 -158 366 -63 -134 311 71 -446 302 71 -117 114 286 -297 31 473 -347 -421 251 2 -355 361 41
4042 41 -112 52 330 -274 173 152 -439 -85 341 -219 -229 132 -91 61 201 -149 -337 246 109 -283 52
4063 52 437 -198 -145 414 -377 54 292 91 -207 141 28 -432 283 286 -284 -148 175 -287 67 235 -22
4084 -22 -101 72 -145 -321 228 -157 -498 117 238 -498 393 346 -484 217 405 -114 -59 247 -172 -10 319
4105 319 -152 -332 32 216 -270 -82 -128 -398 -79 311 -212 -161 306 -71 -134 335 -49 -435 234 228 -224 254
4127 254 204 -239 -123 263 -413 -337 224 -355 -209 406 -196 -237 235 47 -87 207 423 -336 -1 171 -107
4148 -107 -303 -48 -305 -14 427 -42 -4 343 87 -244 172 132 -82 -181 -13 -361 -261 391 -434 -434 299 112
4170 112 -21 121 -24 -242 145 11 -26 147 82 -8 46 348 -164 -96 336 -157 -84 293 307 -176 11 277
4192 277 -399 70 183 -114 -251 374 -285 -182 195 35 -583 225 -18 -312 -41 -84 -410 -99 368 -269
4212 -269 -6 396 76 -80 18 -203 -424 108 89 -329 186 -6 -228 178 381 -151 -80 146 25 24 107 -81
4234 -81 -617 -53 -73 -18 291 14 -132 -70 333 -208 -3 225 -85 -297 -5 153 -184 153 -3 -390 89
4255 89 304 -295 223 411 -307 -137 137 118 -232 57 -57 -392 180 34 -258 243 86 40 150 307 -38
4276 -38 -7 372 -28 -149 289 56 -143 313 -141 -253 12 227 -126 -122 105 -406 -158 176 133 -89 132 -3
4298 -3 62 321 12 -165 130 -8 -306 73 535 -249 -128 338 -190 69 196 47 -133 24 -25 -213 60
4319 60 154 -290 34 139 -118 27 114 -60 -131 65 121 -231 300 149 -165 166 165 -96 162 190 -204 -77 115
4342 115 -258 6 280 135 -194 184 370 -504 316 -65 -243 -190 162 86 171 173 -100 -304 -61 -51 -141 118
4364 118 -6 -190 175 -15 -275 7 292 -95 192 146 -181 -179 -81 -114 -267 69 83 -2 286 168 -289 -59
4386 -59 201 -141 -18 55 -181 -320 294 -43 -186 125 -107 -268 12 -26 -241 128 152 -94 121 234 -238
4407 -238 -257 173 41 -342 344 93 -294 147 201 -358 136 209 93 -40 34 -296 129 413 -238 117 231
4428 231 -64 -446 294 65 -246 -18 198 -327 6 169 -143 -92 297 -130 -78 249 -276 47 -97 177 -347
4449 -347 36 119 -3 -100 86 -74 4 144 19 -114 62 153 75 29 193 -203 -150 270 -384 6 37 -117 -7
4472 -7 247 -9 -181 -50 -53 -313 133 31 -246 67 225 232 -21 11 -301 -65 149 189 -275 219 73 -219 -130
4495 -130 39 -10 14 105 29 -65 186 40 -204 89 -87 -54 111 58 -49 300 245 -214 33 172 -256 66 111
4518 111 -76 -28 487 -153 65 81 208 0 -116 126 -169 212 265 -159 6 346 -273 -109 401 -28 -68
4539 -68 354 124 -124 323 -121 -89 101 58 -331 -88 103 -94 -44 213 229 12 252 -52 -68 -174 -132 -62 -140
4562 -140 215 -40 235 237 -47 -31 -194 -110 -349 -38 31 -142 65 -21 -190 291 301 -47 -78 269 94 -195 280
4585 280 49 -88 125 -30 -87 -130 -41 -344 45 86 -200 -89 310 -165 -73 260 -127 -224 367 107 -258 30
4607 30 -43 -69 86 -16 -140 -310 203 -54 -91 196 -145 -343 142 22 99 110 138 -135 45 324 -318 -78
4629 -78 223 -201 -100 202 146 8 135 -127 -154 -141 -154 -51 -83 -32 156 -109 -94 -42 -46 210 58 -254 308 -42
4653 -42 -141 -5 131 -35 151 -22 -288 3 197 -165 -217 56 -118 -109 212 -101 18 7 68 37 136 -27 -272
4676 -272 267 266 -98 24 128 -188 -157 198 29 -289 169 41 -334 -95 23 -159 -175 125 168 -132 -55 14
4698 14 -272 111 -259 -26 93 56 -323 77 -247 -237 285 128 84 -39 10 -252 -167 42 11 -172 32 92 116
4721 116 90 -34 -2 -6 -37 28 -97 4 19 -181 -37 -111 -185 -44 24 -159 123 272 -40 -19 -47 -99 -43 267 80
4746 80 -212 69 -207 -134 52 73 -194 281 99 107 -122 165 -91 -90 226 -168 -151 110 150 -55 209 240 -10
4769 -10 -57 89 4 -45 241 -17 141 187 -53 -47 70 440 -216 51 239 -326 68 -10 -224 -33 123 -87 -159
4792 -159 139 -171 -157 114 66 33 288 69 -311 81 25 58 19 239 -147 146 48 -126 134 25 -15 -66 -101
4815 -101 138 -64 75 -1 -391 149 301 -164 74 57 -2 -124 276 -37 189 349 -118 -87 -9 168 -113 153
4837 153 -82 -174 -96 -40 -142 -63 211 131 -123 96 18 -193 259 234 36 269 73 -220 -186 138 164 47 122
4860 122 75 41 99 21 -236 144 253 -84 261 135 34 180 89 -194 -107 13 -203 93 -14 293 33 53
4882 53 106 80 135 -177 -5 -43 205 -67 -195 289 85 -164 415 63 176 127 -27 -14 287 216 73 40 107
4905 107 -81 -152 237 -20 -219 362 353 -108 255 303 52 106 198 -63 14 84 31 83 372 -61 31 88 88 -44 -182
4930 -182 300 -13 5 154 103 13 244 -153 -154 -133 21 16 301 -160 -145 16 170 -229 223 -15 -103 25 120 -122
4954 -122 -213 131 -218 -217 226 7 108 80 -109 -84 138 114 -154 -354 180 -7 -332 185 108 -58 10 19 -131
4977 -131 133 283 -107 203 197 -214 -94 -19 -131 -46 292 -133 -35 -45 195 52 132 146 -24 -32 183 34 -187
5000 -187 146 -158 -42 -24 -139 -110 459 58 21 84 22 -78 39 -30 -136 -87 320 -76 -72 -53 -140 -18 406 54
5024 54 132 -48 -142 -343 70 62 -136 -134 209 30 137 127 -100 81 177 119 -258 91 3 -170 8 68 -36 -65
5048 -65 -114 257 76 254 36 -131 14 -318 -66 163 104 -166 -183 252 -389 -73 2 -59 -8 108 20 -139 -34
5071 -34 252 47 272 113 -2 -66 374 -31 36 119 -53 14 128 83 -18 122 142 -59 -140 -64 -1 112 22 -144
5095 -144 39 179 -39 58 -99 -99 68 -10 25 -139 365 111 -129 -18 -95 -174 18 -190 -123 20 129 -29 -119
5118 -119 132 56 92 305 132 107 58 29 58 96 -98 -132 -149 65 -70 -35 -11 -119 -70 -111 56 -245 103 211
5142 211 -216 -110 342 -133 -121 -106 -5 25 196 -54 -191 4 19 -7 10 62 -178 87 39 -231 -124 176 -17
5165 -17 42 24 -256 -224 284 97 -104 -2 20 14 74 -6 221 217 119 4 62 103 153 26 107 -1 -83 28 58 -338
5191 -338 -33 140 -113 -12 -285 44 83 -13 -1 125 -8 -177 127 -16 30 -216 -66 46 -232 32 343
5212 343 238 -132 305 -177 -133 152 -31 -31 39 66 -35 -111 12 -178 -79 104 23 -278 174 -1 -216 76 -31
5235 -31 -53 231 -69 -334 -115 179 -33 206 144 63 -68 119 50 -133 -139 47 66 -87 224 -207 52 -124 -33
5258 -33 -232 142 -128 57 129 -88 179 3 27 -106 113 137 83 151 253 -370 -199 183 -326 -2 22 0 143
5281 143 -5 -186 -187 -175 -29 12 -130 55 136 74 -118 -255 189 21 144 -189 89 -32 -177 16 -145 -228
5303 -228 109 39 -104 -216 149 168 -155 118 -189 14 -79 41 -110 -119 -113 -182 -116 80 61 33 16 -67 -72 -9 -30 -9
5329 -9 320 -12 -99 -15 -324 -131 -15 213 -28 176 160 -80 -167 -32 -76 36 232 120 102 -120 110 149 -80
5352 -80 32 256 -202 96 -311 -311 -128 25 79 62 -2 -81 27 1 -1 57 255 -300 77 17 -105 16 91 16 52
5377 52 -50 -38 -182 -29 -145 -263 145 4 -146 7 59 -43 72 62 -172 -392 357 20 -18 185 95 -12
5399 -12 84 -13 -53 13 228 88 52 32 34 -173 21 145 -216 104 220 -350 -184 85 36 -195 602 -104 -7 -81
5423 -81 -190 118 50 -54 -197 -38 -182 -183 -25 26 -52 -109 82 -88 293 -123 -58 62 -134 150 -71 166 -138
5446 -138 -129 95 212 -229 -28 263 32 -106 114 -131 -382 -7 -186 -19 133 81 -37 -161 -147 -59 152 -139
5468 -139 6 -100 214 262 141 41 10 -131 11 10 -143 93 -125 -126 24 -114 -95 -85 -111 47 -112 -37 173
5491 173 -323 121 -78 80 -70 119 20 512 159 37 56 6 -148 -54 34 51 175 25 -33 127 136 145 46 -88
5515 -88 152 -168 -192 19 140 33 96 -142 287 8 -35 221 33 14 -22 68 143 152 144 127 1 79 2 130 129 -216
5541 -216 164 97 345 253 269 42 -100 127 -39 113 23 -140 146 -134 148 -4 -90 -71 126 15 90 -28
5563 -28 221 -87 -280 44 192 64 179 120 126 84 -108 40 59 12 -104 -142 148 -84 -33 136 -144 -20 -82
5586 -82 28 31 6 169 200 12 80 -201 201 109 -194 -226 39 -16 -41 -151 -25 -67 140 -60 -3 40 81 -45 191
5611 191 89 138 133 -57 -138 -30 13 101 -98 147 4 -103 196 168 -142 -90 107 -166 160 359 37 -24 -111
5634 -111 6 265 127 -125 -14 -28 -121 -160 120 32 45 4 6 -223 -48 144 -117 -230 23 -131 4 91 -49
5657 -49 -1 -115 -60 -44 -227 72 151 -215 72 144 -45 123 242 21 54 -68 -26 132 207 -153 -175 136 89 20
5681 20 84 51 65 344 174 -279 -93 -108 -63 124 4 166 235 53 -178 -98 10 147 124 -117 -358 -141 29
5704 29 112 61 -98 -32 48 190 42 -141 -300 82 -274 144 -27 9 -44 81 -66 87 -66 253 -26 25 14
5727 14 -341 25 -160 135 -133 41 -2 -120 -178 116 106 -29 193 10 -29 148 -58 -111 -130 -22 -125 5
5749 5 -138 49 -45 53 -83 -56 70 38 -6 108 207 220 42 93 -6 364 -111 139 -90 -72 -48 35 -85 -164 41
5774 41 -37 112 182 -139 -123 -60 -204 53 -190 -247 -164 28 177 368 -26 -260 2 11 -179 -39 50 -195 -132 61
5798 61 -42 -98 -22 -45 19 -35 -93 30 -126 116 80 3 62 66 282 16 -166 63 99 -65 -196 177 -325 -149
5822 -149 194 153 2 -134 80 -311 -173 -56 -118 -148 -156 53 34 6 -82 -93 158 26 168 140 107 -262 115 296
5846 296 -101 114 269 -270 -105 48 79 -136 151 -67 -345 -74 104 -21 76 246 -52 50 -29 -33 -121 64
5868 64 16 -10 -9 -150 -58 45 53 -123 -18 138 -55 86 -181 -52 -109 71 123 -47 351 -144 -157 72 -49 10
5892 10 60 -169 -9 25 -18 -134 -202 73 -83 -77 26 -112 -133 -42 72 -114 141 -105 -83 26 79 126 -240 -103
5916 -103 -43 -46 53 250 -10 -51 66 -34 13 12 12 77 267 -122 69 187 -50 -150 -119 -157 -162 -141 52 -181 227
5941 227 -31 -167 232 3 16 79 58 2 -105 55 -82 -123 191 -276 -247 -172 -117 -42 132 171 213 76 32 176
5965 176 166 32 -103 -136 112 87 -163 -109 -222 101 8 -149 -86 -9 -18 -106 -160 -126 -28 1 122 -47 170 94 -56
5990 -56 133 -154 322 47 -159 -22 25 -72 23 -151 -27 192 129 -19 -80 -76 -211 -22 -18 -191 196 33 21 -195
6014 -195 21 -32 -18 167 -147 -107 248 62 -75 209 -202 -59 -109 42 -6 -17 124 -234 52 232 -75 161
6036 161 115 4 -62 -192 -131 208 -231 -82 -54 -51 -195 -115 -62 366 -69 -22 -2 290 -127 134 -111 -23 106 -109
6060 -109 -26 22 242 -10 -101 -6 159 -212 70 64 -165 137 128 -224 232 60 136 91 192 39 -9 268 -193 -26
6084 -26 -212 -81 -90 189 -96 84 229 -147 75 71 -36 -274 -48 53 -7 138 165 73 -1 -83 -285 86 40 -187
6108 -187 -53 28 -5 -76 -32 3 -40 -54 -46 145 223 -32 -31 -153 -300 -59 -273 71 -39 91 18 80 11 -31 76
6133 76 317 -168 -133 -128 61 -52 -3 -29 37 70 45 -21 170 176 -179 128 25 -105 100 -148 18 -106 185 -59
6157 -59 -12 260 118 94 -211 -51 -167 129 -59 -185 1 109 -46 -212 109 -266 124 -271 236 -29 14
6178 14 30 72 -167 -18 127 6 157 -277 124 183 -45 74 -1 -56 64 -144 435 -105 256 -35 21 158
6200 158 54 -40 27 -79 65 -144 -73 100 -8 -196 -144 94 -46 118 -340 -187 -262 -178 188 -80 -215 54
6222 54 97 62 216 42 9 -28 12 -105 -59 -40 -220 -94 -68 -206 147 13 19 -95 221 -110 -115 -160 -127 -157 -179 -103
6248 -103 31 -28 -194 -6 -6 48 -110 -49 108 -170 81 30 77 73 -171 103 15 107 35 -73 68 -70 -1 -266
6272 -266 55 -82 113 -54 209 -93 -23 262 40 -67 -132 82 -274 -205 163 97 -35 20 -7 56 170 -5
6294 -5 -29 280 -247 48 28 137 -135 -270 -207 6 -9 126 210 -110 170 26 71 115 -21 73 -201 235 43
6317 43 -72 93 119 -151 -20 112 55 -31 -136 124 169 -31 32 82 84 -8 78 37 -211 91 86 89 147 -131 15 -42
6343 -42 -173 -110 -240 -62 51 208 -318 185 28 46 80 -101 -149 39 -10 -171 79 -111 -60 153 32 -219
6365 -219 -49 55 -424 -146 -92 -267 -160 -114 -144 165 84 -131 86 -158 82 206 168 -135 17 143 -36 -85
6387 -85 99 237 -188 142 72 -25 34 84 47 -65 -125 -128 -62 107 89 -98 -118 -56 -30 34 40 -73 78 -145 -80 255
6413 255 -73 282 109 -131 39 -80 -49 175 -19 21 128 -137 -123 257 13 287 -38 63 101 -141 -81 66
6435 66 121 49 102 -77 48 -35 -55 -65 -28 41 -37 18 -137 -36 -92 9 245 79 -163 -303 63 -24 -229 -23
6459 -23 102 -32 -16 38 -66 -178 17 -46 -19 308 56 56 99 -85 103 225 42 -396 91 -20 -99 8 238
6482 238 89 -206 -82 129 -73 45 109 -51 68 64 -33 -40 -73 -4 -164 -107 -57 96 4 -88 -31 31 35 111 80 -181
6508 -181 29 80 137 -141 -113 154 -84 102 34 70 -66 118 50 5 98 -34 84 24 -109 95 66 -152 -3
6531 -3 117 -93 -185 -168 -123 40 -189 7 -45 100 46 64 140 -105 112 -330 -192 -99 122 144 57 77 -23 -56 379
6556 379 60 74 82 -127 27 85 126 95 102 -28 -166 -93 29 71 46 -83 -126 -67 16 147 166 -86 -40 93 -8
6581 -8 -85 0 64 -72 -110 120 -12 82 -85 195 -153 -14 -73 -230 -71 37 249 105 -173 215 13 -54 -96
6604 -96 -330 80 -75 -58 42 -92 68 -166 -118 343 -86 153 5 -42 -33 114 67 -2 -233 100 -190 -178 -28
6627 -28 -250 -215 -71 77 -21 7 -186 382 -43 -41 -146 82 130 -9 -9 139 -105 -161 -193 28 -242 -197 -193 8 130
6652 130 65 77 235 126 -2 82 -107 -124 48 37 -269 -29 -10 -90 156 33 -109 -204 213 -25 13 -89 -128
6675 -128 -69 -18 -214 4 65 -154 -127 -121 88 -5 167 166 -221 -19 278 21 135 -35 -34 68 -97 -53 -53 74 102
6700 102 138 -201 24 47 93 226 -42 -276 116 -82 -101 -5 -223 -132 14 -38 133 0 31 -96 0 -236 -55
6723 -55 -286 -39 -216 176 368 -32 225 -190 -77 -171 -53 52 -15 -67 109 230 -23 -72 -77 54 66 -62 66
6746 66 131 171 -94 -180 65 61 16 -1 -43 -168 194 -157 -32 16 -66 20 -28 -83 -187 -92 72 76 183 119 -105 125
6772 125 170 78 -182 -152 211 14 -92 -78 -173 381 -60 25 -119 -80 105 -60 73 -17 -34 243 -16 -90 -168 284
6796 284 -107 21 4 -21 -70 17 24 -151 172 -5 118 -55 81 17 75 -20 -174 95 -36 26 -43 132 -103 -204
6820 -204 10 167 -96 -10 -121 -200 -41 -29 -142 -36 -43 189 -96 -367 -32 9 -3 -37 -21 81 79 110 348 35
6844 35 32 63 26 -85 16 275 162 -117 9 -42 -41 107 183 0 45 -164 -62 148 -219 -60 170 207 -185 138
6868 138 -38 201 -59 -110 -45 79 -222 -40 -146 39 -25 322 140 -40 -26 -164 97 -21 -95 59 -138 -298
6890 -298 150 -32 -162 -33 -139 -90 -81 -83 -59 278 212 70 33 120 49 4 283 -64 112 -134 -98 -40 -163 -132 29
6915 29 -37 -21 -105 -99 -148 -154 -4 264 28 -135 53 98 -27 -62 -233 45 145 -247 -143 -170 -131 276 -149 375
6939 375 54 -194 175 -104 -73 -98 152 -109 -44 -208 7 -345 -72 94 -40 -215 212 -100 319 -196 -93
6960 -93 134 -96 301 58 32 -105 41 -100 136 96 12 89 -34 -67 -38 109 -166 3 -129 -107 -118 -110 59 50
6984 50 163 105 -158 -184 12 -63 5 6 -12 -97 95 -70 -40 46 58 -33 -72 -90 -142 -186 89 63 -100 271 185 -105
7010 -105 159 -67 136 75 151 -28 -219 -9 63 -127 156 -109 66 -26 209 -124 -48 97 -185 -40 -135 63
7032 63 28 -116 152 123 105 129 -82 134 104 77 23 79 44 -175 -294 -89 125 -44 -20 -101 -3 -1 -289 -93 51
7057 51 220 -49 28 -174 53 -20 133 -124 -125 -98 -53 199 26 161 -61 56 5 -46 28 -186 -116 -118 102 75 -30
7082 -30 -26 -26 202 -126 20 -14 -128 -196 -77 84 2 -12 -102 33 98 -30 224 -281 -65 111 -39 165 -45 36
7106 36 -91 -168 -87 -93 -7 -114 17 54 -230 -303 -50 134 -89 70 -8 -93 -141 293 174 72 -53 -22 25 56 -90
7131 -90 -124 -86 77 89 127 64 -50 -49 -12 224 -56 31 246 -271 109 -160 -173 -4 142 73 -174 -111 107 -71
7155 -71 -61 174 267 135 13 135 -30 60 79 -122 124 112 15 30 62 -251 150 -4 4 110 101 -91 -116 244 19
7180 19 -195 -109 -165 -46 72 -140 -54 55 -261 -237 264 -28 -169 2 -126 -16 110 69 111 34 173 -256 -218
7203 -218 23 -54 57 38 270 -73 60 151 -145 -83 -143 276 86 5 37 -22 -249 -114 115 -14 94 -55 -132
7226 -132 -58 90 35 126 3 -45 55 -63 -214 -153 -6 197 -107 27 69 146 -242 66 -237 25 -226 -196 382
7249 382 147 90 41 208 -26 41 97 -66 43 -44 -76 -113 188 -229 -37 -19 180 -67 135 -7 -69 -244 -35
7272 -35 -78 266 2 -227 -5 -50 85 252 -97 103 -22 -65 -31 -21 -129 -130 40 -53 -171 -310 224 -278 74
7295 74 10 -13 92 -78 181 -52 -52 -136 104 58 201 -25 258 -291 -155 -181 -110 -9 -74 215 -188 -104 -39 74
7319 74 -100 57 -57 -84 74 109 98 -344 -161 -96 -23 130 -63 131 -59 -64 -138 -237 -50 104 -22 -48 -4 42
7343 42 142 69 -152 -2 35 63 12 9 -29 -102 -191 4 -38 43 -191 72 48 -43 94 -15 104 -248 88 169 44
7368 44 55 -39 105 -220 -260 -5 -127 -248 -106 356 -287 117 -73 -92 31 230 -51 171 199 251 -223 139
7390 139 209 -46 -50 223 19 -116 67 -21 209 -23 34 92 -181 8 -130 66 147 -15 293 -195 -2 -204
7412 -204 -97 4 13 144 -192 -380 89 -80 -291 -56 199 -40 80 52 7 56 152 -127 -158 -201 18 -98 -209
7435 -209 -58 65 140 112 -30 19 -94 -310 34 -77 123 35 7 -166 32 -106 -55 -17 2 4 262 -36 -265
7458 -265 -114 70 49 131 155 -192 -132 -19 133 92 26 -221 -58 -77 0 -18 30 -119 -214 -35 -63 -103 -189 69 223
7483 223 -38 -116 87 -309 -57 42 -13 -321 161 68 -71 202 42 150 -79 -291 104 195 -22 79 89 43
7505 43 -105 145 30 -29 -207 174 -147 228 -8 -91 72 -26 -170 142 77 7 157 30 10 -152 156 -52
7527 -52 -123 -1 -218 -45 -53 -12 97 171 225 -69 14 -169 154 54 -58 -151 -76 -118 -68 299 119 -2 -73 154
7551 154 -7 -255 89 -111 17 52 141 -51 -100 -15 70 -235 -113 257 126 -26 5 -112 -1 40 -224 26
7573 26 60 110 42 -299 117 57 142 -57 -8 -22 113 -63 -79 -144 214 223 -1 130 -92 -166 -106 -144 -71 27 -97 -123
7599 -123 -131 -141 97 -149 95 -66 -152 -51 -198 -47 9 242 -191 155 -318 38 -53 -158 -17 -129 107 6
7621 6 -4 -192 183 99 -231 -132 -4 -71 55 -158 -202 136 -105 253 214 154 95 28 145 42 -31 193 -102 27
7645 27 68 -48 -107 398 148 -18 70 -293 -96 320 -15 -45 -63 10 -150 -7 -34 -14 -208 59 -33 -154 -253 -113
7669 -113 -34 180 48 -148 -318 -103 -70 222 46 -4 -77 97 11 106 192 -198 82 237 110 -124 -54 3 -121
7692 -121 -114 -180 20 -72 -95 59 67 -98 186 -228 -115 -43 -93 116 -92 -327 57 70 -169 -136 -158 -140 -32 169
7716 169 -13 62 25 14 -14 95 -223 7 4 -198 29 -197 111 102 270 -370 -4 -137 76 -2 63 4 -109 -27
7740 -27 144 271 55 -235 34 -158 -52 169 36 16 -54 15 -179 -199 70 23 -252 80 137 118 57 72 -34
7763 -34 47 149 -1 -290 186 -165 78 -13 -86 -281 -67 123 56 49 -39 -154 115 -151 -220 -99 88 267 -312
7786 -312 22 -52 -211 16 307 -154 159 -116 39 32 -10 29 -237 158 287 -33 56 -155 7 130 63 -168
7808 -168 147 192 -176 135 101 -357 -181 -209 -251 91 -88 -171 76 -60 139 272 -245 -55 -166 -190 -118 97
7830 97 -87 135 -108 32 -55 97 -124 -214 -131 6 54 -119 -141 -102 89 -311 -135 89 -276 -99 201 128 36
7853 36 4 -117 132 289 137 14 65 142 -278 -150 130 -87 172 166 -235 51 -148 107 74 229 108 -143
7875 -143 110 40 210 103 121 -67 170 83 37 -162 -190 59 -30 -157 138 -15 -21 -17 -95 218 -54 -67 25 99 -72
7900 -72 -438 9 105 89 -219 145 111 -144 89 1 36 -141 230 -207 -14 -127 -71 15 74 297 69 82 -5 67
7924 67 -14 -147 112 95 134 31 -198 -179 42 131 -102 -105 -29 97 -13 -210 173 -186 -139 -80 19 -212 284 -39
7948 -39 -263 -324 -109 -30 42 302 3 -121 43 -208 92 143 -94 6 165 74 43 57 62 -23 -197 160 -223 -175
7972 -175 -79 -82 50 170 -123 4 -55 12 -36 -67 -4 -38 55 38 -118 -170 -169 37 84 79 -27 0 126 160 21 -97
7998 -97 -232 8 -195 36 -39 230 -19 225 -108 -30 -212 71 258 -2 -206 111 16 -55 -2 -17 40 -136 42
8021 42 -185 208 -37 -7 -73 64 107 14 177 87 -208 -56 102 129 205 28 249 -139 -103 -104 -89 -62 -64 9 -4 154
8047 154 -119 -58 -115 -73 138 35 -141 -26 -205 -225 -154 72 34 237 218 51 143 -84 122 -77 -23 -50 127
8070 127 229 23 -22 -50 168 -137 -130 -41 90 91 -139 -206 -143 -184 -113 -15 -105 259 -160 -148 92 47 76 54 -80 25
8096 25 103 -19 139 180 -64 14 389 195 -57 42 -136 -26 -45 103 -344 -165 21 -147 -77 100 -108 -90 -69
8119 -69 88 -2 66 38 -66 13 44 5 -13 48 151 -194 291 122 74 108 -53 -257 14 -60 276 40 -29 56 -33
8144 -33 142 -195 49 -36 8 -14 113 -68 -81 153 6 -100 -173 91 405 293 83 -11 -218 84 -169 -32
8166 -32 158 57 173 -287 1 11 -144 -220 -107 32 -157 168 34 -152 70 14 -149 99 129 91 69 -22 72
8189 72 60 202
8191B02
##END NTUPLES=NMR FID
##END=
