##TITLE=1H_B1d2910
 CDCl3
 8 sc, 
 30.10.2024
##JCAMPDX= 6.0         $$ Bruker NMR JCAMP-DX V2.0
##DATA TYPE= NMR FID
##DATA CLASS= NTUPLES
##ORIGIN= UXNMR, Bruker Analytische Messtechnik GmbH
##OWNER= root
$$ XWIN-NMR		Version 3.5
$$ Wed Oct 30 14:33:29 2024 Russian Standard Time (UT+4h)  she@DPX200
##.OBSERVE FREQUENCY= 200.1318
##.OBSERVE NUCLEUS= ^1H
##.DELAY= (6, 6)
##.ACQUISITION MODE= SIMULTANEOUS
##.ACQUISITION SCHEME= undefined
##.AVERAGES= 8
##.DIGITISER RES= 18
##SPECTROMETER/DATA SYSTEM= spect
##.PULSE SEQUENCE= zg30
##.SOLVENT NAME= DMSO
##.SHIFT REFERENCE= (INTERNAL, DMSO, 0, 15.7039)
##AUDIT TRAIL= $$ (NUMBER, WHEN, WHO, WHERE, WHAT)
$$ ##TITLE= Audit trail, XWIN-NMR		Version 3.5
$$ ##JCAMPDX= 5.01
$$ ##ORIGIN= Bruker BioSpin GmbH
$$ ##OWNER= she
$$ F:/spectra/data/she/nmr/H-F/1/audita.txt
$$ ##AUDIT TRAIL=  $$ (NUMBER, WHEN, WHO, WHERE, WHAT)
(   1,<2024-10-30 14:31:45.71 +0400>,<she>,<DPX200>,
      <created by zg, POWCHK disabled, PULCHK disabled
       configuration hash MD5:
       00 E9 B6 7A A2 85 ED C7 34 08 36 98 17 FE 4E 26
       data hash MD5: 16K
       C8 84 50 9F 19 16 14 8E 43 1C 75 C4 12 9A A5 88>)
$$ ##END=
$$ 
$$ hash MD5
$$ 90 9F E5 9A CE 9E A7 3D 3E 31 91 CE F9 A1 32 FA
##$RELAX= 
##$RELAX= 
##$RELAX= 
##$RELAX= 
##$RELAX= 
##$RELAX= 
$$ Bruker specific parameters
$$ --------------------------
##$DU= <F:/spectra>
##$EXPNO= 1
##$NAME= <H-F>
##$PROCNO= 1
##$TYPE= <nmr>
##$USER= <she>
##$AMP= (0..31)
100 100 100 100 100 100 100 100 100 100 100 100 100 100 100 100 100 100 
100 100 100 100 100 100 100 100 100 100 100 100 100 100 
##$AQSEQ= 0
##$AQ_mod= 1
##$AUNM= <au_zg>
##$AUTOPOS= <>
##$BF1= 200.13
##$BF2= 200.13
##$BF3= 200.13
##$BF4= 200.13
##$BF5= 200.13
##$BF6= 200.13
##$BF7= 200.13
##$BF8= 200.13
##$BYTORDA= 1
##$CFDGTYP= 0
##$CFRGTYP= 5
##$CHEMSTR= <none>
##$CNST= (0..31)
1 1 145 1 1 1 1 1 1 1 1 1 1 1 1 1 1 1 1 1 1 1 1 1 1 1 1 1 1 1 1 1 
##$CPDPRG= <>
##$CPDPRG1= <>
##$CPDPRG2= <>
##$CPDPRG3= <>
##$CPDPRG4= <mlev>
##$CPDPRG5= <mlev>
##$CPDPRG6= <mlev>
##$CPDPRG7= <mlev>
##$CPDPRG8= <mlev>
##$CPDPRGB= <>
##$CPDPRGT= <>
##$D= (0..31)
0 1.2 0 0 0 0 0 0 0 0.06 0 0.03 0 0 0 0 0.0002 0 0 0 0 0 0 0 0 0 0 0 0 
0 0 0 
##$DATE= 1730284305
##$DBL= (0..7)
120 120 120 120 120 120 120 120 
##$DBP= (0..7)
150 150 150 150 150 150 150 150 
##$DBP07= 0
##$DBPNAM0= <>
##$DBPNAM1= <>
##$DBPNAM2= <>
##$DBPNAM3= <>
##$DBPNAM4= <>
##$DBPNAM5= <>
##$DBPNAM6= <>
##$DBPNAM7= <>
##$DBPOAL= (0..7)
0.5 0.5 0.5 0.5 0.5 0.5 0.5 0.5 
##$DBPOFFS= (0..7)
0 0 0 0 0 0 0 0 
##$DE= 6
##$DECBNUC= <off>
##$DECIM= 24
##$DECNUC= <off>
##$DECSTAT= 4
##$DIGMOD= 1
##$DIGTYP= 9
##$DL= (0..7)
0 120 120 120 120 120 120 120 
##$DP= (0..7)
150 150 150 150 150 150 150 150 
##$DP07= 0
##$DPNAME0= <>
##$DPNAME1= <>
##$DPNAME2= <>
##$DPNAME3= <>
##$DPNAME4= <>
##$DPNAME5= <>
##$DPNAME6= <>
##$DPNAME7= <>
##$DPOAL= (0..7)
0.5 0.5 0.5 0.5 0.5 0.5 0.5 0.5 
##$DPOFFS= (0..7)
0 0 0 0 0 0 0 0 
##$DQDMODE= 0
##$DR= 18
##$DS= 0
##$DSLIST= <SSSSSSSSSSSSSSS>
$$ [...]
##$SUBNAM2= <"">
##$SUBNAM3= <"">
##$SUBNAM4= <"">
##$SUBNAM5= <"">
##$SUBNAM6= <"">
##$SUBNAM7= <"">
##$SUBNAM8= <"">
##$SUBNAM9= <"">
##$SW= 24.0689170037331
##$SWIBOX= (0..15)
0 0 2 0 0 0 0 0 0 0 0 0 0 0 0 0 
##$SW_h= 4816.95568400771
##$TD= 16384
##$TD0= 1
##$TE= 0
##$TE2= 300
##$TE3= 300
##$TEG= 300
##$TL= (0..7)
0 120 120 120 120 120 120 120 
##$TP= (0..7)
150 150 150 150 150 150 150 150 
##$TP07= 0
##$TPNAME0= <>
##$TPNAME1= <>
##$TPNAME2= <>
##$TPNAME3= <>
##$TPNAME4= <>
##$TPNAME5= <>
##$TPNAME6= <>
##$TPNAME7= <>
##$TPOAL= (0..7)
0.5 0.5 0.5 0.5 0.5 0.5 0.5 0.5 
##$TPOFFS= (0..7)
0 0 0 0 0 0 0 0 
##$TUNHIN= 0
##$TUNHOUT= 0
##$TUNXOUT= 0
##$USERA1= <user>
##$USERA2= <user>
##$USERA3= <user>
##$USERA4= <user>
##$USERA5= <user>
##$V9= 5
##$VALIST= <valist>
##$VCLIST= <CCCCCCCCCCCCCCC>
##$VD= 0
##$VDLIST= <DDDDDDDDDDDDDDD>
##$VPLIST= <PPPPPPPPPPPPPPP>
##$VTLIST= <TTTTTTTTTTTTTTT>
##$WBST= 1024
##$WBSW= 4
##$XGAIN= (0..3)
0 0 0 0 
##$XL= 0
##$YL= 0
##$YMAX_a= 170579
##$YMIN_a= -191329
##$ZGOPTNS= <>
##$ZL1= 120
##$ZL2= 120
##$ZL3= 120
##$ZL4= 120
##$ABSF1= 10
##$ABSF2= 0
##$ABSG= 5
##$ABSL= 3
##$ALPHA= 0
##$AQORDER= 0
##$ASSFAC= 0
##$ASSFACI= 0
##$ASSFACX= 0
##$ASSWID= 0
##$AUNMP= <proc_1d>
##$AZFE= 0.1
##$AZFW= 0.1
##$BCFW= 1
##$BC_mod= 2
##$BYTORDP= 1
##$COROFFS= 0
##$CY= 11.3945322036743
##$DATMOD= 1
##$DC= 2
##$DFILT= <>
##$DTYPP= 0
##$F1P= 15.6554695791079
##$F2P= 12.8336369535428
##$FCOR= 0.5
##$FTSIZE= 0
##$FT_mod= 4
##$GAMMA= 1
##$GB= 0.15
##$INTBC= 1
##$INTSCL= 1
##$ISEN= 128
##$LB= 0.24
##$LEV0= 0
##$LPBIN= 0
##$MAXI= 10000
##$MC2= 0
##$MEAN= 0
##$ME_mod= 0
##$MI= 1.114404
##$NCOEF= 0
##$NC_proc= 0
##$NLEV= 6
##$NOISF1= 3.799351
##$NOISF2= 2.8
##$NSP= 1
##$NTH_PI= 0
##$NZP= 0
##$OFFSET= 15.70392
##$PC= 1
##$PHC0= -26356.75
##$PHC1= 23.18743
##$PH_mod= 1
##$PKNL= yes
##$PPARMOD= 0
##$PSCAL= 0
##$PSIGN= 0
##$REVERSE= no
##$SF= 200.130013532006
##$SI= 16384
##$SIGF1= 3
##$SIGF2= 2
##$SINO= 400
##$SIOLD= 16384
##$SREGLST= <1H.CDCl3>
##$SSB= 0
##$STSI= 0
##$STSR= 0
##$SW_p= 3612.71676300578
##$SYMM= 0
##$S_DEV= 0
##$TDeff= 0
##$TDoff= 0
##$TI= <>
##$TILT= no
##$TM1= 0
##$TM2= 0
##$TOPLEV= 0
##$USERP1= <user>
##$USERP2= <user>
##$USERP3= <user>
##$USERP4= <user>
##$USERP5= <user>
##$WDW= 1
##$XDIM= 8192
##$YMAX_p= 0
##$YMIN_p= 0
$$ End of Bruker specific parameters
$$ ---------------------------------
##NTUPLES= NMR FID
##VAR_NAME=  TIME,          FID/REAL,        FID/IMAG
##SYMBOL=    X,             R,               I
##VAR_TYPE=  INDEPENDENT,   DEPENDENT,       DEPENDENT
##VAR_FORM=  AFFN,          ASDF,            ASDF
##VAR_DIM=   8192,          8192,            8192
##UNITS=     SECONDS,       ARBITRARY UNITS, ARBITRARY UNITS
##FACTOR=    0.0002076,     1,               1
##FIRST=     0,             0,               0
##LAST=      1.7004516,     0,               0
##MIN=       0,             -191329,         0
##MAX=       1.7004516,     170579,          0
$$ Real data points
##PAGE= N=1
##DATA TABLE= (X++(R..R)), XYDATA
0 0 0 0 0 0 0 0 0 0 0 8 -8 8 -8 16 -16 22 -24 32 -33 40 -49 57 -68 78 -88 103 -119 135 -154 174 -197 222
32 222 -250 280 -313 347 -388 433 -479 531 -590 653 -723 801 -887 979 -1087 1208 -1347
49 -1347 1501 -1684 1898 -2154 2467 -2857 3362 -4037 4995 -6447 8896 -20409 170579 2094
63 2094 -149099 154242 7464 -174904 104061 96495 -144514 44177 92057 -132650 -13787
74 -13787 127694 -63302 -50878 92718 -26861 -77780 75858 35182 -77033 18565 58580
85 58580 -67361 -22734 85617 -34285 -67206 85920 3038 -93342 75315 41941 -110478
96 -110478 50734 76884 -113315 12861 97279 -103128 -16106 120130 -79860 -52145 118647
107 118647 -52985 -70413 120679 -21115 -95037 92450 3976 -96647 76340 34598 -97383
118 -97383 37117 52006 -75754 15460 68601 -56018 -23515 62143 -23916 -39518 52476
129 52476 4527 -58986 25271 38568 -51070 -914 62094 -42325 -38347 76822 -14722 -68735
141 -68735 73934 11657 -95491 61150 48612 -104305 35773 77754 -100684 5383 102295
152 102295 -84078 -32222 109149 -57830 -61992 105506 -25984 -84646 87543 9158 -88462
163 -88462 62189 37537 -83775 28342 57183 -63855 -4809 61115 -39890 -34009 56486
174 56486 -6262 -49719 39682 22621 -55299 16263 49215 -48387 -14920 61608 -33543 -43311
186 -43311 68025 -8403 -67312 61530 19561 -79945 48192 46536 -84726 24111 66524
197 66524 -78570 -1710 78893 -64125 -28519 82597 -40273 -47967 78184 -14428 -61205
208 -61205 63815 10133 -65890 42291 28615 -61930 17242 41810 -47113 -6170 46423 -25955
220 -25955 -25451 43512 -1716 -39669 30394 20219 -46058 11213 38409 -42596 -10765 51333
232 51333 -29506 -31355 57297 -10637 -49809 53253 10659 -62982 41078 30269 -68900 23771
244 23771 47759 -65003 4488 60418 -52988 -15482 65733 -34800 -33510 61488 -15397 -47365
256 -47365 49802 5085 -52951 33577 23118 -49055 14729 36316 -37846 -5437 40833 -21545
268 -21545 -24109 37137 -2372 -37621 26766 17869 -42765 11982 36453 -39780 -6374 48543
280 48543 -29626 -26121 52731 -14690 -44270 48894 4557 -55870 39046 24798 -59820 24420
292 24420 41985 -56407 5867 52316 -46712 -13634 55001 -31329 -29865 50871 -12063 -39774
304 -39774 41414 7555 -43350 26618 23275 -40563 8366 32447 -31595 -9891 35417 -16923
316 -16923 -24375 32607 1235 -33414 24138 18622 -37173 10244 32641 -35513 -6548 41127
328 41127 -27742 -22406 44930 -14037 -34994 42476 2246 -43610 34726 17986 -48038 21356
340 21356 30740 -46948 5704 39841 -39191 -9498 44732 -26016 -21916 43116 -10515 -31432
352 -31432 34654 4832 -36786 21453 18299 -35840 6499 28878 -28154 -7837 34277 -15546
364 -15546 -21213 32600 -1055 -31589 24082 13874 -36483 12001 27524 -35132 -2017 37906
376 37906 -27341 -16099 42367 -15735 -28957 39795 -2053 -38670 31351 12225 -42487 19638
388 19638 25827 -39896 6156 35375 -32202 -7927 38749 -21055 -20646 35767 -8087 -29165 27771
401 27771 6200 -32300 17055 19003 -29641 4244 27870 -23330 -9464 30819 -13485 -21392
413 -21392 28791 -1412 -29411 22329 12428 -32123 12335 24506 -30326 -165 32499 -24749
425 -24749 -13855 35362 -15413 -24963 33716 -2917 -32329 27869 10526 -34788 17999 21769
437 21769 -33439 4706 29404 -28069 -8431 32854 -18197 -19367 31731 -5580 -26360 26190
449 26190 7546 -29193 15749 18136 -28628 2682 25666 -22792 -9944 29374 -12733 -20012
461 -20012 28466 -791 -26665 22375 10952 -29823 12086 20526 -28554 -161 27451 -22547
473 -22547 -11223 31132 -12648 -20442 29778 -1262 -27153 23574 9122 -30286 13435 18326
485 18326 -28483 2371 25635 -22223 -8354 28852 -12814 -17772 27818 -2690 -24781 21685
497 21685 7199 -27662 12563 16645 -25990 2123 23895 -20049 -8103 27034 -11716 -17440
509 -17440 25934 -2047 -24814 20210 7687 -27267 11764 17391 -25217 2268 24100 -19560
521 -19560 -8328 26927 -11430 -18035 25103 -1970 -24671 19534 8026 -26640 11895 17436
533 17436 -24340 2129 23741 -19056 -8469 25856 -11185 -17613 24191 -1906 -23758 19378
545 19378 8372 -25458 12153 17133 -23569 2323 22313 -18735 -7665 23955 -11343 -16502
557 -16502 22577 -1962 -21574 18523 7962 -23260 11051 15454 -21602 1570 20099 -17213
569 -17213 -8162 22096 -9636 -15648 21039 -183 -20737 16893 8940 -22659 9525 16225 -21710
582 -21710 265 21195 -17293 -8886 23231 -9635 -16357 22626 -539 -21423 18311 8073
594 8073 -23884 11169 14849 -23009 2284 19804 -18401 -5882 22471 -10811 -13064 21508 -2351
607 -2351 -18468 17320 5783 -21266 9815 12340 -20010 1548 17516 -15132 -6305 20012 -7559
620 -7559 -13471 18761 401 -18916 13826 8259 -21168 7068 14933 -19762 -432 19954 -14804
633 -14804 -7875 22147 -8057 -15069 20410 -858 -20299 15904 7010 -22383 9801 13991 -20772
646 -20772 2800 19006 -16450 -4802 20368 -10150 -11887 18565 -2795 -16946 14352 4983
658 4983 -18524 8578 11907 -16879 1538 16386 -12703 -6150 17658 -6800 -12970 15817 637
671 637 -17555 12126 8566 -18985 6515 15342 -17671 -712 19377 -14048 -8537 20417 -8247
684 -8247 -14706 18917 -737 -18774 15324 6946 -20067 9542 13286 -18946 2454 16653 -15443
697 -15443 -4822 17522 -9905 -10552 16304 -2225 -14092 13014 5070 -15531 7056 10655 -14914
710 -14914 -43 14248 -11308 -6727 15622 -5239 -12033 14209 1816 -15496 10965 8583 -17238
723 -17238 4777 13816 -16522 -2040 17371 -13108 -7983 19209 -7318 -13172 18323 -676 -16757
736 -16757 14426 5488 -18717 8741 10557 -17906 2460 14712 -14307 -3296 16551 -8778
748 -8778 -8356 15566 -2532 -12541 11383 3583 -14360 5716 8911 -13359 121 13668 -9360
761 -9360 -6004 14818 -4195 -11275 13522 1411 -15443 9511 7508 -16402 4490 13055 -15336
774 -15336 -1116 17290 -11888 -7247 18579 -7113 -12650 16893 -1484 -16238 13161 4432 -17064
787 -17064 8307 10233 -15536 2711 13893 -12389 -3316 14745 -8047 -8570 12956 -2205 -11794
800 -11794 10011 4108 -12676 5255 9363 -11098 -441 12737 -8247 -6768 13317 -3819 -11714
813 -11714 12245 1997 -14615 9215 8120 -14968 4253 12587 -14258 -1518 15488 -11189
825 -11189 -7173 16409 -6727 -11631 15645 -1047 -14131 12613 4138 -14929 7870 8699 -13833
838 -13833 2027 11498 -11160 -3726 12499 -6338 -7536 11882 -913 -10065 8679 4493 -11086
851 -11086 3879 8347 -10374 -1578 10878 -7309 -6715 12467 -2481 -10685 11725 2667 -13448
864 -13448 8709 6853 -14636 4000 10810 -13238 -956 14014 -10104 -6002 15276 -5693 -9892
877 -9892 14387 -1180 -12713 11032 3292 -13665 6613 7544 -12393 1873 10257 -8983 -2793
890 -2793 11497 -4871 -7114 10335 -469 -9929 7086 4018 -10960 3196 8168 -9517 -1160
903 -1160 11173 -6388 -6081 11744 -2560 -10370 10579 1748 -13140 7845 6297 -13540 4228
916 4228 10300 -12020 -78 12995 -9373 -4958 13315 -5552 -9095 12275 -1237 -11295 9650
929 9650 3206 -11832 6309 6988 -10576 1812 9344 -8041 -3007 9714 -4408 -7084 9024
942 9024 148 -9195 6665 4855 -9732 3131 8220 -8703 -1456 10257 -6381 -6172 10722 -2517
956 -2517 -9599 9961 1722 -11549 7928 6064 -12216 4305 9325 -11446 -251 10974 -9150
969 -9150 -4528 11537 -4878 -7858 11012 -550 -9922 8660 3364 -10573 4689 6447 -9748
982 -9748 681 8220 -7209 -3139 9200 -3284 -6347 8447 756 -8650 6125 4451 -9619
995 -9619 2255 7532 -8619 -1556 9707 -6382 -5057 10477 -2349 -8205 9536 1456 -10357
1008 -10357 6893 4930 -11354 3550 7964 -10329 30 9966 -7784 -3731 10635 -4134 -6572
1021 -6572 9547 -525 -9134 7075 3163 -9653 3821 6375 -8646 360 8354 -6213 -3116
1034 -3116 8888 -3121 -6504 7555 579 -8566 5556 4248 -9283 2271 7554 -7927 -1155
1047 -1155 9508 -5954 -4559 9665 -2921 -7697 8399 854 -9641 6233 4737 -10042 3505
1060 3505 7805 -9007 -56 9166 -6943 -3574 9445 -3876 -6639 8400 -156 -8171 6385
1073 6385 3375 -8579 3516 6315 -7491 -235 7982 -5946 -3519 7910 -2893 -6304 7199
1086 7199 791 -7547 5247 4292 -8332 2186 6871 -7679 -1106 8365 -6038 -4206 8730 -2958
1100 -2958 -6655 7858 929 -8191 6019 3914 -8834 2693 6486 -8331 -541 7971 -6219
1113 -6219 -3543 8658 -3147 -5840 7872 289 -7441 5900 3303 -8044 2613 5780 -7400
1126 -7400 -687 7555 -5293 -3424 8174 -2265 -5734 7293 688 -7348 4775 3699 -7841
1139 -7841 1825 6081 -7023 -813 7935 -5012 -3657 8412 -2324 -5993 7204 536 -7833 4637
1153 4637 3434 -8137 2238 5937 -6784 -553 7687 -4842 -3387 7985 -2486 -5922 6874
1166 6874 182 -7469 4633 3207 -7305 2189 5841 -6378 -277 7492 -4537 -3430 7572 -2446
1180 -2446 -5809 6737 365 -7038 4825 3373 -7165 2480 5880 -6305 -423 7221 -4842 -3437
1194 -3437 7315 -2309 -5923 6479 212 -7017 4771 3385 -6961 2163 5821 -6244 -766 7025
1208 7025 -4737 -3908 7161 -2373 -5797 6463 718 -6813 4783 3336 -6919 2290 5395 -6329
1222 -6329 -721 6652 -4954 -3381 7034 -2427 -5283 6556 562 -6215 4886 2917 -6633 2412
1236 2412 4882 -6050 -477 6139 -4257 -3016 6447 -2011 -4920 5986 892 -6117 4150 3231
1250 3231 -6613 1580 4894 -5603 -1087 6271 -3963 -3313 6844 -1557 -5369 6384 1072 -6486
1264 -6486 4727 3030 -7245 1979 5052 -6244 -494 6447 -4481 -2695 6975 -2212 -4878 6143
1278 6143 98 -6133 4651 2257 -6490 2433 4231 -5480 -232 5633 -3587 -2530 5974 -1516 -4818
1293 -4818 4889 667 -6092 3659 3069 -6076 1507 4995 -5058 -832 6218 -3414 -3347 6366 -1466
1308 -1466 -5433 5559 818 -6592 4095 3167 -6620 2328 5023 -5991 -155 6155 -4331 -2584
1322 -2584 6112 -2255 -4670 5434 32 -5526 4163 2301 -5752 2242 4198 -4999 -215 5129 -3539
1337 -3539 -2531 5088 -1268 -4368 4657 925 -5453 3619 3397 -5612 1329 4893 -5037 -1005 5702
1352 5702 -3791 -3193 6010 -1669 -4912 5588 937 -6060 4349 3127 -6386 2150 4457 -5916
1366 -5916 23 5346 -4604 -2299 5922 -2413 -3731 5206 15 -4918 3738 2126 -5305 1735 3563
1381 3563 -4503 -363 4519 -3167 -2244 4880 -872 -3965 4278 1144 -5101 2745 3085 -5552 655
1396 655 4636 -5044 -1087 5787 -3418 -3118 6132 -1287 -4812 5254 764 -5923 3580 2496 -6220
1411 -6220 1994 4248 -5678 127 5495 -3855 -1637 5425 -2191 -3312 4485 -252 -4748 3173 1756
1426 1756 -4879 1611 3708 -3968 -169 4503 -2650 -2174 4496 -924 -4018 3592 1068 -5102 2395
1441 2395 3267 -5038 930 4777 -4297 -1059 5772 -3051 -3048 5697 -1806 -4588 4790 530 -5386 3639
1457 3639 2595 -5610 2249 4049 -5097 116 4885 -4015 -1858 4806 -2183 -3291 4305 131 -3850
1472 -3850 3024 1880 -3982 1219 3295 -3429 -642 3971 -2667 -2472 4286 -502 -3787 3473 1509
1487 1509 -4455 2491 3083 -4900 542 4416 -4313 -1176 5322 -3334 -3103 5546 -1490 -4237 5008
1502 5008 443 -4896 3843 1960 -5218 1813 3435 -4726 112 4255 -3503 -1483 4396 -1842 -2730
1517 -2730 4030 15 -3476 2473 1600 -3729 827 2947 -3266 -865 3964 -1947 -2405 4202 -484
1532 -484 -3749 3666 1314 -4452 2167 2793 -4676 367 4316 -3875 -1025 5182 -2979 -2447 5501 -1554
1548 -1554 -4048 4687 159 -4754 3253 1753 -4605 1875 3301 -3950 211 4085 -3058 -1427 4187
1563 4187 -1690 -2858 3488 -441 -3333 2237 1624 -3381 933 3078 -2699 -624 3739 -1858 -2562
1578 -2562 3801 -570 -3886 3306 1101 -4466 2344 2697 -4320 974 4048 -3683 -748 4648 -2953
1593 -2953 -2351 4699 -1559 -3586 4348 176 -4150 3534 1587 -3987 1845 2826 -3794 225 3314
1608 3314 -2839 -1600 3514 -1534 -2592 3329 135 -3054 2399 1644 -3051 593 2682 -2799 -1241
1623 -1241 3546 -1686 -2418 3891 -229 -3424 3375 1253 -4202 2456 2547 -4296 843 3459 -3946 -601
1639 -601 4167 -2780 -1995 4421 -1376 -3252 4111 90 -3948 2866 1375 -3941 1563 2331 -3418 116
1655 116 3096 -2248 -1200 3373 -909 -2405 2891 330 -3270 1829 1599 -2945 602 2640 -2631
1670 -2631 -614 3528 -1571 -2098 3515 -271 -3329 3099 669 -4024 2055 1903 -4180 1018 3443
1685 3443 -3373 -467 4013 -2605 -1873 3967 -1240 -3017 3550 -237 -3572 2451 1356 -3482 1604
1700 1604 2578 -2888 25 2789 -1999 -1280 3037 -950 -2582 2553 437 -3185 1883 1685 -3141 628
1716 628 2663 -2624 -712 3384 -2133 -2135 3413 -976 -3238 3061 1048 -3675 2263 2091 -3770 1206
1732 1206 3116 -3343 -128 3387 -2469 -1537 3531 -1072 -2520 3191 83 -2966 2505 1430 -3205
1747 -3205 1402 2216 -2911 -164 2632 -1932 -1522 2782 -786 -2070 2480 548 -2849 1708 1845 -3100
1763 -3100 514 2699 -2603 -801 3038 -1882 -1672 3524 -414 -2615 3048 820 -3438 2022 1799
1778 1799 -3688 830 2679 -3370 -98 3118 -2265 -1276 3185 -1193 -2282 2900 83 -2891 2132
1793 2132 991 -3218 1092 2191 -2903 -132 2759 -1699 -1230 2908 -677 -2326 2487 281 -3088
1808 -3088 1628 1688 -3019 694 2574 -2376 -408 3181 -1691 -1629 2936 -865 -2505 2533 200 -3163
1824 -3163 1867 1575 -3208 1022 2514 -2786 -48 3054 -2206 -1167 2838 -1262 -2204 2701 100
1839 100 -2602 1683 1298 -2719 939 2243 -2486 -181 2620 -1856 -1422 2578 -812 -2078 2272 375
1855 375 -2663 1706 1572 -2765 732 2533 -2454 -394 2650 -1964 -1561 3003 -762 -2136 2572 410
1871 410 -2523 1856 1541 -3002 773 2148 -2641 -81 2739 -1840 -1267 2844 -994 -1854 2563 17
1887 17 -2493 1743 1250 -2882 831 2051 -2403 -401 2595 -1512 -1224 2646 -826 -1920 2518 366
1903 366 -2481 1652 1393 -2623 589 2116 -2353 -259 2671 -1533 -1341 2863 -681 -1795 2484 261
1919 261 -2555 1480 1080 -2637 711 1803 -2194 -340 2527 -1736 -1246 2775 -830 -1967 2195 56
1935 56 -2635 1461 1149 -2359 740 2048 -2240 -152 2693 -1629 -1040 2546 -882 -2016 2257 23
1951 23 -2206 1654 1056 -2419 923 1930 -1983 -246 2478 -1567 -1125 2280 -799 -1844 2196 237
1967 237 -2195 1410 1175 -2241 832 2111 -1912 -243 2294 -1500 -1491 2212 -765 -2058 2130 272
1983 272 -2302 1748 1043 -2253 629 1881 -2041 -289 2383 -1745 -1125 2578 -747 -1684 2120 261
1999 261 -2274 1574 1113 -2281 801 1481 -2068 -295 2004 -1459 -1309 2310 -549 -1710 2088 314
2015 314 -1956 1565 961 -2243 590 1799 -1989 -605 2388 -1564 -1353 2419 -340 -1742 2343 268
2031 268 -2176 1614 814 -2638 692 1469 -2244 83 2226 -1303 -1021 2485 -636 -1451 2213 -33
2047 -33 -2123 1471 703 -2394 732 1302 -1891 -69 1941 -1075 -1042 1913 -584 -1715 1581 174
2063 174 -2151 1355 917 -2159 455 1837 -1827 -138 2339 -1123 -1115 2200 -442 -1983 2038 132
2079 132 -2286 1489 1200 -2211 987 1946 -1982 -8 2147 -1530 -805 2016 -711 -1559 1732 -24
2095 -24 -1727 1406 794 -1889 917 1456 -1602 -19 1694 -1197 -949 1795 -472 -1639 1579 466
2111 466 -1935 1307 1297 -2110 483 1565 -1817 -324 2163 -1494 -1130 1970 -450 -1833 2230 275
2127 275 -2091 1657 971 -1947 821 1402 -2095 -77 1750 -1517 -715 1894 -634 -1469 1817 -18
2143 -18 -1621 1238 875 -1887 844 1229 -1781 -13 1622 -1114 -972 1814 -215 -1348 1512 351
2159 351 -1819 843 1114 -2084 345 1600 -1817 -341 1979 -1279 -1001 2138 -637 -1719 1869 285
2175 285 -2183 1131 1090 -2059 812 1454 -1946 326 2034 -1289 -598 1883 -772 -1239 1638 -114
2191 -114 -1679 1102 673 -1716 525 1426 -1360 -104 1847 -885 -753 1691 -450 -1603 1440 340
2207 340 -1825 780 917 -1655 391 1772 -1735 -276 2018 -1333 -1155 1931 -628 -1652 1639 -67
2223 -67 -1999 1371 949 -1976 720 1497 -1792 25 1617 -1311 -359 1840 -724 -928 1530 49
2239 49 -1267 894 692 -1420 384 1438 -1452 -338 1452 -837 -877 1670 -319 -1557 1622 507
2255 507 -1552 910 1119 -1955 91 1210 -1596 -358 1873 -1206 -872 1811 -669 -1296 1751 284
2271 284 -1627 1446 543 -1917 627 1110 -1735 2 1292 -1447 -422 1569 -503 -1000 1498 -166
2287 -166 -1384 816 663 -1300 289 1223 -1271 -460 1419 -884 -836 1501 -430 -1529 1350 415 -1619
2304 -1619 829 993 -1748 321 1531 -1322 -433 1855 -1001 -811 1984 -734 -1452 1569 129 -1743
2320 -1743 1255 484 -1669 561 1203 -1530 -107 1485 -918 -250 1390 -373 -933 1112 -40 -1404
2336 -1404 961 739 -1171 454 1168 -1011 -323 1362 -654 -1171 1341 -281 -1364 1133 314 -1701
2352 -1701 958 1102 -1476 356 1418 -1429 -255 1689 -1318 -759 1504 -617 -1440 1537 -46 -1201
2368 -1201 1249 600 -1350 710 1088 -1268 -33 1184 -1014 -479 1144 -545 -917 1205 199 -1311
2384 -1311 876 797 -1134 341 1028 -1032 -314 1481 -704 -849 1697 -187 -1395 1659 377 -1609
2400 -1609 1082 740 -1504 481 1142 -1634 -3 1430 -1175 -667 1712 -566 -1121 1440 201 -1306
2416 -1306 1006 271 -1513 307 942 -1212 -40 1266 -1052 -408 1322 -446 -993 1060 263 -1175
2432 -1175 674 718 -1270 237 891 -1056 -94 1201 -665 -744 1453 -312 -1069 1280 -5 -1451 980
2449 980 757 -1435 509 1159 -1079 3 1559 -957 -708 1394 -399 -1026 1129 -222 -1435 1000
2465 1000 457 -1284 656 970 -1038 80 1164 -725 -662 1163 -399 -928 760 179 -1090 688
2481 688 643 -1343 390 982 -1170 -361 1112 -864 -873 1198 -243 -1144 1071 347 -1388 1048 668 -1241
2499 -1241 524 1119 -1033 -197 1169 -960 -748 1156 -475 -910 1353 -4 -1182 1061 561 -1290
2515 -1290 341 802 -1009 -52 988 -810 -683 1106 -343 -917 892 73 -966 651 474 -1216
2531 -1216 340 880 -1240 -133 1231 -894 -582 1259 -224 -888 1328 252 -1329 720 728 -1124
2547 -1124 196 1020 -1339 181 1268 -881 -347 1241 -206 -768 1066 86 -1134 729 561 -1451
2563 -1451 293 892 -1019 16 1182 -724 -455 1149 -228 -899 712 82 -1151 552 469 -1207
2579 -1207 404 1101 -1249 2 1209 -731 -517 1082 -441 -945 964 50 -1137 665 644 -1083
2595 -1083 210 932 -903 -77 996 -890 -322 920 -331 -926 1027 265 -887 616 495 -846
2611 -846 270 1117 -1056 142 1149 -749 -451 1016 -636 -797 1020 159 -1018 746 687 -983 277
2628 277 1068 -1103 -206 1121 -853 -427 1100 -151 -693 1053 116 -1050 841 527 -1035 502 938
2645 938 -1096 -334 1032 -715 -640 926 -234 -653 956 6 -931 615 674 -878 228 820 -757
2662 -757 -141 894 -478 -407 1075 -230 -933 1096 18 -907 684 279 -1131 77 777 -871 -33
2679 -33 1006 -728 -353 837 -411 -716 972 99 -834 453 481 -1047 148 714 -834 -206 1241
2696 1241 -683 -360 978 -425 -659 980 269 -838 480 475 -825 264 972 -732 66 1010 -541
2713 -541 -409 877 -206 -747 866 -161 -1039 620 464 -780 176 818 -812 57 1010 -491 -502 853
2731 853 -331 -852 476 -20 -670 528 541 -843 233 812 -937 -149 906 -648 -580 1049 -401
2748 -401 -907 873 209 -1011 562 376 -768 320 637 -733 -259 795 -604 -296 956 -283 -673
2765 -673 948 -17 -773 530 265 -773 183 715 -729 -265 768 -540 -550 905 27 -739 936 63
2783 63 -735 487 491 -941 137 532 -827 -60 1110 -462 -502 979 -227 -575 880 36 -923 652
2801 652 563 -930 408 710 -855 -41 809 -491 -273 890 -128 -864 930 59 -837 489 425 -712
2819 -712 104 578 -542 -70 807 -398 -380 772 78 -858 699 66 -842 452 291 -856 92 907
2837 907 -767 -50 794 -239 -348 830 -157 -970 690 110 -879 566 408 -899 291 577 -755
2854 -755 -115 829 -333 -273 713 -619 -630 666 150 -572 580 327 -693 266 585 -523 -156 606 -310
2873 -310 -536 685 -116 -621 623 294 -763 573 576 -628 284 815 -559 -155 799 -356 -704 711
2891 711 -98 -700 693 166 -632 744 395 -775 162 682 -753 -72 694 -513 -242 799 -183 -564
2909 -564 644 -16 -576 419 382 -894 259 432 -496 -209 396 -401 -430 657 163 -578 514 326 -743
2928 -743 204 559 -749 -13 740 -631 -143 856 -352 -546 938 -99 -797 593 47 -814 381 315
2946 315 -1024 169 499 -695 122 610 -475 -127 707 -279 -392 498 -104 -820 187 248 -653 33 645
2965 645 -473 -196 616 -284 -264 523 20 -610 347 225 -666 370 651 -670 113 650 -674 -197 886
2984 886 -423 -504 718 43 -463 361 177 -694 341 119 -666 255 475 -792 -8 511 -426 -398 589
3003 589 -346 -576 601 278 -473 239 413 -735 104 432 -560 -168 629 -338 -516 497 -158 -448 513
3022 513 212 -747 439 473 -700 29 501 -562 -269 855 -469 -439 716 -312 -558 491 6 -586
3040 -586 420 181 -700 120 488 -467 -90 616 -482 -95 792 -365 -513 683 -66 -574 331 99 -443
3059 -443 131 519 -408 -334 592 -559 -525 471 -61 -408 496 39 -768 160 268 -547 -6 627 -418 -56
3079 -56 650 -108 -359 650 -82 -349 680 33 -547 390 356 -348 313 499 -176 -71 600 -375 -305 548
3099 548 -20 -436 530 167 -428 207 153 -579 50 582 -364 -8 676 -194 -386 434 -144 -586 435 96
3119 96 -600 140 387 -451 191 458 -243 -230 528 -113 -376 493 -76 -694 465 98 -602 470 364 -579
3139 -579 65 350 -312 -5 546 -353 -295 424 -101 -343 416 223 -286 390 327 -454 115 458 -355 -174 401
3160 401 -229 -355 460 94 -687 424 180 -552 297 294 -552 -82 537 -529 -122 682 -229 -222 718 -99 -611
3181 -611 539 269 -445 358 135 -319 253 334 -359 -170 538 -125 -234 771 -84 -366 421 -40 -462 398
3201 398 177 -626 6 498 -434 -217 618 -145 -217 268 36 -478 465 148 -451 192 290 -546 373 516 -191
3222 -191 -56 687 -291 -117 350 -125 -497 384 260 -411 48 409 -407 69 508 -201 -66 369 -375 -392
3242 -392 269 -137 -340 256 16 -702 249 459 -284 119 533 -430 3 449 -168 -340 468 31 -327 452
3262 452 77 -650 410 458 -575 196 340 -427 -77 556 -342 -404 413 -56 -481 311 187 -292 204 128
3282 128 -512 224 397 -440 -81 296 -105 -294 472 169 -354 218 164 -421 304 264 -388 72 379 -488 -66
3303 -66 446 -453 -376 411 47 -376 259 295 -452 123 257 -496 5 243 -461 32 451 -401 -325 538 145
3324 145 -389 459 171 -465 -5 245 -275 -43 509 -275 -136 411 -100 -226 529 254 -298 287 153 -478
3344 -478 132 308 -548 -161 385 -281 8 523 -199 -342 522 -95 -381 186 99 -467 221 272 -286 -101 527
3365 527 -377 7 687 -179 -235 391 -5 -365 287 208 -412 146 472 -247 69 415 -33 -72 445 -109 -383
3386 -383 482 -221 -314 210 144 -289 266 468 -175 -14 210 -272 -119 606 -376 -300 465 -300 -417 191 -69
3407 -69 -317 298 137 -253 56 310 -244 -309 375 -61 -254 310 -137 -297 295 150 -220 406 373 -357 -230
3428 -230 589 -417 -173 398 -147 -284 515 17 -371 397 11 -422 182 368 -171 -203 426 -381 -24 293
3448 293 0 -165 352 -44 -419 176 211 -365 79 337 -494 -67 533 -161 -1 359 -18 -254 267 201 -443
3469 -443 115 -44 -437 107 388 -326 -142 169 -206 -18 558 -178 -105 375 -64 -103 165 62 -177 140 85
3490 85 -113 56 493 -301 35 420 -128 -231 201 4 -406 327 26 -288 155 214 -426 245 414 -183 -230
3511 -230 277 -274 -457 300 -118 -421 129 131 -255 114 213 -345 -42 217 -266 60 194 -208 -267 220 35
3532 35 -296 216 181 -259 -16 218 -89 43 61 -143 -25 324 -136 -291 524 10 -197 240 69 -311 -9
3553 -9 207 -225 -24 276 -372 -397 292 -143 -395 156 58 -340 80 147 -427 126 156 -299 41 255 -104 -105 182
3576 182 -48 -207 401 -158 -316 419 1 -279 351 125 -176 -4 108 -362 112 230 -42 -301 276 55
3596 55 -237 167 167 -276 59 361 -143 97 354 -30 -113 303 14 -167 323 3 -337 -25 235 -396 146
3617 146 261 -187 230 85 -333 -128 348 -96 -20 267 -52 -294 0 185 -366 -144 264 -264 47 212
3637 212 -234 12 74 83 -75 125 21 -364 231 283 -382 -1 191 -148 -73 291 -133 -105 246 -35 -395 300
3659 300 116 -232 455 96 -448 162 175 -294 -30 391 -320 -74 34 -205 -140 115 -70 -156 391 131 -63
3680 -63 66 103 -342 1 270 -73 -104 390 7 -202 293 4 -180 89 293 41 199 94 -452 92 35
3701 35 -361 -130 245 -93 -337 238 94 -291 299 246 -418 -90 151 -357 -175 131 -137 46 138 131 5 280
3723 280 102 -49 222 -40 -254 297 122 -160 125 151 -55 -107 208 -88 -45 11 134 -301 101 242 -15
3744 -15 111 288 -240 79 378 -173 -144 332 -143 -229 264 -101 -279 285 -116 -338 259 99 -163 -71 175
3765 175 -160 35 230 -135 -133 83 41 -285 99 158 -251 264 128 -133 175 187 -139 -163 250 -111 -206 148
3787 148 180 -143 66 91 -268 158 270 -144 87 122 -189 -150 204 -338 -236 116 -36 -165 103 -34 -316
3808 -316 -92 19 -185 -37 174 -193 27 180 -13 -149 363 -69 -1 316 119 -56 119 162 -79 -84 254
3829 254 -138 -146 277 -21 -116 338 127 -379 53 -6 -239 -87 21 -215 -210 105 -111 -1 339 -6 -188 329
3851 329 112 -186 190 7 -263 132 157 -200 69 -86 -141 -33 169 -50 -95 409 99 -34 -28 -24 -250 85
3873 85 125 -31 60 419 -78 -19 227 -57 -101 194 117 -415 329 -123 -18 -100 330 -101 -7 197 -64 -13 147
3896 147 -7 -194 251 -79 -269 155 25 -153 103 87 -103 -230 332 49 -297 126 99 -46 124 -149 -167
3917 -167 239 -2 -201 72 86 -166 -35 65 -334 -64 207 -176 -109 187 169 -18 153 168 -201 141 173 -314
3939 -314 92 245 -159 -151 40 86 -113 229 -44 -396 306 111 -181 73 194 -284 -118 219 -99 70 28
3960 28 21 -59 41 -6 -50 96 124 -91 63 80 -111 -88 4 -92 -64 -101 23 -29 173 100 -134 -43 -83 -109 68 194
3986 194 -274 9 402 -202 -4 153 69 -60 6 37 -401 187 50 -310 -12 78 -229 -35 101 -129 302
4007 302 233 -105 -126 56 -145 -123 159 -20 -312 170 171 -212 4 118 -99 -113 267 -61 -203 65 199 -355
4029 -355 129 83 -190 -115 -36 -105 88 277 66 -44 134 -166 -235 213 157 -298 283 150 -92 -64 151 -26
4051 -26 221 432 -95 4 106 -78 -93 152 97 -103 63 123 -81 116 218 -140 75 139 -31 123 136 -23
4073 -23 -212 -23 65 -94 53 206 -172 -23 27 60 -111 69 45 -358 223 -15 243 91 -67 -102 59 12
4095 12 -75 -155 133 -5 -13 36 -174 3 153 162 -51 -23 -33 -24 121 -29 -92 59 116 -238 -29 15 11 38 201 -130
4121 -130 -108 -69 -117 -73 2 113 -129 100 -17 -111 60 272 -118 -101 304 33 -208 55 -76 -37 60 -107 -307
4144 -307 -68 144 -31 119 148 -192 -28 192 -17 -42 208 96 -96 100 -103 -115 95 -62 -14 77 2 -78
4166 -78 -55 -67 -111 -97 85 99 24 139 42 -117 -32 -72 18 -120 72 -224 -98 16 -50 -59 242 105 -47 -57 81
4191 81 3 212 200 -4 -34 50 38 27 187 -77 16 -54 136 -138 96 -15 -2 125 46 -180 -159 241 -150 -67
4215 -67 -68 15 8 77 52 18 103 147 -366 26 255 205 169 -64 -128 -90 94 77 -93 -2 51 -221 131 37 -314 60
4241 60 13 41 -151 210 -170 163 77 -194 -46 181 -28 -160 72 -14 14 12 90 64 16 141 -70 -151 187 66
4265 66 -194 101 24 -147 28 -17 -108 50 -77 -62 -44 122 10 -40 188 -67 -159 45 145 -318 95 83 -182
4288 -182 78 25 -78 -37 178 127 7 44 -82 -27 48 -182 -109 99 146 83 13 -27 2 -202 90 -131 -42 1 35
4313 35 -116 104 115 -41 62 107 -58 17 242 -103 -129 134 -39 -285 106 -101 157 148 -31 -221 52 -80
4335 -80 -107 101 58 7 156 74 -124 67 -3 -121 138 187 -122 -39 -65 203 -9 43 109 -33 -37 200 121 37 -152
4360 -152 -103 16 4 59 -151 30 119 -7 -132 -52 -300 -57 46 -73 157 -81 -112 -172 97 -86 -67 -136 72
4383 72 -199 124 50 -45 -137 90 81 -119 89 6 -121 -148 30 -13 -53 146 21 -51 215 -66 113 92 42 0 -47
4408 -47 157 -49 41 18 47 3 -113 -96 -13 118 -119 34 80 -120 -43 55 -102 -90 73 2 -75 -98 96 -167 -19
4433 -19 35 -30 -170 231 -31 -119 134 28 -38 108 -21 -103 35 11 -39 -53 -45 9 -118 -57 51 -47 5 117 -210
4458 -210 143 20 -94 194 126 -296 69 -253 -212 -2 56 -23 -118 194 0 -139 92 -208 -174 109 -128 -61
4480 -61 4 -87 -66 132 167 -35 -41 132 -155 35 79 24 160 -125 200 82 -153 -28 -47 -123 120 102 78 142 237
4505 237 -41 90 -99 169 -211 63 -16 -73 131 211 116 18 31 14 -137 -52 -20 205 31 -143 2 15 93 36
4529 36 182 223 45 80 -98 57 -117 -3 122 -28 -51 -120 -114 18 234 86 -35 -129 50 96 -229 -92 128
4552 128 -68 155 -86 70 13 -122 187 -112 -5 -143 43 -163 -51 98 52 -62 -39 119 28 -16 -129 -78
4574 -78 -50 -123 -9 -5 -3 195 160 63 -11 -18 -117 -85 248 206 113 24 -44 186 -37 133 146 -5 166 53 -5 -41 -11
4601 -11 -153 141 176 56 73 54 -69 155 -50 89 85 9 -92 -16 175 -93 -4 223 181 -124 -20 -79 24 208
4625 208 -12 83 -95 202 -14 -35 16 37 2 44 -138 -81 149 219 -182 117 61 -78 -35 65 -54 62 69 -45
4649 -45 -33 14 39 -40 -10 170 -107 33 62 109 138 102 165 -46 3 99 184 83 -26 -93 -158 69 -244 86 94 -190
4675 -190 288 51 -162 -126 21 -139 -69 -108 -4 -75 245 156 -90 -32 111 -8 17 22 209 -194 155 -49 105
4698 105 175 -279 -111 71 84 8 116 33 -100 37 -158 -34 -92 -16 57 -151 179 -29 79 85 62 -90 -61 126
4722 126 -125 101 151 -162 -42 32 127 -231 120 51 83 90 -67 40 -22 121 -88 -106 182 -44 -103 -87 -102 -114
4746 -114 72 99 -14 133 -105 -40 -42 44 -61 -149 -46 -59 164 20 -28 -14 95 141 -68 -68 -54 55 125 67 -137
4771 -137 -24 175 64 122 -87 -18 -31 -72 -70 -118 63 -168 -97 -91 124 -136 95 29 70 -19 65 19 -49 135 13
4796 13 -248 13 -342 62 120 159 -104 53 37 -89 -9 139 -51 40 151 -12 -69 -287 -23 -28 -215 -219 31 5
4820 5 8 -113 -121 31 30 50 -100 161 -156 -95 -86 -14 100 56 -85 81 -13 -235 -54 -100 10 95 -1 200 -23 92
4846 92 63 -154 197 -10 -9 26 40 -43 -15 39 26 -199 -57 -89 83 67 169 122 -215 -143 -104 75 69 -110 131 134
4872 134 58 61 -37 20 -49 141 -45 -24 -78 -22 208 155 -27 65 121 -149 -68 108 133 -4 -81 29 98 -256 155
4897 155 184 118 33 -71 24 31 116 58 52 -51 -158 -103 -18 -63 17 -37 242 29 -180 86 -43 -25 -2 28 -84 -53
4923 -53 294 13 -53 -36 -137 26 113 10 40 34 6 -69 85 -41 -77 55 23 -5 11 180 -121 138 -101 -23 132
4948 132 2 -7 -70 -15 -126 -4 -69 137 -218 -31 81 -286 -11 -163 -158 -77 28 -31 6 1 -117 -4 -35 71
4972 71 -14 -95 16 -94 -34 -113 -37 85 171 222 -115 183 53 57 -119 58 -186 9 22 -106 109 -22 267 -72
4996 -72 -90 82 -33 54 233 -54 -17 18 31 73 49 226 291 -28 215 -9 81 18 42 14 44 86 79 229 61 113
5022 113 14 335 117 52 63 145 -81 -43 29 -51 -20 25 48 29 42 122 -127 -9 25 -56 -262 15 -107 34 -78
5047 -78 -71 71 -297 113 57 148 92 -19 71 42 -213 61 -64 -118 -4 -59 -75 25 204 82 -90 -224 -77 -92
5071 -92 -49 21 170 -141 58 -145 -97 133 -209 -73 -18 -46 -108 110 199 258 60 -6 -2 -184 147 71 -124 -31 -42
5096 -42 15 -184 99 128 30 -76 76 45 26 74 133 -20 136 169 230 75 -12 -25 -9 -42 122 -42 -112 -146 -12
5121 -12 -102 126 51 -49 86 -49 -211 67 25 -54 69 -191 33 -102 67 58 121 -34 -55 78 -156 62 -29
5144 -29 33 -87 96 5 -69 -23 -2 12 -71 142 -7 -13 71 86 -34 73 26 100 -70 56 -20 100 153 73 135 -17
5170 -17 -31 123 16 -48 -58 114 73 -22 25 -3 80 -142 -204 -137 203 -3 -24 -10 -89 -6 50 -124 -148 -197 -69 -6
5196 -6 -99 -128 174 213 -104 -121 -106 65 -60 -25 54 132 -229 151 -115 -207 -83 -68 -32 9 10 12 80 78 25 -13 -80 -10
5224 -10 19 -23 -175 84 90 11 -93 -106 -109 -38 -33 50 72 19 168 30 -63 63 113 -9 -36 175 -63 63 -98 -110
5250 -110 -7 88 -27 129 121 -134 -12 -103 95 152 -88 -62 -49 12 -161 163 -67 -148 91 41 -91 -37 67 -209
5274 -209 24 -131 -172 34 -88 -5 -186 -40 -76 -75 -2 10 224 -87 -54 7 121 18 185 -7 -4 171 129 -64
5298 -64 -169 94 -64 65 6 62 -129 -125 123 -168 68 39 -32 112 141 -1 -83 -22 253 7 101 42 -115 77
5322 77 179 13 -296 -97 37 26 -48 -7 -205 9 -188 35 10 35 -21 -172 -9 -34 -168 136 11 80 -9
5345 -9 42 -29 40 -109 -176 20 -66 52 -147 112 -195 126 79 1 104 -47 -96 33 -1 2 102 10 -127 65 -76
5370 -76 101 -164 66 33 29 -38 118 -132 61 -51 -119 56 -75 34 128 -101 -73 -93 105 3 -63 -205 96
5393 96 -48 -39 -173 -107 -43 6 164 -81 143 121 -22 8 -105 162 -132 37 -213 -59 -110 -33 -194 90 58 138
5417 138 -97 -83 47 162 101 -143 -49 -72 8 44 128 123 3 -95 -193 245 -99 -73 49 -82 5 -39 -246 -30 63
5442 63 -28 -8 -306 59 -113 62 97 104 85 -13 -98 30 -90 42 -91 110 -50 -172 -119 -64 -102 83 15 -138
5466 -138 -125 44 -8 39 -52 -85 -173 52 -168 -48 -91 -56 185 -92 246 117 12 -75 -23 65 72 233 -90 -177 179
5491 179 -5 -85 103 -45 -86 44 -11 26 180 157 -38 30 20 123 37 -74 -88 -51 79 -7 -32 21 68 -26 -26 41
5517 41 155 -51 21 -105 44 -90 -70 46 84 -84 82 68 39 103 71 67 74 -7 -293 -189 63 198 -51 10 36
5542 36 183 77 -38 -35 199 -173 58 -98 -166 -81 178 -104 -107 28 -111 -97 -13 181 -153 72 -65 221 -69
5565 -69 9 -56 -88 -14 223 150 106 -250 66 -23 -108 -210 -55 113 74 -47 -40 132 -29 180 92 -67 19 233 12
5590 12 -125 -112 95 115 -2 -15 112 34 191 213 193 -11 53 -72 -1 73 126 120 99 80 119 65 23 125 95 64 41
5617 41 47 -59 43 -48 156 -239 145 43 -29 -41 -170 125 50 -46 5 210 83 -15 -146 -210 10 -99 189 144
5641 144 76 -150 230 -141 194 44 -24 91 -17 -28 67 -108 -21 233 -115 152 -25 -166 -74 -153 -30 98
5663 98 173 46 -166 -9 -160 -23 31 10 109 -47 112 -72 7 -73 131 -138 -12 122 103 166 129 161 74 150
5687 150 -132 103 -138 59 159 32 -3 89 -63 -3 -15 -44 -16 13 92 -24 -131 170 -103 27 68 -73 -242
5710 -242 87 -32 -26 113 -3 233 49 47 7 222 -111 -157 102 -269 100 -166 -64 -117 10 71 68 86 -93 107
5734 107 -57 -66 -100 195 -89 77 9 -2 132 13 -243 62 79 -19 45 -31 106 132 -47 136 -161 -157 -18 7
5758 7 11 142 -29 -133 -58 22 5 -186 -70 13 -14 -84 42 55 -11 154 -2 -43 81 -175 -38 132 232 299 157
5783 157 -10 114 -61 114 -87 25 -77 -25 145 89 75 23 -59 13 -86 -15 95 -33 -148 -56 34 116 -5 12
5807 12 -129 8 -27 208 28 -39 86 -138 204 15 -23 231 152 28 36 156 -86 -25 -89 141 -41 -165 -109
5830 -109 -5 -23 143 -10 -75 162 99 -69 76 17 -85 -29 -232 85 36 77 1 -139 -7 46 52 -109 -154 -150 -36
5855 -36 134 80 83 170 66 -207 108 -12 149 -109 171 -180 149 -55 -134 -11 56 -22 -50 -181 37 126 -46
5878 -46 127 -218 14 -44 -22 -147 71 -165 42 174 33 -69 78 137 25 -131 -5 7 92 44 -165 0
5900 0 1 -17 -183 -94 51 -276 -93 22 -230 -70 -107 37 99 8 -57 309 99 44 -79 62 -65 -18 130 91
5924 91 -164 68 -5 82 105 29 -72 39 -153 42 5 -65 143 68 133 106 59 -15 -206 -11 -19 134 -42 -12 -85
5949 -85 29 -142 89 192 -39 -70 -151 186 -21 -60 -123 121 37 -79 10 39 68 138 -32 -56 56 85 67 27 39
5974 39 -84 -57 -76 -110 -54 146 -86 -8 -64 172 -112 -127 199 -18 218 -35 -104 -45 -16 239 -71 34 -110 60
5998 60 27 187 -34 -140 190 88 13 -157 -41 -55 -96 -44 10 100 163 125 26 20 -55 137 -18 101 249 -53 -158
6023 -158 236 48 -2 -20 -238 -18 -64 -48 58 6 -68 -14 -79 -93 -21 -118 124 98 263 -40 53 85 -155 -142 69
6048 69 -35 84 6 -142 60 41 -110 -3 39 16 113 81 123 51 107 104 -151 205 -47 217 -79 2 -248 -104
6072 -104 37 136 25 -64 163 -29 80 -67 246 -198 -81 -124 102 109 -262 -28 -68 84 -193 -34 -32 161 115
6095 115 -236 -42 62 -99 33 110 15 142 -70 -184 -65 21 -12 65 33 -68 78 -47 77 -19 -139 -140 11
6118 11 -6 -138 -95 -114 77 -146 -14 51 -34 60 -28 79 79 204 134 -56 -83 -102 135 208 -35 106 -72 185 -28
6143 -28 -143 38 -30 42 13 -276 -29 153 29 -107 71 21 48 -12 49 57 -253 25 -206 -113 -44 199 139 69 -144
6168 -144 26 -66 16 224 111 124 -196 -247 -101 -88 3 -71 29 156 14 -42 -36 2 -56 93 135 -162 -120 23 79
6193 79 51 -44 21 158 -26 40 45 -10 157 14 7 -1 32 -101 10 25 60 128 61 17 16 7 153 27 -149 -108 180 39
6221 39 228 85 101 -72 -23 138 -52 -161 -304 52 -218 37 57 141 -134 -108 117 -95 -88 -25 -67 188 105 23
6245 23 136 -88 -10 105 -54 -48 81 -67 9 260 131 -252 4 -134 -175 -24 -125 -28 113 -218 -189 -60 39
6268 39 120 132 11 -12 -41 -46 -178 57 -139 76 194 67 30 155 141 59 -33 46 67 77 66 -53 -133 63 203
6293 203 -86 -73 -46 -16 -1 28 20 -33 88 -94 57 75 -36 214 -5 -158 6 101 -141 64 65 -16 -209 -112 -173
6318 -173 61 -24 49 -123 -240 9 -41 -96 -233 70 159 98 -147 149 50 38 -1 186 46 -238 114 -295 -16
6341 -16 -70 31 -33 -40 38 53 95 -41 -96 83 155 -14 167 43 -11 -132 -205 -97 -274 93 24 -70 -11 29 -126
6366 -126 49 -106 33 8 16 -42 94 54 134 27 31 -65 111 -190 -38 55 16 -28 38 52 62 -164 75 149 -73
6391 -73 -4 -45 -207 110 -68 145 -98 -146 -93 58 174 -93 -183 50 -9 23 36 -147 -42 -65 75 -24 -140 151
6415 151 -66 -144 -33 11 4 96 -57 -8 43 57 -39 -46 -51 173 55 -72 -121 27 -272 -200 117 7 -5 6 -193 -246
6441 -246 135 -60 22 87 -118 -9 -235 87 -171 28 108 -129 -144 -8 -95 -197 -92 66 -237 -6 54 -9
6463 -9 -58 194 68 -16 16 13 104 -30 25 -225 47 20 162 -43 -99 81 -81 -112 -106 -114 18 120 -73 -244 -132
6488 -132 -140 199 -232 -30 7 4 -10 -26 142 12 -83 63 -52 35 55 94 76 -111 104 74 -48 -42 -1 -22 60 205
6514 205 23 34 -28 40 -169 -71 -20 204 -92 90 -91 -78 14 12 -158 -39 -74 -41 -100 -285 -6 29 -10 169 -50
6539 -50 -100 -61 -243 -52 -125 87 70 -196 107 138 301 -5 78 -15 -167 100 148 -147 -106 161 44 -56 16 -122
6563 -122 -113 247 -12 59 -107 79 187 127 103 -105 97 -98 47 79 -84 135 50 -69 -70 -99 -4 97 -161 51
6587 51 -25 77 -20 -119 -83 80 -120 -35 34 62 -23 -65 -64 83 85 173 128 111 6 52 -55 -97 129 264 -60 -127 211
6614 211 85 101 59 109 -352 -16 59 -104 -164 -87 201 20 197 -193 50 -37 -175 -8 -107 178 -37 119 -182
6637 -182 -97 67 -163 -89 5 -14 14 -23 5 79 -111 -67 121 116 -147 -21 -97 28 155 -39 12 175 -111 29
6661 29 230 -20 -7 -208 102 152 22 8 33 65 90 -131 -178 138 -71 -84 -127 47 30 218 -164 38 20 21 -96
6686 -96 14 13 -92 -104 -49 210 135 -96 274 -201 39 70 -61 -80 -187 -108 18 79 108 28 44 126 129 1 -53 -12
6712 -12 -54 178 128 -184 -100 -24 -103 112 73 214 119 -57 166 -4 -92 56 74 82 127 -91 196 44 101 -15 -15
6737 -15 194 -144 142 1 133 -100 -60 116 164 24 -51 127 -246 -48 95 -94 -84 170 -10 64 183 -85
6759 -85 18 22 -24 238 -88 -32 -50 -42 13 141 11 76 -201 113 84 5 70 31 197 116 -152 -152 -24 162 207 98
6785 98 -135 63 41 25 -54 139 -6 44 -27 -120 -44 -58 -121 254 158 -86 102 18 70 58 42 43 97 -189 89 139
6811 139 167 15 31 -137 -89 103 111 18 36 71 137 -135 -40 -9 67 -84 -47 126 -8 44 243 -1 -42 -274 -45
6836 -45 142 -118 117 53 139 -53 56 -28 -60 81 39 -1 6 -45 37 -184 -240 181 -37 79 34 166 -52 -23 148
6861 148 -161 77 -53 16 71 31 124 -175 -20 74 -29 90 -280 -35 18 -124 2 15 62 -113 -128 43 -70
6884 -70 12 52 -81 16 -72 -23 -50 41 -61 42 -19 -79 119 -40 104 41 170 -14 69 -9 -158 20 31 -46 39
6909 39 -110 62 132 -33 -112 -32 -131 -55 85 -2 -54 -31 4 -30 -26 56 -31 -297 43 51 11 -43 -71 -32 74 32 74 -24
6937 -24 133 113 -27 -184 85 -10 39 -72 -72 -163 -79 154 117 71 -186 -16 80 -166 21 -21 75 -9 114 51 33
6962 33 -80 -99 -89 -180 -71 -62 125 95 115 -121 -51 -180 115 -145 -92 -42 183 60 48 0 165 -14 -132 -154 -5
6987 -5 -122 -51 32 -101 125 -93 126 62 67 152 198 185 -78 -6 -189 -25 -45 93 14 38 -72 -175 115 89 -191
7012 -191 209 17 48 23 -113 -83 110 -140 47 -48 -67 -133 -3 26 76 107 21 52 -128 -69 -21 -82 32 -86 92
7037 92 -4 -91 46 154 200 59 -103 108 212 -142 -104 -86 -175 -107 -117 -94 186 -72 137 -76 -50 -147 22 -9
7061 -9 9 100 48 -20 -22 23 -123 188 76 49 31 -74 -46 -112 0 288 73 -9 68 47 -25 -40 -2 -29 -169 -4 43
7088 43 -213 -10 -55 -283 -146 27 -82 -230 95 -3 15 -2 7 18 54 25 4 -35 65 -41 -54 -13 73 -35 130
7113 130 46 -77 40 -224 233 8 -159 -53 -112 65 171 -47 203 145 -17 160 -155 150 -106 -69 49
7134 49 -136 -33 -206 5 201 173 23 16 235 -128 132 -61 -89 25 -366 -36 -68 -110 -4 35 -183 171 3
7157 3 -169 -62 20 -42 214 -7 -102 209 -8 43 67 91 -55 13 47 162 174 43 108 3 -129 -16 -158 74
7181 74 -34 104 89 145 -128 122 74 -77 -25 -108 -244 -57 -46 0 55 55 121 146 -96 2 -15 20 -249 81 -90
7206 -90 23 105 77 -17 38 159 80 -50 128 6 -65 117 -85 173 -309 -59 140 74 120 -90 -183 100 45 -82
7230 -82 23 77 201 80 -2 142 -7 113 40 252 -88 82 185 -73 37 140 106 -77 -94 19 -350 -145
7252 -145 48 82 -16 58 149 -66 -43 223 17 -124 -35 125 87 63 -38 10 61 -28 -26 -27 -87 -49 -87 90 46 -39 92
7279 92 182 -64 -35 101 69 34 2 -124 42 79 -124 -57 -115 -1 -56 88 -64 -21 65 -108 -67 108 145 34 -55
7304 -55 92 65 -45 258 -44 60 -64 -107 100 -65 53 -15 132 10 107 11 68 125 59 102 22 -32 88 -53
7328 -53 132 -98 -68 -50 8 -51 139 -310 -62 -11 78 -31 -81 -69 -9 10 -155 -149 169 -28 195 81 36 329 -21
7353 -21 65 -50 122 -23 6 -126 -116 -17 20 -100 -115 146 22 91 95 -54 212 -32 -30 107 -66 -117 37 55 -154
7378 -154 -22 69 5 -47 36 -135 -11 -40 -42 -66 56 91 32 -117 157 -41 -194 -9 -29 38 -16 -14 -117 201 -136
7403 -136 66 41 0 174 -88 82 -127 -43 -15 6 -30 -21 -79 90 -84 43 2 69 -93 -33 187 -109 -15 15 49
7428 49 63 124 210 -37 33 -11 -133 -19 90 40 -82 186 56 92 226 10 116 209 -109 -84 -39 74 62 79
7452 79 40 -25 -26 57 -4 12 -3 51 -34 17 -64 -234 167 53 201 151 -139 -112 340 160 9 71 49 67 36 -38 -52
7479 -52 -9 189 82 107 -80 -38 -76 -63 -259 -67 -191 -66 -181 -186 126 128 -122 -110 -217 -134 40 -32 -112 -38 126
7504 126 -84 28 89 113 -129 42 37 -39 -101 221 114 26 -38 189 -49 59 273 124 -96 6 151 113 21
7527 21 29 -86 15 -52 -89 37 190 171 36 90 -118 -28 1 -60 51 -19 -48 -209 -103 -112 53 90 -104 2 72
7552 72 -90 -57 91 -116 73 -69 -90 -115 8 26 91 66 157 -25 49 -21 156 100 -17 -5 -124 -43 -68 -135 9
7577 9 140 -24 -25 232 15 100 2 140 -65 -8 -121 41 -16 -21 -37 -98 129 -150 -15 166 -49 68 32 80 -28
7602 -28 -183 13 -177 -133 102 -5 1 57 91 -93 40 258 -4 -19 85 133 -37 -159 -7 -130 42 87 -148
7625 -148 -25 -38 -36 229 60 -21 -19 47 33 226 122 -98 -73 -142 -32 -84 -31 -20 -220 -1 61 -179 -157 91 -112
7650 -112 10 -25 204 -125 -18 123 -259 117 -189 -76 -211 57 126 282 75 31 220 -26 48 70 116 -28
7672 -28 136 -65 -225 -117 -37 -52 28 37 5 138 -47 25 181 -97 90 16 -66 0 6 33 -133 32 118 187 7
7697 7 95 150 19 -101 35 -47 105 102 -197 -51 45 38 15 127 -98 -14 153 -19 -53 -238 -189 115 24 145 -13
7722 -13 -58 -5 -42 152 70 13 -118 119 31 108 104 -35 -47 -198 -111 -208 -159 -107 139 -46 29 51 -87 31 -40 121
7748 121 -1 91 102 42 110 116 35 -56 -84 27 -31 106 -33 35 -102 90 140 106 -20 66 6 -35 -64 88 89 89 32
7775 32 -58 22 -53 -7 11 206 -46 40 -98 -29 83 16 150 -169 -44 -5 130 115 -60 -15 117 -42 117 -45
7799 -45 215 -17 -176 87 23 -158 54 141 59 -23 42 48 15 -18 -3 34 -174 23 163 -126 35 121 -188 135
7823 135 10 -43 -231 -83 -133 -112 -132 129 84 -108 -196 78 -140 -77 -15 -14 53 41 39 -51 -190 38 7 -136 88
7848 88 -90 -211 -36 -12 152 -29 -106 -104 -136 92 193 -67 -99 -24 29 -61 -144 -213 16 62 -88 6 126 70 68 2
7874 2 -190 -139 -174 136 -45 56 -22 -36 -156 -130 -39 20 -14 -114 -13 173 49 -184 -30 103 -48 32 36 -81
7898 -81 48 200 -88 -148 -71 -61 -75 -12 -43 -46 152 -6 -121 158 118 57 86 -70 37 49 -200 -126 -16 151 53
7923 53 -10 89 146 -48 317 142 -84 -152 -126 -78 40 50 -106 -86 42 99 10 -221 -97 -105 28 -28 92 44 110
7948 110 -101 54 -292 34 287 31 132 73 108 30 -9 91 -95 176 -6 -4 100 -116 135 149 67 19 -101
7971 -101 -46 -44 -63 31 10 -135 72 71 184 49 -31 -135 60 184 3 -12 -40 43 201 -12 33 -176 -78 -41 -139
7996 -139 -83 58 36 -156 102 -5 89 94 20 52 28 14 -17 -125 70 -105 -18 10 -118 52 136 45 168 66 151
8021 151 165 23 97 89 -2 -39 -255 62 13 -150 -113 -2 116 -78 75 -144 1 -108 82 17 -94 134 40
8044 40 -184 128 -66 83 82 69 -102 -156 8 -18 -40 209 203 -161 -12 -78 -16 -128 15 -138 -14 217 112 -298
8068 -298 99 -59 -187 -9 59 -51 -33 26 -2 119 72 67 -16 -208 73 -125 -151 -104 244 92 48 40 -107 4
8092 4 253 57 151 91 14 -3 42 -7 -145 -42 -95 -118 -60 84 -150 185 -56 53 -46 158 88 -65 -33 25 32 -90
8118 -90 85 -114 10 -50 35 -56 -173 -54 -164 -88 9 -129 -210 -57 -24 120 50 220 35 -56 68 73 -46 185
8142 185 -47 -20 45 -77 81 109 -270 -98 -16 -19 -101 178 60 14 73 -58 -6 22 -49 -105 -52 41 47 -68 203 5
8168 5 78 -5 213 -113 162 39 45 -44 -11 -7 -99 -61 -103 8 163 -69 -37 -69 102 17 63 -57 -50
8191e0
$$ Imaginary data points
##PAGE= N=2
##DATA TABLE= (X++(I..I)), XYDATA
0 0 0 0 0 0 0 0 0 -8 8 -8 16 -16 16 -24 32 -34 40 -48 56 -70 80 -96 107 -123 144 -163 186 -210 238 -270
30 -270 304 -339 381 -426 475 -530 588 -652 723 -802 890 -985 1089 -1206 1334 -1482 1648
47 1648 -1836 2053 -2306 2607 -2971 3417 -3983 4727 -5753 7261 -9685 14202 -25335 103033
61 103033 85227 -191329 95094 75287 -175064 50680 151285 -140422 -24199 122858
71 122858 -97150 -56430 144119 -29684 -92044 83564 11378 -90961 58036 57740 -80191
82 -80191 -9828 69981 -46237 -43079 80382 -3542 -82036 64035 39985 -96119 38070
93 38070 75512 -101206 3260 102135 -90091 -36975 115340 -63290 -62282 123232 -34246
104 -34246 -94678 110369 -63 -103937 96290 26251 -120067 62871 52928 -104714 41548
115 41548 70919 -95877 3591 81277 -61441 -17100 78164 -40435 -48780 63000 -2256
126 -2256 -53981 40844 21967 -58960 11136 52034 -38462 -20845 60094 -20275 -54694 62472
138 62472 14503 -79689 45884 44716 -92507 25421 79919 -89541 -7339 100642 -73806
149 -73806 -39834 111265 -48969 -73822 105412 -15197 -93985 89430 18880 -103688 63360
160 63360 50810 -95771 31027 67855 -80501 -3181 75140 -51403 -32202 66583 -20701
171 -20701 -50169 51828 14463 -55749 24907 38788 -49779 -3430 55549 -34048 -35305 58113
183 58113 -9548 -57471 53749 20142 -73151 37171 48458 -76533 15421 70091 -72906
194 -72906 -13021 82699 -57156 -37882 86134 -34912 -58655 80880 -6474 -70580 65865
205 65865 17880 -75995 43517 38053 -71232 18038 50045 -57623 -5014 55502 -35368 -24371
217 -24371 50730 -11026 -37388 37620 12426 -44300 16292 31318 -40917 -5695 45012 -28635
229 -28635 -26926 50684 -8845 -44522 46974 12369 -58146 34066 33447 -64082 15877 50981 -60738
242 -60738 -4075 64564 -48417 -23545 69756 -31326 -40965 65387 -11113 -54090 52564
253 52564 9068 -59553 35549 27579 -55841 16341 41332 -44551 -3198 46000 -28687 -21600
265 -21600 41964 -9443 -34537 30973 11048 -39753 15013 29921 -36665 -3540 43247 -27113
277 -27113 -23412 47788 -12226 -41245 43789 6293 -53307 33890 26723 -57150 18685 44377
289 44377 -53508 59 56280 -44144 -20053 59077 -29569 -36062 55255 -10436 -46084 45285
301 45285 9273 -48845 29864 25616 -45756 11062 35569 -36444 -7639 38704 -22280 -22719 36038
314 36038 -4084 -31356 26781 13921 -34826 12478 28241 -32683 -5253 37470 -24686 -22049
326 -22049 41434 -11336 -34801 39537 4953 -43164 31253 20832 -47047 17554 33824 -45446
338 -45446 1196 42883 -37729 -13814 47434 -24786 -26419 46241 -9339 -35671 38060 5674
350 5674 -40403 24646 18885 -38954 9101 29276 -31073 -5923 34961 -18275 -19239 33914 -3938
363 -3938 -29450 25591 10478 -34686 13032 23941 -32728 -1486 34727 -24744 -16078 39888
375 39888 -13088 -29440 37976 391 -39458 29826 14307 -43258 18008 27626 -40220 4086
387 4086 37470 -32010 -10476 41180 -20999 -23432 38364 -7817 -32370 30855 6068 -35282
399 -35282 19554 18897 -32189 6349 27757 -24970 -7774 30877 -14793 -20344 28717 -2498 -28626
412 -28626 22562 11105 -31279 12947 23113 -29004 56 30861 -22697 -13752 33912 -13382
424 -13382 -25615 32320 -1017 -32970 26848 12252 -35658 17009 23301 -34112 4324 30664
436 30664 -28155 -9270 33763 -18367 -20475 32901 -5597 -27832 27432 7584 -31108 17451
448 17451 18160 -29920 4521 25211 -23833 -8518 28651 -13819 -19175 28285 -1224 -26180 22453
461 22453 10684 -29810 12595 20196 -28355 362 26822 -22262 -11257 30192 -12026 -20649
473 -20649 29093 -298 -27656 23154 10366 -31240 13576 19436 -29575 2347 26205 -23133
485 -23133 -8457 29408 -13062 -18147 27878 -2416 -25232 22067 8047 -28758 12626 16981
497 16981 -26946 2810 23832 -20684 -7304 27132 -11853 -17293 25678 -1893 -24591 20019
509 20019 8119 -27671 11857 17582 -25772 2236 24285 -19882 -7819 27131 -11708 -17831
521 -17831 24908 -2075 -24574 19483 8516 -26948 11774 17797 -24974 2269 24024 -19481
533 -19481 -8235 25979 -11723 -17641 23955 -1806 -23879 18929 8787 -25932 11591 17733
545 17733 -24401 2232 23113 -19113 -7862 24482 -11752 -16548 22971 -2042 -22141 18447
557 18447 8219 -23661 11061 16081 -22382 1968 21146 -17965 -7508 22417 -10401 -15249
569 -15249 21048 -903 -20290 16543 8785 -22255 9304 16312 -21601 342 20994 -17113
581 -17113 -8795 22773 -9650 -16140 22140 -9 -21109 17452 8836 -23741 10219 15974 -23106
594 -23106 1535 20823 -18982 -6894 23367 -11541 -13688 22526 -2632 -19069 17692 5787
606 5787 -21790 10529 12543 -20881 1958 18277 -16155 -5592 20274 -8945 -12602 18984 -657
619 -657 -17841 14090 7118 -20330 6780 14220 -18971 -682 19793 -14221 -8288 22115 -7642
632 -7642 -15182 20223 137 -20391 15197 7649 -22468 8665 14901 -20982 1628 20138 -16800
645 -16800 -5747 21865 -10555 -12673 19983 -3267 -17715 15517 4636 -19477 9264 11906
657 11906 -17519 2385 16552 -13478 -5556 17977 -7881 -12360 16082 -719 -16748 12148
669 12148 7274 -17902 6127 14490 -16336 -1142 18876 -12866 -9090 20024 -7375 -15369 18447
682 18447 121 -19366 14880 7660 -20395 8914 14270 -18982 1476 18171 -15828 -6037 19213
695 19213 -10296 -11613 18194 -2972 -15138 14380 4695 -16105 8400 10116 -15119 1176 13793
708 13793 -11834 -5838 15481 -6104 -11081 14337 827 -14577 10888 7626 -15953 4782 13118
721 13118 -15255 -2443 16720 -11472 -8886 18573 -5975 -13958 17912 535 -17379 13918
733 13918 6733 -19253 7944 11907 -18256 1650 15724 -14504 -4335 17917 -9066 -9742 17138
746 17138 -2909 -13483 13294 2944 -15148 7370 8282 -13846 1362 12535 -10204 -4762 14396
759 14396 -4935 -10247 13342 681 -14212 9351 6809 -15680 4298 12437 -14260 -1648 16277
772 16277 -10505 -7830 18016 -5689 -13344 16384 -88 -17452 12814 5765 -17987 8047 11048
785 11048 -16405 2447 14937 -12907 -4048 16009 -8109 -9343 14636 -2589 -12659 11486
797 11486 3293 -13462 6742 8575 -11761 904 11672 -8755 -5191 12564 -4098 -10653 11294
810 11294 1595 -13723 8536 7712 -14122 4030 12373 -13181 -1734 15104 -10327 -7819 15787
823 15787 -5466 -12629 15165 56 -15257 12592 5640 -15984 7886 9856 -14998 2035 12624
836 12624 -12136 -3733 13658 -7331 -7923 12806 -1594 -10528 9819 3598 -11591 5310 7286
849 7286 -10635 -487 10066 -7684 -5546 11424 -2628 -9625 10579 2628 -12234 7918 7271
862 7271 -13578 3223 10907 -12571 -1917 13858 -9346 -6534 15105 -4861 -10742 14138 262
875 262 -13768 11023 4498 -14849 6475 8451 -13744 1879 11340 -10388 -2534 12343 -5872
888 -5872 -6911 11162 -1246 -9907 8205 3253 -11141 3857 7346 -9588 -322 10367 -6329
901 -6329 -4852 10997 -2563 -9426 9647 1959 -12253 6929 6634 -12955 3212 10675 -11599
914 -11599 -941 13427 -8876 -5659 13649 -5069 -9811 12212 -812 -12189 9678 3954 -12803
927 -12803 6140 8082 -11598 1999 10191 -9151 -2725 10458 -5334 -6575 9465 -686 -9035
940 -9035 6981 4024 -9432 3507 7757 -8762 -1035 9500 -6509 -5475 10098 -2506 -8735
953 -8735 9061 1906 -10737 6901 6623 -11755 3369 9876 -10998 -817 11628 -8590 -5433
966 -5433 12111 -4857 -8640 11305 -18 -10386 9097 3938 -11182 5056 6851 -10570 751
979 751 8987 -8245 -3095 9685 -4113 -6152 8991 147 -8083 6212 4088 -9285 2706 6859
993 6859 -8566 -1418 9045 -5964 -4741 10008 -2347 -7862 8909 1544 -9966 6232 5246
1006 5246 -10990 2566 8259 -9907 -775 10369 -7574 -4155 11187 -4055 -7072 10036 -286
1019 -286 -9541 7272 3158 -10235 4040 6511 -8964 440 8822 -6654 -2808 9383 -3461
1032 -3461 -6115 8107 44 -8201 5635 3470 -8711 2505 7083 -7661 -1156 9137 -5421
1045 -5421 -4705 9484 -2680 -7579 8328 926 -9625 6008 4556 -9848 2974 7944 -8701
1058 -8701 -630 9559 -6847 -4017 9811 -3992 -7081 8802 -246 -8536 6647 3240 -8708
1071 -8708 3779 6236 -7872 23 7976 -6211 -3701 8021 -3104 -6049 7566 130 -7658
1084 -7658 5592 4202 -7878 2495 6594 -7122 -1065 7891 -5601 -4410 8518 -2749 -6926
1097 -6926 8045 985 -8382 5825 4256 -8685 2824 6625 -8012 -837 8138 -6128 -4033
1110 -4033 8812 -3020 -6193 8273 283 -7808 5974 3175 -8292 2772 5724 -7562 -673
1123 -673 7325 -5477 -3293 8137 -2456 -5891 7356 694 -7617 5223 3477 -8048 2215
1136 2215 5696 -6955 -914 7668 -4732 -3693 8394 -2168 -6063 7191 666 -7906 5168
1149 5168 3470 -8164 2203 5989 -6926 -605 7699 -4892 -3485 8062 -2352 -6019 7035
1162 7035 379 -7434 4754 3130 -7681 2278 5686 -6535 -469 7273 -4744 -3403 7657 -2323
1176 -2323 -5959 6843 514 -7348 4844 3307 -7411 2511 5683 -6274 -463 7106 -4652 -3281
1190 -3281 7173 -2270 -5827 6329 460 -6983 4858 3579 -7169 2666 5575 -5990 -520 6736
1204 6736 -4674 -3608 7146 -2247 -5894 6100 774 -7019 4704 3410 -7152 2399 5684 -6306
1218 -6306 -540 6624 -4916 -3489 6965 -2304 -5460 6370 506 -6621 4780 3040 -6938 2596
1232 2596 4925 -6372 -323 6061 -4423 -3137 6371 -1879 -4893 5951 913 -6177 4277 3204
1246 3204 -6533 1636 4966 -5797 -1100 6169 -4052 -3332 6727 -1438 -5234 6113 1022 -6683
1260 -6683 4248 3510 -7173 1949 5309 -6390 -522 6664 -4549 -2863 7057 -1959 -5031 6034
1274 6034 276 -6448 4435 2561 -6846 2146 4666 -5939 130 5773 -4043 -2418 6104 -1836
1288 -1836 -4365 5072 515 -5893 3662 2911 -5920 1662 4950 -5071 -636 6174 -3244 -3240 6149 -1461
1304 -1461 -5170 5201 1070 -6461 3774 3551 -6670 2080 5587 -5851 -327 6546 -4461 -2895
1318 -2895 6465 -2262 -4770 5496 34 -5775 4257 2330 -5835 2400 4317 -5281 -2 5284
1332 5284 -4149 -2411 5269 -1945 -4204 4670 581 -4985 3298 2877 -5353 1378 4753 -4869 -1133
1347 -1133 5535 -3718 -3549 5667 -1306 -4781 5135 1077 -5845 4091 3455 -6231 1815 4872 -5925
1362 -5925 -602 5770 -4692 -2402 6247 -2205 -4028 5842 1 -5237 4237 2056 -5582 1876 3674
1377 3674 -5175 -137 4650 -3549 -2290 4963 -1379 -3757 4406 817 -4723 2736 2907 -5069 659
1392 659 4391 -4593 -1437 5400 -2788 -3243 6025 -1094 -4737 5096 977 -5872 3434 3116 -6092 1457
1408 1457 4623 -5454 -180 5725 -4023 -2203 5909 -2143 -3823 5045 -423 -4773 3405 1684 -4991
1423 -4991 1928 3547 -4317 -3 4497 -2801 -1966 4564 -1539 -3721 3643 571 -4668 2254 2638
1438 2638 -4585 638 4491 -3981 -1211 5477 -2893 -3414 5327 -1239 -4782 4878 770 -5677 3570
1453 3570 2785 -5460 1962 4651 -4965 -257 5435 -3847 -2017 5257 -2217 -3571 4813 -280 -4366
1468 -4366 3547 1822 -4149 1860 3294 -3678 -472 3902 -2804 -2488 3822 -1040 -3637 3586 1077
1483 1077 -4029 2443 2836 -4309 669 4182 -4066 -1460 5137 -2620 -3168 5264 -1173 -4525 4781
1498 4781 998 -5326 3536 2473 -5299 1669 3780 -4884 -306 4785 -3721 -1975 4920 -1892 -3233
1513 -3233 4599 3 -3942 3377 1559 -4177 1297 2683 -3434 -553 3612 -2173 -1967 4199 -666
1528 -666 -3497 3301 1404 -4350 1993 2712 -4389 305 3912 -3733 -1496 5003 -2377 -2719 4987 -803
1544 -803 -4233 4569 643 -5046 3390 2099 -5256 1778 3454 -4173 133 4282 -3141 -1574 4400
1559 4400 -1758 -2863 3721 -55 -3715 2486 1454 -3643 1332 2815 -3050 -323 3406 -1825 -2176
1574 -2176 3553 -465 -3511 2927 1112 -4370 2043 2887 -4137 754 3755 -3654 -1188 4563 -2619
1589 -2619 -2597 4607 -1150 -4163 4214 410 -4568 3476 2092 -4518 1994 3203 -4065 95 3623
1604 3623 -3383 -1318 3782 -1653 -2567 3594 128 -3354 2579 1647 -3281 1101 2456 -2892 -476
1619 -476 3169 -1998 -2250 3477 -365 -3214 3083 1169 -3823 2046 2753 -4272 493 3672 -3576 -982
1635 -982 4227 -2473 -2215 4401 -1123 -3456 4092 562 -4054 3028 1751 -4379 1567 2716 -3916
1650 -3916 219 3593 -2525 -1468 3568 -1342 -2295 3106 160 -3245 2117 1360 -3426 771 2731
1665 2731 -2823 -566 3158 -1671 -1851 3376 -286 -2955 2751 919 -4030 1650 2331 -3933 658
1680 658 3446 -3391 -544 4104 -2476 -2017 4007 -1229 -2909 3514 136 -3693 2440 1675 -3688 1611
1696 1611 2660 -3397 351 3233 -2568 -1197 3190 -1257 -2381 2450 254 -3101 1893 1835 -2840
1711 -2840 833 2529 -2593 -836 3150 -1823 -1798 3109 -723 -2971 2774 1033 -3675 2078 2352 -3723
1727 -3723 765 3192 -3188 -624 3572 -2437 -1936 3619 -1256 -2777 3143 264 -3107 2498 1429
1742 1429 -3425 1205 2375 -2871 -23 2914 -2362 -1281 3038 -909 -1937 2697 404 -2697 1713
1757 1713 1590 -3121 478 2366 -2559 -716 3043 -1603 -1905 3220 -423 -2543 2812 584 -3125
1772 -3125 1827 1883 -3566 721 2792 -3273 -387 3402 -2281 -1458 3508 -1024 -2208 3042 55 -2949
1788 -2949 2179 1329 -3079 877 2127 -2833 -163 3053 -1931 -1053 2900 -961 -1951 2576 284 -2699
1804 -2699 1389 1354 -2826 685 2286 -2317 -547 3002 -1618 -1479 3021 -706 -2494 2582 281 -3138
1820 -3138 1831 1392 -2989 845 2690 -2585 -227 3327 -2196 -1481 2894 -1209 -2409 2580 -4
1835 -4 -2816 2023 1139 -2865 839 2095 -2399 -245 2744 -1690 -1189 2687 -921 -2196 2336 361
1851 361 -2455 1798 1625 -2639 764 2257 -2177 -350 2760 -1716 -1578 2858 -780 -2388 2615 417
1867 417 -2702 1819 1473 -2791 954 2323 -2532 -352 2626 -2039 -1419 2832 -923 -2120 2616 80
1883 80 -2548 1919 1074 -2739 840 1955 -2455 -316 2518 -1693 -1315 2929 -678 -2076 2200 374
1899 374 -2595 1563 1038 -2684 680 1873 -2382 -404 2560 -1641 -1061 2804 -542 -2335 2441 345
1915 345 -2574 1551 1135 -2561 816 1925 -2170 -123 2574 -1346 -1086 2825 -575 -2065 2301 80
1931 80 -2365 1602 924 -2659 910 1883 -1985 -158 2425 -1535 -1088 2524 -732 -2069 2260 -5
1947 -5 -2534 1630 967 -2496 1211 1954 -2273 -67 2384 -1427 -1234 2377 -697 -1951 1854 242
1963 242 -2306 1608 1225 -2327 852 1901 -1901 -148 2296 -1450 -1358 2288 -533 -1984 2144 388
1979 388 -2369 1599 1344 -2476 815 1711 -2170 -293 2253 -1818 -1212 2339 -720 -1845 2274 195
1995 195 -2276 1860 1063 -2526 805 1722 -2165 -187 1956 -1633 -1013 2053 -718 -1538 2012 224
2011 224 -2000 1491 1123 -2483 680 1606 -2042 -398 2133 -1263 -1269 2467 -484 -1570 2286 483
2027 483 -2310 1457 1105 -2646 753 1831 -2104 -102 2107 -1397 -999 2406 -582 -1684 2416 -39
2043 -39 -2140 1613 882 -2429 767 1282 -1923 225 2062 -1384 -757 2024 -497 -1535 1576 211
2059 211 -2208 1112 913 -2330 532 1713 -1786 -294 2299 -1297 -840 2135 -698 -1766 1845 290
2075 290 -2298 1170 1318 -2364 776 1824 -2072 -66 2259 -1431 -997 2075 -1061 -1526 1702 -41
2091 -41 -1773 1531 1014 -1776 861 1580 -1552 -125 1915 -1429 -904 1675 -433 -1356 1655 219
2107 219 -1746 1202 1172 -2034 368 1550 -1786 -323 1965 -1396 -1159 2058 -524 -1787 1588 278
2123 278 -2008 1430 1233 -2153 731 1722 -2200 -220 1930 -1598 -902 2043 -831 -1278 1818 -74
2139 -74 -1542 1397 756 -1610 854 1152 -1620 -55 1729 -1176 -797 1947 -372 -1114 1580 363
2155 363 -1688 1118 1254 -1926 261 1475 -1560 -341 2003 -1131 -1109 2113 -537 -1680 1816 174
2171 174 -2029 1303 1123 -2188 672 1449 -1988 -48 2013 -1515 -657 1982 -775 -1184 1658 -54
2187 -54 -1697 1180 652 -1709 505 1316 -1385 151 1592 -1080 -755 1681 -468 -1239 1307 177
2203 177 -1793 964 925 -1743 420 1733 -1507 -439 1982 -1318 -1217 2242 -473 -1813 1745 161
2219 161 -2050 1274 803 -1998 715 1553 -1886 92 1876 -1382 -785 1727 -910 -1289 1611 -161
2235 -161 -1600 1153 641 -1619 755 1030 -1241 -144 1318 -1148 -932 1475 -467 -1412 1282 389
2251 389 -1401 983 914 -1596 351 1592 -1517 -395 1750 -1215 -940 2185 -535 -1593 1982 366
2267 366 -1737 1314 833 -1851 562 1202 -1812 215 1619 -1345 -749 1708 -597 -1114 1522 -204
2283 -204 -1576 1060 508 -1519 339 976 -1096 -378 1422 -677 -724 1492 -236 -1291 1327 392 -1695
2300 -1695 865 722 -1696 191 1187 -1578 -519 1907 -939 -744 1868 -444 -1558 1564 76 -1877
2316 -1877 1074 647 -1803 756 1072 -1440 161 1334 -1145 -565 1591 -639 -992 1344 -366 -1373
2332 -1373 965 364 -1370 460 974 -1262 -255 1202 -672 -821 1496 -294 -1493 1117 366 -1519
2348 -1519 908 861 -1545 520 1259 -1279 -239 1627 -990 -981 1546 -333 -1420 1658 408 -1496
2364 -1496 1447 868 -1516 538 1036 -1421 91 1151 -1289 -638 1512 -656 -965 1415 19 -1066
2380 -1066 818 705 -1363 386 882 -1255 -164 1223 -933 -924 1409 -143 -1148 1130 271 -1510
2396 -1510 1003 1207 -1654 247 1119 -1562 -231 1487 -982 -752 1639 -240 -1091 1481 114 -1573
2412 -1573 1120 637 -1492 541 1059 -1503 -68 1258 -854 -291 1470 -392 -993 1075 122 -1146
2428 -1146 705 431 -1261 391 873 -999 -176 1337 -477 -597 1356 -262 -1126 1275 193 -1474
2444 -1474 901 633 -1473 538 1207 -1570 -100 1346 -1054 -497 1369 -477 -1074 1299 -27 -1456
2460 -1456 957 475 -1487 622 1050 -1163 163 1300 -817 -398 1163 -581 -1032 939 87 -1405
2476 -1405 919 770 -1342 422 1187 -939 -370 1202 -741 -590 1034 -428 -1048 1030 180 -1531
2492 -1531 765 622 -1314 459 1091 -1315 -162 1251 -1110 -506 1283 -391 -838 1210 86 -1219
2508 -1219 889 476 -1357 374 839 -1065 31 1314 -779 -488 1269 -435 -717 985 172 -985
2524 -985 701 652 -1440 338 728 -1279 -349 1163 -812 -608 1150 -86 -851 1090 86 -1190 776
2541 776 575 -1200 310 1085 -1056 -98 1075 -748 -434 1093 -543 -774 1264 -83 -1371 587
2557 587 308 -1168 364 808 -1192 28 1115 -762 -655 1279 -498 -882 966 191 -1219 625
2573 625 570 -1159 141 1014 -921 -326 1217 -770 -616 1029 -350 -749 835 -39 -1266 534 712
2590 712 -1122 454 1076 -995 22 1110 -593 -574 1358 -666 -779 897 75 -1071 901 648 -1086
2607 -1086 305 844 -938 -188 1077 -647 -604 936 -348 -829 896 133 -967 819 461 -886 404
2624 404 860 -860 -188 1072 -754 -585 1183 -357 -727 888 162 -947 875 595 -892 205 897
2641 897 -998 -230 985 -610 -891 1092 -97 -834 1178 184 -1086 747 326 -874 282 713 -931
2658 -931 -279 889 -544 -470 998 -227 -887 1056 -23 -953 589 458 -770 163 750 -1033 -61
2675 -61 912 -659 -208 1099 -175 -932 852 45 -1096 373 85 -1032 288 724 -844 -248 967
2692 967 -591 -608 938 -254 -832 833 -50 -1165 526 385 -1074 416 578 -722 -154 903 -566
2709 -566 -269 956 -340 -860 1034 120 -1005 497 332 -1003 339 642 -677 -136 771 -651 -678
2726 -678 804 -428 -845 650 -26 -981 606 411 -973 428 582 -725 -8 719 -606 -639 905
2743 905 -130 -943 636 275 -965 733 605 -841 234 636 -808 -140 920 -471 -446 897 -373
2760 -373 -767 824 19 -761 667 467 -1179 305 644 -690 -83 606 -650 -644 846 -123 -755 864
2778 864 133 -762 361 433 -1001 105 575 -641 -206 971 -414 -509 730 -227 -653 865 349 -916
2796 -916 472 397 -1136 153 754 -847 -114 901 -613 -242 1019 -235 -614 670 5 -896 413
2813 413 258 -927 248 551 -796 3 591 -349 -267 738 -72 -400 703 149 -649 138 466 -785
2831 -785 206 856 -857 -30 932 -513 -394 774 -230 -768 562 238 -822 287 376 -934 146
2848 146 739 -873 110 850 -601 -330 811 -365 -628 689 102 -733 352 412 -573 132 484 -596
2866 -596 -139 588 -570 -212 432 -160 -684 865 158 -651 461 569 -823 107 587 -867 -154 878
2884 878 -274 -464 817 -190 -804 627 274 -720 561 379 -908 354 836 -920 -47 748 -768
2901 -768 -462 670 -190 -607 667 319 -419 462 457 -644 84 516 -627 -254 703 -467 -321 739 -414
2920 -414 -552 353 283 -888 374 310 -765 -55 417 -714 -361 773 -542 -323 736 103 -618 565
2938 565 169 -924 270 483 -715 -74 690 -833 -191 669 -409 -227 618 -113 -612 724 88 -588
2956 -588 360 164 -713 89 406 -570 -17 713 -386 -270 537 -189 -716 572 10 -598 385 524 -555
2975 -555 52 544 -387 -82 725 -304 -515 827 -245 -670 616 112 -604 424 507 -623 297 700
2993 700 -804 18 518 -580 -605 758 -100 -674 504 29 -540 530 295 -501 201 448 -417 -150 517
3012 517 -244 -440 713 -215 -520 263 414 -714 592 316 -611 38 486 -361 -336 705 -530 -276 787
3031 787 -33 -646 570 50 -616 474 379 -766 256 485 -617 -37 605 -444 -224 593 32 -431
3049 -431 476 104 -518 180 74 -711 26 329 -490 -330 598 -275 -417 737 127 -436 603 197 -593
3068 -593 287 416 -626 -18 512 -516 -298 676 -328 -505 823 -71 -624 615 142 -734 399 148
3086 148 -713 72 522 -292 -114 371 -250 -178 562 -110 -549 626 -41 -505 315 356 -642 143 563 -428
3106 -428 -12 551 -288 -337 468 110 -721 228 408 -578 359 336 -534 150 654 -547 -9 468 -291 -449
3126 -449 847 72 -321 408 246 -549 438 344 -537 340 214 -495 -77 441 -437 -204 482 -174 -436 458
3146 458 226 -421 338 360 -399 79 400 -475 -176 372 -175 -470 539 -5 -454 590 104 -653 245 284
3166 284 -674 59 366 -464 -382 566 -215 -496 528 140 -367 370 -66 -765 428 231 -608 -5 410 -527
3186 -527 -253 395 -176 -263 378 62 -267 451 46 -432 286 271 -534 255 249 -374 -139 577 32 -219 719
3207 719 -38 -502 352 202 -599 442 245 -619 -34 506 -600 -84 566 -280 -312 458 -114 -310 351 73
3227 73 -413 163 293 -564 185 385 -381 151 529 -355 -259 361 119 -425 242 36 -438 97 411 -557 52
3248 52 587 -444 64 384 -188 -169 415 11 -597 290 382 -449 194 315 -558 192 438 -350 -265 436 -261
3269 -261 -295 376 -310 -409 317 60 -417 84 395 -383 -14 555 -466 -80 449 -230 -372 339 -72 -325
3289 -325 515 192 -360 267 390 -637 -169 508 -423 -72 93 -88 -303 330 33 -275 530 127 -294 220
3309 220 531 -446 -271 303 -468 40 264 -304 -135 471 -78 -447 261 144 -475 68 192 -593 -24 526
3329 526 -307 16 366 -243 -402 383 -142 -487 270 343 -309 117 123 -266 58 269 -240 -197 301 -234 -323 264
3351 264 -66 -436 373 140 -489 61 406 -457 -50 490 -278 -115 479 -347 -375 452 -171 -277 234 257 -356
3372 -356 128 150 -333 89 393 -344 -219 758 -134 -395 349 -27 -433 158 119 -278 218 314 -329 -108 275
3393 275 29 -213 440 -278 -523 272 -97 -418 199 260 -325 26 247 -176 32 331 -308 -84 532 -103
3413 -103 -146 469 82 -239 342 32 -413 127 249 -275 96 129 -387 -157 587 7 -491 411 112 -382 339
3434 339 37 -562 208 286 -291 -94 14 -345 89 497 -142 -185 517 -126 -480 441 54 -553 119 229 -321
3455 -321 -56 184 -83 -230 442 -159 -153 223 -53 -324 84 208 -368 180 318 -277 -44 404 -292 -140 461
3476 461 -113 -245 364 -86 -482 257 -10 -353 151 241 -347 85 335 -267 -124 388 -197 -277 415 9 -298
3497 -298 247 2 -563 233 82 -330 225 519 -138 -43 323 -135 -192 250 -131 -461 320 -32 -297 368 269
3518 269 -330 62 309 -366 -213 331 -66 -376 46 103 -281 422 129 -216 349 308 -107 57 355 -68 37
3539 37 173 -91 -317 295 84 -261 364 213 -340 98 310 -140 -2 -54 -76 -9 208 -73 -147 390 152 -206
3561 -206 259 317 -451 -96 273 -177 69 376 -274 -34 271 -51 -213 107 75 -309 189 -33 -343 158 100
3582 100 -351 151 390 -294 -143 303 12 -114 328 67 -290 129 99 -252 137 347 -273 28 393 -251
3602 -251 -187 278 -179 -217 240 -59 -312 74 196 -140 64 353 -417 -83 382 -245 -92 131 -240 -208 378
3623 378 38 -190 101 -10 -317 167 184 -220 176 227 -191 -179 77 -60 -265 119 45 -276 162 287 -323
3644 -323 97 130 -14 41 134 -241 -58 382 -100 -290 225 -20 -254 -15 234 -288 119 306 -391 -97 226
3665 226 -258 -13 229 -69 -267 248 -56 -226 188 157 -279 188 -12 -353 97 196 -171 -70 147 -169 -171
3686 -171 206 -103 -298 -44 44 -326 -199 190 -257 -106 146 -167 -310 363 -163 -45 214 85 -350 293
3706 293 110 -529 109 96 -95 -32 270 -88 -267 389 -231 -215 278 -78 -214 87 102 -253 93 -85 -188
3727 -188 178 132 -231 26 174 39 -150 157 57 -209 -2 114 -244 232 282 -401 -34 -72 -183 -149 230
3748 230 30 -107 291 -6 -234 133 309 -230 22 35 -48 -79 190 -348 106 434 -236 -105 186 -155 -421
3769 -421 168 73 -68 -25 -59 -266 -31 180 -58 79 274 110 -48 143 169 -289 206 60 -171 63 250
3790 250 -343 8 145 -245 -80 271 -22 -42 164 -15 -230 317 322 -374 -1 265 -233 -211 233 -176 -43
3811 -43 216 -96 -323 277 93 108 140 157 -366 302 38 -236 -234 -149 -40 109 40 -6 5 158 -32 -237 58
3834 58 80 -331 -147 46 -102 31 203 -223 -199 169 -10 -55 137 19 -244 356 -90 -380 -39 176 -295
3855 -295 167 108 -128 -54 190 -115 -46 88 -55 -264 66 14 -200 51 30 -191 24 119 -20 37 349 -59
3877 -59 -133 96 -38 -198 -38 20 -251 114 201 -153 0 268 -80 -167 244 -56 -111 60 141 -162 158 269
3899 269 -261 -148 249 87 -20 26 -156 135 109 -73 -126 58 61 52 155 -84 -89 15 114 -172 -37 47 -185 -170
3923 -170 44 68 -246 96 73 -329 224 110 -171 9 38 -159 120 -3 -241 -135 46 -67 -172 267 -45
3944 -45 46 -10 -1 -14 180 110 -158 -210 37 60 77 67 19 -40 271 -58 -46 39 86 47 53 186 -315 -46 139 -95
3970 -95 64 282 9 -193 209 128 -83 191 131 -223 -162 267 -174 126 178 -79 -88 413 -149 -62 270 -64 55
3993 55 58 16 -153 87 118 -47 182 -2 -18 -112 117 -203 -101 28 -89 -45 96 -89 -187 55 54 -90 212 87
4017 87 -308 -232 172 -146 -108 89 162 -87 144 34 -175 -72 251 -196 182 7 -124 -99 293 77 -218 9
4039 9 -98 -224 50 87 -141 135 198 11 29 283 -6 -20 195 -180 -290 75 49 7 318 250 -106 -54 -131 -161
4063 -161 -99 98 -33 -142 302 -242 -152 162 24 -322 171 31 -65 164 138 -87 22 -21 -229 -77 105 -149
4085 -149 -52 51 141 -86 -124 193 -168 -93 130 -198 -102 196 -184 -230 234 -110 -51 251 -98 -2 20 117 -62
4108 -62 53 91 -116 192 228 102 -83 46 -128 -227 123 -101 -197 27 -43 -167 -45 -99 -135 114 -24 112 7
4131 7 44 21 -130 127 -79 -76 258 103 -88 -53 40 -95 64 246 -138 -258 107 17 91 208 106 -91 211
4154 211 170 -225 84 83 -180 43 178 -189 1 349 -100 -12 -136 -71 10 -39 35 -93 54 46 -72 84 116 -53
4178 -53 -175 53 261 -229 -85 156 -165 41 -59 -159 86 -100 -143 -129 -68 -77 -53 -9 -372 -87 -77 77 -55
4201 -55 277 222 -167 102 -21 -115 229 300 -47 -122 78 24 -4 298 96 23 39 133 -25 -38 75 -170 -122 -200
4225 -200 -87 -147 -35 88 -11 18 82 11 146 -105 -150 -101 229 -36 -78 133 -160 53 40 92 -98 -68 43 52
4249 52 181 -27 -86 181 -81 34 3 153 -50 67 108 -32 114 -177 30 66 -119 9 -187 141 213 -32
4271 -32 -8 230 16 -151 26 -121 -28 -32 44 109 -200 170 -271 106 42 -110 50 -113 -56 -137 -37 -80 8 136
4295 136 -42 -222 -10 -70 -158 126 -16 24 26 8 -47 48 338 -50 -354 238 50 -102 22 96 -253 100 46
4318 46 -212 -63 55 -2 -89 243 -124 -162 151 102 63 -47 -46 8 207 -21 -119 -71 130 16 -284 4 70 -91
4342 -91 -56 312 -62 228 52 -142 115 151 -89 14 234 52 -32 117 114 -108 81 68 -131 133 -75 -150 118
4365 118 44 -81 0 147 -40 77 -36 133 -48 117 -201 -51 146 90 -15 78 97 -36 -165 -102 -227 -70
4387 -70 -46 -91 78 -90 -6 -55 139 215 -115 87 138 -27 -84 -11 11 -9 58 -94 76 -74 114 -82 45 193
4411 193 -39 249 17 -157 -57 -70 -18 -58 107 -60 14 144 67 -5 -97 45 39 98 42 -118 -13 94 -64 -123
4435 -123 1 116 -3 54 -61 -98 127 138 20 136 97 -50 -141 17 32 33 73 -77 115 104 -135 -76 -81 115
4459 115 39 -5 76 -237 -129 224 -74 -40 -91 40 -47 98 107 -44 280 48 39 66 51 85 75 -7 -134 -82 -3 12
4485 12 147 165 -57 -92 105 -112 53 69 -47 -171 -164 31 -46 -100 -8 -42 133 -1 2 142 81 -101 20 -105
4509 -105 32 53 -24 65 -36 -103 -25 33 -76 49 -52 39 -96 -57 -16 33 -27 -67 -63 100 -55 -35 -6 -67 -36 69
4535 69 -59 -106 204 -150 -7 159 139 155 144 55 -15 84 128 -116 -42 109 -145 -98 33 155 -121 16 76 -166
4559 -166 -27 241 8 -129 119 -1 133 -74 -33 -65 165 220 -81 152 -10 73 -130 54 35 152 71 -13
4581 -13 -62 118 -243 -10 92 -160 79 -138 33 -48 -9 84 -147 -72 3 -14 -58 75 70 -92 -63 27 -222 -9
4605 -9 45 -9 -31 42 -68 32 -87 -3 -116 133 17 -146 411 -106 -216 110 -43 -4 -139 254 -47 96 128
4628 128 88 -67 -50 -150 -81 -53 -255 -27 -83 128 -105 -198 -237 68 -45 -43 258 17 -21 137 -185 -2 -145
4651 -145 -203 0 -105 -177 142 50 55 -84 195 -21 -139 36 -19 -40 -22 137 23 67 159 -163 122 86 -85 -54
4675 -54 79 -7 -108 -70 -154 -121 124 192 -81 33 143 59 -63 -62 -6 -25 6 -171 -153 -132 -153 53 -38 140 62 3
4701 3 111 -179 -96 -67 -129 -214 -14 98 58 32 -87 -159 -20 138 173 21 -137 47 39 -21 266 -57 -61 76 -95
4726 -95 5 -183 40 -36 61 15 70 71 -168 -10 73 28 -23 -124 43 -105 132 66 -165 -7 -86 -151 -16 39 77
4751 77 -128 -13 6 -6 -40 -92 -90 111 -44 -27 -105 66 78 -43 10 -32 80 149 -13 121 127 182 32 49 173 -2
4777 -2 -40 22 51 49 56 -42 -174 -69 79 -49 91 -9 -247 37 -62 -176 -111 -109 -138 -105 113 -92 -54 -66 -65 1 -51
4804 -51 -166 -234 75 -63 -133 159 356 -128 -172 -54 -17 -159 207 12 57 72 -102 58 76 -111 -72 -149 43
4827 43 14 -85 -1 -133 -30 1 -198 -156 112 193 -82 -25 60 62 -117 -179 -143 2 91 -225 -176 81 -44 70 185
4852 185 -27 63 13 94 -136 171 -45 -99 47 173 -19 -124 -30 -3 -124 95 -1 -10 -113 -147 -26 180 -71
4875 -71 -166 -17 104 113 61 -16 -226 74 -204 85 -80 84 23 160 8 146 -5 -80 -61 129 128 36 87 -39
4899 -39 18 -38 -74 -145 78 -79 34 125 -41 -93 87 19 -96 -48 -16 -61 292 -33 -112 53 -134 -14 3 -184
4923 -184 -88 -78 65 -3 46 94 -86 -252 159 -4 -80 -71 -25 -28 -12 98 125 41 -155 -70 -4 -244 -111 91 -99
4948 -99 42 66 95 -88 273 -94 83 207 169 -50 -102 55 76 -188 -118 -29 -89 -34 -38 49 -173 181 -171 22
4972 22 132 -81 -68 -47 -191 52 -31 55 111 167 111 34 40 76 -32 -120 25 116 -67 92 -20 -105 -80 59 57 -47
4998 -47 -102 -62 17 37 69 -86 -121 65 -161 -41 36 -102 -106 -98 -74 92 30 63 -134 61 -100 33 17 118 31 -162
5024 -162 68 -4 -29 71 -84 92 -81 -4 -241 -49 44 69 -161 -39 67 130 101 -225 -112 73 44 -93 -25
5047 -25 -140 -158 128 18 -148 164 24 -3 91 -34 80 85 -42 7 125 44 52 77 -127 101 83 -81 26 -62
5071 -62 133 -178 -219 34 -112 41 0 -28 147 44 30 4 -4 25 -132 10 -23 -22 152 88 -76 4 63 77 95 -36
5097 -36 114 -86 66 81 150 -13 250 -53 -151 -155 -137 -18 123 43 76 -148 -173 -61 -114 -120 -29 -31 42 -104 -59 -28
5123 -28 69 -92 -73 15 -117 15 19 -188 -354 73 -95 -130 1 30 -107 72 16 169 -170 -5 -198 115 -141
5146 -141 -57 -94 -17 106 -139 -68 -72 114 -23 116 101 103 281 -160 101 -38 -72 115 -80 36 -25 185 -41 -225
5170 -225 -86 -19 -174 -103 -9 237 -306 -74 81 -16 70 -10 36 -128 78 53 -32 22 53 92 37 113 22 -104 -18
5195 -18 115 21 8 -33 -105 172 46 -75 234 163 230 185 -113 165 68 65 -129 -67 -5 -41 -109 214 127 -272 -110
5220 -110 -76 -171 -63 198 -53 58 -33 -101 109 59 27 -100 68 0 -121 6 -163 89 -129 53 -91 -198
5242 -198 72 19 87 42 -91 113 -35 -247 -162 2 -17 168 242 112 -5 -139 73 -168 -71 168 -260 94
5264 94 -82 -94 -42 -111 215 -39 -123 185 53 170 35 -8 33 76 -128 14 -101 156 -50 -34 -96 -63 -27 -23 -100
5289 -100 13 -198 -49 277 18 21 -74 88 -65 -15 -214 70 1 36 -93 -219 29 256 116 -56 264 101
5311 101 27 70 107 62 -269 160 -30 11 -105 -154 -188 -85 -57 29 204 71 7 22 81 304 -37 -79 -91 91 -65
5336 -65 -45 8 -59 -25 202 106 -67 5 -137 -2 41 -101 4 -31 66 -24 -49 -57 -79 -164 146 -47 126 -87 93
5361 93 255 -10 49 17 141 283 -46 -1 -28 8 -94 145 114 -125 -63 162 126 -28 37 118 96 61 85 -112 66
5386 66 -32 158 1 -40 -154 13 -38 -9 6 -43 -8 8 -145 -45 -4 -8 -2 30 111 -30 -14 54 -18 -35 -181 156 14
5413 14 -202 55 83 108 51 -82 -14 18 -23 -52 -106 52 85 190 -17 -33 -100 -26 -11 -135 -18 131 19 -84 249
5438 249 -215 25 53 -139 -109 41 -1 262 -110 17 112 95 315 -186 29 41 111 -79 110 -171 80 30 4
5461 4 148 -59 36 95 55 -85 -3 41 2 173 -40 -131 81 70 -78 21 -30 11 -27 -268 34 92 34 -167 -46
5486 -46 -121 2 87 -84 -88 183 -53 -17 -1 -88 -117 -10 149 -13 -100 -48 133 222 -72 116 4 48 97 -22 -95
5511 -95 -126 -122 -216 37 -203 -108 62 -28 92 -56 -150 -82 254 72 -36 56 -101 -65 -11 83 5 -137 15 -34 -23
5536 -23 -24 -22 -75 157 108 69 -49 -2 172 -93 77 -128 64 -167 -54 -40 -177 56 -26 -19 -32 66 98 79 122 -92
5562 -92 -52 69 65 -134 118 1 118 104 62 -159 56 -45 -181 44 131 -262 -89 -115 -31 -51 -29 -178 -196 215
5586 215 -88 5 114 50 8 45 -37 104 221 -108 21 78 -5 29 -152 82 198 -30 108 -223 -98 4 161
5609 161 61 -131 -173 173 81 -93 -131 -52 180 -87 104 76 -30 -22 -60 -18 230 4 129 -89 115 -5 189
5632 189 236 40 -39 -39 55 -70 -88 73 -73 -73 -61 -9 -78 -62 -82 -8 136 -206 -25 76 -67 18 66 230 -119
5657 -119 -64 48 39 19 -12 78 71 88 -68 -68 -133 42 96 149 12 22 -10 -58 -63 -73 -187 -58 26 -1 -292 -115 38
5684 38 -145 -9 -60 19 -43 -181 -93 -87 -31 67 96 -108 -18 65 -118 -71 47 -68 94 74 126 -173 64 55 -5 67
5710 67 94 31 -133 -54 -34 -74 -79 56 -33 215 80 195 -62 -107 -31 15 -158 -74 7 -56 -158 56 56 -37 -23 62 -43
5737 -43 -244 101 -39 93 122 12 -284 -110 -39 57 24 66 136 -51 180 148 91 210 69 -56 203 -59 70
5760 70 -133 81 -45 -86 212 9 192 107 37 -132 27 97 7 -36 -167 -18 55 6 -87 -6 70 -50 -29 -34 8
5785 8 210 82 121 29 218 -4 -104 80 -98 10 67 57 -183 -181 35 -8 4 128 -220 137 23 -62 -170 86
5809 86 -71 -47 117 -140 28 76 -153 156 84 -94 -115 182 161 36 -264 -8 68 -45 90 -57 80 -30
5831 -30 -2 119 -24 -15 -133 -167 -85 266 44 69 158 141 -217 8 -151 112 32 8 91 -75 128 59 -173 52
5855 52 116 40 -8 -9 117 31 -69 -33 -214 -224 75 -119 46 -8 64 12 -20 66 -64 129 -98 -334 -222 -10 -33
5880 -33 -49 43 -149 23 -300 51 -9 117 132 -39 99 -92 -42 -63 -147 33 79 50 74 6 -99 44 -49 36 3
5905 3 52 41 -44 122 6 87 54 -46 -129 -24 -220 -15 9 -32 -164 -32 159 -137 210 19 -116 12 43 -122
5929 -122 -24 -155 -53 30 139 -94 25 -34 -101 -151 220 -93 -60 -18 -60 -16 18 16 48 -218 116 15 -56 147 -8
5954 -8 -102 -11 20 80 -37 11 109 -92 -85 -43 21 7 -33 44 164 143 108 -34 -26 -57 117 -17 -213 -194 8 178 -48
5981 -48 39 33 7 24 37 -39 53 -59 38 33 42 102 -40 28 85 -57 -161 76 -54 144 41 -94 -20 -74 127 50 -99
6008 -99 34 -19 -143 -160 -80 -100 -73 133 -47 -119 124 1 -103 62 -110 -172 61 -27 -98 -141 52 -111 -24 -39
6032 -39 -88 -17 -51 2 27 -113 -144 50 -156 -173 271 -47 -17 104 -224 -214 20 37 -61 -77 186 -22 110 37 -242
6057 -242 -10 -29 50 -162 -124 -52 -47 136 14 -146 -65 -203 74 -62 -50 -133 -42 -150 155 -79 -28 75 -81 -54
6081 -54 -58 56 36 150 -85 -31 82 -130 43 -104 2 62 157 -13 -122 -18 152 22 10 79 -2 142 73 -160
6105 -160 -152 48 -21 22 201 12 100 3 -26 69 -104 5 23 208 -43 -223 132 -11 -28 2 34 6 69 -223 -39
6130 -39 102 29 0 -76 -56 116 -103 101 179 100 63 -103 182 126 64 -63 -7 -52 40 -45 -155 115 -132 230 -188
6155 -188 -38 -20 -160 -177 124 -7 -9 101 -176 149 19 -8 22 16 -136 26 118 35 -65 -240 62 24 46 -87
6179 -87 -41 -3 -187 126 -19 -81 63 -27 -144 -82 97 -152 10 -100 -43 56 67 -95 146 13 -207 40 136
6202 136 -74 -10 -49 -30 168 80 100 -30 -24 47 32 76 63 -51 -65 61 172 177 95 86 -129 -175 63 77 119 -58 -146
6229 -146 26 86 -65 -126 -7 -107 -190 -85 -196 95 206 144 -198 -198 6 -178 -63 119 -61 -35 36 -121 60
6252 60 149 239 52 16 -60 -120 75 116 8 -64 108 -8 34 -27 -66 -115 54 -87 -22 24 66 89 -47 -75 104 57
6278 57 -18 -144 -12 -31 140 246 -122 66 15 88 24 27 82 21 79 -65 94 52 51 -51 -147 164 -141 96 48
6303 48 -52 -95 -133 14 -31 -79 29 -76 -79 -119 53 103 -24 10 -157 88 -68 -161 -193 -44 -37 166 -38 -164 -18
6328 -18 260 0 -94 -49 68 54 41 149 25 12 -68 107 178 -16 55 72 21 -69 -112 0 1 -13 -134 -15 39 -106
6354 -106 124 -61 -41 -50 246 -35 52 -129 -77 47 -104 -91 -86 127 -147 -179 41 -62 -203 176 -138 239 -78
6377 -78 -178 -60 -10 79 30 36 269 168 296 -59 172 14 -69 1 21 -122 122 -28 34 40 85 117 38 40 -120 39
6403 39 22 145 -124 -105 13 -50 -80 -250 -118 -79 -30 -31 -45 -68 -28 190 -50 10 19 215 28 81 -15 -69 -72 13 -30
6430 -30 152 -39 -64 78 85 -122 -308 190 72 -8 -64 159 93 96 -17 28 22 125 3 118 50 183 214 -91 1
6455 1 107 -32 -249 60 6 267 16 -10 -46 -20 87 82 -130 -122 -98 9 55 140 94 -188 -70 173 111 71 66 -51
6481 -51 -85 -29 7 177 46 101 19 -130 126 66 135 -130 24 24 237 84 287 -180 -81 47 63 80 -249 13
6505 13 -131 -40 -192 85 85 81 19 8 69 -230 -238 80 -77 -38 10 -30 37 -180 46 -161 -49 113 62 13 -73 4
6531 4 64 -58 80 -13 230 76 -84 41 -90 -82 53 -36 37 30 -72 116 141 -120 8 -80 -52 14 60 4 35 -170
6557 -170 42 -33 14 -121 18 163 -1 150 32 -74 -93 -143 42 47 -22 -57 -169 21 -122 -36 224 15 36
6580 36 -171 -40 -58 -65 -310 64 11 -124 120 42 -15 -57 -85 -5 -39 -38 86 -44 -183 -114 69 13 -33 -146 -28
6605 -28 59 140 4 -193 241 28 81 -48 55 88 -75 -136 107 19 -176 0 50 -196 -104 171 53 -62 10
6628 10 -151 201 -9 -145 -32 -156 -12 139 166 -201 -31 -63 -185 61 -89 -41 95 105 166 -73 66 -13
6650 -13 105 -2 99 191 -54 173 -73 9 143 115 71 -10 64 -158 32 79 -67 204 -82 -145 38 -87 -23
6673 -23 101 76 -276 -2 127 58 -63 188 -40 34 -199 227 41 -61 -192 -47 1 -1 31 -4 68 -13 -18 -74 19
6698 19 -171 -47 27 -155 -65 -40 -49 -140 -73 -152 -155 57 52 -203 -35 -68 3 -63 -14 31 -37 208 -128 194 -121 -199 81
6725 81 -108 79 -153 33 145 -184 -72 -2 -48 137 -89 40 53 3 186 3 -28 -243 -245 145 -87 0 86
6748 86 -15 1 -154 -16 -12 -49 99 -117 -37 33 37 94 127 24 -44 113 -22 24 116 -15 -29 2 -152 -145 -89 -61 50
6775 50 -42 133 -30 49 78 215 40 120 81 77 121 -11 -119 1 -170 37 -2 -248 131 65 68 40 -175 -130 -135 33
6801 33 56 -4 -80 -9 -44 -214 12 -48 162 -59 107 -22 -23 -76 91 21 35 -25 -95 89 9 -54 161 62 92 204
6827 204 120 152 22 -160 28 -88 45 170 119 42 -146 3 -30 111 -35 -81 4 -96 -127 -63 62 5 -231
6850 -231 87 101 -119 113 -123 60 164 50 -102 82 -87 -129 -93 119 -23 44 -222 124 11 17 -53 -113 -55
6873 -55 22 -26 -37 210 -154 -100 -116 41 -100 -46 100 122 217 64 -49 -176 140 -106 29 -54 -149 -79 -124 185
6897 185 -91 77 67 -133 242 33 -31 -51 -40 -126 -86 115 23 -99 -65 36 -63 38 -55 -88 -116 -118 60 47 -59
6922 -59 111 71 -90 -4 22 88 -40 208 -53 -51 146 -44 -12 7 -218 -84 -17 38 -47 0 -101 70 122 138 89
6947 89 86 111 92 83 67 42 58 100 -31 113 -157 34 131 137 47 -57 -70 117 111 -27 17 -54 0 171 121 73 57 58 -132
6976 -132 -166 61 -5 34 137 -97 -74 16 -137 184 60 -82 64 22 -105 74 -61 -67 55 143 -6 38 -61 41
7000 41 -118 4 -34 46 131 14 42 -103 -12 -3 -123 80 -95 -76 27 -178 183 177 -223 62 54 18 76 19 -102
7025 -102 16 70 -61 15 73 -97 61 41 98 -11 49 241 -57 91 109 37 122 51 -23 -258 189 -3 -14 -18 -105
7050 -105 125 36 -102 -17 -71 200 115 47 208 202 41 -30 -17 125 36 8 244 -60 11 -105 252 79 -42 110
7074 110 -47 -96 -47 -5 -44 83 39 109 65 147 105 -84 236 110 86 102 -165 85 -23 1 -41 46 92 -153 -156 -56
7100 -56 -135 171 -45 -77 -214 9 1 -65 25 -100 -29 230 201 -24 29 -99 -69 -30 30 45 -79 72 -38 -96 -6
7125 -6 -84 -125 -110 -160 -38 32 10 -212 -63 -61 -34 -28 15 37 -105 -118 -60 66 100 -58 -74 6 -131 20 -64 -81 -153 -4
7153 -4 -250 102 10 -4 -70 -109 -279 15 -82 118 86 146 50 32 -26 0 117 -111 8 159 -12 29 162 -113 24
7178 24 20 290 -3 59 -59 -34 88 48 -133 -59 -38 -94 147 -50 -43 78 22 -63 -42 -127 -120 -107 -118 -48 101 -147 10
7205 10 -68 -2 -92 321 -245 -11 120 -29 22 -81 6 61 115 -53 -146 97 150 45 -66 80 -54 -93 139 127
7229 127 -59 -60 -130 -9 92 19 -67 -86 108 14 -65 20 -95 -69 126 -71 -17 10 -97 76 -97 -186 -136 99 -89
7254 -89 48 2 -66 -16 37 -19 50 -73 51 313 -40 22 -161 -49 -38 150 -65 -131 -80 98 101 -15 92 -26
7278 -26 71 -169 -100 -101 217 78 13 -163 -161 43 77 -58 91 38 -58 244 -142 22 59 -59 -280 -42 -12 108
7302 108 0 -25 40 -165 44 12 -59 291 83 -146 112 135 25 22 225 -20 89 110 -67 -123 -206 116 -193
7325 -193 -113 94 -90 24 -56 190 90 -49 190 199 73 -178 -159 -68 -87 -208 123 150 -81 -90 -89 57 -47 9
7349 9 -51 -85 -11 -6 -10 -151 116 -85 -271 -105 12 30 -62 -97 80 -68 -50 -5 -49 -70 -116 43 200 60 116 -119
7375 -119 -83 21 52 41 87 -66 166 23 -193 -35 93 -21 -48 44 -88 41 99 -69 -30 -56 -75 -79 89 -12
7399 -12 16 9 -118 69 94 -16 88 100 73 59 101 111 -105 48 24 67 213 2 54 -53 27 94 73 171 32 201
7425 201 143 87 30 -44 -133 100 38 -63 -64 51 20 -85 -43 163 154 98 151 -49 129 -87 16 100 153 -93 -25 -172
7451 -172 -73 19 -17 -13 -50 -72 -66 134 19 -109 3 23 77 -122 81 74 16 13 7 50 83 67 65 -88 114 5 101 -51
7479 -51 46 -190 -292 21 72 -93 -39 -235 -143 -138 -40 -28 -60 29 50 -204 -81 108 40 13 -9 65 -108 105 122 -74
7505 -74 40 62 29 77 26 84 25 -29 188 50 49 58 -221 44 -96 -83 62 1 -94 108 -21 0 -80 60 -1 104
7531 104 54 60 -90 -34 49 -38 31 -70 90 -3 -41 -121 124 -71 -128 -132 -79 142 -72 58 178 -12 19 -9 5 19
7557 19 9 -92 -149 -196 -111 -66 4 -20 99 54 -44 -26 -231 -190 -78 -35 153 -270 154 9 -130 6 -82 54 -14
7582 -14 28 85 -66 -215 -32 153 -36 26 -94 151 82 -3 -154 147 -33 29 -28 4 -269 128 -39 77 166
7605 166 -42 -107 -35 29 51 5 37 -26 82 -2 75 -52 49 -32 66 -80 77 -76 -59 68 -30 -20 -126 12 -124
7630 -124 9 -42 -55 -50 -12 151 30 -82 -72 3 88 -103 -112 161 103 -59 12 -72 21 40 -106 -85 -31 -39 -98 6 -59
7657 -59 68 26 94 86 117 90 -94 41 184 57 59 -207 19 -113 155 63 -56 63 -70 92 11 28 -13 50 14
7682 14 52 -38 117 -179 -147 136 -105 134 -4 -143 126 -34 -143 -25 29 54 237 -13 -81 -63 -223 10 111
7705 111 47 -159 -269 -116 -73 99 -93 65 -81 38 5 -7 -77 138 19 72 -138 -64 -170 -55 165 224 -145
7728 -145 -23 52 -127 -171 130 61 88 -74 25 -98 87 84 110 54 240 -82 40 -3 -57 65 44 -139 -145 -89 204
7753 204 31 -65 -15 -54 -126 -21 41 40 -1 54 38 10 3 -20 49 154 -18 -58 -100 -127 10 36 13 136 56 -92 -135
7780 -135 114 154 51 190 -74 70 -50 53 -35 -93 -69 68 83 -76 -28 -191 158 48 43 -41 71 76 -52 -84
7804 -84 44 -273 -113 20 -53 86 -65 53 65 169 -165 78 57 -98 181 -154 37 -144 29 174 109 123
7826 123 -41 35 -26 -122 172 89 -10 212 -60 -26 89 -121 -83 110 -11 -15 210 -81 -79 -22 77 -92 -27 -56 -262
7851 -262 217 -36 104 -122 49 -133 -50 -88 -54 22 -329 105 31 60 -3 137 -96 55 -116 84 -139 113
7873 113 139 196 -11 -17 14 -7 15 162 -67 -64 28 56 -55 116 -30 51 1 -106 52 71 25 56 -32 -128 88 10
7899 10 123 7 120 85 42 -174 116 50 -29 210 1 -90 -55 216 41 -149 112 151 230 -24 -90 -258 49
7922 49 -82 -121 106 20 82 47 -30 -113 17 51 62 -13 84 76 7 181 94 71 -70 -132 212 -10 34 -37 -91 119 49
7949 49 -28 10 -202 -36 -124 73 16 172 35 10 192 101 -102 -8 35 -4 250 -154 31 136 -19 -2 -170 155
7973 155 60 -188 -105 -190 -87 7 52 169 105 -84 -135 -176 -203 -107 -90 -65 -258 -253 64 11 61 182 -88 -20 -22 36 25
8000 25 23 272 57 -88 28 17 3 41 68 -55 -125 -13 -15 -162 27 -18 42 13 105 -116 94 97 -16 12 54 39
8026 39 -119 -102 15 -4 274 -169 -81 23 -148 -100 63 -46 49 -80 -8 2 -96 77 202 155 296 -12 3 -52
8050 -52 -11 67 34 73 34 67 102 -114 48 79 -130 71 65 8 -156 133 -30 -179 -47 217 -23 -98 -102 -135 -124 -281
8076 -281 63 53 -3 63 37 180 36 -84 98 -91 115 -144 163 142 -7 91 -89 -78 96 44 56 10 -49 -108
8100 -108 30 46 54 -174 41 -205 144 58 75 104 158 -6 -123 -8 68 -120 41 51 46 -51 -162 -46 -29 -133
8124 -133 58 7 -53 -44 17 -165 62 -144 -113 -23 -91 86 83 -94 -77 -40 16 17 -24 148 13 69 -47 -152 82 -57
8150 -57 -16 39 -119 89 -55 10 6 -53 -187 -66 -74 47 -29 50 71 -102 191 -213 120 59 28 52 52 153 99 -23
8176 -23 8 297 -55 49 -25 -25 -72 -128 -77 -228 85 35 -65 27 89
8191H9
##END NTUPLES=NMR FID
##END=
