##TITLE=1H_B1d-4
 CDCl3
 8 sc, 
 30.10.2024
##JCAMPDX= 6.0         $$ Bruker NMR JCAMP-DX V2.0
##DATA TYPE= NMR FID
##DATA CLASS= NTUPLES
##ORIGIN= UXNMR, Bruker Analytische Messtechnik GmbH
##OWNER= root
$$ XWIN-NMR		Version 3.5
$$ Wed Oct 30 14:39:11 2024 Russian Standard Time (UT+4h)  she@DPX200
##.OBSERVE FREQUENCY= 200.1318
##.OBSERVE NUCLEUS= ^1H
##.DELAY= (6, 6)
##.ACQUISITION MODE= SIMULTANEOUS
##.ACQUISITION SCHEME= undefined
##.AVERAGES= 8
##.DIGITISER RES= 18
##SPECTROMETER/DATA SYSTEM= spect
##.PULSE SEQUENCE= zg30
##.SOLVENT NAME= DMSO
##.SHIFT REFERENCE= (INTERNAL, DMSO, 0, 15.7039)
##AUDIT TRAIL= $$ (NUMBER, WHEN, WHO, WHERE, WHAT)
$$ ##TITLE= Audit trail, XWIN-NMR		Version 3.5
$$ ##JCAMPDX= 5.01
$$ ##ORIGIN= Bruker BioSpin GmbH
$$ ##OWNER= she
$$ F:/spectra/data/she/nmr/H-F/1/audita.txt
$$ ##AUDIT TRAIL=  $$ (NUMBER, WHEN, WHO, WHERE, WHAT)
(   1,<2024-10-30 14:37:57.65 +0400>,<she>,<DPX200>,
      <created by zg, POWCHK disabled, PULCHK disabled
       configuration hash MD5:
       00 E9 B6 7A A2 85 ED C7 34 08 36 98 17 FE 4E 26
       data hash MD5: 16K
       F0 E0 4C CD 16 51 7A A5 69 2C AF 18 99 10 83 B9>)
$$ ##END=
$$ 
$$ hash MD5
$$ 35 86 B9 6B 52 3A FF B1 57 C8 5E FF 9F C4 73 FE
##$RELAX= 
##$RELAX= 
##$RELAX= 
##$RELAX= 
##$RELAX= 
##$RELAX= 
$$ Bruker specific parameters
$$ --------------------------
##$DU= <F:/spectra>
##$EXPNO= 1
##$NAME= <H-F>
##$PROCNO= 1
##$TYPE= <nmr>
##$USER= <she>
##$AMP= (0..31)
100 100 100 100 100 100 100 100 100 100 100 100 100 100 100 100 100 100 
100 100 100 100 100 100 100 100 100 100 100 100 100 100 
##$AQSEQ= 0
##$AQ_mod= 1
##$AUNM= <au_zg>
##$AUTOPOS= <>
##$BF1= 200.13
##$BF2= 200.13
##$BF3= 200.13
##$BF4= 200.13
##$BF5= 200.13
##$BF6= 200.13
##$BF7= 200.13
##$BF8= 200.13
##$BYTORDA= 1
##$CFDGTYP= 0
##$CFRGTYP= 5
##$CHEMSTR= <none>
##$CNST= (0..31)
1 1 145 1 1 1 1 1 1 1 1 1 1 1 1 1 1 1 1 1 1 1 1 1 1 1 1 1 1 1 1 1 
##$CPDPRG= <>
##$CPDPRG1= <>
##$CPDPRG2= <>
##$CPDPRG3= <>
##$CPDPRG4= <mlev>
##$CPDPRG5= <mlev>
##$CPDPRG6= <mlev>
##$CPDPRG7= <mlev>
##$CPDPRG8= <mlev>
##$CPDPRGB= <>
##$CPDPRGT= <>
##$D= (0..31)
0 1.2 0 0 0 0 0 0 0 0.06 0 0.03 0 0 0 0 0.0002 0 0 0 0 0 0 0 0 0 0 0 0 
0 0 0 
##$DATE= 1730284676
##$DBL= (0..7)
120 120 120 120 120 120 120 120 
##$DBP= (0..7)
150 150 150 150 150 150 150 150 
##$DBP07= 0
##$DBPNAM0= <>
##$DBPNAM1= <>
##$DBPNAM2= <>
##$DBPNAM3= <>
##$DBPNAM4= <>
##$DBPNAM5= <>
##$DBPNAM6= <>
##$DBPNAM7= <>
##$DBPOAL= (0..7)
0.5 0.5 0.5 0.5 0.5 0.5 0.5 0.5 
##$DBPOFFS= (0..7)
0 0 0 0 0 0 0 0 
##$DE= 6
##$DECBNUC= <off>
##$DECIM= 24
##$DECNUC= <off>
##$DECSTAT= 4
##$DIGMOD= 1
##$DIGTYP= 9
##$DL= (0..7)
0 120 120 120 120 120 120 120 
##$DP= (0..7)
150 150 150 150 150 150 150 150 
##$DP07= 0
##$DPNAME0= <>
##$DPNAME1= <>
##$DPNAME2= <>
##$DPNAME3= <>
##$DPNAME4= <>
##$DPNAME5= <>
##$DPNAME6= <>
##$DPNAME7= <>
##$DPOAL= (0..7)
0.5 0.5 0.5 0.5 0.5 0.5 0.5 0.5 
##$DPOFFS= (0..7)
0 0 0 0 0 0 0 0 
##$DQDMODE= 0
##$DR= 18
##$DS= 0
##$DSLIST= <SSSSSSSSSSSSSSS>
##$DSPFIRM= 0
$$ [...]
##$SUBNAM2= <"">
##$SUBNAM3= <"">
##$SUBNAM4= <"">
##$SUBNAM5= <"">
##$SUBNAM6= <"">
##$SUBNAM7= <"">
##$SUBNAM8= <"">
##$SUBNAM9= <"">
##$SW= 24.0689170037331
##$SWIBOX= (0..15)
0 0 2 0 0 0 0 0 0 0 0 0 0 0 0 0 
##$SW_h= 4816.95568400771
##$TD= 16384
##$TD0= 1
##$TE= 0
##$TE2= 300
##$TE3= 300
##$TEG= 300
##$TL= (0..7)
0 120 120 120 120 120 120 120 
##$TP= (0..7)
150 150 150 150 150 150 150 150 
##$TP07= 0
##$TPNAME0= <>
##$TPNAME1= <>
##$TPNAME2= <>
##$TPNAME3= <>
##$TPNAME4= <>
##$TPNAME5= <>
##$TPNAME6= <>
##$TPNAME7= <>
##$TPOAL= (0..7)
0.5 0.5 0.5 0.5 0.5 0.5 0.5 0.5 
##$TPOFFS= (0..7)
0 0 0 0 0 0 0 0 
##$TUNHIN= 0
##$TUNHOUT= 0
##$TUNXOUT= 0
##$USERA1= <user>
##$USERA2= <user>
##$USERA3= <user>
##$USERA4= <user>
##$USERA5= <user>
##$V9= 5
##$VALIST= <valist>
##$VCLIST= <CCCCCCCCCCCCCCC>
##$VD= 0
##$VDLIST= <DDDDDDDDDDDDDDD>
##$VPLIST= <PPPPPPPPPPPPPPP>
##$VTLIST= <TTTTTTTTTTTTTTT>
##$WBST= 1024
##$WBSW= 4
##$XGAIN= (0..3)
0 0 0 0 
##$XL= 0
##$YL= 0
##$YMAX_a= 85348
##$YMIN_a= -96829
##$ZGOPTNS= <>
##$ZL1= 120
##$ZL2= 120
##$ZL3= 120
##$ZL4= 120
##$ABSF1= 10
##$ABSF2= 0
##$ABSG= 5
##$ABSL= 3
##$ALPHA= 0
##$AQORDER= 0
##$ASSFAC= 0
##$ASSFACI= 0
##$ASSFACX= 0
##$ASSWID= 0
##$AUNMP= <proc_1d>
##$AZFE= 0.1
##$AZFW= 0.1
##$BCFW= 1
##$BC_mod= 2
##$BYTORDP= 1
##$COROFFS= 0
##$CY= 11.3945322036743
##$DATMOD= 1
##$DC= 2
##$DFILT= <>
##$DTYPP= 0
##$F1P= 15.6554695791079
##$F2P= 12.8336369535428
##$FCOR= 0.5
##$FTSIZE= 0
##$FT_mod= 4
##$GAMMA= 1
##$GB= 0.15
##$INTBC= 1
##$INTSCL= 1
##$ISEN= 128
##$LB= 0.24
##$LEV0= 0
##$LPBIN= 0
##$MAXI= 10000
##$MC2= 0
##$MEAN= 0
##$ME_mod= 0
##$MI= 1.114404
##$NCOEF= 0
##$NC_proc= 0
##$NLEV= 6
##$NOISF1= 3.799351
##$NOISF2= 2.8
##$NSP= 1
##$NTH_PI= 0
##$NZP= 0
##$OFFSET= 15.70392
##$PC= 1
##$PHC0= -26354.99
##$PHC1= 21.78743
##$PH_mod= 1
##$PKNL= yes
##$PPARMOD= 0
##$PSCAL= 0
##$PSIGN= 0
##$REVERSE= no
##$SF= 200.130013532006
##$SI= 16384
##$SIGF1= 3
##$SIGF2= 2
##$SINO= 400
##$SIOLD= 16384
##$SREGLST= <1H.CDCl3>
##$SSB= 0
##$STSI= 0
##$STSR= 0
##$SW_p= 3612.71676300578
##$SYMM= 0
##$S_DEV= 0
##$TDeff= 0
##$TDoff= 0
##$TI= <>
##$TILT= no
##$TM1= 0
##$TM2= 0
##$TOPLEV= 0
##$USERP1= <user>
##$USERP2= <user>
##$USERP3= <user>
##$USERP4= <user>
##$USERP5= <user>
##$WDW= 1
##$XDIM= 8192
##$YMAX_p= 0
##$YMIN_p= 0
$$ End of Bruker specific parameters
$$ ---------------------------------
##NTUPLES= NMR FID
##VAR_NAME=  TIME,          FID/REAL,        FID/IMAG
##SYMBOL=    X,             R,               I
##VAR_TYPE=  INDEPENDENT,   DEPENDENT,       DEPENDENT
##VAR_FORM=  AFFN,          ASDF,            ASDF
##VAR_DIM=   8192,          8192,            8192
##UNITS=     SECONDS,       ARBITRARY UNITS, ARBITRARY UNITS
##FACTOR=    0.0002076,     1,               1
##FIRST=     0,             0,               0
##LAST=      1.7004516,     0,               0
##MIN=       0,             -96829,          0
##MAX=       1.7004516,     85348,           0
$$ Real data points
##PAGE= N=1
##DATA TABLE= (X++(R..R)), XYDATA
0@%%%%%%%%%%pJ5j6J6j6J7k5L2l4M2n0N8p1Q1r1J06j22J40j60J81k05K32k61K92
$$ 0 0 0 0 0 0 0 0 0 0 0 -7 8 -8 8 -8 9 -16 16 -18 24 -26 32 -39 42 -49 57 -65 75 -85 96 -109 123 -138 154
34A54l26L66m08M52n03N60o22O88p61Q43r35J034j145J272j414J578j766J985
$$ 154 -172 194 -214 238 -265 295 -327 361 -400 443 -492 542 -603 669 -745 833 -933 1052
52A052k249K569k963L468m139N079o502Q953k1515J01595q1644p9360J51163p0096
$$ 1052 -1197 1372 -1591 1877 -2262 2817 -3685 5268 -16247 85348 3704 -75656 75507 5411
66E411q9736J36816k045j25188R0666L3161j12360N2990P5765r9436K597Q3601
$$ 5411 -84325 52491 50446 -74742 15924 49085 -63275 -10285 65480 -33956 -31359 52242
78E2242o0856l2880Q1558k2058o0128N4423K0205p0874K4413N8898o3381j6478
$$ 52242 -8614 -41494 40064 18006 -42122 12301 32506 -38368 -13955 44943 -18438 -34916
90c4916Q0508m5625m8608R0738j8414q0306Q1400J3226r4920O2681M4160j01203
$$ -34916 45592 -33 -48641 42097 23683 -56623 24777 38003 -56917 5764 49924 -51279
102e1279L7392P3523r4805O012Q9181q0643j8940R8773o2424m7173R2539l4842
$$ -51279 -13887 59636 -35169 -29157 60024 -20619 -39559 59214 -3210 -50383 42156 7314
114G314n7411Q2262j0650o9786O0048J9355o4507L4718L5928o0554N231N1375
$$ 7314 -50097 32165 21515 -48271 11777 31132 -33375 1343 37271 -23283 -18052 33323
126C3323m0075j9131N0311j9101l8043M3922J1304m8841K3466L6418n1604k628
$$ 33323 -6752 -25883 24428 5327 -32716 11206 22510 -26331 -2865 33553 -18051 -20679
138b0679N9571m3626l2161P2645k7220n8623P7385p53p8484O6929K6733q9236
$$ -20679 38892 -4734 -36895 35750 8530 -50093 27292 26539 -51945 14984 41717 -47519
150d7519M6005N5101q9760J4992P5546p7750j4391Q8547n6298m2905Q8559k7483
$$ -47519 -1514 53587 -36173 -21181 54365 -23385 -37776 50771 -5527 -48432 40127 12644
162A2644o0259P4737K15o9489M9929K7434o5008J9070M5184n0761r884N5773k6306
$$ 12644 -47615 27122 27337 -42152 7777 35211 -29797 -10727 34457 -16304 -26188 29585 3279
175C279l5605N1616K15n1218L7188K6433n7073J2036M8585m9677j4795O3603l3093
$$ 3279 -32326 19290 19505 -31713 5475 31908 -25165 -13129 35456 -14221 -29016 34587 1494
188A494m1868O8462r300o2549O2369J4463p5197M6230L6649p6861K4217N4776
$$ 1494 -40374 28088 18788 -43761 18608 33071 -42126 4104 40753 -36108 -11891 42885
200D2885o7765k69O5474m9773k3164O7980k9541m1788O0694p121n2388M6284J1693
$$ 42885 -24880 -25149 40325 -9448 -32612 35368 5827 -35961 24733 17612 -34776 11508 23201
213B3201n2524K7114K7878m3736N222L7558k9058j5072L9185j0480l2733L3167
$$ 23201 -29323 -2209 25669 -18067 -12845 24713 -4345 -19417 19768 9288 -23445 9722
225I722Q621m2297K1944K6171m3060N630M0349l5564j3140M8438k3054l2178M9937
$$ 9722 18343 -23954 -2010 24161 -18899 -13269 27080 -8484 -21624 26814 3760 -28418 21519
238B1519o546m7627M4743J0811n6246L4786K8247n7796K0017M1687n1508J688
$$ 21519 14973 -32654 12089 22900 -33346 1440 29687 -28109 -8092 33595 -17913 -16225
250a6225M9065l9709j6884N0012k3297l1736M5814m729m0408L5459J2452m2306
$$ -16225 32840 -6869 -23753 26259 2962 -28774 17040 12311 -28097 7362 19814 -22492
262b2492K0332K6183l7181K314L2880k5144j5972L4202q092l0117K9590J0400
$$ -22492 -2160 24023 -13158 -10844 22036 -3108 -19080 15122 7030 -23087 6503 16903
274A6903l8466J8761K7651m0061L369L9562l4796j4418M6173k2668l0132M5939
$$ 16903 -21563 -2802 24849 -15212 -11843 27719 -7077 -21495 24678 2010 -28122 17817
286A7817n051m3500L9976J3693n0600K8042K9083n0987J2118L9838m4315m156
$$ 17817 12766 -30734 9242 22935 -27665 377 29460 -21527 -9409 30429 -13886 -18042
298a8042M4427l0829j9155M3275j3969k9887L5939L496l6238K3789J7611l6101
$$ -18042 26385 -4444 -23599 19676 5707 -24180 11759 15255 -20983 2806 20417 -15684
310a5684Q532K7719k9324n978L1572j6372j9039L0024j176k8392K2150J4198l3817
$$ -15684 -7152 20567 -8757 -14735 16837 465 -18574 11450 10274 -18118 4032 18230 -15587
323a5587J0434K6848l3078k683L5668k6453j5399L9336j5368k6274L6652j203
$$ -15587 -5153 21695 -11383 -14066 21602 -4851 -20250 19086 3718 -22556 14096 12893
335A2893l5295K9191J2571l9624J7856K4226l8280O029L2750l1934n902L5960
$$ 12893 -22402 6789 19360 -20264 -2408 21818 -16462 -10433 22317 -9617 -15519 20441
347B0441k1409j6647L3540r179k4615K5877M178k8527J5416J6347k7800M084K5119
$$ 20441 -968 -17615 15925 6746 -17869 8008 12186 -16341 -925 15422 -12378 -8294 16825
360A6825k1884p442K7628j2390j7692K5317o45k5994J8499J1618k8366Q680K3583
$$ 16825 -5059 -12501 15127 2737 -14955 10362 9717 -16277 2222 13840 -14526 -5846 17737
373A7737k7636k017L1370k2255j3495L4265j3890k3145L1068k052l0013K4306
$$ 17737 -9899 -11916 19454 -2801 -16296 17969 4079 -19066 12002 9950 -20063 4243
385D243J0401l2278J4728K1372l0646L355K8509k5079p876L0543j6387j7321K7879
$$ 4243 14644 -17634 -2906 18466 -12180 -8825 19684 -5395 -13271 17272 885 -16436 11443
398A1443n276k3081K1184P142k4979J1622J6871k2975Q4K3649j7667j1084K5662
$$ 11443 6167 -16914 4270 11412 -13567 -1945 14926 -8049 -7965 15684 -1983 -13067 12595
411A2595r327j9309K3251J677k4252J6837J2347k5420P042K1458k3338m661K7651
$$ 12595 3268 -16041 7210 8887 -15365 1472 13819 -11601 -4559 16899 -6439 -11100 16551
424A6551j7620j4815K9164r169k2197K6331J579k6209J9423J1237k6846R501J9735
$$ 16551 -1069 -15884 13280 4111 -18086 8245 9824 -16385 3038 14275 -12571 -3070 16665
437A6665k4502j606K4635j8212j1137K6286r413j8070K3349K57k1574J6626Q924
$$ 16665 -7837 -9443 15192 -3020 -14157 12129 2716 -15354 7995 8252 -13322 3304 12228
450A2228k2491O969J6439j9117l276K1349j3362j1747K2510m899j8357K0064L347
$$ 12228 -10263 -3294 13145 -5972 -9248 12101 -1261 -13008 9502 4603 -13754 6310 9657
463I657k1857J3462J1335k1920M609J7390j8534m284K1910j2286j2388K2928n089
$$ 9657 -12200 1262 12597 -9323 -4714 12676 -5858 -10142 11768 -518 -12906 10022 4933
476D933j8349K0148K668k1980J4217J0155k2038N939J6154j8381k403K0272j2048
$$ 4933 -13416 6732 9400 -12580 1637 11792 -10246 -4307 11847 -6534 -8937 11335 -713
489g13j0701K1212n071j6782J8481J839k0245J3028Q982j9980N820J5091j6532
$$ -713 -11414 9798 4727 -12055 6426 8265 -11980 1048 10030 -9950 -4130 10961 -5571
502e571k235J8812j1074r999J9165m127j6757J6906K942j9968J2026J0186j9553
$$ -5571 -7806 11006 -68 -10067 9098 4971 -11786 5120 8062 -11906 120 10306 -9247
515i247M992J5616j5899k532J7768j0185j0428J8165l395j6798J5834M067j9564
$$ -9247 -4255 11361 -4538 -7070 10698 513 -9915 8250 4855 -11943 3891 7958 -11606
528a1606J1249J0194j8235M417J5274j4949l347J7243r236j0851J6929k271j6498
$$ -11606 -357 9837 -8398 -3981 11293 -3656 -7003 10240 1004 -9847 7082 4811 -11687
541a1687J4883M694j8590J0312J0885j8173L984J4969j4714l659J6566q960j0281
$$ -11687 3196 7890 -10700 -388 10497 -7676 -3692 11277 -3437 -7096 9470 510 -9771
554i771J6107k415j4338J3137M620j6613Q953R986j5796K865J3316j3060l637
$$ -9771 6336 3921 -10417 2720 7340 -9273 -320 9666 -6130 -3265 10051 -3009 -6646
567f646J4401p459r314J3695l96j3511J1073N968j5342O478J1115j5533J121J3947
$$ -6646 7755 296 -9018 4677 4281 -9230 1843 7811 -7531 -1053 10062 -5471 -4350 9597
581I597j2227n080J5237p105j0053J4615l65j3703J1772N484j6070P361J0187
$$ 9597 -2630 -7710 7527 422 -9631 4984 4619 -9084 2688 8172 -7898 -537 9650
594I650j5648K077J3009j3306k518J4377q097p467J3639k191j1324J0952L417
$$ 9650 -5998 -3921 9088 -4218 -6736 7641 -456 -7923 5716 3525 -7799 3153 6570
607F570j3778O903P929j3320K276J0663j0583k406J2400o238o983J1318p08j0874
$$ 6570 -7208 -305 7624 -5696 -3420 7243 -3340 -5746 6654 416 -6567 4751 4043 -6831
621f831Q668N007j2995M308R481j2577j35J2707r814m526J3976n786q674J2525
$$ -6831 1837 6844 -6151 -1843 7638 -4939 -5074 7633 -2181 -6707 7269 1483 -7191 5334
635E334q15j2208R931M310j3818O010Q938j3564J907J2128j1492j978J2824p323
$$ 5334 4519 -7689 2242 6552 -7266 -1256 7682 -5882 -3975 8153 -3339 -5317 7507 184
649A84o325J1627k763r569Q738K883j1330N286P296j0426J166J0089q023l716
$$ 184 -6141 5486 2723 -6846 1892 4775 -6555 -1269 6027 -4399 -3233 6856 -1167 -4883
663d883J0731m649p187R087K48r715O521N013j0479K727R673j0120j323J2119
$$ -4883 5848 1199 -5988 3099 3347 -6368 153 5166 -5313 -2586 7087 -3033 -4356 7763
677G763q164n535J2320m693r262J1352k67j1262Q848M413j1345M972Q089j1037
$$ 7763 -401 -5936 6384 1691 -7571 3781 3514 -7748 1100 5513 -5832 -860 7229 -3808
691c808P86J0669r431l109J0872o119o060R916k191p059P196K308p718L274N731
$$ -3808 -3022 7647 -1784 -4893 5979 -140 -6200 3716 1525 -5534 1662 3970 -3748 -474 5257
706E257p479l74P568n743l796Q220k742o359P683P14p900N382M778q442J679P595
$$ 5257 -2222 -2596 4972 -771 -4567 3653 911 -5448 2235 2949 -4951 431 5209 -3233 -1554 6041
722F041q218k029R943o263n821J1204l665p935J0729n42r459Q281L028j0618N049
$$ 6041 -2177 -4206 5737 -526 -6347 4857 1192 -6743 3986 3444 -6015 2266 5294 -5324 -275
737b75N795r609J320Q332q327j793R578n224m635R177k339o184O700M14o756L686
$$ -275 5520 -4089 -2769 5563 -2764 -4557 5021 -203 -4838 4339 2000 -4184 2516 2930 -3826 -140
753a40L309o047K62O206m305l540Q055k358n527O595R65p672M754L797p871J432
$$ -140 3169 -2878 -2616 3590 -715 -4255 3800 1442 -4085 2510 3475 -4197 557 4354 -3517 -2085
769b085O732p322j172R042n383m784J0196l344p657R836r96r065P812J910r171
$$ -2085 4647 -2675 -3847 5195 -188 -4972 5224 1880 -5777 4059 3063 -6002 1810 3720 -5451
784e451N279M705q665K406O902o812j167P552m494m139P246k549n325N846O71
$$ -5451 -172 4533 -4132 -1726 5176 -1636 -2803 4749 255 -3884 3362 813 -4512 1334 2005
799B005n893L626L289m870M45M950l421k921N654j194o028N472J542p146M276
$$ 2005 -3888 -262 3027 -1843 -1398 3552 131 -2790 2864 1670 -4358 1114 2656 -4490 -214
814b14M206p638K405O102o630q41P565n005m553Q677l291o552Q546k84q210P790
$$ -214 3992 -3646 -1241 4861 -1769 -2610 4955 -50 -4603 4074 783 -5769 2777 2493 -5717 2073
830B073J680q178M932L777p440K405M841o183n94N931m249k678O332j880m404
$$ 2073 3753 -4425 507 4284 -3156 -751 4090 -2093 -2687 3244 -1005 -3683 2649 769 -3635
845c635N563J51m477L078K325m701M90L546l281j936M595n99m722M690J822o258
$$ -3635 1928 2079 -2398 680 3005 -1696 -1206 2340 -941 -2877 1718 1119 -3603 1087 2909 -3349
861c349M112L349p030K114N116o659l91O497m970k652P759l288n031Q050j401
$$ -3349 763 4112 -2918 -804 4312 -2347 -2738 3759 -1211 -3863 3896 608 -4423 3627 2226
876B226o927P231R25p994M960L094p548L027M546n949K97N684l981j851N091j454
$$ 2226 -4701 2530 3455 -4539 421 3515 -4033 -1006 3540 -2409 -2112 3572 -409 -2260 2831 1377
892A377m182M530M40n322K903K568m885J128M006l306j437M769j562l764M545
$$ 1377 -2805 1725 2165 -3157 -254 2314 -2571 -1443 2563 -743 -2180 2589 1027 -2737 1808
907A808P56o262L873K888o886K640M918o329O93O503n571j767O964l527m686O811
$$ 1808 2564 -3698 175 3063 -3823 -1183 3735 -2594 -1901 4602 -969 -2736 4228 701 -3985 2826
923B826j363o024N878J044o717M771L073o913L291L955n909P59M647l959j911
$$ 2826 1463 -4561 1317 2361 -4356 415 3488 -3425 -134 3821 -2088 -1329 3318 -641 -2552
938b552M625j775l395M007P97m255K663L092m835N14M312l721j641M660k248l548
$$ -2552 2073 298 -3097 910 1707 -2548 115 3207 -1628 -1114 3198 -523 -2164 2496 248 -3300
954c300M885j44n049M053K556o002K657M406o567J197N402n683j382O682m379
$$ -3300 1585 1441 -3608 445 3001 -3001 -344 4062 -2505 -1308 4094 -1589 -2971 3711 -668
969f68l062O568j943m708N691J002o221M225K714o827K605M284o036N91M683l966
$$ -668 -3730 2838 895 -3813 1878 2880 -3341 884 3598 -3229 -624 3660 -2376 -1785 2898 -1068
985a068j356M709j366l149L872N69m647K208L007m884P26M285m347j377N993l080
$$ -1068 -2424 2285 919 -2230 1642 2211 -2436 -228 2779 -2105 -1379 2906 -1441 -2818 3175 95
1001I5l158N269m16m534L877J781o142K556M278o482Q86N859o059p56O825m190
$$ 95 -3063 2206 1790 -2744 1133 2914 -3228 -672 3606 -2876 -1990 3869 -2190 -2946 3879 -311
1017c11k699O205k134m447N134L51n497L628K579n890J766M872n291J11N253l854
$$ -311 -3010 3195 1061 -3386 1748 2099 -3398 230 2809 -3081 -1315 3557 -1734 -1623 3630 -224
1033b24j968M787j814l719M149M73m600K441L227m752M45M967m236j371N938l647
$$ -224 -2192 2595 781 -2938 1211 1684 -2916 -475 2752 -2000 -1555 3412 -824 -2195 3743 96
1049I6l192N606j174m959M518J288n576L117L592n589R00N739n567j154O367m395
$$ 96 -3096 2510 1336 -3623 895 2183 -3393 -276 3316 -2273 -1373 4366 -1201 -2355 4012 -383
1065c83k835O064k420m123N123N41n385L871K499n173J480M491n070q60N618l956
$$ -383 -3218 2846 426 -3697 1426 1967 -3418 453 2952 -2221 -741 3750 -1320 -2180 3438 -518
1081e18k701N122j402l662M742M74m562K722K917m979M41M894m432j842N919l327
$$ -518 -3219 1903 501 -3161 1581 2055 -2507 215 3132 -1847 -1406 3488 -944 -2786 3133 -194
1097a94l439O009j349m610N208R66n400L119L076n731P91N135m914j715O323l550
$$ -194 -3633 2376 1027 -3583 1625 2591 -2809 310 3386 -2345 -1554 3581 -1333 -3048 3275 -275
1113b75l335O431j629m607N510L40n476L565K613n750J226M511m735j005N897
$$ -275 -3610 2821 1192 -3415 2095 2435 -3041 524 3137 -2613 -1387 3124 -1611 -2616 3281
1128C281l272l151N724j097m816N440K94n396L154K553n397J138M703m424j506
$$ 3281 9 -3142 2582 1485 -3331 2109 2403 -2993 161 2714 -2683 -1545 3158 -1266 -2772
1143b772O227l169l455O340j298n292M973P33n771L402L054n393J005M871m197
$$ -2772 3455 286 -3169 3171 1873 -3419 1554 2287 -3484 -82 2972 -2421 -1416 3455 -742
1158g42j856O163k862m221O426j368n262M940R79n776L384K844n075P76N253m480
$$ -742 -2598 3565 703 -3518 2908 1540 -3722 1218 2197 -3579 -195 2649 -2426 -1650 3603 -877
1174h77j471N784l097l853N973j130n257M870J156n552L416L271n462R43M988
$$ -877 -2348 3436 339 -3514 2459 1329 -3928 942 2098 -3454 -38 3233 -2229 -1286 3702
1189C702m169j951N754k933l837N565p05n295M725J574n828L376L423n523R05
$$ 3702 -467 -2418 3336 403 -3434 2131 1426 -3869 856 2430 -3398 -22 3401 -2122 -1217
1204a217M932m317k333N847k687l906N491r8n691M904K106o059L263L536o043
$$ -1217 3715 -602 -2935 2912 225 -3681 1810 1712 -3979 925 3031 -3028 235 3771 -2272
1219b272R36M968m654j829N446k379l711N203J26n457M845K113o453L366L194
$$ -2272 -1336 3632 -1022 -2851 2595 216 -3495 1708 1834 -3623 1222 3335 -3118 248 3442
1234C442n790R52M810m613j708N420k101l933N357P3n176M252K121n888K320L788
$$ 3442 -2348 -1396 3414 -1199 -2907 2513 412 -3521 1836 1909 -3267 985 3106 -2782 -462 3326
1250C326n517L03M955m286j836N583j575m571N591M07n927M100K970o588K111
$$ 3326 -2191 -1888 3067 -1219 -3055 2528 953 -3618 1973 2380 -3547 553 3523 -3065 -954
1265i54M656o258N57N433m477k176O179j952m387N739K2n862M220K515o652K616
$$ -954 3702 -2556 -1999 3434 -1043 -3219 2960 1008 -3379 2360 2382 -3480 740 3255 -3397 -781
1281g81M066n720O14N330m466j780N791k355l499M798K01n461L741K347n645J485
$$ -781 3285 -2435 -1821 3509 -957 -2737 3054 699 -2800 1998 2199 -3262 479 2826 -2819 -1334
1297a334M568n132k67N662l580k630N790j735m753M696J188o183L498L483o249
$$ -1334 3234 -1898 -2165 3497 -83 -2713 3077 1342 -3411 1285 2473 -3710 -212 3271 -2978
1312b978J604N338o091L3O075m447k704O391k376m529N463P1n648M125K559o122
$$ -2978 -1374 3964 -2127 -2094 3981 -466 -3170 3221 845 -3684 1779 1850 -3798 327 2886 -3236
1328c236K402M689n559Q6N173m044k169N206k116l694M343O30m874K974L319n324
$$ -3236 -834 3855 -1704 -1618 3555 -489 -2658 2548 432 -3262 1081 1711 -3163 -189 3130 -2194
1344b194J038M765m683j085N298l320l205N637j090m661M405J831o051L255L754
$$ -2194 -1156 3609 -1074 -2159 3139 -181 -3386 2251 1161 -3500 905 2736 -3315 -60 3694
1359C694o324J406N679o144j034O620m349l207O281j736m568N235R18n473L443
$$ 3694 -2630 -1224 4455 -1689 -2723 3897 -452 -3659 2622 886 -3682 1553 2471 -3002 441
1374D41L238o179J427M659n261p13N591l848k328N326j597l742M621P14m936K854
$$ 441 3679 -2500 -1073 3586 -1675 -2388 3203 -645 -2973 2353 756 -2986 1635 2349 -2587 267
1390B67K970m980p7M938m190k049O161k823l689N933r05n084M934J701o060K787
$$ 267 3237 -1743 -1820 3118 -1072 -3121 3040 217 -3472 2461 1556 -3528 1406 3107 -2953 -166
1406a66L899o202O62N501n276j875P061l278l764O366j455n106N037J003n885
$$ -166 3733 -2469 -1807 3694 -1582 -3457 3604 326 -3438 2928 1473 -3633 1404 2407 -3478
1421c478L694K533n181J065M472m022j578N894k906l283N294j120m546L875J732
$$ -3478 216 2749 -2432 -1367 3105 -917 -2495 3399 493 -2790 2504 1384 -3162 713 2445
1436B445n409K107L775n070R6N190l360k624O068k049m521N588k79n682M445K097
$$ 2445 -2964 -857 2918 -2152 -2056 3134 -226 -2850 3218 1169 -3352 2236 1957 -3725 720 2817
1452B817o185K549M229n687K60N903m464k090O149k971l888N859q92n477N023
$$ 2817 -3368 -819 3410 -2277 -2017 3886 -578 -2668 3481 510 -3378 2481 1589 -3888 1135
1467A135J170n458K955L321m780M59M405l578k063N002j839l858M991k27m790
$$ 1135 2305 -3153 -198 3123 -1657 -1198 3207 -371 -2434 2568 729 -3129 1862 1635 -3155
1482c155L462K397n120J711L897m245o83M978l272l276N704r92n400N414Q95o318
$$ -3155 307 2704 -2416 -705 3192 -1053 -1736 3242 -30 -3306 2398 1406 -3994 1420 2315 -4003
1498d003M457K998o129K231M310n721j13N486m281k371N857k149m368N522K99
$$ -4003 454 3452 -2677 -446 3864 -1857 -1970 3516 -765 -3136 2721 572 -3796 1726 2025
1513B025n294M166J916n461K336L647m673l51M321l140k103M328n34m178M303
$$ 2025 -3269 897 2813 -2648 -312 3335 -1338 -1689 2632 -508 -2611 1717 1183 -2995 1308
1528A308J437n625K800L101n223P96M536m619j202N459k692l566N749m72n031
$$ 1308 2745 -2880 -80 3021 -2202 -1406 3130 -1489 -2691 2768 76 -3490 2259 1787 -3244
1543c244M551J714o382L579L134o200J559M671n289k90N235l570k337N409j618
$$ -3244 1307 3021 -3361 218 3352 -2848 -1289 3382 -1907 -2197 3038 -532 -2869 2540 922
1558I22m152M902N50n149L522K126n416J338M187m333o34M557k283k341M084l41
$$ 922 -3230 1672 2222 -2927 595 2721 -2695 -1357 2830 -1503 -2137 2420 137 -2204 1880 1539
1574A539m180L623J543n199K233L488n140L98M722l932j719N627k280l785N466
$$ 1539 -2641 982 2525 -2674 -441 3047 -2093 -1695 3027 -905 -2624 3003 723 -3062 2404
1589B404o37n113M184J678n939L136L424n736J061N076m831o31N267l339k898
$$ 2404 1767 -3346 838 2516 -3423 -287 3137 -2599 -1538 3538 -1293 -1924 3343 4 -2894
1604b894N060r96m252L919J073m665K654K678m698O68M376l621q70M163j929l191
$$ -2894 2166 1170 -3082 837 1910 -2755 -101 2577 -2121 -1453 2923 -698 -1568 2595 666 -2525
1620b525L449M48m217K973K164m759J508M166m605l15N033l751k293N355j955
$$ -2525 924 1372 -2845 128 2292 -2467 -959 3207 -1398 -1713 3320 -431 -2724 2631 676
1635F76l893M887n3m996L585K479n246J916M236n057j04N008m243j475M623k293
$$ 676 -3217 1670 1617 -3379 206 2685 -2561 -645 3591 -1466 -1570 3438 -805 -2280 2343 50
1651E0l126M713n82l648L237J691m454J693L392l997n58M195k969k140M378j371
$$ 50 -3076 1637 1055 -2593 644 2335 -2119 -426 2966 -1031 -1589 2606 -363 -2503 1875 504
1667E04l098L605N73l778K323K536m505Q70L746m019j049M654k651k766N271j360
$$ 504 -2594 1011 1584 -2194 129 2665 -1840 -970 2776 -1243 -2292 2362 -289 -3055 2216 856
1683H56l787M591J59m557L218K418n464J658L767m608n32N223l661j767M959j811
$$ 856 -2931 1660 1819 -2738 480 2898 -2566 -908 2859 -1749 -2281 2942 -719 -2486 2473 662
1699F62l129M059K2l938K669J895m080J028L134l291j047L967j787k630M358o46
$$ 662 -2467 1592 1614 -2324 345 2240 -1840 -812 2322 -969 -2016 1951 164 -2466 1892 1246
1715A246l549L290P42l899K057K385m014J76M321l553j407M704k006k940M625
$$ 1246 -2303 987 1729 -2170 -113 2272 -1742 -1566 2755 -798 -2205 2499 493 -2447 2178
1730B178r12m127M200N10m635K654K364m251Q99L562l331q65M114k323k397M335
$$ 2178 1266 -2861 1339 1849 -2786 -132 2232 -2019 -1120 2442 -889 -1754 2360 37 -2360 1975
1746A975j217l340L594L78l796K261K042l237L80L084k482j356L869j598k776
$$ 1975 758 -2582 1012 1390 -2406 -145 1897 -1340 -960 2124 -358 -1714 2155 557 -2219
1761b219L656p8l791K789J546m093J795K511l346o3M005l202j500L916j388l129
$$ -2219 1437 1359 -2432 357 1903 -2190 -395 2116 -1230 -1293 2712 -490 -1990 1926 538 -2591
1777b591M163k42m032L185J441m197K158K583l816P62L023k994j152L708j697
$$ -2591 1572 1330 -2702 483 1924 -2273 -115 2468 -1348 -586 2437 -557 -1709 1999 302
1792C02k492L418j35l640L276J073l523J838K145l322J25L062k252j607L259j170
$$ 302 -2190 1228 1093 -2547 729 1802 -1721 117 2262 -1060 -935 2127 -125 -1732 1527 357
1808C57k783L309M65l485K343K105l806J062K818l764o8L496k464j783L760p88
$$ 357 -2426 883 1348 -2137 206 2311 -1495 -433 2385 -1379 -1447 2049 -415 -2198 1562 774
1824G74l494M054L39l806K485J821l907J459K242l401n7L207k336j333L602r41
$$ 774 -2720 1334 1673 -2133 352 2173 -1734 -275 1967 -1434 -1491 1716 -620 -1953 1649 708
1840G08k641L237K22l355K171J612l741J252K320k951m49L287j844j665L393q86
$$ 708 -1933 1304 1526 -1829 342 1954 -1787 -535 1785 -1166 -1615 1672 -172 -1837 1556 670
1856F70k437K502P03l276K050K071l900P56L388l922J56L077j933j388L160n48
$$ 670 -1767 735 1438 -1838 212 2283 -1617 -861 2527 -1395 -1239 1838 -95 -1483 1677 1129
1872A129l169K856O39l205J702J878l348R93K728l176m86L048j530j471K860k70
$$ 1129 -2040 816 1455 -1750 -48 1830 -1518 -525 2203 -973 -1459 1589 59 -1412 1448 1178
1888A178k696K372O09l305J675J975l371P49K631k498o27K946j617j427K649m61
$$ 1178 -1518 854 1463 -1842 -167 1808 -1563 -814 1817 -681 -1308 1638 21 -1406 1243 782
1904G82k699K382R66l234J491K185l016M43K989k758q34K969j586j633K619l41
$$ 782 -1917 465 1431 -1803 -312 1873 -1143 -700 2289 -469 -1303 1666 80 -1553 1066 725
1920G25k720K268J166k875J111K251k831K87K476k238r03L067j625j818K748m83
$$ 725 -1995 273 1439 -1436 -325 1926 -905 -618 1858 -380 -1283 1784 159 -1659 1089 606
1936F06k475J901J450k995J125K178k729L0K725k358o46K818j660j736K738l05
$$ 606 -1869 32 1482 -1513 -388 1790 -939 -909 1816 -542 -1188 1630 -30 -1766 972 667
1952F67k332K031J024k644R58K067k612nK883k516r69K579j017j948K730l9k160
$$ 667 -1665 366 1390 -1254 -296 1771 -841 -846 2037 -479 -1448 1131 114 -1834 896 857 -1303
1969a303J657J265k891Q94K104k422m84K677j847j391K954q57j856K508M3k498
$$ -1303 354 1619 -1272 -378 1726 -696 -1180 1497 -350 -1741 1213 356 -1500 1008 1051 -1447
1985a447K046R33k891R44K079k469n18K987j935j009K538r20j639K211o5j864
$$ -1447 599 1532 -1359 -415 1664 -805 -1323 1664 -271 -1280 1258 338 -1301 910 845 -1019
2001a019J507O00j913K80J685j649o87K290j506p75K410q53j576J982N8k148J629
$$ -1019 488 1088 -825 -545 1140 -509 -1196 1094 -412 -1187 1223 370 -1206 776 834 -1314 315
2018C15Q81k324L81J836j321o52K279j360j449K637m29k201J878N86k295J253
$$ 315 1196 -1128 -747 1089 -232 -884 1395 35 -1414 1223 794 -1407 471 1057 -1238 15
2034A5J201k498J106J094j661R7J670p60j449K287p54j842K136M1k157J525J081
$$ 15 1216 -1282 -176 918 -743 -646 1024 264 -1185 1102 348 -1494 642 683 -1474 51 1132
2051A132k134M42J586j274m63J919j018j305J968k47j772J616M17k155J080J250
$$ 1132 -1002 -560 1026 -248 -711 1208 190 -1115 853 606 -1166 450 867 -1288 -208 1042
2067A042j744K42J806j577o94K073r55j439K089l69j840J744O55k108J022J154
$$ 1042 -702 -460 1346 -231 -925 1148 193 -1246 843 474 -1366 378 1033 -1075 -53 1101
2083A101j995P56J222j175n72J590p68j399J899k21j727J486N88j875R02J109
$$ 1101 -894 -138 1084 -91 -663 927 159 -1240 659 438 -1289 197 785 -1090 -188 921
2099I21j525L54J393j312n76J358l79j252J356K44j679J310Q17k085J117J204
$$ 921 -604 -250 1143 -169 -745 613 234 -1018 338 582 -1097 213 1030 -1055 62 1266
2115A266j672k76J719j541o92J803p90p61J497L6j757J656M71j847Q72J020j688
$$ 1266 -406 -682 1037 -504 -1196 607 -183 -944 553 589 -1168 488 959 -888 -16 1004 -684
2132f84L45J168j416k20J320l18p74J131j56j184J042O16j595M49R25j266J88
$$ -684 -339 829 -587 -807 513 195 -579 552 396 -788 254 870 -725 -276 649 -617 -429
2149d29P94l28r06J319o5j122J179J08j215O31R46j681L67J377j480k09J615j238
$$ -429 365 37 -869 450 385 -737 442 550 -665 -34 912 -769 -402 975 -505 -714 901 -337
2167c37q1J153m71j018J267M5j148P47O22j657O84R84j350K09J057j099n6J294
$$ -337 -418 735 264 -754 513 558 -590 157 779 -878 -194 790 -560 -351 706 -393 -449 845
2185H45m91j086J050Q9j095O96M36j116J68J018n07l18J171m06j077J616m58j211
$$ 845 354 -732 318 407 -688 8 444 -672 -504 514 7 -311 860 454 -623 993 535 -676
2203f76O24L80j178M43J118j055j13J373j214j28J275o73n49J068o87p82J290
$$ -676 -52 328 -850 -407 711 -344 -457 916 -298 -426 849 176 -373 695 8 -774 516
2220E16l89q82O63N97p37K71P42j132Q1J016q07m15J014r29k60P86J14m40J15
$$ 516 127 -755 -92 505 -232 39 781 -351 -270 746 -61 -476 538 -391 -651 135 249 -191 -76
2239g6O02n91j25Q41n43n41J143n80o38P44j46q63Q50L88n93M6J010j140N2Q28
$$ -76 526 -65 -190 651 108 -433 710 130 -508 236 90 -773 77 465 -128 -82 928 -212 -160 668
2259F68p56l15J074p14p85J358m92n36O75J93p49O89L17p91k65P76m55j69N66
$$ 668 -88 -403 671 -43 -828 530 38 -498 177 370 -379 310 627 -164 -429 347 -108 -277 289
2278B89l18l91Q51m14m53O00L2m10K85K24m79J7N43n08l44P63j23p02Q21L2n16
$$ 289 -29 -420 431 17 -436 164 196 -214 71 295 -184 -167 376 -132 -476 287 164 -538 283 315 -201
2299b01K79N18r28O1P39o48m8M95n65p9J133p08m17R07o49n26Q59o2p67O64j3
$$ -201 78 596 -332 -271 468 -180 -228 267 -298 -377 756 48 -369 538 -111 -637 222 160 -607 57 44
2320D4o11O00J82m42L17K72k61jJ48q2n7k7j21j85L70J35m05J31J76K04q40O40
$$ 44 -567 33 215 -227 90 362 101 100 248 166 109 82 -39 -224 146 281 -124 7 183 387 -453 187
2342A87L00p94N84j15o12M41J57p15L33M33n58M01M35m32q4K60m36k02N27k37
$$ 187 487 -307 277 162 -450 -9 148 -567 -234 199 -359 42 477 45 -39 221 -215 -417 110 -127
2362a27l40N82j82k92Q19m91M3K85P5m49R7M9M2m12L12J37n85L85M18l36J04L51
$$ -127 -467 115 -67 -359 460 -31 12 297 372 -77 20 69 111 -301 11 148 -437 -52 366 30 134 485
2384D85j46m96J17lj94K59J9j54J02O8k39L71J47n37L41J5l46K83N1m17J29J35
$$ 485 339 -157 -40 -43 -237 22 41 -113 -11 57 -182 189 336 -201 140 155 -191 92 143 -274 -145 -10
2406a0j40j13L16N4k30L67p9k53M26l65l89K11L54n03M73j98K5J00K12l54M4L49
$$ -10 -150 -263 53 107 -123 244 165 -88 338 -27 -416 -205 149 -354 119 -79 -54 46 258 -96 -52 297
2428B97j26l92M00k17l05K08K05l74K33K75k52q4J61J46k32R3J43o48O22N1n75
$$ 297 171 -221 179 -38 -343 -135 70 -304 -71 204 -48 -132 29 175 -57 36 179 -469 153 204 -371
2449c71L29L35m69L75J20m82K66J02p1k68K77k91k18O12l06oK48J7m75L00k9K1
$$ -371 -42 293 -176 199 319 -163 103 205 134 -134 143 -148 -366 246 -60 -66 182 199 -276 24 -5 16
2471A6K6j77j1K0M5j01J48J60r1k22L73N9m36L46q2k71J96N8l25PK69J21l03L56
$$ 16 42 -135 -146 -126 -81 -182 -34 126 35 -187 186 245 -191 155 73 -198 -2 56 -269 -262 7 128 -175 181
2495A81Qk35K24P5o42P06J4m87J92N5m75L33K51k55KN25k70k90M64l08m39N66
$$ 181 189 -46 178 253 -389 317 331 -156 36 91 -384 -51 200 -55 -53 472 202 -88 376 68 -371 195
2517A95p2n66N44p1m55P80j96l68K51K19k58k28L56j26o09O75J44p55M76K44j79
$$ 195 123 -443 101 30 -425 355 159 -209 42 261 3 -225 131 5 -604 71 215 -540 -64 180 1
2538AJ43m2n01L38K47j26o16Q51l29m30O15J78q11M18N51p91M82K04l99k25N68
$$ 1 144 102 -399 -61 186 60 -556 295 -34 -464 151 329 -482 -64 487 -304 178 382 -17 -242 326
2559C26m93K4N05k44n28N30J27n64M84K09q62L68M38l87j95L34k20k07M50Pj89
$$ 326 -167 -143 362 118 -410 120 247 -317 167 376 -486 -118 320 -67 -262 72 -148 -355 95 102 -87
2580h7K55K03p24N77J52m64o1M48n94N6M26P2l84K64J94p43M52K67n16K82K19
$$ -87 168 371 -353 224 376 -88 -149 299 -295 -239 187 259 -125 139 333 -410 42 309 -207 75 294
2601B94q44K91M56m77j72P59l73j80P05l95k14N06J09p48L72M17r54L08O72p69
$$ 294 -550 -259 197 -280 -452 307 -66 -246 459 64 -150 356 465 -283 89 506 -448 -140 532 -237
2621b37l8O74k14l94M59Q6o88N21J09o13j35P49o93J61M85m74J98O02o80N5K67
$$ -237 -275 399 185 -209 250 336 -352 169 278 -335 -470 279 -414 -253 232 -242 -44 558 -122 -67 200
2642B00K08p00M34j2p42O57M09q02L4Q69p28P9N43l74m77N32K8o03N35L51p17
$$ 200 408 -292 142 130 -612 45 454 -348 -314 555 -173 -94 449 75 -402 130 158 -445 90 441 -276
2663b76k4Q94r55K01P61o79k15O36k67p22Q83j97n37P05L24r08J94P29o69j12
$$ -276 -300 594 -361 -160 601 -78 -293 343 76 -646 237 40 -497 208 532 -376 -182 547 -122 -234
2683b34R84p04l47P01p10l03P00K77q52M68N75q64K12O63r51M06N19o17n12Q19
$$ -234 750 46 -301 400 -310 -613 87 364 -488 -20 555 -309 -97 566 -385 21 540 -77 -589 230
2703B30l52m58R05r7p58P45J83j038M69P45r77J74N96m32n14R65l53p16J020k91
$$ 230 -122 -580 325 228 -530 215 398 -640 -171 574 -403 -229 367 -65 -579 386 33 -683 337 46
2723D6k75O60O4q22R1N99n97k8Q88j006j84Q22n50l5O26j44m91P25j66o96K65
$$ 46 -229 431 495 -327 -236 363 -234 -262 626 -380 -564 258 -292 -327 299 155 -336 389 223 -473 -208
2744b08P60r33M7P64k70o65Q35k98m36Q13j72p89N07N70q97K90M06p41j16Q80
$$ -208 552 -381 -334 430 160 -505 330 32 -404 409 237 -552 -45 525 -372 -82 324 -417 -533 347
2764C47o19j72P99k60n93J093m30o88N37N64j070O0P26m35L7N83m79l14N55l04
$$ 347 -272 -444 355 95 -498 595 165 -523 14 578 -492 -432 294 -141 -104 479 0 -314 241 -63
2784f3n22R45pp24L93N9n45L35P24q93k3Q46l32n35O33Kq48P93J36q32M16M38
$$ -63 -585 360 353 -371 22 81 -464 -129 595 -298 -321 525 193 -342 291 293 -555 238 374 -458 -42 396
2806C96r65K87P99q55j89J007j66j052J203m83n85Q06R4j079R12N40r41O9Q73
$$ 396 -569 -282 517 -338 -527 480 314 -738 465 -18 -603 203 297 -782 130 670 -271 -202 671
2825F71r13P8N11m97m83J135l53j000J195jq23M97N11p64NP71p31j03J004q77
$$ 671 -242 -164 347 -150 -633 502 149 -851 344 343 -480 17 528 -236 -231 540 -191 -294 710 -167
2845a67m40R77k46o80P24L45j282O21O08o21J7P19o57l59P64n39l42P26J51o54
$$ -167 -607 370 124 -556 168 513 -769 -148 460 -161 -144 575 -82 -441 323 -216 -558 168 319 -335
2865c35N52O1p71N48N87j199M26Q29q19l76J010m84o56R53q4o77O27M55j015M10
$$ -335 217 278 -493 55 642 -557 -131 698 -121 -497 513 29 -627 326 242 -435 192 647 -368 42
2885D2N16q76j85Q47n57k65R29k65q67R21K29j106Q66L78j056K61P55j253J83
$$ 42 558 -318 -503 344 -213 -478 451 186 -681 240 469 -637 229 607 -449 -188 567 -686 -503
2904e03Q47n81k20J046o41o18J134Q0j032J88Q48j106L04P80p08l01J107q01m77
$$ -503 344 -237 -457 589 -52 -670 464 544 -488 -300 548 -558 -254 526 -182 -483 624 -177 -654
2923f54J058l15n13P44J14j204P23P15j413M17J020j086qJ233o50n30Q01j25j231
$$ -654 404 89 -424 320 434 -770 -47 668 -745 -328 692 -394 -402 831 181 -349 452 327 -904
2942i04J021J54r53P73N22j130J96J032r90m5J179j134l07J103m47l58O81N0j033
$$ -904 117 271 -682 91 613 -517 -321 711 -279 -324 855 -279 -586 517 70 -288 393 443 -590
2961e90P34L61j155N27Q74j118O9R56o28n14P41q3r55Q73M68p52K29O75j101N5
$$ -590 144 505 -650 -123 751 -367 -298 658 30 -484 257 174 -781 92 560 -192 37 712 -389 -334
2981c34Q17n28n08J095l51q13R73j13q31N47O56j175M25P97j138J32J024p65m98
$$ -334 483 -45 -553 542 191 -622 351 238 -593 -46 610 -565 -140 657 -481 -349 675 -90 -588
3000e88J156o19m78J040k98q08R72K11r70M94P12j088p5Q76o95m57R16j29o00
$$ -588 568 -51 -529 511 213 -595 377 588 -382 112 824 -264 -339 537 -158 -615 301 172 -428
3019d28Q67l1r41Q57L81j406N79P60q43l46R12k15j159J366k3q30P60O8q09N34
$$ -428 439 408 -533 324 705 -701 -122 638 -205 -551 361 146 -1013 353 330 -500 260 328 -481 53
3039E3N10j284N98N62q38j89R92n48o75J266n05n51J053j56p86N20M89p32K00
$$ 53 563 -721 -123 439 -399 -588 404 -144 -819 447 -58 -609 444 288 -498 22 511 -221 -21
3058b1M61n68j96R87p45l91Q16n8q16R21R0j023O58P7m23L6N70p17k2R02l57n77
$$ -21 440 -128 -324 663 -82 -473 343 285 -531 390 480 -543 115 192 -231 -195 375 -342 -364 538 181 -396
3080c96P28j32r25J106n7j091P10N54j089K78R54j104Q6R38o62k95R97m29p72
$$ -396 332 200 -725 381 324 -767 -57 497 -592 -314 640 -464 -378 560 -102 -397 600 171 -601
3099f01O87L56q67L95N41o64N2L23j82m54P18n9q22O51J68q64O77N53j096N38
$$ -601 86 442 -425 -30 511 -153 -101 222 40 -414 304 245 -577 74 242 -622 55 608 -488 50
3119E0M54q31J57O77m61l44J053o62p09J068r0j057P11K75p81N97N42j101L50
$$ 50 504 -327 -170 507 46 -298 755 93 -616 452 362 -695 16 291 -490 107 649 -452 -102
3138a02Q37p12o27Q87l19n18P88j12o72R23Q8r74N11N69p12P8N48m63m81P61r3
$$ -102 735 23 -604 283 -36 -554 234 122 -550 373 461 -513 -2 567 -145 -67 481 18 -463 298 205
3159B05p54Q25k19m39K59P27r54L51O00j123L27O64m67l46N27Jn97O85O7q45M21
$$ 205 -549 276 57 -382 -123 604 -350 1 601 -522 -195 469 2 -344 183 184 -413 272 339 -506 -85
3180h5Q71j154L89M91q20j08P30m08m20Q40j06p37O54J41p01M76M95r74M19N24
$$ -85 786 -368 21 512 -308 -416 314 -94 -514 326 220 -517 137 278 -423 53 548 -426 -7 517
3200E17n58l46O69k98n70P91J38p49M18L36p64M08M44q28J83P98q00p7Q85m13
$$ 517 -41 -387 282 -16 -586 205 343 -406 12 348 -416 -8 436 -392 -209 589 -211 -288 597 184
3220A84p72J079j75p79O30K74q86K94Q54j148J32Q60r53K3Q85k69n40N63k90m94
$$ 184 -588 491 316 -463 167 441 -445 -151 703 -445 -313 547 -406 -383 502 233 -307 256 -34 -528
3240e28P65L58j131L81O36q22k3J058o88k95N36M4o52O62j52o89O61J39p45J46
$$ -528 237 595 -536 -155 481 -341 -364 694 6 -289 247 291 -361 301 149 -540 121 260 -485 -339
3260c39P31o44j1Q40n22k90R20o43l97Q88j31j024P97J20o90K35M78n61K2O57
$$ -339 392 -252 -263 577 55 -235 685 42 -355 533 402 -622 175 295 -395 -160 318 -243 -221 436
3280D36l49n28P39p9n91O80j98n54L55M12o71K12O21n80l65Q17l46n41Q29l53
$$ 436 87 -441 298 219 -372 308 110 -444 -89 323 -348 -136 485 -95 -460 357 11 -530 299 -54
3300e4l67O68K46p13K27K90n36K31M98o82O2N41n48m07J067l77n63O65j30l94
$$ -54 -421 247 493 -220 7 297 -239 -8 490 -192 -130 411 -137 -544 523 146 -417 248 118 -276
3320b76M47K56n68J78L57o31RN84j93n93N67J96q75P73j80k35L11L92p61k15P29
$$ -276 171 427 -141 37 394 -237 -228 356 163 -430 137 333 -542 231 51 -184 127 519 -242 -457 272
3341B72n21j13P95n02n49R01l26m35N30K69o17L31M43q42n4O46l03l72P26n5n54
$$ 272 -249 -362 433 -69 -618 283 -43 -478 52 321 -296 35 478 -364 -418 228 -75 -447 279 224 -330
3362c30R12n98l22N29J71n65J37N95j057L39N63j99p19J025k76n71O86k38k84
$$ -330 582 -16 -338 191 362 -203 -66 529 -528 -189 374 175 -544 481 205 -366 320 82 -202
3381b02M99j88m02M24J53o07J78L33k65l2M59l49n72O91J10k23k29O62p83K32
$$ -202 297 109 -293 131 284 -323 -145 188 -77 -109 350 1 -571 120 230 7 -222 440 -343 -111
3401a11K62o95L91M14l80j20N59p6o13O37o7m41L80L11p52rO71m15k23N02r3k99
$$ -111 151 -544 -153 261 -119 -239 320 244 -369 268 201 -240 140 451 -301 -310 361 -54 -277 225 132 -167
3423a67N26j92o18L97K57o27K64O03q09L92L36p62J03O77n06j67N02j52m36M68
$$ -167 359 167 -451 -54 203 -424 -160 443 -366 26 362 -400 -297 380 -126 -293 209 57 -379 89
3443H9K12o22k5P42o00%N93o06J07M19k55k22K27J61n70K19L79n75M27Q4l32O7
$$ 89 301 -321 -346 396 -204 -204 389 -217 -110 309 54 -168 59 220 -350 -131 248 -327 100 184 -148 -81
3465h1M51m35j35K37n6n01P11J04q65O00J31m83N57K45o61n1N20n51O5O04l03
$$ -81 370 -65 -200 37 -19 -520 191 295 -570 30 161 -322 235 480 -181 -232 288 -263 -198 406 103
3486A03n47L69M32o17K84M86n31l0J31k80N4K15m18J04O01k38n42N49L9o13N19
$$ 103 -444 -75 357 -260 24 510 -21 -51 80 -200 -146 69 -349 -245 356 118 -424 125 164 -449 70
3507G0L08k69k02K90n16K88K22j69j21L29j44n36Q95n0p20L43J76m19P8N08n92
$$ 70 378 109 -93 197 -319 -31 191 22 -99 230 86 -450 445 395 -325 18 194 -225 -147 361 -231
3528b31O8N79n34r2O03l01m17N41n9n08M74q0l90J82J90j53j88N66k60j76K63
$$ -231 -163 416 -118 -210 393 92 -325 216 157 -351 123 43 -347 -165 25 -128 -316 250 -10 -186 77
3549G7J80l76N68j43o19M10K48o28k53O30l66N5N50l55n6L82k55k05K84O3k80
$$ 77 257 -119 449 306 -313 97 345 -283 -536 94 -272 -217 333 -22 -78 304 49 -156 128 191 -89
3570h9K11J07m88K17J48j10j65J88K6l62N02j6k82J88k1l92J21N4J30l10P65n65
$$ -89 122 229 -259 -42 106 -4 -169 19 45 -317 185 169 -113 75 54 -338 -217 -163 -33 -343 422 -143
3592a43PM70k43k01M36k64k34K27l1l65L85J58l35m9M40k06l14M76j74l79P36
$$ -143 -136 334 91 -110 326 62 -172 55 24 -341 44 202 -133 -182 258 52 -262 214 40 -339 397
3613C97j57o42K72M12l59J39J97l73J89K29l11l20M84j51j53J23J29l96J96K73
$$ 397 240 -402 -130 282 -77 62 259 -114 75 304 -7 -327 157 6 -147 -24 105 -291 -95 178
3633A78p0N3K25n03P4K08k00r2K30j23k6J13J59m85M21J28m29j18N01k39j56L89
$$ 178 108 161 386 -117 -43 165 -35 -127 103 -20 -46 67 226 -259 162 290 -139 -257 244 5 -151 238
3655B38j01j33J68j89K04rJ68m93M48K01q79J97N54l07m31L42j7j48K77j54j41
$$ 238 137 4 172 -17 187 178 346 -147 301 502 -377 -180 374 67 -364 -22 -39 -187 90 -64 -205
3676b05l5M06k10K7L31l88j89L47P0m72L93k2l28J84K07k68K30J21p8k37M79n78
$$ -205 -240 166 -44 -17 314 -74 -263 84 154 -318 75 53 -275 -91 116 -152 78 199 121 -116 363 -215
3698b15J6L56j88j59L83j3m04L49qj65K44Pk70j35L45m47L10j05j27n3K48k10
$$ -215 -199 157 -31 -190 193 180 -224 125 117 -48 196 203 -67 -202 143 -304 6 -99 -226 -279 -31 -241
3720b41L32J69m80K91j46J37k52J17NR0k40J46j37K63p7Q9k26K86k5n15M89N2
$$ -241 91 260 -220 71 -75 62 -190 -73 -68 22 -218 -72 -209 54 -23 66 -160 126 101 -414 75 127
3742A27n0J07j90k7l4M20k99j42K42o5NJ17q4m56M47L17n36m0L96l25k05M49Q
$$ 127 77 184 -6 -33 -67 353 54 -88 154 89 94 211 127 -329 118 435 -101 -141 255 -70 -275 174 182
3765A82j35n6K00l58K2R5n9L3L50j82m38M96j28OP8j53L4n0O7j64K16M8l05L8
$$ 182 47 -9 191 -167 -145 -50 -109 -76 274 92 -346 150 22 28 106 -47 -13 -63 4 -160 56 104 -201 -163
3789a63L6K72k58L13l06j00NL52l22L13k12N5l22O49m91R3J39j10q1K65j30k43
$$ -163 -127 145 -113 200 -106 -206 -201 151 -171 142 -70 -15 -337 312 -179 -86 53 -57 -138 127 -3 -246
3811b46L33k80J90k6J10k59J61L19j30j20J14k91K92k99K21q6oK0k53J81J14k36
$$ -246 87 -193 -3 -29 81 -178 -17 302 172 52 166 -125 167 -132 89 3 -3 17 -236 -55 59 -177
3833a77M73k50R0q2L09m37j21J75l0j35K58j49j48K10J70m32J90M6J65k44K2K4
$$ -177 296 46 136 54 363 -74 -195 -20 -50 -185 73 -76 -224 -14 156 -276 -86 -40 125 -119 -97 -73
3855g3K3M7K88k24M5J25j47K2Qqk00J08J44k72J21O8l32L80J15k48Q3l6k39K03
$$ -73 -50 -3 285 61 106 231 84 106 114 106 -94 14 158 -114 7 75 -257 123 238 -10 73 37 -202 1
3879AN3p4P1k63L28k4p1q9j58L37j30p6J97K92j32k61P1M9k74J72J02k64K65j55
$$ 1 54 -20 51 -212 116 92 21 -68 -226 111 -19 -95 102 394 262 1 72 121 -153 19 121 -143 122 -33
3903c3K94k75N1R4k86J89j54k08J49j45K90L4l7j46Q0K83k92J61J10k11K17Q3
$$ -33 261 -14 37 131 -155 34 -120 -328 -179 -324 -34 0 -37 -183 -103 180 -112 49 159 -52 165 248
3925B48m61J79q8K08j28nJ99p5J4O4l04J80O7l31K31J96l56J19p9J08J43j47M2
$$ 248 -213 -34 -122 86 -42 -47 152 77 91 155 -149 31 98 -233 -2 194 -162 -43 -122 -14 129 -18 24
3948B4lj79M66k92j79K72l8O1j6k18J3K98k39o9J38R1k78L22p5M3k40l7j05J24
$$ 24 21 -158 308 16 -163 109 71 132 116 -102 -89 209 -30 -99 39 130 -148 174 99 142 -98 -135 -240 -116
3972a16J95j05m1K39o1j64K7J67Mk7j14q6L6k0K05r7J9R2k67K01n5j35MJ30L9
$$ -116 79 -26 -67 172 111 -53 -26 141 145 118 4 -82 -46 -66 139 42 61 153 -114 87 32 -103 -99 31 70
3997G0l64L14r9j73K70J88l3l50M05m73L79j8l4j35J00l38L07K39m28J45Q2J54
$$ 70 -294 20 -79 -252 18 206 173 -177 228 -245 134 116 82 -53 47 -291 16 255 -173 -28 54 208
4019B08l44K44N5j28n0J01k68J73K19k11j00K58j95rk0MJ9J65Ok8j67K0k6j08
$$ 208 -136 108 163 35 -15 86 -182 -9 210 -1 -101 157 -38 -47 -67 -63 -44 121 127 99 -68 -48 -74 -182
4043a82J68n9K2M8j54K13K0j12KR3mk49L50k40J29o0KK33k96L32k17lK7J02L0
$$ -182 -14 -73 -51 -3 -157 56 76 -36 -34 59 55 -194 156 -84 45 -15 -13 220 -76 256 39 36 63 165 195
4068A95k66m6l6L23k92j2J5J90o7pk19N5O7l21N07k50m4M49l1l88K82r3K21j66
$$ 195 -71 -117 -153 170 -122 -134 -119 71 4 -3 -222 -167 -100 -421 86 -164 -208 241 210 -178 104 11 232 66
4092F6m28N41l24J26j62L17J20j84o3J43k8k65M68j91o0J64m79J42J69j04N9j32
$$ 66 -362 179 -145 -19 -181 136 256 72 9 152 124 -141 327 136 76 240 -239 -97 72 -32 27 -105
4114a05j89R7L25j35J33p4q3J16j55J23J36j17O9j99P2N0k22lK48mJ33m60M20
$$ -105 -294 -197 128 -7 126 52 -31 85 -70 53 189 72 141 -58 14 64 -158 -161 87 83 216 -244 176
4137A76j90Q2j87M62l00q8J73l35K9J37n1K7L32k99J00j27l0l8K19j09K6R8r6
$$ 176 -14 68 -119 343 43 -45 128 -207 -178 -41 -92 -65 267 -32 68 -59 -89 -127 92 -17 9 107 11
4160A1M4p3R3p5O9O3k23j48K06K9k78K47N8J66l10K20P2k33J27l3j22Q5Q9j5R6
$$ 11 55 -18 75 0 69 132 -91 -239 -33 -4 -282 -35 23 189 -121 99 171 -62 65 32 -90 -5 84 69 165
4185A65l4k41p8L11m34M43j72q9K97qp4j97j49J93jJ8K8l08M37k1j27PR9j81J76
$$ 165 131 -110 -188 123 -311 132 -40 -129 168 160 86 -111 -260 -67 -68 -50 -22 -330 107 86 -41 -34 65 -116 60
4210F0N1j91j17L94m3k59K69K5q5j19L85m74j06J52N8r1L6K04l23J13K95j33J00
$$ 60 111 -80 -197 197 154 -105 164 189 104 -15 370 -104 -210 -58 0 -91 -55 149 -174 -61 234 101 201
4233B01r8k26J04R2n3k5O9k61M22j88l1nJ20j13o5J9k18J50J67l7q3K73j20j54
$$ 201 103 -123 -19 73 20 -5 64 -197 225 37 6 1 121 8 -57 -38 -256 -106 61 24 -59 214 94 -60
4257f0q3K96k87n9M62o5l36O5K07k04j9J31j85J67o9J61l34M13l27j6NQ0K14J0
$$ -60 -143 153 -134 -193 269 204 -132 -67 140 -64 -83 48 -137 30 -39 122 -212 201 -126 -142 -137 -57 157 167
4281A67o7k59K92k22J93j26J29j71Q4J20Ok38K21N0l00NJ89l86L62j19j11L2L91
$$ 167 100 -159 133 -89 104 -22 107 -64 20 140 146 -92 129 179 -121 -116 73 -313 49 -70 -181 -149 242
4304B42k94j3L78m44J37MM26o49K58J47l27K59K36k13n67M06L00l83k6K54q7o
$$ 242 -52 -65 313 -131 6 10 436 -213 45 192 -135 124 360 147 -420 -14 286 -97 -123 131 44 38
4326C8M0r5P0j36M3K3J66j17j67K89k28j31R5P7q3K14j93L1J14J30k83K9L89n09
$$ 38 78 -17 53 -83 -40 -17 149 32 -135 154 -74 -205 -110 -33 -116 98 -95 -64 50 180 -103 -74 315 -194
4350a94J51J50j54k06N02j24k37K79q7k56J44L68l36k1J69j43j00L16m16N4L84
$$ -194 -43 107 -47 -253 249 125 -112 167 80 -176 -32 336 0 -21 148 5 -95 221 -195 -141 243
4371B43k70o4j2J90j72N5l6N5k01J2J34r8K76j64n9L23j93k60L09m1r2PL34k93
$$ 243 -27 -91 -103 87 -85 -30 -66 -11 -212 -200 -66 -164 112 -52 -111 212 19 -241 68 27 -65 -58 276 -17
4395a7k70L94l02L5O8J70Mj68J44K9R3j62pk35K59l08K21J74l19J47j6J18k38
$$ -17 -287 107 -195 -160 -92 78 82 -86 58 87 180 18 11 -224 35 -273 -52 122 -197 -50 -66 52 -186
4418a86K90j41N3M20l73j22J49K41n96K92J29j29j49L28r6j25K00m7r4n9n2q6
$$ -186 104 -37 16 436 63 -59 90 331 -265 27 156 27 -122 206 110 -15 185 138 44 -15 -67 -153
4440a53J02K15o35M79J56m29K86PK90m78K8lO6K74J5m25NN98m35J49K61j67m23
$$ -153 -51 164 -471 8 164 -265 21 28 318 -160 -132 -135 -69 205 220 -205 -200 398 -37 112 373 206 -217
4463b17L77j86k59J33K09m09M67O8l91P19k58j14k75k4K14j01P7N1j41J66j08
$$ -217 160 -26 -285 -152 57 -352 115 183 -208 511 253 139 -136 -160 54 -47 30 81 -60 106 -2
4484bk05J62K44k96l3J19P1l7J20k64l0J91P7k13j33N26l69L1K58n40L61J67k64
$$ -2 -207 -45 199 -97 -130 -11 60 23 143 -121 -151 40 117 -96 -229 297 -72 -41 217 -323 38 205 -59
4507e9o0L5K7o7L63j27j27%L30n19Q6K47k33K38l0j12J7J78j81l3q5K98l26K3
$$ -59 -119 -84 -57 -124 239 112 -15 -15 315 -204 -118 129 -104 134 104 -8 9 187 6 -27 -112 186 -140 -117
4531a17M31n14R1K28j80KL29m09k1L08l63N1J78M2P1j63K34k14j97L77m11L48
$$ -117 314 -200 -109 119 -61 -59 270 -139 -160 148 -215 -164 14 56 127 -36 198 -16 -213 164 -247 101
4553A01J06k24j58K58k99M0L73N2n16L27r3j03J66J97l66pL18l09l8M12k13j74
$$ 101 207 -17 -175 83 -216 -176 197 249 -267 60 -33 -136 30 227 -139 -146 172 -137 -175 237 24 -150
4575a50K92M3l95L80j68r3J2J27j19J30J67k00k54N10l92J45J6j7o3j82L65l12
$$ -150 142 185 -210 170 2 -91 -79 48 -71 59 226 26 -228 282 -110 35 51 34 -29 -211 154 -158
4597a58J68k22J28J68J29l50k8J87L07j73j04M2o2NNj19j38L81j75j13J72K98
$$ -158 10 -212 -84 84 213 -137 -165 22 329 156 52 94 32 37 42 -77 -215 166 -9 -122 50 348
4619C48m98M38l95k04K10J53l22j24L51R5N3K19j87m33K33kj12K18k96L50k64
$$ 348 -150 288 -107 -311 -101 52 -270 -394 -43 52 105 324 137 -296 -63 -65 -177 41 -255 95 -169
4640a69L19j04k4O4j47k8J32J27k14M25k51j10l6J66k78L27l2r7k0J51m25L4M77
$$ -169 150 46 22 86 -61 -89 43 170 -44 381 130 20 -16 150 -128 199 167 70 50 201 -224 -190 287
4663B87j47l24L30J53n36K77o6j5k00O00n46m2K86j00k48N90l45M1K52k58j82
$$ 287 140 -184 146 299 -237 40 -26 -41 -241 359 -187 -229 57 -43 -291 299 -46 -5 247 -11 -193
4684a93K98r1J96j0Qj35k27L82k17l29M41n9k63K49o7l03L96k6j22J33J37k96
$$ -193 105 14 210 200 208 73 -154 228 11 -318 123 64 -199 50 -17 -320 76 50 -72 61 198 -98
4706i8M4J12r9n3L4M6j65K01j58J17j08M05o55N07M8j14Mj47K22l38Q6J07Rn2
$$ -98 -54 58 -41 -94 -60 -14 -179 22 -136 -19 -127 278 -377 130 178 64 68 -79 143 -195 -109 -2 7 -45
4730d5K96m47K50J14m87K02J66n4k63L18j62j73K38L5j36Q5J45k48K01J58k54
$$ -45 251 -196 54 168 -319 -117 49 -5 -268 50 -112 -285 -47 -12 -148 -63 82 -166 35 193 -61
4751f1K07R3j78q8r8K98p3q5nm92N03K16k97P7K35l76L0K70k35J02L88k37j94
$$ -61 146 239 61 -27 -125 173 100 15 10 -482 21 237 -60 17 252 -124 -94 176 -59 43 431 194 0
4774@J53k4n4n6J65k04K6J34o14N61K4q1q3N2o4o6L76l4k14J75m9N1j68J02l52
$$ 0 153 129 75 19 184 -20 6 140 -474 87 111 30 -53 -1 -65 -131 245 211 -3 172 123 174 6 108 -244
4799b44K05K9j08J6L32ok05QJ4j40J76j0l49j2K47kJ26L1l4J3j22Q7k02K65j49
$$ -244 -39 -10 -118 -102 230 224 19 27 41 -99 77 67 -282 -294 -47 -49 77 108 74 87 -35 52 -150 115 -34
4824c4J9O8K1n6R2J33l43pm5P9j46J95O0l38M73j61j40K52j21r0j90M39l91L28
$$ -34 -15 53 74 18 110 243 -100 -107 -152 -73 -219 -24 36 -302 171 10 -130 122 1 -89 -279 160 -231 97
4848I7N3j52j6J47j61J80j08l5j18K20M1lj00M9j67J8K96r1k88J47L5k16M5q3
$$ 97 150 -2 -18 129 -32 148 40 5 -113 107 148 145 45 94 -73 -55 241 150 -138 9 44 -172 -127 -210
4872b10J55J21j63P7J00oL1k72J82K07l7k72L40k59o1K34l30N1L30j99o2K08l86
$$ -210 -55 66 -97 -20 80 74 105 -167 15 222 185 -87 253 -6 -67 167 -163 -112 218 19 -43 165 -221
4895b21O2L22o8m30M15j31q9J65J42j99r8P7J98j18J87l60P2N3J63k37K02K38
$$ -221 -159 163 95 -335 80 -51 -140 25 167 -32 -130 -53 145 27 214 -146 -74 -21 142 -95 107 345
4917C45m81J41j48p0j08N70m33M9M6J19j73Q0L2n6K15o7J10m54N27k54J22L4l36
$$ 345 -136 5 -143 -213 -321 249 -184 -135 -89 30 -143 -63 -31 -87 128 61 171 -283 244 -10 112 146 -190
4940a90L08J19m29K04l9mk1p4J04j29R5lJ00J02k93J34N7J11m9l21K57j75K53
$$ -190 118 237 -192 12 -27 -31 -52 -126 -22 -151 -56 -59 41 143 -150 -16 41 152 103 -218 39 -136 117
4963A17j31N8k63k5M51k85P6J39j17k46R1K65l7onj18j7L07l25K08Jp8m4J09k41
$$ 117 -14 44 -219 -244 207 -78 -2 137 20 -226 -135 130 93 87 82 -36 -53 254 -71 137 138 60 16 125 -116
4988a16L0j09K61j22k7J40r9N5k4k14J48L94k98L9j9P5p2J87l08j24K46J73k55
$$ -116 -86 -195 66 -56 -83 57 -42 13 -11 -225 -77 317 19 58 39 114 42 229 -79 -203 43 216 -39
5011c9n4K02o0K17j66r7l1K74m40J72j77L83k00J88k66j84L49L25k04l37K25o3
$$ -39 -93 109 49 266 100 3 -28 246 -194 -22 -199 184 -16 172 -94 -278 71 396 192 -145 80 17
5033A7j95lK41j45J44k51J27J06K0p2Ll0J57j92J03rm8K52k45j91J77J01k17k8
$$ 17 -178 -181 60 -85 59 -192 -65 41 61 -11 -8 -38 119 -73 30 21 -27 225 -20 -211 -34 67 -150 -178
5057a78o5K84p6M5J8j49Q2m4J24J94j89k75M86l51m0K00j03J14J3M1k27M2R0j32
$$ -178 -243 41 -35 10 28 -121 -39 -83 41 235 46 -229 257 -94 -134 66 -37 77 90 131 -96 -54 36 -96
5081i6K62k22Rr1K11L9j59PK8k33J72R8Q0k80L02n1k10M61k05m0m3k7j19J39m7
$$ -96 166 -56 -47 -138 73 112 -47 -40 -12 -245 -73 25 105 -175 127 76 -134 327 122 82 39 12 -107 32 -15
5106a5j38K65n5o9j44O0J9L60j96j2j79N9J81k78P9K1j23J26j61R3k6K75j78j34
$$ -15 -153 112 57 -12 -156 -96 -77 283 87 75 -104 -45 136 -142 -63 -42 -165 -39 -200 -107 -133 142 -36 -170
5130a70L81l6j34J31k32r4q7K83j40o1O4K16J29q6j40j51Q4J4j75J9J26j46K65
$$ -170 211 175 41 172 -60 -154 -241 42 -98 -159 -95 121 250 164 24 -127 -43 -29 -204 -185 -59 -205 60
5153F0O1rJ61k09J33k30j03o0J40K2K29o0k3k18L7J23K10j85k38L48k01r0K99
$$ 60 121 112 273 64 197 -33 -136 -196 -56 -34 195 135 112 -106 -69 54 264 79 -159 189 -12 -102 197
5176A97j80k05M00J98m20J54j14Q8j40l8n0J95K38n01K13R2j16J2Q7j91R4M3j26
$$ 197 17 -188 212 410 -10 144 30 118 -22 -60 -110 85 323 -178 35 127 11 23 110 -81 13 56 -70
5199g0o3J26Jj02n3K82j4j01J33q4K2n6j63L0j54J88N9N1o1K2O8j26m2J24j33
$$ -70 -133 -7 -6 -108 -161 121 107 6 139 55 77 21 -142 -112 -266 -78 -19 32 -29 -7 61 -65 -107 17 -116
5224a16lo2J34J69j90J52N2j81o6N3NL9Q2j73K7K21j4p0q5K95k44k7J17j31l10
$$ -116 -119 -181 -47 122 -68 84 136 -45 -111 -58 -53 -14 68 -105 -78 143 129 59 -26 269 25 -2 115 -16 -326
5249c26K16J26M6j99K33l06J87k01K29j14K13k53K14N5k55O8L31k38K10j72j8
$$ -326 -110 16 62 -137 96 -210 -23 -224 5 -109 104 -149 65 120 -135 -67 264 26 236 64 46
5270D6j05J26K6r5O4k3J2J73j41j48o2m0p8M9K07k99K03P9j79J32J88j94J24O2
$$ 46 -59 67 93 -2 62 39 51 224 83 -65 -127 -167 -245 -196 11 -288 -85 -6 -185 -53 135 -59 65 127
5294A27n3l47L32k23L02j41q4K54k74J84n0J48Pj34Q8k80K60m1k6k51K00K48j57
$$ 127 74 -273 59 -164 138 -3 -87 167 -107 77 27 175 182 48 136 -144 116 75 49 -202 -2 246 89
5317H9j94N7K44l34j7Q7mj18r9J38m5K84k07J96J26J5j17k51J26j5L1R1r2M5q3
$$ 89 -105 -48 196 -138 -155 -68 -72 -190 -289 -151 -196 88 -119 77 203 218 101 -150 -24 -39 -8 83 -9 36 -47
5342d7K7o1J67p4J26p3j33q9N9k5J51q3j34M14j56k59K42J71n73M73l42l1M35
$$ -47 -20 -81 86 12 138 65 -68 -157 -98 -123 28 -55 -189 225 69 -190 52 223 -350 123 -219 -250 185
5365A85l08L05l75n0J32R8K30j86k02J51r7K22r8R0p8j10J0l6K94l46K53J11k82
$$ 185 -123 182 -193 -243 -111 -13 217 31 -171 -20 -117 105 7 97 19 -91 -81 -117 177 -169 84 195 -87
5388h7N2j5Q4L0o6K00j95k08J03K35q4k1O2o2j37P5Q7j22J65j00k8J28J3r4K65
$$ -87 -35 -50 34 64 -2 198 3 -205 -102 133 49 28 90 28 -109 -34 53 -69 96 -4 -32 96 109 15 280
5413B80l37K8pJ11ko8J51l04R1%J52o8j40L45r5l69J97J07J43j21K5j56K29l73
$$ 280 -57 -29 -36 75 73 5 156 -148 -57 -57 95 27 -113 232 137 -232 -35 72 215 94 119 -37 192 -181
5437a81o9Q9J63k7J21l00J65Q8k9o1O8J24j53j37Mj63L29q6k9J4n6M68l85OK6
$$ -181 -250 -161 2 -25 96 -204 -39 49 20 -41 27 151 -2 -139 -135 -298 31 -55 -84 -70 -126 342 -43 -37 -11
5462a1r4J28L6M2j67o0L43l80K78Mn6k2K7q1r6O0O1j31J08K9l1L5R5j78J56j75
$$ -11 -105 23 59 101 -66 -126 217 -163 115 119 63 41 68 -13 -109 -49 12 -119 -11 18 -13 22 117 -61 95 -80
5488h0Nj63J89j03L34l22K41n01K94K07k30J82m0m9j92K81j05Q3j11k3K41j82
$$ -80 -75 -238 -49 -152 182 -140 101 -400 -106 101 -129 53 13 -36 -228 53 -52 31 -80 -103 138 -44
5510d4J9R8R0p8k12k5K26N4oo6l5j56J10K02r5rj13Q2j88J55M9j2k32J21J33J2
$$ -44 -25 73 163 85 -127 -152 74 128 122 56 21 -135 -25 177 82 73 -40 42 -146 9 58 46 -186 -65 68 80
5536H0J36l32L94m16mMK70j59O4L49l47m1J11j86N8N6n5oNN8r7L31k58O2k22J26
$$ 80 216 -116 278 -138 -142 -138 132 -27 37 386 39 -2 109 -77 -19 37 -18 -24 -19 39 -58 273 15 77 -145 -19
5562a9O9k33K03rN4o6nN3k76K64l6l5k04Q6J99R6M0k69J1K02j04K74N1l82J49
$$ -19 50 -183 20 11 65 -1 -6 47 -229 35 -1 -36 -240 -154 45 141 181 -88 -77 125 21 295 346 -36 113
5587A13P6k96J87q5l87O19j23j10j2j80mL16M9k37K44j20l85M25K4j20p2Q9j26
$$ 113 189 -107 80 -5 -392 227 104 -6 -18 -198 -202 114 163 -74 170 50 -335 90 114 -6 -78 11 -115
5610a15K99k61o4J81j08K37j12k53j07K81Q7j3k7r7J04O9L7k20o2n8p9K41L8R5
$$ -115 184 -77 -141 40 -68 169 57 -196 -303 -22 65 52 25 -72 32 101 138 -82 -144 -202 -281 -40 -2 93
5634I3J17l58L08l48L42n16M10Rj79J81j33K44j79j7J35l4k4K10j73j70J9J28
$$ 93 210 -148 160 -188 154 -362 48 57 -122 59 -74 170 -9 -26 109 75 51 261 88 -82 -63 65
5656F5q0K24l88O0P7P8j13K89j77R9j28k6O5l3JQ3k35J0J98p1m3J30k56j3J91
$$ 65 -15 209 -179 -119 -42 36 -77 212 35 134 6 -20 45 12 13 96 -139 -129 69 -2 -45 85 -171 -184 7
5681GL4%n1j9q0J64j87l5J08J03L2j37j3j75K72J20l09K90j8j19j98N87m94M6
$$ 7 41 41 -10 -29 -109 55 -132 -167 -59 44 76 -61 -74 -249 23 143 -166 124 106 -13 -211 376 -118 -72
5705g2J55O1k46L8k8R2j33K02j10J86n4j31K60L3j96j42J79O3l16L4M43m21J76
$$ -72 83 144 -102 -64 -92 0 -133 69 -41 145 91 -40 220 253 57 -85 94 157 -159 -125 318 -103 73
5728G3J34m07J86J54l42K51l1j12p5p9J42K08N9k55j34J5J56J21Jn5J51l84L9
$$ 73 207 -200 -14 140 -202 49 18 -94 -169 -248 -106 102 161 -94 -228 -213 -57 64 65 10 161 -223 -184
5751a84L39qj05L5l2k42J86n5R1K34m64J98J85L4r2j65J53j51J41J95o82K95J11
$$ -184 155 147 42 77 45 -197 -11 -66 25 259 -205 -7 178 212 120 -45 108 -43 98 293 -389 -94 17
5774A7O3R8k62RN2q6J19J16j34J15k04K1K73j72J03Q1Qk81J28j48m5K41k06K70
$$ 17 80 178 -84 -75 -23 -109 10 126 -8 107 -97 -76 197 25 128 209 217 -64 64 -84 -129 112 -94 176
5798A76k87J46m2k3O5j15J24Kk8M4rp4O8J6O8K1J16m21K8p2J84l4P1J01n8j25
$$ 176 -111 35 -7 -30 35 -80 44 46 18 62 53 -21 47 63 131 152 268 -153 -125 -197 -13 -47 24 125 67 -58
5824e8R7j13j7Q5R4k7K4m5j15k6R0mp3J19j73R3N6J25k50K08k51L41l05r3K32
$$ -58 39 -74 -91 -6 88 61 85 40 -75 -101 -11 -15 -88 31 -142 -49 7 132 -118 90 -161 180 -125 -218 14
5849A4k05J26r0rK11j13n3R9p3K8m8M90j37l06J85k88J09J79k29k1m6J61O1l7
$$ 14 -191 -65 -155 -164 47 -66 -119 -20 -93 -65 -113 377 240 -66 119 -169 -60 119 -110 -131 -177 -16 45 8
5873HJ62m9k84J3o4J19J32l6k7K20l66J54rR0k70M38j61L6J30k66P7j16J99J40
$$ 8 170 121 -163 -150 -214 -95 37 1 -26 194 -172 -18 -27 63 -207 231 70 106 236 -30 47 -69 130 270
5897B70k05J08K4n93N51j11J4p3L4O2j6J3r4J28j26j92J52J82J3j25P7J3j63j22
$$ 270 65 173 197 -396 155 44 58 -15 19 81 65 78 -16 112 -14 -206 -54 128 141 16 93 106 -57 -179
5921a79l4K07J01k37Jp3K47k39L11k3m5j23M0M2Q8k68J8P4J34Q7k23qmK20k75
$$ -179 -213 -6 95 -142 -141 -214 33 -206 105 82 37 -86 -46 -4 84 -184 -166 -92 42 129 -94 -102 -106 114 -161
5946a61L40k59J72m3r4K82k7q6n78M62j2jJ02k06J1J99q0p0J06P7k19J78j58K39
$$ -161 179 -80 92 49 -45 237 210 124 -454 8 -4 -5 97 -109 -98 101 21 -49 57 134 -85 93 -65 174
5970A74L2k25L42n06K82m5q6o4K94p2j78N1j1J06J22k80j38K35K9r2M9j28J77
$$ 174 206 -19 323 -183 99 54 -32 -96 198 126 -52 -1 -12 94 216 -64 -202 33 62 -30 19 -109 68
5993F8j34K53k48K14O4l30N2J50j80j0J8Q7J06J10k05j81K15K8j16K7o2R9j41
$$ 68 -66 187 -61 153 217 -113 -61 89 -91 -101 -83 4 110 220 15 -166 49 77 -39 -12 -74 25 -116
6016a16J88J89l65K62q1j01l4j46J94Pj3p9J78j00j71M41J20n54OJ38J22m0j81
$$ -116 72 261 -104 158 77 -24 -58 -204 -10 -3 -16 -95 83 -17 -188 253 373 -181 -175 -37 85 45 -136
6039a36j4K81k09j33K43j04J87q1l9R3rL1o4L7q0P9p9j30Nk7L27j10j00k34L74
$$ -136 -150 131 -78 -211 32 -72 115 34 -5 88 79 110 46 83 3 82 3 -127 -122 -149 178 68 -32 -266 108
6064A08k13J51J6j19km8n1L0J88k30J86n2Q7N6q8j13j11K02r5K60n0j13Q0j02
$$ 108 -105 46 62 -57 -59 -107 -158 -128 60 -170 16 -36 51 107 19 -94 -205 -3 -98 162 112 -1 79 -23
6088b3K53l20P1K9oQ9j35P5j74J03j5l6J73j02J88j84j70J98k12J75j7L6m7J52
$$ -23 230 -90 -19 10 4 93 -42 33 -141 -38 -53 -89 84 -18 170 -14 -184 14 -198 -23 -40 -4 -51 101
6112A01j40l9J85k48K98k68J57O5j33j36K81j53m9J32J9k62K5K30j04j18K09j82
$$ 101 -39 -78 107 -141 157 -111 46 111 -22 -158 123 -30 -79 53 72 -190 -165 65 -39 -157 52 -130
6134a30J85k25n7K67J84j03k20J65k39J24O7J0j8n7K31j32ok34K13J76L5j76Q4
$$ -130 55 -170 -227 40 224 121 -99 66 -173 -49 18 28 10 -47 184 52 46 -188 25 201 236 60 144
6157A44l77P9ORM6K38j18L1k14L10j28Oq6J13p8j20K25j40J8Q1m4J22m6o8J25
$$ 144 -233 -154 -148 -139 -93 145 27 58 -156 154 26 32 -54 59 -19 -139 86 -54 -36 45 1 123 77 9 134
6182A34l29K90J6j10j63J44j02J02K35q9k75J92o6k7J22j04j19K42m9J32L8j69
$$ 134 -195 95 111 1 -162 -18 -120 -18 217 128 -147 45 -21 -48 74 -30 -149 93 44 176 214 45
6204D5j14p9J09J12N5j77pj36oR0QQ0k80L68K94m00N9J11j65k15K73J52p0j45
$$ 45 -69 -148 -39 73 128 -49 -56 -192 -198 -108 -100 -20 -300 68 362 -38 21 132 -33 -248 25 177 107 -38
6228c8J64j34j00L40l74O1J15j09K16k03p5K6P2m1L39l40n3J54p4J70p1L8on1
$$ -38 126 -8 -108 232 -142 -81 34 -75 141 -62 -137 -111 -39 -80 259 -81 -134 20 -54 116 45 83 77 26
6252B6l2Q2n2J49k24P2nk64L40n3K8J10n5k11K6J46k87J97P9l28O1J81q9K89k54
$$ 26 -6 76 24 173 -51 21 16 -248 92 39 67 177 122 -89 -63 83 -204 -7 72 -256 -195 -14 -103 186 -68
6277f8O6Km2J41k81J42J87j58J36M8l9k41K51p9j35J39J8r7m8K46l65k7O3J07
$$ -68 -2 0 -42 99 -182 -40 147 -11 125 173 134 -107 144 65 -70 69 87 -10 -58 188 -177 -204 -141 -34
6301c4m7k10M07j31K8N2L0Ok04qP8J24j12J6k4J24j92K19P6j58q6K3J72q2o0m4
$$ -34 -81 -291 116 -15 13 65 95 101 -103 -111 -33 91 -21 -5 -29 95 -97 122 198 40 -46 -23 149 67 7 -37
6327c7J78j73J00P8k33K76k64KJ07j04J95j67J52N3m30K05R6r5L9NJ42j45J0J75
$$ -37 141 -32 68 146 -87 189 -75 -73 34 -70 125 -42 110 163 -267 -62 34 -61 -22 -17 125 -20 -10 165
6351A65K5k65M1K03j87K4M8j05k56K41j34K02Q7k69J01J19l3m9K34r1k61J9K15
$$ 165 190 -75 -34 169 -18 6 54 -51 -307 -66 -200 2 89 -180 -79 40 7 -42 192 101 -160 -141 74
6374G4K7M0j56J11k00j7J34P3j44K23j39l6J91k71J08J3J02j80L1P1r6Q3N9j61
$$ 74 101 141 -15 96 -104 -121 13 86 -58 165 26 -10 181 -90 18 31 133 -47 -16 55 -41 42 101 -60
6398f0L2R4j71J73j94O7o9L11k20j09K15J0K24m44K21j7k16J67l00K58l59L62
$$ -60 -28 66 -105 68 -126 -59 -128 183 -37 -146 69 79 303 -141 80 63 -153 14 -286 -28 -387 -25
6420b5L69j14k77K48k9j51j26K71k08n0J35Q1k39J9J67r6Q0J19k29JJ07n7O4o7
$$ -25 344 230 -47 201 172 21 -105 166 -42 -92 43 124 -115 -96 71 -25 55 174 -55 -54 53 -4 60 -7
6444gJ63n8J42l95J40J17k32O9j6K61j66O3j37j66J29J01k45K81Q0k11J75k04
$$ -7 156 98 240 -155 -15 102 -130 -61 -77 184 18 81 -56 -222 -93 8 -237 44 124 -87 88 -116
6466a16K55r1M5k22L11j83J63p5j46N2n6j79L85p5P0r2J85k25k35K90j67o3K03
$$ -116 139 48 93 -129 182 -1 162 87 -59 -7 -63 -242 143 68 138 46 231 6 -229 61 -106 -169 34
6489C4J13l78L45j07k02L34l97K17j5Q3j19J34k1j56K21l1p1j28j31L89k60J57
$$ 34 147 -231 114 7 -195 139 -258 -41 -56 27 -92 42 21 -135 86 55 -16 -144 -275 114 -146 11
6511A1%l1rK50j57l62L35j57L0L8Q1P2k09m2K89k94L59k83K27M1k48P6K52m31
$$ 11 11 -20 -29 221 64 -298 37 -120 -90 -52 29 101 -108 -150 139 -155 204 -79 148 189 -59 17 269 -162
6535a62j5L93j32p0q6K76k27J52j40J4j51J98r5J3r4l2J72J6J57j96J00j94J54
$$ -162 -177 216 84 14 -72 204 -23 129 -11 3 -148 50 -45 -32 -126 -158 14 30 187 -9 91 -103 51
6558E1k97M28l32k2Q7J58k69L17j87R9J47j91j64L27j53j07Q0J10l89R6L14q1
$$ 51 -246 182 -150 -172 -85 73 -196 121 -66 33 180 -11 -175 152 -1 -108 -28 82 -307 -211 103 22
6580B2k30L87l55J25j9K62k54Q6L16n20K80j06J27j16K26k76K59j32M5j26j65
$$ 22 -208 179 -176 -51 -70 192 -62 24 340 -180 100 -6 121 5 231 -45 214 82 127 1 -164
6601a64K00Pj36J44Q0k44L36m06K04o8R8k05J01L0j69K18j06K79j16N1j11j53
$$ -164 36 43 -93 51 131 -113 223 -183 21 -47 51 -154 -53 -23 -192 26 -80 199 83 134 23 -130
6623a30OQ8q1L17k63M3n3NK64J9j61j17p2L05k12J59q8j00J58j48J39r4m8j20
$$ -130 -124 -36 -117 200 -63 -20 -73 -68 196 215 54 -63 -135 170 -42 117 29 -71 87 -61 78 -16 -64 -184
6647a84L94j05j16J13j58K47l37J21P8q3k23K55j1n3Q7ol54K32J30p6j15K29o4
$$ -184 210 105 -11 102 -56 191 -146 -25 53 -30 -253 2 -9 -62 25 19 -335 -103 27 -49 -164 65 1
6670Aj16Q8L9K24j93j48J23q9K7k11K26J38k98M34k67R7l0O9j54L1J85m13J36
$$ 1 -115 -27 12 236 43 -105 18 -71 -44 -255 -29 109 -189 245 -22 75 45 114 -40 -9 176 -237 -101
6693a01J11J72m16N4K14R3j44J82j06pN2j34k5J06k5J07k04P2J38j34P2k45J25
$$ -101 10 182 -234 -180 34 127 -17 165 59 52 104 -30 -55 51 26 133 -71 1 139 5 77 -168 -43
6716d3K17j53K3P2j91Q1j52J66M6JJ06l60J41J29k6j0m0j78M1p1L50m7J49j51
$$ -43 174 21 44 116 -75 6 -146 20 66 67 173 -187 -46 83 57 47 7 -171 -130 -201 149 102 251 100
6740A00j30n0J08k49L61k09k8Oj7K38q6q6K73L7j64k5j45K65k79k9J84k09K18
$$ 100 -30 -80 28 -221 140 -69 -97 -91 -108 130 44 -42 231 268 104 79 -66 199 -80 -109 75 -134 84
6763H4k19J80N6m3P1j46Q6l6r3M1MJ77j75J94mj92k1j13J51J22k84J87j74j0J48
$$ 84 -135 45 101 58 129 -17 69 33 -60 -19 -15 162 -13 181 177 -15 -36 -149 2 124 -160 27 -147 -157 -9
6788io5n4K53k22K63R4j08k05K2K51l96p3K88k17J89M6R6M4j36o8oq3J69j25o6
$$ -9 -74 -128 125 -97 166 260 152 -53 -31 220 -176 -249 39 -178 11 57 153 197 61 -7 -13 -96 73 -52 -118
6813a18J20p3J00J06j88j34N8R7J74l97M14j90J28j01l36M57j79m5jJ05lJ1n1
$$ -118 2 -71 29 135 -53 -187 -129 -32 142 -255 159 -31 97 -4 -340 117 -62 -107 -108 -3 -6 5 -46
6836d6Q1P5m7J3j13J25o4j91K43k86J00O6J17p5q7K23l72%K88j13J72J4j56q2
$$ -46 35 110 63 76 -37 88 24 -167 76 -210 -110 -44 73 -2 -89 134 -238 -238 50 -63 109 123 -33 -115
6860a15O3Q9K39l64Q2M5n7j1p0n9J91M3J26j29m0r5m3K33j31JJ52j65r3O0J02
$$ -115 -52 37 276 -88 -6 39 -18 -29 -99 -158 33 76 202 73 33 -62 -105 128 -3 -2 150 -15 -108 -48 54
6885E4J11r1m4L5j36J06k28j08K68jj96J76O7k26Q7J59J43l4k47J48K50n3l44
$$ 54 165 74 30 65 -71 35 -193 -301 -33 -34 -230 -54 13 -213 -126 33 176 142 -105 43 293 240 -104
6908a04K85Qj29j48J43j96l6K3J30p3J83j07M7J4p8L1K13j35j8O3j63m9K71k76
$$ -104 181 189 60 -88 55 -141 -177 -154 -24 -97 86 -21 26 40 -38 -7 206 71 53 116 -47 -96 175 -101
6932a01K47m1K75m11l6J56j40KO1J24l01J80J1j08K30o4k01J05oj96L41q7n0q0
$$ -101 146 105 380 -31 -67 89 -51 -49 12 136 -165 15 26 -82 148 84 -117 -12 -18 -214 127 40 -10 -90
6956i0j64K09j89J80j7J11K4j46K38O2m32M55l20n1RK82o2k81L53n0o3q2l01N45
$$ -90 -254 -45 -234 -54 -71 40 64 -82 156 218 -214 241 -79 -130 -121 161 99 -182 171 121 58 -24 -325 220
6980B20l79J10n9J96j41K46k19J28m3J85k86k5N2l2K17M7k50k37M04j38R4j10
$$ 220 -159 -49 -108 88 -53 193 -26 102 59 244 -42 -67 -15 -47 170 217 -33 -270 134 -4 90 -20
7002b0M4j02K21l07L8K67j67j9Q9j42j05K87J3k2J20k44N9M1P2p2M2j35J51o6
$$ -20 24 -78 143 -164 -126 141 -26 -45 44 -98 -203 84 97 75 195 -49 10 51 123 51 93 -42 109 43
7026D3k4J60k86L27k39j44J90O9j39J34m04K53Q5P7j55M1j41J74Mk4J02l47L04
$$ 43 19 179 -107 220 -19 -163 27 96 -43 91 -313 -60 25 102 -53 -12 -153 21 25 1 103 -244 60
7049F0k34K43J35o8kl15K22j5k57J18K05k13K64k44J7K08j76K1n1j3J26J12j2
$$ 60 -174 69 204 136 134 -181 41 26 -231 -113 92 -121 143 -101 -84 124 -52 -31 -82 -95 31 143 131
7072A31q3j52j60K55k6Q2Q2o3k82oK88p6j19J17q4m4L20k47K12j05J54j93k94
$$ 131 48 -104 -264 -9 -35 47 129 66 -216 -222 66 -10 -129 -12 -96 -140 180 -67 145 40 194 1 -293
7095b93K83J08kn2Q5k06O6o6L2J19l9j02J4J70r0j18K21j16O0o1j6o6J10j18n9
$$ -293 -10 98 96 44 129 -77 -11 -77 -45 74 35 -67 -53 117 27 -91 130 14 74 13 -3 -69 41 -77 -136
7120a36J2K46j63N4Lj75L14m61L02k3K66j8K9k22j97J38l6R2k1L7l3J30j31K03
$$ -136 -124 122 -41 13 16 -159 155 -306 -4 -27 239 221 250 28 -169 -31 -67 25 4 41 8 138 7 210
7144B10k74JJ82k82K02J0j65K31k75o7L60j4L1j17J5J06l09K18l1o9p4K22o6j53
$$ 210 -64 -63 119 -163 39 49 -116 115 -160 -227 133 119 150 33 48 154 -155 63 32 -37 -111 111 45 -108
7168a08L66l91K69k45L2m7K17j67J71j34L06l26j3J52j87N9n6K15j98J7J44j33
$$ -108 258 -133 136 -109 -77 -124 93 -74 97 -37 269 -57 -70 82 -105 -46 -102 113 -85 -68 76 -57
7190e7J85k63J45P1l6J36k22K89m53L81l48K49j54K15J6l51L07j25L1m15M36r8
$$ -57 128 -135 10 81 45 181 -41 248 -205 176 -172 77 -77 138 154 -197 110 -15 16 -399 37 -61
7212f1J13J38j43j93K57k35J65J04k18qL6J03J18k39k5Rj90K59L6J81k2j33Q1
$$ -61 52 190 47 -146 111 -124 41 145 -73 -81 -45 58 176 -63 -88 -79 -269 -10 26 207 185 52 133
7235A33p8j22J99k09p8P8JK07j62J28P1R0j28J64m39N06k04l91K38j46K24N0j60
$$ 133 55 -67 132 -77 -155 -77 -76 131 -31 97 168 258 130 294 -145 361 157 -234 4 -142 82 132 -28
7258b8r9n3K27o9m4K38j98Q2q3R8k0P4m7j21K17l27Q8K34r9J16n0k34J36K11j48
$$ -28 -127 -180 47 -22 -66 172 -26 56 -27 71 51 125 78 -43 174 -153 -65 169 70 186 136 -98 38 249 101
7283A01j63j47k9J51r9Q3J65n5p3M6J57k13J86j92L0k73N06j76k40K54k12K30
$$ 101 -62 -209 -238 -87 -186 -103 62 7 -66 -20 137 -76 110 -82 -52 -325 181 5 -235 19 -193 37
7305C7j74M9K25l60L10p9P5j53q5J72o2L01j43j40k42K15J74l59J93j15rQ9J07
$$ 37 -137 -88 137 -223 87 8 83 -70 -155 17 -45 256 113 -27 -269 -54 120 -239 -46 -161 -170 -81 26
7328B6j1K44k95m1J8j18K02J34k59K77j33Q8l50N6K76k7l87M25n3k64J85k7q8
$$ 26 15 259 -36 -77 -59 -177 25 159 -100 177 44 132 -218 -162 114 87 -300 125 72 -192 -7 -34 -122
7351a22K19K49k53Q5j06n7k05J18J34K33k64j01j28L24n2p5J6n7q9K02N0k68J50
$$ -122 97 346 93 178 72 15 -190 -72 62 295 31 -70 -198 126 74 -1 15 -42 -131 71 121 -147 3
7374Cp3j0Q5J70l97L60K0j7j23k38K50pK2j72O2J62k66J27K41lk68J98r8N4j23
$$ 3 -70 -80 5 175 -222 138 158 141 18 -220 30 23 45 -127 -65 97 -169 -42 199 196 -72 126 28 82 -41
7399d1M6J14l02K32n3j12J44k72J11m5J83j74M7nJ88k93J07J09O0n2j47K29k05
$$ -41 5 119 -183 49 -4 -116 28 -244 -133 -178 5 -169 -122 -127 61 -232 -125 -16 44 -8 -155 74 -131
7422a31K1K64r4J2q6j70J96o5m9J49l33J73J51o1L7N3lj12K27n6Nj73k9Q6j38
$$ -131 -110 154 60 72 -14 -184 12 -53 -102 47 -286 -113 38 -23 14 67 64 -48 179 123 128 -45 -74 12 -126
7447a26K05O4k50L43Lk12q3J58N4l33J04J7K26k10n4o5M77k53k41J47l9O5j44
$$ -126 79 143 -107 236 239 27 -56 102 156 -177 -73 -56 170 -40 -94 -159 318 65 -176 -29 -68 -3 -147
7470a47L6K67j68J62k01j25J52N9j7k4O3k36N8J14j02J1K36Qk17K43k80j09J00
$$ -147 -111 156 -12 150 -51 -176 -24 35 18 -6 57 -179 -121 -7 -109 -98 138 146 -71 172 -108 -217 -117
7493a17K83l22r3P2L31j22l27J64J60j9L3Q2N5K9l07j08J81k14J7K07J31j13O6
$$ -117 166 -156 -249 -177 154 32 -295 -131 29 10 43 125 180 209 -98 -206 -25 -239 -222 -15 116 3 69
7516F9r2l4J98J3j13Q2n3k50L91k23J00k31K49l2Q5j91K5j15R0M3o2RO5P6j89
$$ 69 -23 -57 141 154 41 123 70 -180 211 -12 88 -143 106 74 159 -32 -7 -122 -32 11 -51 -42 23 99 -90
7541i0j35L30j34k5J36JJ11j89j6J50J21k22j48o2L03k43L45m43M56L4k42J6k30
$$ -90 -225 105 -29 -54 82 83 194 5 -11 139 260 38 -110 -172 131 -112 233 -210 246 280 38 54 -176
7564a76K81j43R5K8r7j04K17k77o4K80j58Q1J23j94J00J70j13j17R5J77j58k72
$$ -176 105 -38 57 85 -12 -116 101 -176 -240 40 -118 -37 86 -108 -8 162 49 -68 27 204 46 -226
7586b26K71K6k18K82j17J40j45j13J90K7j41o7J59J27m14r5M61O8m12L14j14L72
$$ -226 45 71 -147 135 18 158 13 -100 90 117 -24 -91 68 195 -219 -314 147 215 -197 117 3 375
7608C75n19k0K41q5J70j24P5k54J68k18J29K37j25Q3mk60J87l05K45J16p4l33
$$ 375 -144 -164 77 -8 162 38 113 -141 27 -191 -62 175 50 133 129 -131 56 -249 -4 112 38 -295
7630b95N02j77j81K68k4l5j84L00m41L82%j99J95Q1K7l53J51j42j03K07O8j48
$$ -295 207 30 -151 117 93 58 -126 174 -267 115 115 -84 111 192 219 -134 17 -125 -228 -21 47 -101
7652a01NJ10q5j38kK83k40qM34k86OK40k27q7K96m00K85j43k06M13P4N2n11K16
$$ -101 -96 14 -71 -209 -211 72 -168 -176 258 -28 -22 218 -9 -96 200 -200 85 -58 -264 149 223 275 -236 -20
7676b0j29R0J09k5q0k12L64l39K25R7k61K34J85k48jP0m6j77K05J91l38J3J52
$$ -20 -149 -59 50 25 -55 -267 97 -242 -17 80 -181 53 238 -10 -11 59 13 -164 41 232 -106 -93 59
7699E9K6k16L2k9J4J88j68J27j16j9J38k00J80j42k8O8j79K16J37j80N%K46p3
$$ 59 85 -131 -99 -128 -114 74 -94 33 -83 -102 36 -164 16 -126 -154 -86 -265 -49 88 -92 -87 -87 159 86
7723H6r7K8j71J91R9k24k2q1o7J04K00R7l9m7R2j82K09j30k75K18K1J87k26k0
$$ 86 -11 17 -154 37 136 -88 -110 -191 -258 -154 46 143 104 57 149 -33 176 46 -229 -11 10 197 -29 -49
7747d9k06J57K50j68K3J94l95RJ56k7q2J44j71J54m7j34J07K38j14q1J36j02L52
$$ -49 -255 -98 152 -16 7 201 -194 -185 -29 -56 -138 6 -165 -11 -58 -192 -85 153 39 -42 94 -8 344
7770C44m35J01J53m78J45k6K28o2J41o6m37N19j01k24J57L33k47P0m1j08MK22
$$ 344 -91 10 163 -315 -170 -196 32 -30 111 45 -392 127 26 -198 -41 292 45 115 74 -34 -30 192
7792A92m63K07J13J1l89L39j33J95l7j13n3J76J31m09K88l36L88j99J18P3j80
$$ 192 -271 -64 49 60 -329 10 -123 72 35 -78 -131 45 176 -233 55 -281 107 -92 26 99 -81
7813h1L21j82N4j46m2L3J82J18l78K01j30P7j47K71J27l10l2J74m9m5m4n6J11
$$ -81 240 58 112 -34 -76 -43 139 257 -121 80 -50 27 -120 151 278 -32 -64 110 61 16 -28 -84 27
7836B7J07L6j44K49k52m2j83J51k0j57Q3R3N0J36j80J07k61K00r9J0O0L8N6j17
$$ 27 134 170 26 275 23 -19 -202 -51 -71 -228 -145 -52 -2 134 -46 61 -200 0 -99 -89 -29 9 65 -52
7860e2JR8K62o18L32L7K9m4J54n5k07k43L83j21l1K00m93J49K02k0k98K95k27
$$ -52 -51 47 309 -309 23 60 89 45 199 144 -63 -306 77 -44 -75 125 -368 -219 -17 -37 -335 -40 -267
7883b67K89N2l9j48L83k74M6L2k07Nj73M06k47j21N62j52l09J95j16M6N2Pl33
$$ -267 22 74 35 -113 270 -4 42 74 -133 -128 -301 105 -142 -263 299 147 -162 33 -83 -37 15 22 -311
7906c11M44l59J60J27Q4k82l6J11K43j80k00K75J65m7r0l2O0o3rk13k1l1J66K79
$$ -311 133 -226 -66 61 145 -137 -173 -62 181 1 -199 76 241 194 104 72 132 69 60 -153 -174 -205 -39 240
7930B40k24kq9K20o0j47J89l19K87Jk15L0L3k36M42q8p2o4J8J40j5Lk9K5j47P6
$$ 240 16 14 -75 145 85 -62 127 -192 95 96 -119 -89 -56 -292 150 62 -10 -74 -56 84 69 72 43 68 -79 -3
7956cJ12q3J93q7m6o6o7OJ68K7k99o3J90L31l80o0NK1J89j15j45L97l77L49m39
$$ -3 109 26 219 132 86 20 -47 -41 127 154 -145 -208 -18 313 -67 -127 -122 -101 88 -27 -172 225 -152 197 -242
7981b42K65k44L21J65j66k80L3K11K8k88J27P0j74J32k4L04k86K0j45J33J87j96
$$ -242 23 -221 100 265 99 -181 -148 63 91 -197 -70 0 -174 -42 -66 238 -48 -28 -173 -40 147 -49
8003d9K1J5J06j8J45j38L0k61o2K48m0j06J87j29J92k86N1N4j69L55l00N4J37
$$ -49 -28 -13 93 75 220 82 112 -149 -211 37 -3 -109 78 -51 141 -145 -94 -40 -209 146 -154 -100 37
8026C7pJ3qM8Lj82L29j94O5k3k80J69J00o2Oj0K25k04r4L15l64N2K16j41j87K96
$$ 37 30 43 35 83 86 -96 233 39 104 81 -199 -30 70 8 14 4 229 25 -69 246 -118 -66 150 9 -178 118
8052A18k03K27j14l8L6K24k93Oo6N7J49j94K88j66j05J59k63J48K35j05j89K95
$$ 118 -85 142 28 -10 26 250 -43 -37 -103 -46 103 -91 197 31 -74 85 -178 -30 205 100 -89 206
8074B06j50l5J37j89L0J26k3l62J56L91m81j8L13j52J18j44Qj12J79Q9m7j54R9
$$ 206 56 21 158 -31 -1 125 102 -260 -104 287 -194 -212 101 -51 67 -77 -69 -181 -2 87 40 -114 -15
8097a5J6j13K62j91M5J63m15M39l59J09j12J19m6K29k68l6K99k95j4J22J06j3
$$ -15 1 -112 150 -41 4 167 -248 191 -168 -59 -171 -52 -98 131 -137 -173 126 -169 -183 -61 45 32
8119C2k3j47J36p5%K28j75k70J90O7N5K31k35J64j89O0J4rL5n9j26J90q2J54j88
$$ 32 9 -138 -2 -77 -77 151 -24 -294 -104 -37 18 249 14 178 -11 49 63 54 89 30 -96 94 12 166 -22
8144b2J16J55m12K1O6N7M8r3p6J30K33k47J6L6j48P9m3J55k2K22j93j46K45k23
$$ -22 94 249 -163 -142 -76 -19 29 -64 -140 -10 223 -24 -8 28 -120 -41 -84 71 49 271 78 -68 177 -46
8168d6m1O9k4q0J57o4M8L24k74j38m0J22j65L4K80l66M31l03Q4k1m7K28j32
$$ -46 -87 -18 -42 -122 35 -29 19 343 69 -69 -109 13 -152 -118 162 -204 227 -76 8 -13 -60 168 36
8191C6
$$ Imaginary data points
##PAGE= N=2
##DATA TABLE= (X++(I..I)), XYDATA
0@%%%%%%%%Nj3J6j6J6k4L2l2M0m8N6p2Q5r4J06j25J47j68J92k18K46k79L15l54
$$ 0 0 0 0 0 0 0 0 0 5 -8 8 -8 8 -16 16 -16 24 -24 32 -40 45 -49 57 -68 79 -89 103 -115 131 -148 167 -187
32a87L96m43M95n51O12o79P54q37R27j027J139j261J396j548J719j913K136k392
$$ -187 209 -234 261 -290 322 -357 397 -440 487 -540 599 -662 734 -814 905 -1008 1128 -1264
50a264K693l059L502m055M774n743P127r274J3066k1649P2414j0331j45030J43506
$$ -1264 1429 -1630 1872 -2183 2591 -3152 3975 -5299 7767 -13882 58532 48201 -96829 46677
64D6677q015j23415J08814N0407j47185N5907Q0558j06916J1325J03186q5118
$$ 46677 38662 -84753 24061 74468 -72717 -16810 63748 -43168 -31843 71343 -13775
75a3775l5881R6321l4535o2221P7843K346p3954L9946M1965o5596K577O8695m4288
$$ -13775 -49656 46665 12130 -50091 27752 30098 -43856 -3910 38055 -27541 -24964 43731 -557
88e57m1882P7091j4382p0202P2516J7562r4238N3965N0899r6477K6878P6846q8933
$$ -557 -42439 34652 20270 -49932 22584 40146 -54092 -127 50772 -45705 -18827 58019 -30914
101c0914l890R5806p1823l7214J01436m8000n9877R8651k5144q0510Q6231N578
$$ -30914 -34804 61002 -10821 -48035 53401 5401 -54476 44175 19031 -61479 24752 30330
113C0330q1951O5969K4532q2933M0222M7589o7799R446N3037n2733j5617N9564
$$ 30330 -51621 14348 38880 -44053 -3831 43758 -24041 -14595 38442 -14291 -29908 29656
125B9656k4833l7215M8245j29m6309L4517K5959m8687N789M5020l9288k2143N9133
$$ 29656 4823 -32392 15853 15724 -30585 3932 29891 -18796 -13007 32013 -7275 -29418 29715
138B9715k0740n1178O2736M462p2159N6906L3037q5389L6726N7886q5391J0041
$$ 29715 8975 -42203 20533 24995 -47164 9742 42779 -42610 -5884 52002 -33389 -23348
150b3348P8593p4292k1978Q9763n0893m8998R1449k2947p1290P9795P718q0960
$$ -23348 55245 -19047 -41025 48738 -2155 -51153 40296 17349 -53941 25854 33572 -47388
162d7388N6689L1517p8792K8088N1053o2739l154N8514l7356k8512N6624q613
$$ -47388 9301 40818 -37974 -9886 41167 -21572 -24726 33788 -3568 -32080 24544 15931
174A5931m8184M1377J9302n5002J9342M1112n0678p774N6065l2066l4645O0460
$$ 15931 -32253 9124 28426 -26576 -7234 33878 -16800 -24574 31491 -575 -35220 25240
186B5240q230n7005N4483J8463p1608L8810M2464p5816J6886O1074o7514o416
$$ 25240 17010 -39995 14488 32951 -38657 153 42617 -33199 -16313 44761 -22753 -29169
198b9169P2081n0561k9285P2865k7137m7809O4135l761n9928M9181J8149o2066
$$ -29169 42912 -7649 -36934 35931 8794 -39015 25120 21359 -38569 10612 28761 -33305
210c3305K9854L4131n3798R264M3583l8618j0808M3228j8675k7823L6169K234
$$ -33305 -3451 30680 -23118 -13854 29729 -8889 -19697 23531 4856 -22967 13202 15436
222A5436l8459K2771K2023m0342O722L7196l4351j1346M5629k1965k9212M5544
$$ 15436 -23023 -252 21771 -18571 -11849 25347 -9004 -20350 25279 3314 -25898 19646
234A9646n521m3914L8704J4345n3206K7504L2562n5553J3263M6882n0529m175
$$ 19646 14125 -29789 8915 23260 -29946 -2442 30120 -25433 -12170 34712 -15817 -19992
246a9992N4384l9762k1216N4599k3566l5066M8471m186m3946L7746J4432m6795
$$ -19992 34392 -5370 -26586 28013 4447 -30619 17852 13666 -30280 7466 21898 -24897
258b4897K2508K8825m2232M907L6391l1676j2157L6867j4808k5794L1096M558
$$ -24897 -2389 26436 -15796 -10889 25502 -6174 -18331 18536 3728 -22066 9030 13588
270A3588l4071J9806K2500l6198M018L5871l1857j3596M3367k1071k9222M3484
$$ 13588 -20483 -677 21823 -14375 -10357 25514 -6343 -19939 23428 2357 -26865 16619
282A6619m328m1480L7050J4447m8412K4249L1361m9179P677M3505m3368r418M9572
$$ 16619 12291 -29189 7861 22308 -26104 -1855 29506 -19673 -11996 31509 -11859 -21277 28295
295B8295l1759k3333M8493j4999l4047M0759K531l9102K7110J7497l8795J1186
$$ 28295 -3464 -26797 21696 6697 -27350 13409 15940 -23162 3948 21445 -17350 -6164
307f164K8382l2670m359L3734k0766j7205L2658n850k6082K4528R651l0858J1774
$$ -6164 22218 -10452 -14811 18923 -1843 -19048 13610 7760 -18322 6206 15857 -15001 -3227
320c227K2941k9959k925L3056k3477j6342L7643j2696k7918L6143K48l5531K8472
$$ -3227 19714 -10245 -13170 19886 -3591 -19933 17710 5014 -22904 13239 13487 -22044 6428
333F428J3335l9341J6431K5502l7245K609L5006l0968r498L9107k0898k0742L7457
$$ 6428 19763 -19578 -3147 22355 -14890 -12281 22725 -8243 -17741 21366 468 -20274 17183
346A7183r045k8338K9949L233l1267J8962J4989k9369O352K4177k3127o171K8164
$$ 17183 8138 -20200 9749 12982 -18285 677 15666 -13703 -7351 16826 -6301 -12472 15692
359A5692j3724j7391K6775k708k4923K0395Q602k7220J0482J9719k4835j834K8209
$$ 15692 1968 -15423 11352 8644 -16279 4116 12718 -14502 -4020 15699 -9136 -10970 17239
372A7239j8833j4290L2014j0695k4674L0676k42l1324K4256J1127l3074J4708
$$ 17239 -1594 -15884 16130 5435 -19239 11437 11195 -20129 4127 15254 -17820 -3112
384c112K1749l0621K845K8806k4178r616L1542j5440j9926L0102m597k6439K4434
$$ -3112 18637 -11984 -9139 19667 -4511 -14127 17415 1975 -17951 12151 7554 -18885 5549
397E549O166k7218J4814J5820k4555L051K2183j8599r169K4702r658j8817K3221
$$ 5549 11715 -15503 -689 15131 -9424 -6373 15810 -2789 -11958 12744 3086 -15731 7490
410G490J005k4128J7495J1324k5291Q488J9796k2828l196K5453j6115j4846K7315
$$ 7490 8495 -15633 1862 13186 -12105 -3617 16179 -6649 -9845 15608 -507 -15353 11962
423A1962o833k3286K5606L324k7910J9475J3369k9021J0232K0181k5395j095K5052
$$ 11962 5129 -18157 7449 10773 -17137 2338 15707 -13314 -3082 17099 -8296 -9391 15661
436A5661j8413j1356K6043q916j9102K3988J140k3690J7952R735k4560R187J6287
$$ 15661 -2752 -14108 11935 3019 -16083 7905 9045 -14645 3307 13042 -11518 -2331 13956
449A3956k0989r24K0292j4546j0170K1605n193j7540J9353L853k1804J3274J1758
$$ 13956 -7033 -7957 12335 -2211 -12381 9224 4031 -13509 5844 9697 -12107 1167 12925
462A2925k2666N222J7628j9247l476K1110j2319j1588K1652m173j8084J8966M194
$$ 12925 -9741 -4519 13109 -6138 -9614 11496 -823 -12411 9241 5068 -13016 5950 10144
475A0144k2629J3506J1570k3270O449J6725j9393j661K0158j3011r454K0731n204
$$ 10144 -12485 1021 12591 -10679 -4230 12495 -6898 -8559 11599 -1412 -10866 9865 4661
488D661j6446J7843K889k0875J2797J0003k1051O100J5666j7778j358J8652j1726
$$ 4661 -11785 6058 8947 -11928 869 10872 -10179 -4079 11587 -6191 -7549 11103 -623
501f23r127J8916m514j5955J6415L074j9729J1202J0976k0266N014J6399j7009
$$ -623 -9750 9166 4652 -11303 5112 8186 -11543 -341 10635 -9631 -4617 11782 -5227
514e227k432J9102j1390r827J8328l966j5954J5163L751j8760J0401J1292j8991
$$ -5227 -7659 11443 53 -9774 8554 4588 -11366 3797 7548 -11212 -811 10481 -8510
527h510L784J6696j5974l064J8218j0647j0246J7369l171j5412J3985M784j8149
$$ -8510 -4726 11970 -4004 -7068 11150 503 -9743 7626 4455 -10957 3028 7812 -10337
540a0337R281J1681j8383L371J6135j5360l616J7823j0649r720J6680l324j4115
$$ -10337 -1056 10625 -7758 -4387 11748 -3612 -7228 10595 -54 -9774 6906 3582 -10533
553a0533J3363M276j6480Q734J0576j6356K536J4507j3885l472J5672r209q728
$$ -10533 2830 7106 -9374 -640 9936 -6420 -3884 10623 -3262 -6734 8938 -271 -8999
566h999J4438j954j2675J1454M701j4147O335J0433j4511N08J4145j2223n333
$$ -8999 5439 3485 -9190 2264 6965 -7182 -847 9586 -4925 -4417 9728 -2495 -7828
579g828J5736p376r954J4639j272j2782J1272N281j5343O614J0609j5296J042
$$ -7828 7908 532 -9422 5217 3945 -8837 2435 7716 -7627 -1013 9596 -5700 -4658
592d658J4205j3218m046J5802q230q681J5271k872j1498J1628K614j3203P046
$$ -4658 9547 -3671 -7717 8085 -145 -8826 6445 3573 -7925 3703 6317 -6886 160
605A60P678j3568J748J1778j0985l005J3195o878p168J2596k130r878R292K976
$$ 160 7838 -5730 -3982 7796 -3189 -6194 7001 123 -7045 5551 3421 -6457 2835 5811
619E811j1633M561Q384j1568n58J2231q996n100J3987n476r376J3045n67j2394
$$ 5811 -5822 -1261 7123 -4445 -5003 7228 -1768 -6868 7119 1643 -7733 5312 4745 -7649
633g649R845M212j3499N392Q906j2487N73J2922j0942l451J4345p370p828J3096
$$ -7649 2196 6408 -7091 -1699 7207 -5280 -4707 8215 -2727 -6178 8167 797 -7031 6065
647F065k623j1188J0565J793j1455O165O490j0440J465R770q113l403J1343n327
$$ 6065 3442 -7746 2819 4612 -6843 -678 5812 -4628 -3163 6607 -1506 -4909 6434 1107
661A107p433J0290p46r803P329L895r864L231Q200q859j524J1147o888o316J2296
$$ 1107 -6326 3964 3218 -6585 744 4639 -5225 -1994 6206 -2653 -4177 6970 82 -6234 6062
676F062l934r675J1197K01j1795R074M581j1824M965Q177j0718N19J0536q576
$$ 6062 2128 -7547 3650 3851 -7944 1130 5711 -6113 -1148 7029 -3689 -3170 7366 -1210
690a210m372J1679n466p468J0838j663q948Q873J795q982N304M928q003Q04O719
$$ -1210 -5582 6097 631 -6837 4001 2338 -6610 2263 4058 -4924 380 5308 -2695 -1891 4828
705D828n743l498Q045k778o195P604P94q099N939M039q400K530O325p027k106
$$ 4828 -915 -4413 3632 854 -5341 2263 3057 -5042 897 4936 -3464 -934 5391 -1636 -3742
720c742Q558m902n618R634k063q536R807Q79j0104P783L911j1264N403O616j0407
$$ -3742 4816 -86 -5704 3930 1867 -6669 3138 4017 -6087 1696 5607 -5657 -254 6362 -4045
735d045J058Q559p874k341R873n227n565R921k095p280P537J154q253N112L258
$$ -4045 -2987 5572 -2302 -4643 5230 3 -5562 4359 2264 -5016 2521 3675 -4578 534 3792
750C792p428J973M988m782j755O435k128m770O333O22p380M425L723p700K164
$$ 3792 -3636 -1663 3325 -1457 -3212 3223 1095 -3675 2658 3280 -4100 325 4048 -3652 -1488
765a488N816o729j133Q013m829m347Q835j733p744Q251J056r884O895L831j0826
$$ -1488 4328 -2401 -3534 4479 -350 -4697 4138 2405 -5339 2912 3968 -5916 979 4810 -6016
780f016N020O320r401J988P719p373j462Q223m738m545P885j992o541O473R41
$$ -6016 -996 5324 -4077 -2089 5630 -1743 -3205 5018 280 -4265 3620 1628 -4913 1560 2501
795B501o990M864L492o682K041M578m564j327M848k039l997M481J024o200L607
$$ 2501 -4489 375 3867 -2815 -774 3804 -760 -2087 2761 722 -3275 1206 2230 -3970 -363
810c63M005o715J336O450o271j118P553n104l939P684k165o870P347J010q324
$$ -363 3642 -3073 -1737 4713 -1558 -2676 4877 -227 -4166 3518 1353 -5517 1830 2840 -5484
825e484O206L820r485M795N494q825K330O203p281n07O772n023k842O702k168
$$ -5484 722 4542 -4943 -148 5346 -3479 -1149 5054 -2227 -2734 4038 -985 -3827 2875 707
840G07m710O065O95n891L945K537n684J390M023m566r42M505j876l096M131J044
$$ 707 -4003 2062 2757 -3134 811 3348 -2336 -946 3077 -1489 -2431 2074 198 -2898 1233 2277
856B277n067K997L471n935J243N154o063r28O689n026k766P378k698m787O949
$$ 2277 -2790 207 3678 -2257 -1014 4140 -1923 -2851 3838 -1188 -3954 3424 726 -4061 2888
871B888p1o953N469K578p950L781M693q371K083N927o788K43O919m846k375O282
$$ 2888 2817 -4136 1333 3911 -4039 -258 4435 -3936 -1853 4074 -2714 -2471 4448 -398 -2773 3509
887C509k780l510M443L80n557L624K437n375J527M260m417k17M559k370k732M083
$$ 3509 729 -2781 1662 2042 -3515 109 2546 -2829 -1302 2958 -1459 -1676 2883 513 -2219 1864
903A864J33m988L114K549n608J247N447n947n73P200n163k440P397l629m141O255
$$ 1864 1997 -2991 123 2672 -2936 -1689 3758 -2189 -2762 4438 -725 -3165 4232 603 -3538 2717
919B717j076n905N541J469o835L993L840o728K089N338o200j61O019n107j715
$$ 2717 1641 -4264 1277 2746 -4089 -96 3744 -2984 -895 4443 -1757 -1918 4101 -1006 -2721
934b721N397k675l256M607l5m285L394K137m307R88M038l970j149M683k778l131
$$ -2721 2676 1 -3255 1352 1317 -2968 426 2563 -1744 -756 3282 -688 -1837 2846 68 -3063
950c063M437l03m131L543J956m692J783M311n563k80O121n242j844O592l529m241
$$ -3063 1374 1071 -3060 483 2439 -2253 -470 3841 -1722 -2002 4119 -1123 -2967 3625 96 -4145
966d145P064j778n104O006J020o307L905L042o379J673M886o051m07O139m734
$$ -4145 2919 1141 -3963 2043 3063 -3244 661 3703 -2676 -1003 3883 -2168 -2575 3564 -1170
981a170j986O201k496l490N084k58m018K556J930m448Q68L819m007j235N080k392
$$ -1170 -3156 3045 549 -2941 2143 1885 -2133 423 2353 -2095 -1227 2592 -1415 -2650 2430 38
997C8l005N266q77m268M103J396n402K256L702n562K07N551m766j618O647l534
$$ 38 -2967 2299 1422 -2846 1257 2653 -2749 -493 3209 -2353 -2146 3405 -1361 -2979 3668 134
1013A34l522O821j941m873N437M11o208M023K525n953K094M499n269k85O049m299
$$ 134 -3388 3433 1492 -3381 2056 2467 -3741 282 2807 -3146 -1052 3447 -1822 -2107 3942 -357
1029c57k155N697k248m145M749k23m490L093K390m392P75M442m007j238N357k754
$$ -357 -2512 3185 937 -3208 1541 1318 -3172 -79 2311 -2081 -1306 3136 -871 -2109 3248 494
1045D94l580N607j142n115M631J379n599L003L317n241J051M963m781j294N954
$$ 494 -3086 2521 1379 -3736 895 2274 -3325 -322 2995 -2246 -1195 3768 -1013 -2307 3647
1060C647l508l545O174j835n001N904L35n658M159K565n462J643M148n020p60
$$ 3647 139 -3406 2768 933 -4068 1836 2171 -3487 672 3237 -2225 -582 3566 -1454 -2214
1075b214N529m044k524N665j766m344N065N17m753L477K495m907R57M042m131
$$ -2214 3315 -729 -3253 2412 646 -3698 1367 1884 -2869 608 3103 -1804 -847 3195 -936
1090i36j499N071k783l354N580n71n026N009J101n686L577L056n966J208M476
$$ -936 -2435 2636 -147 -3501 2079 1508 -3518 1491 2592 -3094 483 3539 -2427 -1219 3257
1105C257m657j518N909l195l350O135j136m953N490O27n923L981K504n905J668
$$ 3257 -1400 -2918 2991 -204 -3554 2581 1445 -3508 1982 2609 -3314 667 3171 -2734 -1066
1120a066L895m343j064N558l053l184N833j073m832M890J318o178L568K642n712
$$ -1066 2829 -1514 -2578 2980 -73 -3257 2576 1503 -3329 1561 2879 -3299 269 2911 -2801
1135b801J297M447m391j178N612k794l373N878o00n447M534J558o317L264L359
$$ -2801 -1504 2943 -1448 -2626 2986 192 -3181 2697 2097 -3350 1184 2742 -3575 -311 3048
1150C048o046J526M378m018j353N567k609l537N681p68n296M469J267o196L321
$$ 3048 -2998 -1472 2906 -1112 -2465 3102 493 -3044 2637 1869 -3427 1042 2309 -3887 -566
1165e66L754n904J341M625m307r96N351k917l454N327p70n351M704J766o419L549
$$ -566 3188 -2716 -1375 3250 -1057 -2053 3298 381 -3073 2254 1484 -3867 837 2603 -3816 -267
1181b67L689n806J195N062m725j355N567l107l477N386n90n287M460K099o427
$$ -267 3422 -2384 -1189 3873 -852 -2207 3360 253 -3224 2162 1572 -3715 745 2844 -3583
1196c583L393L809o079J114N309m940j545N647k923l915N402P9n326M393K187
$$ -3583 -190 3619 -2460 -1346 3963 -977 -2522 3125 202 -3713 1689 1768 -3558 835 3022
1211C022o274K910M485o322N87N391m999j697O015l065l719N688k10n623M822
$$ 3022 -3252 -342 4143 -2179 -1592 3799 -1200 -2897 3118 53 -3666 2022 1812 -3811 1011
1226A011K288o188K728M217o338M38N237m772j323N421k684l267N228k69m925
$$ 1011 3299 -2889 -161 4056 -2282 -1844 3393 -1379 -2702 2719 35 -3232 1996 1727 -3198
1241c198M102K206n771K081M020n779N14N318m602j724N499k182l562N031K20
$$ -3198 904 3110 -2661 -580 3440 -2339 -1825 3493 -1109 -2833 2666 484 -3078 1953 2173
1256B173n327L874K550n981J871M554n852k75O041m728j946N987j965m347N754
$$ 2173 -3154 720 3270 -2711 -840 3714 -2138 -2413 3628 -1100 -3046 2941 976 -3371 2383
1271B383J38n836M256K126o171K137M611n960K49N814m676j790O171k901l492
$$ 2383 2521 -3315 941 3067 -3104 -967 3644 -2316 -2067 3747 -929 -2719 3452 551 -2941
1286b941N175l43n045L934J992n541J682M282n108r7N553l846k421N826j744m458
$$ -2941 2234 1891 -3154 780 2772 -2769 -1087 3195 -1913 -2010 3543 -303 -2724 3102 1358 -3100
1302c100M686O13n402L009L340o082J321N336n329p32O515m373k917O481k462
$$ -3100 1586 2199 -3203 -194 3146 -2936 -1615 3721 -1608 -2340 4175 -198 -3115 3366 904
1317I04m775N781J89n920M415K320n687J725M769n293l14N881m585k106N743k573
$$ 904 -3871 1910 2099 -3821 594 2914 -2773 -1048 3721 -1572 -1886 3995 -590 -2696 3047 474
1333D74l827N059N0n060L716K136m619J317M276m447j501N843l228l483N915j703
$$ 474 -3353 1706 1756 -3304 412 2548 -2071 -754 3522 -925 -2426 3417 189 -3294 2621 918
1349I18m631M947J133n783L336L753n698P18N207n035j717O426l654m020O614
$$ 918 -3713 1234 2367 -3416 -80 3673 -2025 -1307 3900 -1135 -2852 3574 -80 -4100 2514
1364B514j570n232O324K20n776M136K816n948J507M660n274j086N796l500k826
$$ 2514 944 -4288 2036 2256 -3520 616 3432 -2516 -1009 3651 -1623 -2709 3087 -413 -3239
1379c239N811j777m176N038N89m882L124K513n050Q13M089m022j785N902k774
$$ -3239 2572 795 -3381 1657 2246 -2636 488 3001 -2049 -1236 2853 -1169 -2954 2948 174
1394A74l871O101p60n134M855J163n621K770L775n824P38M871m636j887O595k694
$$ 174 -3697 2404 1644 -3490 1365 2528 -3093 -323 3452 -2372 -1634 3237 -1399 -3286 3309 615
1410F15m088O391j020n547N392R91o199L503L019n989J337M761m559j194N717
$$ 615 -3473 2918 1898 -3649 1743 2734 -3465 38 3057 -2932 -1595 3166 -1393 -2587 3130
1425C130k880l178N281p01m801M283J208n352K700K979m999P47M583l658j983
$$ 3130 250 -2928 2353 1652 -3149 1134 2342 -3010 -310 2669 -2330 -1583 3000 -658 -2641
1440b641N509j719m285N464m8o018M201K169o049K287M722n753L62N609m356k103
$$ -2641 2868 1149 -3136 2328 2280 -3738 463 2632 -3417 -1130 3592 -2161 -1799 3810 -546 -2649
1456b649N951k621m050N560o98n282M703J480n806L149L619n538J189M196m150
$$ -2649 3302 681 -3369 2191 1493 -3789 914 2394 -3412 -263 3356 -2182 -993 3203 -947
1471i47j023M932k527l471M553O0m791L562K248n147K006L806m859j18M541l334
$$ -947 -1970 2962 435 -3036 1517 1577 -3214 348 2596 -2551 -545 3261 -1598 -1716 2825 -509
1487e09k268N010j008m927M975J058n999L691L288o143K086M562n750j72N670
$$ -509 -2777 2233 1225 -3702 1273 2331 -3668 23 3311 -2832 -746 3816 -1934 -2106 3564
1502C564m232k629O051k189m164N158M17n481M188K256n525K176L863n270L42
$$ 3564 -668 -3297 2754 565 -3599 1559 1976 -3505 683 2939 -2586 -410 3453 -1817 -1475
1517a475M284l639j782N018j918l275M182O42m687K831K754m935R45M136m307
$$ -1475 2809 -830 -2612 2406 488 -2787 1395 2037 -2650 181 2935 -2000 -1055 3081 -1226
1532a226j269N414l120k841N293q42m453M084J847n732K803L824o390J105N257
$$ -1226 -2495 2919 -201 -3042 2251 1409 -3044 1040 2887 -2845 -42 3782 -2608 -1503 3754
1547C754n510j019N994l689k704N887j490m190M844J12n230L525K356n131J380
$$ 3754 -1756 -2775 3219 -470 -3174 2713 1223 -2967 1877 1989 -3241 284 2640 -2491 -1111
1562a111M107m718k08M708l006k247M468q76l499L464J026m346J869L136m578
$$ -1111 2996 -1722 -1930 2778 -228 -2475 1993 1117 -2382 1082 2108 -2238 -369 2767 -1811
1577a811Q6M579l599j850N485k188l679N117m24m909M161J784n844K130M225n835
$$ -1811 -1725 2854 -745 -2595 2890 702 -2977 2140 1716 -3193 968 2752 -3092 -962 3263 -2572
1593b572P76N365m512j373N850l359l205N362j080m521M284Q88m957K952K909
$$ -2572 -1796 3569 -943 -2316 3534 175 -3030 2332 1252 -3269 1015 1903 -3054 -102 2807
1608B807m701P03M171l715j276M804k432k838M207p22l683L090J576m066J360
$$ 2807 -1894 -1191 2980 -735 -2011 2793 361 -2477 1730 1008 -2675 415 1991 -2075 -715
1623g15L515l818o93M495k826k777N439j992l823M518N36n097L649K277n400K289
$$ -715 2800 -1018 -1711 2784 -42 -2819 2620 628 -3195 1323 1859 -3238 411 2688 -2712 -423
1639d23L502m716j51N162l965j896N211k669l021M858o96m125M003J001m281K128
$$ -423 3079 -1637 -1788 3374 -591 -2487 2724 55 -2966 1892 1196 -2929 1074 2075 -2206 -78
1655g8K883m278K45L937l452j803M749j829l157L982K77l957K813K300m205P83
$$ -78 2805 -1473 -1228 2709 -743 -2546 2203 374 -2783 1199 1476 -2481 332 2632 -1573 -790
1671g90L404l538j063M406k720k458M642o79m307M496P76m666K864K511n060J232
$$ -790 2614 -924 -1987 2419 -301 -2759 1883 1204 -3103 1393 2169 -2497 367 2878 -2182 -950
1687i50L787m277n83M376k760k303N164j641l438M437m36l753L135J304m270J575
$$ -950 2837 -1440 -2023 2353 -407 -2710 2454 813 -2625 1812 1376 -2377 758 2062 -2208 -633
1703f33K695l269m32L534k069k073L997m19l682L368R16m229K230K325m211P33
$$ -633 2062 -1207 -1639 1895 -174 -2247 1750 1331 -2351 1017 1933 -2296 -66 2259 -1952 -1219
1719a219L514l187j181M403j809k831M249l60m089L541J000m765K487K899m970
$$ -1219 2295 -892 -2073 2330 521 -2310 1939 1579 -2510 1031 2031 -2734 -247 2652 -2318
1734b318J150L750l687p04M464k585k144M135q75l799L730O92m352K535K008l701
$$ -2318 -1168 2582 -1105 -1809 2655 70 -2074 2061 1186 -2613 1117 1809 -2543 -8 2000 -1701
1750a701J013L076l199n53L270j385k586L346r6l880K979J441l973J764K718l437
$$ -1701 -688 2388 -811 -1364 1906 521 -2065 1281 1185 -2695 284 1725 -2248 -484 2234 -1203
1766a203L3L631k800j496L963j498l000L643O9m207L280J708m596K136L121m150
$$ -1203 -1170 2461 -339 -1835 2128 630 -2370 1273 1342 -2865 415 2123 -2473 -337 2784 -1366
1782a366L66L822l659r40M025k147k337L575m21l215K591J606l912J738K857l928
$$ -1366 -1000 2822 -837 -1777 2248 101 -2236 1339 918 -2297 294 1900 -2012 -274 2583 -1345
1798a345J91L424k899j203L699j624k615L525M27l679K193J951l498N64L688l860
$$ -1345 -1154 2270 -629 -1832 1867 243 -2372 1153 1580 -2099 94 2045 -1453 -889 2799 -1061
1814a061l27L570k352j836L516j197k591L193N60l504K394J891m242J383L052
$$ -1061 -1388 2182 -170 -2006 1510 313 -2278 915 1475 -2029 365 2256 -1986 -603 2449
1829B449l657l61L678k711j432L864j434k292K829K62k793J892J484l323R71K667
$$ 2449 -1208 -1569 2109 -602 -2034 1830 396 -1896 933 1195 -1598 294 1778 -1545 -574 2093
1845B093l247l91L268k151j503L296p94k313K824M86l258J829J833l635P12K952
$$ 2093 -1154 -1545 1723 -428 -1931 1365 571 -1742 1082 1568 -1690 139 1972 -1663 -951 2001
1861B001l074o48L898k206j723L113n83k467K608N54l313J971J714l439O00L331
$$ 2001 -1073 -1721 2177 -29 -1752 1361 778 -1689 919 1473 -1840 131 1845 -1594 -994 2337
1877B337l211o77L484j806j905L767j289k329K558J00k911J605K006l032L38K900
$$ 2337 -874 -1551 1933 127 -1778 1989 700 -1629 929 1029 -1882 -277 1729 -1303 -965 1935
1893A935k720n58L334j615k064L238o77k845K412P20k764J244J917k551J41K906
$$ 1935 -785 -1343 1991 376 -1688 1550 873 -1972 440 1160 -1604 -360 1557 -994 -853 2053
1909B053k250j203L372j591k100L156p84k658K116J105k885J318J853k451L34
$$ 2053 -197 -1400 1972 381 -1719 1437 653 -2005 111 1216 -1669 -351 1502 -949 -615
1924f15K566k264r93L070j568j966K750k38k934K475R89k612J194J801k415LK334
$$ -615 1951 -313 -1306 1764 196 -1770 980 742 -2192 283 1272 -1340 -146 1655 -760 -757 1577
1941A577j761j251K823j177k071L002k85k727K386Q14k835J608J725k723J3K518
$$ 1577 -184 -1435 1388 211 -1860 1142 857 -1870 516 1330 -1505 103 1828 -895 -882 1636
1957A636j698j665K908j064j900K652j64k283J835J095k628J060J884k379m46
$$ 1636 -62 -1727 1181 117 -1783 869 705 -1578 257 1352 -1276 -216 1668 -711 -1157
1972a157K595j633j495K904q00k247K785L59k890K059R95k611R40J651k332K90
$$ -1157 1438 -195 -1690 1214 414 -1833 952 1311 -1579 480 1475 -1136 -196 1455 -877 -587
1988e87K113j847j216K649n52k193K529J13k437J724J179k894R14J791j740o31
$$ -587 1526 -321 -1537 1112 560 -1633 896 1009 -1428 296 1475 -1419 -505 1286 -454 -1085
2004a085K239j417j066K345l28k098K157K19k178J263J337k702Q45J728j741n47
$$ -1085 1154 -263 -1329 1016 688 -1410 747 966 -1212 51 1388 -1314 -469 1259 -482 -1029
2020a029J940j129j035K250m81j693J584O26k483J255J223k126M55J934j947j27
$$ -1029 911 -218 -1253 997 516 -1177 407 1033 -1450 -195 1028 -1098 -643 1291 -656 -783
2036g83K272j316j166K074m30j978J732L23k286J500J194k091M47J520j265l54
$$ -783 1489 173 -993 1081 651 -1327 405 728 -1558 -58 1136 -955 -508 1012 -253 -607
2052f07J770r13j291J756K01j973J161P17j959R38J322j900N0K238j646n27J664
$$ -607 1163 250 -1041 715 916 -1057 104 821 -1138 -200 1122 -778 -728 1510 -136 -663 1001
2069A001p50j264J793j96j797J293N09j634Q70J363k073N76J792j916l19J656
$$ 1001 251 -1013 780 584 -1213 80 589 -1045 -175 1188 -885 -309 1483 -433 -752 904
2085I04q78j051J636k33j536J463M32j585Q47R10j367J80J677j503p21J625q37
$$ 904 26 -1025 611 378 -1158 305 737 -848 -1 909 -458 -278 1399 -104 -825 800 -37
2102c7j210J511L04j465O30J342j849O13J435j586l95K013j639n72J576m36j404
$$ -37 -1247 264 568 -897 -267 1075 -774 -161 1274 -312 -707 1306 -333 -905 671 235 -1169
2119a169J538J90j720J421O18j737O37J240j559j52J449j230n75J881r56p26J477
$$ -1169 369 559 -1161 260 878 -859 -222 1018 -541 -693 756 -474 -1049 832 -124 -850 627
2136F27l70j015J310K15j466M78J023j312o8J381j027o74J471k74r78J141p2r08
$$ 627 257 -758 552 767 -699 -221 802 -510 -578 803 -224 -898 573 299 -679 462 390 -518
2154e18O04O46j391Q5J483j416j35J422j108n00J751n85j045J157J44j107O71
$$ -518 86 732 -659 -574 909 -507 -642 780 -328 -828 923 338 -707 450 594 -513 158
2171A58N02j429K67J227j326R2J439r28o94J335l38q55J345m36j093R85O8r58
$$ 158 660 -769 -502 725 -601 -509 930 2 -692 643 305 -550 795 359 -734 251 319 -639
2189f39L54O96p38o7R86m26r87J652n28j178P51L55r95O11Q68j316L12J020j053
$$ -639 -285 411 -327 -394 592 166 -821 831 303 -875 -124 231 -764 -153 715 -601 -289 731 -322
2208c22j14J425p12j112J402m18j023J283n2j175Q13O67j151L82R87j235j2J302
$$ -322 -436 989 277 -835 567 149 -874 409 357 -818 -5 662 -489 -107 880 -355 -367 935
2226I35j077n53J102n88o36J096r9o03N74R3m70J43M85l60k97O27j75p67P87n3
$$ 935 -142 -695 407 -181 -817 279 180 -423 151 244 -226 -83 402 42 -255 372 197 -570 217 164
2246A64o98N27L94o16K03M46n76r8Q55m29q66J100r7j051R80Rr77Q92L64j064
$$ 164 -534 -7 387 -229 -26 420 -156 -254 601 172 -694 406 309 -742 238 247 -730 162 526 -538
2266e38O98L79j203M97O67o81l07Q83l83l76O49M6m20L89J78o55M41J12o79J26
$$ -538 160 539 -664 -167 500 -181 -488 395 12 -364 285 331 -89 300 478 -177 264 376 -303 -177
2286a77K26n3o25P92K65r43R84r9o81R3M49n84K64P66j189J00P52p21lJ010n95
$$ -177 49 -4 -629 163 428 -515 469 370 -311 -218 231 -353 -89 677 -512 -412 340 -381 -384 626 31
2307C1n92O91N31r09N25R6q93O21K60q41M35K56l70N8N29m06j75N16j98k52K36
$$ 31 -561 130 661 -248 277 373 -520 101 361 -480 -45 211 -159 -101 428 22 -153 363 165 -87 149
2328A49Q7p04K23M29k23j33J55L9j35N60k92k99J32L10m21J91J68r50M31P52p29
$$ 149 236 -468 -245 184 -39 -172 -17 22 -113 447 155 -144 -12 298 -123 68 236 -714 -283 469 -260
2349b60J74L70m35K6L59o4o74Q96l44m27O03p6o30N13L22p89O74j5m92L98J82
$$ -260 -86 284 -151 -125 234 170 -504 392 48 -379 224 148 -482 31 353 -436 238 223 -269 129 311
2370C11m75p1M39l65k04K96O0o2N7Q4q7J24q3m7L4r3MK1N4J15l03R9L12n68M56
$$ 311 -164 -235 204 -161 -365 -69 -9 -71 -14 70 -17 107 24 -23 11 -82 -78 -57 -3 112 -191 -92 220 -348 108
2395A08N76r91L25N05n88j42M46l67O1K86l45K4M26nn37N20j43l16L16r1m36K83
$$ 108 684 -307 18 523 -65 -207 239 -128 -67 219 -126 -102 324 319 -218 302 159 -157 159 68 -368 -85
2417h5L4m04O73J30l10J62Q3o8l31K53k7n14K57J44j99pL05m60N60K24k67k40
$$ -85 -51 -455 218 348 38 200 283 215 -116 137 110 -404 -147 -3 -202 -209 96 -364 196 420 153 -87
2439h7L91k4m68L42j54o4o4M11m93M0M42m96K27L13m39o5M28k26l90N04j7m36
$$ -87 304 280 -188 154 0 -64 -128 283 -210 -170 272 -224 3 316 -123 -188 240 14 -376 128 111 -325
2461c25M52n6l65N16K24p54M43K64p03J27J12k29L13Q7j16k04K22J31k38K87o4
$$ -325 127 71 -294 222 446 -308 135 399 -304 -177 -65 -294 19 106 -10 -214 8 139 -99 188 124
2482A24k33j57P12n02k12M12k81p3N19J8o55N27q1l28K55K67o09J57L22n75L39
$$ 124 -109 -266 446 -56 -268 144 -137 -210 309 327 -328 199 118 -210 45 312 -297 -140 182 -393 -54
2503e4L74n35K72K64k74k16M70l81j09J85J07n57L35K03n00M40L92p58M37L17
$$ -54 320 -215 57 321 47 -169 301 -80 -189 -4 103 -454 -119 84 -416 24 416 -342 95 412
2523D12l93r8K50j22k07O5K81n12J20N72o68K00N37n91O3N55o24K26L6j46m94
$$ 412 19 -79 171 49 -158 -93 188 -324 -204 368 -300 -100 437 -154 -91 464 -160 66 102 -44 -538
$$ [...]
8191D9
##END NTUPLES=NMR FID
##END=
