##TITLE=1H_B1a0711
 CDCl3
 8 sc, 
 7.11.2024
##JCAMPDX= 6.0         $$ Bruker NMR JCAMP-DX V2.0
##DATA TYPE= NMR FID
##DATA CLASS= NTUPLES
##ORIGIN= UXNMR, Bruker Analytische Messtechnik GmbH
##OWNER= root
$$ XWIN-NMR		Version 3.5
$$ Thu Nov  7 14:08:13 2024 Russian Standard Time (UT+4h)  she@DPX200
##.OBSERVE FREQUENCY= 200.1318
##.OBSERVE NUCLEUS= ^1H
##.DELAY= (6, 6)
##.ACQUISITION MODE= SIMULTANEOUS
##.ACQUISITION SCHEME= undefined
##.AVERAGES= 8
##.DIGITISER RES= 18
##SPECTROMETER/DATA SYSTEM= spect
##.PULSE SEQUENCE= zg30
##.SOLVENT NAME= D2O
##.SHIFT REFERENCE= (INTERNAL, D2O, 0, 15.7039)
##AUDIT TRAIL= $$ (NUMBER, WHEN, WHO, WHERE, WHAT)
$$ ##TITLE= Audit trail, XWIN-NMR		Version 3.5
$$ ##JCAMPDX= 5.01
$$ ##ORIGIN= Bruker BioSpin GmbH
$$ ##OWNER= she
$$ F:/spectra/data/she/nmr/H-F/1/audita.txt
$$ ##AUDIT TRAIL=  $$ (NUMBER, WHEN, WHO, WHERE, WHAT)
(   1,<2024-11-07 14:06:58.03 +0400>,<she>,<DPX200>,
      <created by zg, POWCHK disabled, PULCHK disabled
       configuration hash MD5:
       00 E9 B6 7A A2 85 ED C7 34 08 36 98 17 FE 4E 26
       data hash MD5: 16K
       E1 11 AE B2 A8 16 56 79 A8 DC 94 E5 7F C1 28 2A>)
$$ ##END=
$$ 
$$ hash MD5
$$ 69 6F 40 63 C8 16 DC 16 E3 96 E3 C4 4A C9 D4 AF
##$RELAX= 
##$RELAX= 
##$RELAX= 
##$RELAX= 
##$RELAX= 
##$RELAX= 
$$ Bruker specific parameters
$$ --------------------------
##$DU= <F:/spectra>
##$EXPNO= 1
##$NAME= <H-F>
##$PROCNO= 1
##$TYPE= <nmr>
##$USER= <she>
##$AMP= (0..31)
100 100 100 100 100 100 100 100 100 100 100 100 100 100 100 100 100 100 
100 100 100 100 100 100 100 100 100 100 100 100 100 100 
##$AQSEQ= 0
##$AQ_mod= 1
##$AUNM= <au_zg>
##$AUTOPOS= <>
##$BF1= 200.13
##$BF2= 200.13
##$BF3= 200.13
##$BF4= 200.13
##$BF5= 200.13
##$BF6= 200.13
##$BF7= 200.13
##$BF8= 200.13
##$BYTORDA= 1
##$CFDGTYP= 0
##$CFRGTYP= 5
##$CHEMSTR= <none>
##$CNST= (0..31)
1 1 145 1 1 1 1 1 1 1 1 1 1 1 1 1 1 1 1 1 1 1 1 1 1 1 1 1 1 1 1 1 
##$CPDPRG= <>
##$CPDPRG1= <>
##$CPDPRG2= <>
##$CPDPRG3= <>
##$CPDPRG4= <mlev>
##$CPDPRG5= <mlev>
##$CPDPRG6= <mlev>
##$CPDPRG7= <mlev>
##$CPDPRG8= <mlev>
##$CPDPRGB= <>
##$CPDPRGT= <>
##$D= (0..31)
0 1.2 0 0 0 0 0 0 0 0.06 0 0.03 0 0 0 0 0.0002 0 0 0 0 0 0 0 0 0 0 0 0 
0 0 0 
##$DATE= 1730974017
##$DBL= (0..7)
120 120 120 120 120 120 120 120 
##$DBP= (0..7)
150 150 150 150 150 150 150 150 
##$DBP07= 0
##$DBPNAM0= <>
##$DBPNAM1= <>
##$DBPNAM2= <>
##$DBPNAM3= <>
##$DBPNAM4= <>
##$DBPNAM5= <>
##$DBPNAM6= <>
##$DBPNAM7= <>
##$DBPOAL= (0..7)
0.5 0.5 0.5 0.5 0.5 0.5 0.5 0.5 
##$DBPOFFS= (0..7)
0 0 0 0 0 0 0 0 
##$DE= 6
##$DECBNUC= <off>
##$DECIM= 24
##$DECNUC= <off>
##$DECSTAT= 4
##$DIGMOD= 1
##$DIGTYP= 9
##$DL= (0..7)
0 120 120 120 120 120 120 120 
##$DP= (0..7)
150 150 150 150 150 150 150 150 
##$DP07= 0
##$DPNAME0= <>
##$DPNAME1= <>
##$DPNAME2= <>
##$DPNAME3= <>
##$DPNAME4= <>
##$DPNAME5= <>
##$DPNAME6= <>
##$DPNAME7= <>
##$DPOAL= (0..7)
0.5 0.5 0.5 0.5 0.5 0.5 0.5 0.5 
##$DPOFFS= (0..7)
0 0 0 0 0 0 0 0 
##$DQDMODE= 0
##$DR= 18
##$DS= 0
##$DSLIST= <SSSSSSSSSSSSSSS>
##$DSPFIRM= 0
$$ [...]
##$SUBNAM2= <"">
##$SUBNAM3= <"">
##$SUBNAM4= <"">
##$SUBNAM5= <"">
##$SUBNAM6= <"">
##$SUBNAM7= <"">
##$SUBNAM8= <"">
##$SUBNAM9= <"">
##$SW= 24.0689170037331
##$SWIBOX= (0..15)
0 0 2 0 0 0 0 0 0 0 0 0 0 0 0 0 
##$SW_h= 4816.95568400771
##$TD= 16384
##$TD0= 1
##$TE= 0
##$TE2= 300
##$TE3= 300
##$TEG= 300
##$TL= (0..7)
0 120 120 120 120 120 120 120 
##$TP= (0..7)
150 150 150 150 150 150 150 150 
##$TP07= 0
##$TPNAME0= <>
##$TPNAME1= <>
##$TPNAME2= <>
##$TPNAME3= <>
##$TPNAME4= <>
##$TPNAME5= <>
##$TPNAME6= <>
##$TPNAME7= <>
##$TPOAL= (0..7)
0.5 0.5 0.5 0.5 0.5 0.5 0.5 0.5 
##$TPOFFS= (0..7)
0 0 0 0 0 0 0 0 
##$TUNHIN= 0
##$TUNHOUT= 0
##$TUNXOUT= 0
##$USERA1= <user>
##$USERA2= <user>
##$USERA3= <user>
##$USERA4= <user>
##$USERA5= <user>
##$V9= 5
##$VALIST= <valist>
##$VCLIST= <CCCCCCCCCCCCCCC>
##$VD= 0
##$VDLIST= <DDDDDDDDDDDDDDD>
##$VPLIST= <PPPPPPPPPPPPPPP>
##$VTLIST= <TTTTTTTTTTTTTTT>
##$WBST= 1024
##$WBSW= 4
##$XGAIN= (0..3)
0 0 0 0 
##$XL= 0
##$YL= 0
##$YMAX_a= 371475
##$YMIN_a= -433172
##$ZGOPTNS= <>
##$ZL1= 120
##$ZL2= 120
##$ZL3= 120
##$ZL4= 120
##$ABSF1= 10
##$ABSF2= 0
##$ABSG= 5
##$ABSL= 3
##$ALPHA= 0
##$AQORDER= 0
##$ASSFAC= 0
##$ASSFACI= 0
##$ASSFACX= 0
##$ASSWID= 0
##$AUNMP= <proc_1d>
##$AZFE= 0.1
##$AZFW= 0.1
##$BCFW= 1
##$BC_mod= 2
##$BYTORDP= 1
##$COROFFS= 0
##$CY= 11.3945322036743
##$DATMOD= 1
##$DC= 2
##$DFILT= <>
##$DTYPP= 0
##$F1P= 15.6554695791079
##$F2P= 12.8336369535428
##$FCOR= 0.5
##$FTSIZE= 0
##$FT_mod= 4
##$GAMMA= 1
##$GB= 0.15
##$INTBC= 1
##$INTSCL= 1
##$ISEN= 128
##$LB= 0.24
##$LEV0= 0
##$LPBIN= 0
##$MAXI= 10000
##$MC2= 0
##$MEAN= 0
##$ME_mod= 0
##$MI= 1.114404
##$NCOEF= 0
##$NC_proc= 0
##$NLEV= 6
##$NOISF1= 3.799351
##$NOISF2= 2.8
##$NSP= 1
##$NTH_PI= 0
##$NZP= 0
##$OFFSET= 15.70392
##$PC= 1
##$PHC0= -26708.2
##$PHC1= 13.38744
##$PH_mod= 1
##$PKNL= yes
##$PPARMOD= 0
##$PSCAL= 0
##$PSIGN= 0
##$REVERSE= no
##$SF= 200.130013532006
##$SI= 16384
##$SIGF1= 3
##$SIGF2= 2
##$SINO= 400
##$SIOLD= 16384
##$SREGLST= <1H.CDCl3>
##$SSB= 0
##$STSI= 0
##$STSR= 0
##$SW_p= 3612.71676300578
##$SYMM= 0
##$S_DEV= 0
##$TDeff= 0
##$TDoff= 0
##$TI= <>
##$TILT= no
##$TM1= 0
##$TM2= 0
##$TOPLEV= 0
##$USERP1= <user>
##$USERP2= <user>
##$USERP3= <user>
##$USERP4= <user>
##$USERP5= <user>
##$WDW= 1
##$XDIM= 8192
##$YMAX_p= 0
##$YMIN_p= 0
$$ End of Bruker specific parameters
$$ ---------------------------------
##NTUPLES= NMR FID
##VAR_NAME=  TIME,          FID/REAL,        FID/IMAG
##SYMBOL=    X,             R,               I
##VAR_TYPE=  INDEPENDENT,   DEPENDENT,       DEPENDENT
##VAR_FORM=  AFFN,          ASDF,            ASDF
##VAR_DIM=   8192,          8192,            8192
##UNITS=     SECONDS,       ARBITRARY UNITS, ARBITRARY UNITS
##FACTOR=    0.0002076,     1,               1
##FIRST=     0,             0,               0
##LAST=      1.7004516,     0,               0
##MIN=       0,             -433172,         0
##MAX=       1.7004516,     371475,          0
$$ Real data points
##PAGE= N=1
##DATA TABLE= (X++(R..R)), XYDATA
$$ [...]
2146i75J42L151n117N254l675P86K406m655N424m474J645J361l847N395m132J596
2162B85J007l757N072m448K456L42l290M960m985L371m61k344M194m452L254j049
2178A55j920M359n055M016j741j545M615n478M539k791m50L484m543M548k884
2193f91l96L265m762M615k862P11J816m413N247l670Q96J844m121M759l970J913
2209A81P24l246M814m414K204N51l114N027m561K474N4k530M397m811L432j177
2225Ej866M087m469L692j175j944L761m575M362k063q12L068m595M240k311R3
2241e02K616m655M526k974O28K117l902M483l728P96J864l463M621m033J735R78
2257A107l364M269l495J934N65l354M827m125K547j06k528L936m229L310p97k002
$$ plain form
2146 -975 -833 2318 -2799 2455 -1220 -434 1972 -2683 2741 -1733 -88 1273 -2574 2821 -1311 285
2162 285 1292 -2465 2607 -1841 615 957 -2333 2627 -2358 1013 552 -1792 2402 -2050 1204 155
2178 155 -1765 2594 -2461 1555 -186 -1731 2884 -2594 1945 -846 -1296 2188 -2355 2193 -691
2193 -691 -1087 2178 -2584 2031 -831 -120 1696 -2717 2530 -1140 -244 1600 -2521 2238 -1732 181
2209 181 905 -2341 2473 -1941 263 814 -2300 2727 -1834 640 694 -1836 2561 -2250 1182 5
2225 5 -1861 2226 -2243 1449 274 -1670 2091 -2484 1878 -185 -997 2071 -2524 1716 -595 -502
2241 -502 2114 -2541 1985 -989 -361 1756 -2146 2337 -1391 -595 1269 -2194 2427 -1606 129 1107
2257 1107 -2257 2012 -1483 451 1016 -2338 2489 -1636 911 805 -1723 2213 -2016 1294 497 -1505
2273a505L733m502L264p01j465L459m439L265j211j158L158m213M069k354l6K527
2289A891m461M722k682j12K144l740L964k984J193J751l999M377l319J187J275
2304A207l357M016l240J581N73k422L733l715J690P52k492L906l930K278m22j773
2320a615L494m017L301j187q98K917m135L545j363j211L065m119L518k027j27
2335h59K966m507M005k129k04K162l367L752k710P62J548l298L822k817R10J412
2351A448l594M078l373J852M93k697L846l218J577J17k174L700l579J879O4k380
2367a961M080l787K680r59j375K827l204K688q01j270K505l428L333j567r81K721
2383A501l240L286k128K58J733l312L696k529N72J260k616L409l103R77J559k922
$$ plain form
2273 -1505 2228 -2274 990 289 -1176 2283 -2156 1109 -102 -1260 1898 -2315 1754 -600 -636 1891
2289 1891 -2570 2152 -530 -642 1502 -2238 1726 -1258 -65 1686 -2313 2064 -1255 -68 1207
2304 1207 -2150 1866 -1374 207 780 -1642 2091 -1624 66 818 -1674 2232 -1698 580 158 -1615
2320 -1615 1879 -2138 1163 -24 -922 1995 -2140 1405 42 -1169 1896 -2223 1295 -732 -859
2335 -859 2107 -2400 1605 -524 -728 1434 -1933 1819 -891 -129 1419 -1879 1943 -874 36 1448
2351 1448 -2146 1932 -1441 411 904 -1793 2053 -1165 412 529 -1645 2055 -1524 355 419 -1961
2367 -1961 2119 -1668 1012 53 -1322 1505 -1699 989 188 -1082 1423 -2005 1328 -239 -1220 1501
2383 1501 -1739 1547 -581 -323 1410 -1902 1794 -735 -163 1097 -1519 1890 -1213 -236 1323 -1599
2399a599L138k838J416N71k057L465l437J776J41k135L248l220K155l36j694K730
2415A324k685J870j80j578L032l270K402r90n28K295l467K837j310o77K840l555
2431a640K784j679j61K362l571L341k059K97J572k708K823k220Q87J022k961L678
2447A767k897J329O42k452L267k623J306L67k329K904k433J440Qj648K635k574
2463a291J737m02j350K728k694J965o10q74K127k592K345j490p81K335k670K943
2479A426j209r53J877k731K884j623o0J639k863K971k141N25J234k152K335k111
2495i52P27J149k221K808k779J455O45k483L204k511J580l17j298K206k601K162
2511G74k89j825K678k937K527o20j158K077k890K330p31o01K120l092K334r12
$$ plain form
2399 -1599 1539 -1299 117 688 -1369 2096 -1341 435 576 -1559 1689 -1531 624 288 -1406 1324
2415 1324 -1361 509 329 -1249 1783 -1487 915 -75 -603 1692 -1775 1062 -248 -925 1915 -1640
2431 -1640 1144 -535 -696 1666 -1905 1436 -623 -326 1246 -1462 1361 -859 28 1050 -1911 1767
2447 1767 -1130 199 841 -1611 1656 -967 339 706 -1623 1281 -1152 288 296 -1352 1283 -1291
2463 -1291 446 44 -1306 1422 -1272 693 83 -791 1336 -1256 1089 -401 -1182 1153 -1517 1426
2479 1426 217 -736 1141 -1590 1294 -329 -389 1250 -1613 1358 -783 -258 976 -1176 1159 -952
2495 -952 -225 924 -1297 1511 -1268 187 832 -1651 1553 -958 622 305 -993 1213 -1388 774
2511 774 485 -1340 1338 -1599 928 308 -850 1227 -1663 667 -64 -665 1455 -1637 697 -215
2527b15k05J759k676K627j950M61J258k575L240k359J87J373k571L239k299N34
2543a72J188k897L105k295J212Q26j977K455k842J909L57j940K322k519J639k24
2559A47q25K072k447J546m55q99K323k403J601o51j010J899k160K258r36m51J306
2576I15k086K035j212J96J062k205K310j389j23J427j968K380j994L94J112j814
2592i60K555k380N97Q47j909K685k117P76K05j748K792k123J121J2j298J978k298
2609a265J676kj044J938k468J783n71o08J948k713K108j215m84K029j881J637
2625H68j514K06J626k319K099j294J45J247j751J850j710M86Q99k072K163j609
2641f80P37O84j833K192j991J015L12j689K400k360J509J51j653K745k513J317
$$ plain form
2527 -215 -420 1339 -1337 1290 -660 -199 1059 -1516 1724 -635 -448 925 -1646 1593 -706 -172
2543 -172 1016 -1881 1224 -1071 141 967 -1010 1445 -1397 512 869 -1071 1251 -1268 371 147
2559 147 -678 1394 -1053 493 38 -861 1462 -941 660 9 -1001 898 -1262 996 60 -391 915
2576 915 -1171 864 -348 -152 910 -1295 1015 -374 -497 930 -1038 1342 -652 -258 854 -960
2592 -960 1595 -785 -188 659 -1250 1435 -682 94 299 -1449 1343 -780 341 353 -945 1033 -1265
2609 -1265 411 409 -635 1303 -1165 618 47 -561 1387 -1326 782 -433 -917 1112 -769 868
2625 868 -646 -440 1186 -1133 966 -328 -183 1064 -687 1163 -547 -61 838 -1234 929 -680
2641 -680 57 741 -1092 1100 -891 124 436 -1253 1147 -1213 296 447 -1206 1539 -974 343
2657C43n26o38J902k202J412n05q22K290k083J494m04p83J673k409J771p82k69
2674e38J180j625J673j041o0J365j921J585r50P9R67j527J684j481O46O05j694
2691a053J863j461O42M32j170J652j502Q98P3j276J942j834J339q5q93J448j677
2708f62J061k60p47J421j594J544j254r6J557k251K133j211q1J100j752J867q69
2725i4j91J152j750J824j493O75O69j391J552j939J145M00j149J334j404Q26K85
2742D51j121J583j741R28L89j488K090j789Q67J94j096J794k183J309j23q36J891
2759A119j965J192j22o87J100j217J043k45r50J645j867J589q27j78R66j767J998
2776H27j031j77R24j492J557r37L67M87j085J741j693M51R17j501J552j775J097
$$ plain form
2657 343 -183 -821 1081 -1121 291 -214 -1036 1254 -829 665 261 -522 1151 -1258 513 -269 -538
2674 -538 642 -983 690 -351 -411 954 -967 618 -332 -253 714 -813 871 -610 36 641 -1053
2691 -1053 810 -651 -9 423 -747 905 -597 301 374 -902 1040 -794 545 460 -433 1015 -662
2708 -662 399 139 -608 813 -781 763 -491 -587 970 -1281 852 -359 -440 660 -1092 775 -94
2725 -94 -285 867 -883 941 -552 123 792 -599 953 -986 159 559 -590 744 -660 166 451
2742 451 -670 913 -828 100 489 -999 1091 -698 169 363 -733 1061 -1122 187 64 -772 1119
2759 1119 -846 346 224 -463 637 -580 463 218 -732 913 -954 635 -192 -370 596 -1171 827
2776 827 -204 -381 543 -949 608 -329 38 525 -560 1181 -512 -61 856 -645 907 -868 229
2793B29K08j141J467j347J026j98r65J694j893J313j91p76J121j403J376l29p72
2810e81J055j306J334k77q62J306j415J428o05n84J433j655J175q56M2Q48j401
2827i21J554r59k1O26r28J375j084L71R9j173K020j337N93J29j134J111j167J041
2845A95K09j097J497j391R65m42n45J416j428J357p99k36J261j463J049o55n72
2862f79J346j361J014j29l43R08j687J617j234K33P14j202J277q81L64O97j144
2879d90J207q95K10K59j022J515j413P42K92j220J132j017P59P0p27J477j414
2896e35M69L71p25R73j239R90j63n57J037j390J717j127l76R42p28J094n77n51
2914c75R17j056J333o66j76O13j373J232o45j57J042j235R78r78J31J030j275
$$ plain form
2793 229 437 -704 763 -584 442 244 -721 973 -920 393 202 -574 547 -856 520 191 -581
2810 -581 474 -832 502 225 -637 669 -746 682 77 -507 926 -729 446 -410 -368 480 -921
2827 -921 633 -326 -347 279 -649 726 -358 13 112 -1061 959 -378 215 344 -790 321 -846 195
2845 195 404 -693 804 -587 378 -64 -609 807 -621 736 -63 -299 962 -501 548 -107 -679
2862 -679 667 -694 320 191 -152 756 -931 686 -548 -315 399 -803 474 -407 -43 654 -490
2879 -490 717 -178 32 291 -731 784 -629 113 405 -815 317 -700 59 129 -598 879 -535
2896 -535 -66 305 -420 553 -686 304 141 -416 621 -769 948 -179 -555 387 -341 753 176 -375
2914 -375 542 -514 819 153 -23 590 -783 449 -196 -353 689 -546 432 -546 -415 615 -660
2931f60J181j173N60L80p49J171j211L38M05o86Q24q20O40k95l04P95r55Q79K99
2950F19j000J038j361R07R4p27J119j258J006m90j59R89j075P54p30J20N55q56
2968d55J012p07Q0O47j083R93n32J90K83j061J167j004N29L10q50J107j069L92
2986e1M91r80J042q82L13L22o55P68q35P07J14q44J148p28N30o27j48O07o48P91
3006D35m17n16O06n44R15p14K48N57j365J065j71k17N78r54J169q63o6M90m97
3025b61R55q74K56L25r12J162p06L71L00j052P58p02N99n9n72R88j034M83J69
3044A94j99N15p38J88j90k46J008r35R35m97k71P72q65P91q66K59P84j031O59
3063B67k58o6P1m21O06m52L03N13r40R36o52K55L30n94P91p56K84j91n26J216
$$ plain form
2931 -660 521 -652 -92 288 -461 710 -501 -163 242 -444 380 -440 200 -95 -399 396 -559 320 619
2950 619 -381 657 -704 203 297 -430 689 -569 437 -53 -212 777 -298 456 -274 -154 401 -455
2968 -455 557 -150 -70 577 -506 487 -45 145 428 -633 534 -470 59 369 -481 626 -443 -51
2986 -51 440 -540 502 -380 -67 255 -400 368 -467 240 354 -490 658 -70 460 -167 -315 292 -356 435
3006 435 18 -498 108 -436 479 -235 13 570 -795 270 99 -118 460 -494 675 -188 -254 236 -261
3025 -261 694 -180 76 401 -511 651 -55 316 616 -436 322 -380 219 160 -412 576 -458 25 194
3044 194 -5 510 -228 -40 -230 -476 532 -403 532 35 -236 536 -329 462 -404 -145 639 -392 267
3063 267 9 -57 14 -407 199 -253 50 563 -377 559 -93 162 492 -102 689 -67 217 26 -500 716
3083G16r49J29K7m96J318j214R22k98o11P73q26Q52p7l74M55j102R77K38m44M38
3103D54o34M24o62J37P18o00M34l27m91R64q09Q83o07j94N32o27Q63p82L30K67
3123B73o31R05j029N30J62o89R02o37J90L04o72J055j059M34L31p75Q05n46N12
3142C65n54k19M51m99Q37n06j88N86n95N71l76l61N51o13M89P1q6K53o05L60m97
3163e65J00P07l07L55n13K51j1m26R47q15L47K52o33J119q68K02q3n76P57l85
3183a45L50J45o39L69r19Q28n5j46L24l13M5Qn5O01p29N35j59k90P85q79N04l82
3205b17m7M69l37N30m98rM81r29J181m34j02K13p98N24k60J66J93p61P24k02L27
3226B14N6o29O76o66M71L91p24Q00q35N52l05p19J099q25P95k60l10N21k67K03
$$ plain form
3083 716 -233 -104 -77 -573 745 -469 453 155 -456 317 -509 343 266 -108 347 -755 222 460 16 454
3103 454 -180 244 -418 -281 437 -163 271 -56 -547 417 -392 491 -116 -310 222 -405 458 -324 6 273
3123 273 -358 547 -482 48 210 -479 423 -214 -24 280 -392 663 -396 38 369 -406 399 -147 365
3142 365 -189 -408 43 -456 381 -125 -313 273 -322 249 -127 -488 63 -550 -61 10 -76 177 -428 -68 -565
3163 -565 -465 242 -65 290 -223 28 17 -409 538 -277 70 322 -311 808 -60 142 59 -517 240 -145
3183 -145 205 350 -289 80 -839 -11 -66 -212 112 -201 -156 -148 -203 398 -331 204 45 -245 540 -339 165 -217
3205 -217 -264 205 -132 398 -100 -109 372 -557 624 190 88 301 -497 27 -233 -67 126 -635 89 -113 214
3226 214 270 -359 317 -349 122 513 -211 589 -246 306 1 -718 381 -444 351 91 -219 302 35 238
3246B38k23l09P07p20P35n33J42r1k15L91j49K8K63o16O03l71p5K80l90P61o24
3267a68j64O83o23N22j91J52n9m12M11n57O39j11k89M91m62J98R5q7L99r08O67
3288B26p9j66L03p12P72k48j6M37p48L64O3m14L90j68M95q27J33L53l32P43q90
3309c21M8N39n85M27j17J18l6l41M53k95J79L53j289J256n44M54j79n49R87j037
3329d79P02j57j80P24n43k04K37j62M32n72L07l17L46Q4o67P25l23O3M3l50Q18
3350E27n15j13K13k79M1J88j73L85l04L61j70k37K41m01K53k6L3Qm7P8k54J83
3372hK51m96P10o68L78m8l64L24p7K25j64l37N36o90N66r0k74L45m07L84j95L8
3394f1K50n36N93k41k13L98n91M08J91k20J31k42M42m24K23j48l91Q55n05n3K34
$$ plain form
3246 238 15 -294 413 -307 428 -105 37 -54 -269 122 -27 1 264 -352 251 -120 -195 85 -305 456 -168
3267 -168 -332 351 -272 250 59 211 152 -260 151 -406 233 122 -167 324 -138 60 155 68 467 -441 226
3288 226 147 -19 284 -428 344 96 80 517 -231 133 196 -218 172 4 499 -328 -195 158 -174 569 -321
3309 -321 -273 266 -319 108 -9 109 73 -268 185 -110 69 422 -867 389 -155 299 120 -429 558 -479
3329 -479 223 66 -114 610 67 -137 100 -62 370 -202 105 -212 134 218 -449 276 -47 16 59 -291 527
3350 527 12 -101 112 -167 -126 62 -111 274 -30 331 161 -76 165 -236 17 -9 24 32 -15 63 -191 -8
3372 -8 243 -253 457 -211 167 119 -245 79 2 227 63 -274 262 -428 138 48 -226 119 -288 96 -99 -61
3394 -61 189 -347 246 5 -208 190 -401 7 198 -22 109 -133 309 -115 108 -40 -431 424 -81 -134 100
3415A00m03M93k24K82k19l34O01n82L52J75n86M59k73N2M4j80P12n88k7J55p9
3436g0M16o77P30n72J55M80m93K28k23O3K32o12Q70o47K51J04o65Q28p83M17K58
3457B90r02M85J89k20L63l33M07m22lM55q80P73l92K56k3j17L20l68L30m2j69
3478cK40l48J80l02Q2K69l75M92n28m2Q84o30J60Q5m69L77n02O36k56j9K84k88
3500g3K64n67L78J80m62K71j83J70o6m6O48r05M30k19k5K54p3J06k66Q1L33n42
3522c12M49n1l19O09m33M03k36k06L58m96K98m68L53N19o24L20j03j46N04o15
3542a96J93p1q0Q9LL32j95k62N25o20P10m49r1J87k88N07k23Rj6N3q3k53J08M2
3566f9l54O48o99N09nOL38q66L54Q4k8j05K41J18k86l25M98l49N04k45p6L67n84
$$ plain form
3415 100 -303 190 -34 248 29 -305 296 -286 66 241 -345 114 -159 -107 -63 -243 469 -119 -146 9 -70
3436 -70 346 -331 399 -173 -18 462 -31 197 -26 37 269 -343 527 -120 131 235 -430 398 -385 32 290
3457 290 -612 -127 62 -158 205 -128 279 -143 -146 309 -571 202 -190 66 43 -74 246 -122 208 166 -3
3478 -3 237 -111 69 -233 -151 118 -257 235 -293 -335 549 -81 79 164 -305 72 -430 206 -50 -69 215 -73
3500 -73 191 -376 2 182 -280 -9 -192 -22 -88 -134 514 -391 39 -180 -205 49 -24 82 -184 -103 230 -312
3522 -312 137 86 -233 376 -57 346 110 -96 262 -234 64 -404 -51 468 -156 164 61 -85 419 -196
3542 -196 -3 -74 -154 -65 -62 270 75 -187 338 -282 428 -21 -112 75 -213 294 71 80 64 117 34 -219 -111 -69
3566 -69 -423 225 -474 35 30 36 374 -492 -138 -54 -82 -187 54 172 -114 -439 59 -290 214 -31 -107 260 -324
3589c24N32k54M9L76l53M07k82J22q7j87K42k70J81P5m73N98m10J00L14m07N67
3610E16m91n9j98J73L74m49L10j44j26K14k35M13l60K0J58k40L31l22J36m0m0
3631e9J73m26n9O82m94K04j51m2L84l45J9J22L1J89o95M90j07j27L28k37L54m02
3653a68%O7LN64m92k2r7J82J1l45M12o1j17K45l68P1K83m48L65j41K06m1l54M55
3677B10m31K56Ok16m7L40J77k96o5N1l73L44K5O6o6q6J36J00j89O07q44K30M1
3700b4j67J5j46N92n40L63J24j99M81j054M41l3J46J57m84K35o1j02J29O1J84
3721A18k18j43M80n95L88l70J45L38k86J85r1J34P5j14K9j70j0K07pj07q9K37
3743A36k3l72N1M04m70R6M1J53Pn2j40k00P93j7j01lm74K31j44K7L08k56j32m
$$ plain form
3589 -324 208 -46 3 379 26 433 151 273 186 -1 241 -29 152 227 -246 352 -58 42 356 -51 516
3610 516 25 -34 -232 -59 315 -134 176 32 -94 120 -115 298 -62 -42 116 -124 207 -115 21 -19 -59
3631 -59 114 -312 -371 311 -183 21 -130 -172 212 -133 -114 8 39 228 -467 23 -84 -211 117 -120 234 -168
3653 -168 -168 -101 -98 466 -26 -48 -145 37 48 -297 115 54 -63 182 -186 -115 168 -280 85 -56 150 109 -245 210
3677 210 -221 35 41 -175 -222 118 295 -1 -66 -15 -388 -44 -19 47 -19 -105 31 131 -58 549 -295 -65 -24
3700 -24 -191 -176 -322 270 -270 93 217 18 499 -555 -114 -147 -1 156 -328 -93 -154 -256 -127 -66 118
3721 118 -100 -243 237 -358 30 -340 -195 143 -143 42 -49 85 160 46 75 -95 -105 102 95 -12 -101 136
3743 136 113 -259 -208 196 -274 -178 -137 16 23 -29 -169 -369 424 407 306 303 -171 60 -84 -57 251 -5 -137 -141
3767a41N7k7P3N22n82L24j87j86L31l34L20k81J14K77l82m6M40l02J10p7j91j41
3789c09J1M94k24jj02J38l40P0N0J13J4J20k0J95l95M62l55J38P1j00J74j87k2
3812el7o4j04K69k37K24k67M93l47j34L26k39K2K18K57l07n65L74N9k4N2q0J14
3835bj21l7K88k03L60m25K99k1L0j71k69K59N7K39m02k4J25Q3j7J39k01k93L27
3858B0N2J13j8m6j65j16L10n4N7k44k88N77k10p2P2J26P8m36L75J44k78J0k37
3881b30L13j64J8n5J7N9K43l99L62k39M02o08j0L42k56M05k32M1Ol72L61l62M47
3904H9J92m27L51k59j52K82j40R3k55K98K16m11L12m43L99K19n65L98l03m2j82
3925c30M52j50j8K07o4k16L40l42Q3m3k68M00j95K28o9J40m1k90J07j13K56k8
$$ plain form
3767 -141 -84 -111 -38 484 -98 226 39 -147 184 -150 170 -111 3 280 -102 -148 292 -10 100 23 -168 -309
3789 -309 -298 196 -28 -29 -131 7 -333 -263 -213 -100 -86 34 14 209 -186 276 -79 59 130 30 204 17 -5
3812 -5 -42 -106 -210 59 -178 46 -221 272 -75 -209 117 -122 -100 118 375 68 -497 -123 -64 -88 -36 -116 -2
3835 -2 -123 -160 128 -75 285 -140 159 138 168 -3 -272 -13 44 283 -119 -143 -18 65 48 187 -14 -307 20
3858 20 72 185 167 121 -44 -160 150 96 153 -91 -379 198 -12 -84 -12 114 192 -244 131 275 -3 7 -230
3881 -230 83 -81 -63 -118 -101 -42 201 -198 164 -75 327 -281 -291 51 -205 200 -32 9 15 -357 4 -358 89
3904 89 281 -146 205 -54 -206 76 -64 29 -226 72 288 -123 189 -254 145 364 -201 197 -106 -148 -330
3925 -330 122 -28 -46 161 97 -119 221 -121 -38 -81 -349 51 -144 84 15 155 114 -176 -69 -182 74 46
3947D6M1L76o29Q1L84n07K99j43J29l58K20J94O5j75k17R5M13l78j61M76n01N72
3969C22l12j42J56k76N31k98J7L9j07J67R1k78j69J78J67j9m7m7k6K90m37K72
3991G2k31J54K16o40N28l48M42k11N5r2j20K60j10j03L20q5mn9j65K09j77j97
4013b86J67kL85l61K70j88K61k58L4L06k79k94J08mOp6J10J73j19K79l65M45k82
4036C0k19M68j82O0K6pj90l10K58J04j44N68l80LK03l70J97l41K73J91m76L37
4058I9Q4r5J4j24J68o20K55r8M45j59L3j68JM22k74o8L01k86J36p4Q2j47Q4j25
4082a14j7R2%j6K77l12J87k47K19r6N8J1j51k9L04j56q4j92l0J67J64k64M17j58
4106C0j31L76l38j73M36j5k12k81O04m79M52k64l63K88k2o6L31k44k15J79K11
$$ plain form
3947 46 87 463 -166 -85 299 -208 91 -52 77 -281 -61 133 198 23 -194 -99 314 -64 -225 251 -250 322
3969 322 10 -132 24 -252 279 -19 -2 37 -70 97 188 -90 -259 -81 86 67 20 -27 -53 237 -200 72
3991 72 -159 -5 211 -429 99 -249 193 -18 37 -55 -175 85 -25 -128 192 107 103 44 -121 88 -89 -286
4013 -286 -119 -121 264 -97 173 -15 246 -12 22 328 49 -245 -137 -141 -135 -211 -101 72 -47 232 -133 312 30
4036 30 -189 279 97 157 183 176 -14 -324 -66 38 -106 462 82 85 288 -82 115 -226 47 238 -238 99
4058 99 183 88 102 -22 146 -474 -219 -317 128 -31 2 -166 -165 257 -17 -85 216 -70 66 -8 74 -73 11 -114
4082 -114 -131 -39 -39 -55 222 -90 97 -150 69 -27 31 42 -109 -138 166 10 -74 -266 -296 -129 35 -229 188 30
4106 30 -101 275 -63 -236 200 185 -27 -308 296 -183 269 5 -358 -70 -92 -158 173 -71 -286 -107 104
4127A04k28lL23k56K18m19K95ll56L84Kk49M9K02J31m27K98K70l46J58n25Q6L40
4150D8k24J88NJ06J58n11L41l03L99o9l09K51n07M51Jj85K39K9Rk13l0m7j54O19
4174B92m18M61k9n73M30k4K1k19R9M7J48m13J59J2M05l90k94K14o10P29k1k17
4196a91K59j64Q6J57L3k5j74K36j41r2J88j45r7J75j26K13m44K73J33l89L43j62
4218e4K13k35P5J13j15j46R1P3l30J02J59q1J13j69P1J78kj38J20J12mn17N65
4241A94o18M97m4J13l6j88J83K31p1j69K01j88K02j33j05ql6J29Nk52k57L20N7
4264B7j00l23K27K15R2k14J14J26j70L4l55L97n6k7j43J01j1o6J50j41J98k51
4286a76k7L32j47k62L84k25M5Q1K27J53n04K31K4p4lJM9l17K87p8k81K34k28J71
$$ plain form
4127 104 -124 -127 196 -60 158 -261 34 31 -325 59 61 -188 -139 63 194 -233 65 335 -11 147 -378 -292 48
4150 48 -176 12 17 123 281 -230 111 -192 207 138 -171 80 -427 24 25 -160 79 108 117 -96 -126 -173 -327 292
4174 292 -126 335 306 -267 163 139 160 -59 40 87 235 -178 -19 -7 398 8 -286 -72 -682 47 26 -191
4196 -191 68 -96 -10 147 180 155 -19 217 76 -16 172 27 -70 105 -21 192 -252 21 154 -235 108 -54
4218 -54 159 -76 -1 112 -3 -149 -58 15 -315 -213 -54 -135 -22 -191 -120 58 56 -82 38 150 146 -371 194
4241 194 -424 73 29 142 106 -82 101 332 261 92 293 105 307 174 69 61 25 154 159 -93 -350 -30 27
4264 27 -73 -396 -169 46 138 -76 38 164 -6 28 -327 70 14 -13 -156 -55 -66 -132 18 -123 75 -176
4286 -176 -203 129 -18 -280 104 -121 -76 5 232 385 -119 112 136 62 59 60 109 -208 79 1 -280 -46 -274 -103
4310a03J52k57K25q6k73J54J01P7l57L58O2J91J06l65j1L2nj5j8J41j37k9L44
4333B87m35K26o0p0J68q5J83k12j04j03J59n0n0L20K07m24L3L7L28j96m9j39R
4356b0M4J68j27J54j69j3j01K57m3J48l38k1N4n5l5K21m6m46L22N5j31M40l20
4379bk9q3J13R2m4O0p3N0j95K2P2r8K29p4l22j91O19l23L26k5J2l94J88j0M3K20
4405A83n31K03M9q8P1J48k35J57R5j0q9J30j44O8O4j50O8M5k08L27k11p7K56k97
4429a76J01j5M7MjL8K40l09P1k93L19p9K9J05J4P4K38p34N29k77M80l47r0P2k16
4454a76L75l72K29J4m2l8j94l6K19J80j02O4j81k78L89j16j87J35J83p2j70L59
4476A83k70L5J67k50j26J94j38J88m8P5J24o15O47j32l1P3p7K48k75j16K8P1J59
$$ plain form
4310 -103 49 -208 17 -69 -342 -188 -87 -10 -367 -9 53 244 350 -15 -26 6 1 -14 -32 109 -28 -57 287
4333 287 -148 78 18 -52 116 31 214 2 -102 -205 -46 -96 -146 174 381 -43 -10 27 355 159 110 -29 -20
4356 -20 24 192 65 219 50 37 -64 193 150 298 -40 -61 -7 -62 -97 124 78 -368 -46 9 -122 318 -2
4379 -2 -31 -114 -1 91 47 107 34 84 -111 -89 -17 -115 114 40 -282 -473 146 -177 149 124 136 -258 -70 -80 -37 183
4405 183 -348 -145 -96 -184 -113 35 -200 -43 52 42 -47 83 -61 7 71 -79 -11 34 -174 153 -58 -135 121 -176
4429 -176 -75 -90 -43 -39 -40 -2 238 -71 0 -293 26 -53 -24 81 95 169 407 -327 202 -75 405 58 -32 40 -176
4454 -176 199 -173 56 70 28 -10 -204 -240 -21 159 57 121 -60 -338 51 -65 -252 -117 66 -6 -176 183
4476 183 -87 -52 115 -135 -261 -67 -205 -17 -65 10 134 -481 166 34 3 76 -1 247 -28 -144 -116 -45 114
4499A14l17L10J58l37K08j10J50p2M4j86J13K28k73j44p7L86o7Mj12j23p1N92
4521D18k90j51R1l7L1n3j30J55l23L16R1o5j04k1L60Q9k06l46K14J37j51J54l39
4544a60L78k90L52l01j41l2LJ24Nj8J53L30m81J23k43K03m2R5K74n19j58M93O5
4567B13K3k52K82l71j01M80k43J3N3j10L9m2j1J67j60J84j48M2Qk65K82K3j53
4590d7Q1J32n3O5j88K8RJ94k74J02K20n75r1O93m7j29j50j1j19N27m63L35m40
4613b01J48L54l22J77k04j58L69o2N4k20K41j21j69M02K0j57m49J50N07k42k58
4634a41NR2Rj25J02K86l06k56N37k47J21q0j37L2j70J80J42J71j55N5p7p0NL0
4658CM2J19j62K9m6m2j24j09L19L2r4J13l44M65l96N18n14K84m1J02j31K12k93
$$ plain form
4499 114 -203 107 265 -72 136 26 176 104 148 -38 75 303 30 -114 -191 195 128 132 20 -103 -174 418
4521 418 128 -23 68 31 62 9 -121 34 -289 27 118 53 -51 -72 288 377 171 -175 39 176 25 179 -160
4544 -160 218 -72 280 -21 -162 -194 -191 -67 -62 -80 73 403 -78 45 -198 5 -37 58 332 -187 -345 148 213
4567 213 236 -16 266 -105 -206 274 31 44 97 -13 26 -16 -27 140 -20 164 16 58 66 -199 83 106 -47
4590 -47 34 166 113 178 -10 18 27 221 -53 49 269 -306 -397 296 249 120 -30 -41 -160 367 -96 239 -201
4613 -201 -53 301 -21 156 -48 -206 163 101 155 -65 176 55 -114 288 308 151 -298 -148 359 117 -141
4634 -141 -136 -44 -35 -160 -58 228 -78 -334 203 -44 77 -3 -140 -108 -278 -98 44 215 60 115 38 -32 -27 3
4658 3 45 164 2 31 -15 -57 -181 -290 29 61 -33 80 -264 201 -195 323 -191 93 52 154 23 235 -58
4681e8q9K80m27J85O7n6O1K31m14O1L86L0l64M42m78L65j01J28l31K1M09n09M93
4704C32l25J70K19l81j4k68K55n5j57L29j48n0L84l74r6L62K7l9k83M93m29N6
4726HJ09n4k03K08J73j39Qp8j55P0j05k1L95k57J13k25K17K70j81r9L8l3j08p6
4750a25J90N1k26J02K44l22k7K01k43n8R3N7l1L0M8k5J55j76J53k95L32j90N8
4773dK2j44L49m90K08k40J84P3L0J38j08Q1J59n79L88jj60K45j9lk9n0K44k99
4797e%R7J2j05p9N5Q7j57j13K48J0J37l02j38J89L68k32q9J21J08O5l47K07j1
4821A26k8j66K60l32L10m23L48m6NQ5q8J5k94O8K19j25jJ23r5n0o9n1O09n33K7
4846a06k7K09l55J70%R8J16m52N03o2m11L31n0K45k64j96L92k32N1K07j23l75
$$ plain form
4681 -58 -147 133 -294 -109 -42 -98 -37 194 -220 -159 227 257 -107 335 -143 222 121 249 -82 -61 348 -161 332
4704 332 7 177 396 15 1 -267 -12 -67 -224 105 -43 -93 291 -83 -179 183 210 171 -112 381 -48 8
4726 8 117 63 -140 68 241 102 110 32 -123 -53 -158 -179 216 -41 72 -153 64 334 153 54 92 59 -49 -125
4750 -125 65 116 -110 -8 236 -86 -113 88 -155 -213 -120 -63 -94 -64 -16 -41 114 -62 91 -204 128 -62 -4
4773 -4 18 -126 223 -267 -59 -299 -115 -42 -12 126 18 99 258 -321 67 66 -94 151 132 129 100 50 294 -5
4797 -5 -5 92 104 -1 -80 -25 62 -95 -208 40 50 187 -115 -253 -64 304 72 -17 104 212 277 -70 137 126
4821 126 98 -68 192 -140 170 -253 95 49 54 139 51 66 -228 -160 59 -66 -67 56 -39 -89 -158 -209 400 -133 -106
4846 -106 -133 76 -279 -109 -109 -11 105 -347 156 94 -317 14 -36 209 -55 -251 141 -91 -40 167 44 -331
4868c31K51K59l20j31M52m7J47j13k04o1J67J81m02n5M0J03n4j15J72L72k68J29
4890A72n47L57j03K82j70k00M63j18po1k13J36K18j89j65j94J16J45Q6LN9j44
4912g4N5Nk77Q8OJ8L01m26J78K12K75n85j34M73J60k45j55Q7K5%K1p9K96r2j43
4937a0k27L68j72J18j97J30N8j44J7J2q5m5m4j2l9J35J71k52J63P4k01J61o5P5
4961a1j4k0M39l63n0J11n8j2L7M2m12K60R4j58JK45j46m0p2J64j05m7J2M09j18
4986A88R7j27n5l90L37R0m52M41j74M18l84j15P5j57J41j34L09J41l22k52J46
5007a79N4Q8j63J94J3o9R6K07l52M9k47K81j82J44J01j25k21J42J72J71k32k5
5029h3Q1o6p%L4k06M12m72M71l60M5K91l9l5m46M44k4j66K44J6p9O3j16o5Q6J
$$ plain form
4868 -331 -80 179 -141 -272 180 133 280 167 -37 -98 69 250 -152 -207 -167 -64 -118 -233 -61 311 43 172
4890 172 -375 -18 -121 161 -9 -209 254 136 129 68 -145 -9 209 20 -145 -339 -223 -78 8 11 70 -74
4912 -74 -19 -14 -291 -203 -197 -179 122 -304 -126 86 361 -224 -358 115 275 30 -125 -38 -13 -13 8 -71 225 133 -10
4937 -10 -237 131 -41 77 -120 10 68 -76 -59 -47 -132 -177 -221 -233 -272 -137 34 -218 -55 19 -182 -21 -86 -11
4961 -11 -25 -45 394 31 -19 92 34 22 59 101 -311 -51 43 -115 -114 131 -15 -55 -127 37 -68 -115 -103 306 188
4986 188 285 158 103 -287 50 140 -312 129 -45 373 -11 -126 -51 -208 -67 -201 108 249 -73 -325 -179
5007 -179 -125 -37 -200 -6 7 -62 34 241 -111 -62 -309 -28 -210 -66 35 -90 -311 -169 3 174 -58 -83
5029 -83 -2 -68 -75 -75 -41 -247 165 -307 164 -196 -151 140 101 66 -380 64 40 -126 118 134 55 118 2 -63 23 24
5055B4K3k52RL42k45J52k5k14J28j68K8K01p8J50r6O4N2K90k75l07k2l4K14J24
5079H5r4p9O7J40O1O3k51N2J95j81P6Q3K63p63L81K70m44J25j4R2l7JMj09j53
5104a67K21k80J92L23k31q5M9j79L0O6K8J36q4P1k62O5m5J45K79k82k1l6J04J65
5128B02l79L64j74K14k26j15K01j27p3J27K72j31k86K20j9j12l4K4J27o0j21j73
5150b79M62l25L13k01j59K04J03r8L2J65k17K67j02k14Q6N5j45K01q0K02l99K16
5172H7n5j10K49j34N1j81K90o3p8k08p8M93j24j65j32Pn8K60j7l21K99J18k45
5195a15R9O1K82q8j88k43J67O0k53L78R5m06K61k81q2K22P6k27L35k67J10q5K38
5218A49k34QR8j01j2K8j52J51J92n04M34l07K80K07j15R4o4N2j27j66J86jj6j
$$ plain form
5055 24 47 -205 -196 146 -99 53 28 -186 -58 -226 -198 3 -75 75 -21 43 95 385 110 -197 -219 -253 -39 85
5079 85 -9 -88 -21 119 180 243 -8 44 239 58 134 217 480 -283 98 368 -76 49 35 127 90 91 95 -14 -167
5104 -167 54 -226 -34 289 58 -27 22 -157 -127 -61 -33 103 19 90 -172 -107 -152 -7 272 -10 -31 -67 37 202
5128 202 -177 187 13 227 1 -114 87 -40 -113 14 286 155 -131 89 70 -42 -76 -52 75 15 -106 -279
5150 -279 183 -142 171 -30 -189 15 118 20 52 217 0 267 165 -49 37 92 -53 148 68 270 -129 87
5172 87 32 -78 171 37 88 -93 197 134 56 -152 -230 263 139 -26 -158 -151 -209 51 34 -287 12 130 -115
5195 -115 -16 45 327 239 51 -192 -25 35 -218 160 255 -151 110 -171 -253 -31 45 -182 153 -114 -4 -89 149
5218 149 -85 -77 21 -80 -92 -64 -216 -65 127 -377 57 -250 30 237 122 216 152 204 77 -89 97 96 80 79
5242G9k82O56o17J82K39l05L41k97L69O3l87r1N5J67m7q7j92K56j58R3J94j6k38
5265b3N8k80Q6L30j84J76k07j8Jp4Q9P7p1k94M74J55l00L99m14j01K27m37M17
5288H6j21j72K07p8R4q5J36m2J88l39P3J35l4k62N13n27K43k88L93k22J79J13
5310A90L4l24j23J71Q9P2m04K98J05j16j1j1k0J40L5k32K15m5m9j53K68k18J8
5333g1Q7j34M52m38J18J7j32L85l35K5j86K34k89J11M72k63K6k35J01J8J26K79
5355C68k25j35K02j61N4l1l24L86j32PK94l35L3M26m51p7L03j44J38l10J44N6
5377H6j83L97k8j99K8j15j00Ql7L07J8l16Q1k58O93k87k41J35k81M12q2M45l43
5400A40l33J14l5K63k47n1J43p9oL7L76n14J03K9J42K39m82L92N4j71k36N6L10
$$ plain form
5242 79 -203 453 -164 18 257 -48 293 -4 365 428 41 -50 5 172 125 38 -154 102 -56 37 231 215 -23
5265 -23 35 -245 -159 171 -13 163 -44 -62 -61 -135 -46 31 -40 -334 140 295 -5 394 -20 -121 106 -331 86
5288 86 -35 -207 0 -78 16 -69 67 25 213 -126 -53 82 48 -214 299 -228 15 -273 120 -102 77 190
5310 190 224 -100 -223 -52 37 109 -295 3 108 -8 -19 -30 -50 90 125 -107 108 63 14 -139 129 -89 -71
5333 -71 16 -118 334 -104 14 31 -101 284 -51 -26 -212 22 -267 -156 316 53 79 -156 -55 -37 89 368
5355 368 143 8 210 49 103 72 -252 134 2 9 303 -32 1 427 -24 -101 202 58 196 -114 30 86
5377 86 -97 300 272 73 101 -14 -114 -106 -143 164 182 -134 -53 -311 382 95 -146 -11 -292 120 38 483 140
5400 140 -193 -79 -114 149 -98 -149 -6 -85 -91 -54 322 -192 -89 -60 82 321 -161 231 285 114 -122 -66 244
5423B44l07j7k55K41j58J47o9M71j12k05M3k19K2L15J99j94m09O43n00J00r0J99
5445H9p2j76R6j5k3L85Nj74l91K09l8K92m76J78L83k61j3j5K67l47K01om14M92
5469A76j53j61J80k44M68m27M79j79o0j82J97j35L21m34K17j29P1l36N55j71q9
5490c6K48n46J97M77l82J80p7p6j23L94j93j65n0J59k2o7o5J63k3k53J19R1o2
5513a12j49L73l01K73J0l61M89m68K17K2L09m92K5K66n4j80j91J10J94J69n9J48
5535B38l40m8K58j30K7J85l38K34L35j02m19o5P2L45k77m23P35j25l51K13l5K75
5557B64k64k10K09m0P1l03L61L2k66J14J31j40J29P1k14k54L31m2L0k5J15m82
5579c82L67j1p4J28p4m9kl2J28q9Q1J14n9J52k38K45k49K10k26L5k8L19k80J87
$$ plain form
5423 244 -63 -80 -335 -94 -252 -105 -174 297 185 -20 23 -196 -174 141 340 146 -263 380 -120 -20 -110 89
5445 89 17 -159 -63 -78 -101 284 289 115 -276 -67 -105 187 -289 -111 272 11 -2 -17 250 -97 104 98 -316 176
5469 176 23 -138 42 -202 266 -161 318 139 79 -103 94 -41 280 -154 63 -66 5 -331 224 53 -36
5490 -36 212 -334 -137 340 -42 138 61 -15 -138 256 63 -102 -152 7 -15 -82 -147 16 -7 -260 -141 -50 -112
5513 -112 -261 112 -189 84 94 -267 222 -246 -29 -7 302 -190 -165 101 47 -133 -324 -214 -20 149 90 238
5535 238 -102 -150 108 -22 5 190 -148 86 421 319 -100 -165 -93 252 -25 -448 287 162 -189 24 -11 264
5557 264 0 -210 -1 -41 30 -273 88 120 -146 -32 99 -41 88 159 -55 -309 22 -20 10 -15 100 -382
5579 -382 -15 -26 -100 28 -46 -95 -97 -129 -1 -90 -9 105 46 198 -40 205 -44 166 -60 -25 -53 266 -14 173
5603A73l10K74k07J0j92M07l10K88k19m7qJ81J37j92mo4L5lO4J31p2m4j74K39
5627I3j53J07L12m19k31O22l73l9L11l10J29no5rJ97j37Q5Q2J02k75l16M97k32
5650b7n1K00K5j96J54l17K46K44r5%p6J97m73K32r1J48j32j08N6J73J30j44j83
5673h8K22L1n1O1l61L65q2j59J19P4Q7m16NL52j54J07k26k25L65j80M55k80p2
5696e1J10n8J1j55K33n4J45k87P1om8J79q0n2R3K76j80K6j15J7J64p1k28KN7j56
5722a57L30k06k4J27K15k04K67k43L7k21kk60M10L80p54K81k83M14k1k0k86K21
5744AK92k52j06K91p8n05K09RM26k54k20K39j35j77K17K48j04j74J2O4J08j29
5766a8K6J3J0L3n1J36J5k20J27j84J80p6r3Q6k02j05K41j23L67k61J3L70l64o7
$$ plain form
5603 173 -137 137 -70 -60 -252 155 -155 133 -86 -133 -141 40 177 -15 -19 -83 -48 -51 13 144 72 28 -146 93
5627 93 -60 47 359 -60 -291 331 -42 -81 230 -80 49 44 -21 -30 167 30 115 197 299 24 -292 205 -27
5650 -27 -78 122 147 -49 105 -212 34 278 183 183 107 304 -169 63 -28 120 -12 -120 -64 109 239 95 -88
5673 -88 134 165 114 175 -186 179 97 -62 57 131 218 -198 -193 159 5 112 -114 -339 26 -154 301 21 -51
5696 -51 59 1 12 -143 90 36 181 -106 -35 -41 -89 90 10 -42 51 327 147 173 58 75 239 168 -60 -58 -1 -157
5722 -157 173 -33 -57 70 285 81 348 105 142 -79 -81 -341 69 449 -305 -24 -307 107 86 66 -220 1
5744 1 293 41 -65 226 148 -357 -148 -139 287 33 -187 52 -83 -260 -43 205 101 -73 -61 3 111 -18
5766 -18 8 21 31 64 13 149 164 -56 71 -113 67 -9 -102 -16 -218 -323 -82 -205 162 -99 -86 284 -80 -147
5790a47J56n1P9K02jj20l64M33k57l22L97j80L22l08L54k37j25K25m63N49j32
5811A0L2j5L10l36q2L87l71M80m68k4Q9Q9q5K37j84k9o5K25O3j5l17j55J83Q7
5835D6j5M8j29L3k25J24M43j42k81J58L2k89Q8J66L12p21L76m4k47L14k6p1P9
5858B9L9j71J13m6O0j22J96Op8O6K12j26Kk07Q2p2j01m6j41L02m5L20l94K24j88
5883h6j7j73J83k2L58n2k27L9J6K62m98R7P3R1k29j3J36k62LK89J36j93O1O8o2
5908b2j3q7n0j55K95k95L94K9r8N6J48k33k94N48r5j59k05L25j19K65M8l53j21
5931a91J8J47J20J14k26NK7Q8j9j5j11J67k34J29L37k67P9j04l20p7K03J16k05
5954b19L45O3l17J13K9J37j37k17M61j09P7j52J0k60L38l64j21L05R5n6m5K49
$$ plain form
5790 -147 9 -42 37 239 238 118 -246 187 -70 -392 5 -175 147 -161 193 -44 -169 56 -407 142 10
5811 10 42 27 337 1 -81 306 -65 415 -53 -77 12 101 16 253 69 40 -25 200 263 248 -69 -224 -41 46
5835 46 31 79 -50 -17 -242 -118 325 183 -98 60 92 -197 -109 57 369 -352 24 -20 -267 47 21 -50 29
5858 29 68 -103 10 -36 24 -98 98 104 26 92 304 178 180 -27 55 -17 -118 -164 -305 -3 -48 272 -122 102 -86
5883 -86 -103 -276 -93 -115 243 191 -36 3 19 281 -217 -120 -47 44 -185 -198 -62 -324 -321 -32 104 -89 -28 40 -22
5908 -22 -35 -122 -172 -327 -32 -327 67 96 -2 54 202 -31 -325 223 128 -31 -236 89 -30 235 283 -70 -191
5931 -191 -173 -26 94 208 -18 -13 14 102 83 68 -43 124 -110 19 356 89 168 64 -256 -333 -130 -14 -219
5954 -219 126 189 -128 -15 14 151 14 -203 258 149 226 74 84 -176 162 -202 -323 -18 77 21 -24 225
5976B25k2l87j13M62o4q9j55K04L9l03Q5K88k54J21p6L20k98Jp1j27K62j38K45
5999A55k52K83j37m4J39j88K52j13k67o4L61p9O5nj48J0l60L62k87M34l0o0k85
6022b58K69j69K34J14k07J15l28pK52L0J11k62J29j65n8K93j81K6J38j19Q6k3
6044B0q9l1p0L90j95P5j67L32j99l61L82n7L45k77pj39j27J08K08p5r5j91j86
6067d06M51k56Q7J24j69n0J20p7M8J00l2L82l22K3m0K06l9k43k15L25k7l30L35
6090ek78N23k87K15q4k62L05k49O7M4K50m16l7K41oQ0j53j89L88L76n77K3o3M09
6114C15n50P9J03k21M90k38j94J33O7M1J82m06N55m66P7p3n1K7K15m40M10m2n1
6137c8l3K22l11Q5PJ24L28m57L01l47J89M7m4p1L27k11k73J98J48j09m43P31n36
$$ plain form
5976 225 203 -184 -297 165 101 12 -143 61 100 -203 -118 170 -84 37 -39 281 -17 -16 -87 -214 48 -90 155
5999 155 -97 186 49 5 144 -44 208 95 -172 -236 125 46 111 106 -42 -32 -392 -30 -317 117 87 27 -258
6022 -258 11 -158 76 190 -17 98 -230 -237 15 45 156 -106 23 -142 -200 93 -88 -62 76 -43 43 20
6044 20 -69 -100 -170 220 25 100 -67 265 66 -295 87 30 375 98 91 -48 -175 -67 141 66 -29 -220 -406
6067 -406 45 -211 -124 0 -169 -219 -99 -176 -128 -28 -60 322 0 23 -17 189 150 -93 -308 17 -10 -340 -5
6090 -5 -283 240 -47 168 84 -178 127 -122 -55 -11 239 -177 -214 27 21 101 -52 -241 147 523 -54 -31 -94 315
6114 315 -235 -156 -53 -274 216 -22 -216 -83 -16 25 207 -199 356 -110 -33 -106 -157 -130 85 -355 55 13 -38
6137 -38 -71 151 -160 -75 -68 56 384 -73 228 -119 70 117 73 2 329 118 -155 43 191 82 -361 370 -166
6160a66K9j89N86l74o6J65L17k25l4k95J24M3j48J39J9J14K9o8Ll37M55K4k37
6183i2J77K12m50J90j49M2R1j22j4M25l08R2k43M83k53r0J39J11l06J97k12O6
6205a4k19J27J54L8j19J74j59K61l1m54Q1J65J15j54L3j56R8j15L32l37K05l07
6227b82K33K66j99r8K1Kr7O33m76J55m82M49p5j37P3j01K22j38K83j71M2k95K72
6250A00J15j3j37j63Q7j36K73N8j35j1J2l26L25J74n09N66pj99J40l91K81J10
6272B14l34K51Kk85J48k40M83n10K86n1K38j91J47k36J43R6j69l4j31J94m2l0
6294e1k03J28mK12J53n40N00k62J79M9p3J88l82j20L41k9M6n05L06O5k6K47j21
6317I8j2j37k30K26j36L09j45l9o0M6J04m12O30j49l70R9M06k15K9k12o9o7K40
$$ plain form
6160 -166 -137 -326 260 -114 -180 -15 302 77 43 -252 -128 -85 -233 -94 -75 39 68 0 3 -334 121 145 -92
6183 -92 85 297 -153 37 -112 -70 21 -101 -115 310 2 94 -149 334 81 -9 130 241 -65 132 -80 -14
6205 -14 -233 -106 48 86 -33 141 -18 243 212 -242 -161 4 119 -35 -2 -158 -60 -175 157 -180 25 -282
6227 -282 -49 217 18 -80 -59 -57 -154 479 3 158 -324 125 50 -87 -14 -115 107 -31 252 81 123 -172 100
6250 100 215 202 65 -98 -11 -147 126 184 49 38 50 -276 49 223 -286 280 273 74 214 -177 104 214
6272 214 -120 131 133 -152 -4 -244 239 -271 15 -36 202 11 158 -78 65 161 -8 -42 -173 21 -21 -51
6294 -51 -254 -126 -130 82 235 -305 195 -67 112 161 88 276 -106 -226 115 86 132 -373 -67 -2 -28 219 98
6317 98 86 -51 -281 -55 -191 118 -27 -66 -126 -80 24 -388 242 93 -277 -178 228 13 42 -170 -239 -306 -66
6340f6k23q6L45P0r3M13l50j65Q6P6O5j59J14L3k89M02j84O3PJ29l6j22Q4k92
6364a78K71j92J33j02J39k7j65J79L5j9j58P8J40j52K9n3J50n5j7O0j04P6k9l53
6388c14M53J0o6L9j08j9l90L65j70J83n7J34j72k00Q1mL18n8k10R4K5j1J39j74
6412a12j03K22O7j44Q4J44l08J18m0j15j1N07l06p5L4M4J20j79J60l92K40J47
6434A02j56J60p2J09J23L3j82m96N59J40l46K28m00J07L21Jj55j88K54j13o4L69
6456C34o54K39j51K08R0j31K5O3L71m23j5K9%k4r9J36Q1l00J90O5q3J36l1J29
6480A85k31j10K23j39J2j83O26l66j16j00K62k33K18k9K19k7k28N0j0p3K5p6K67
6503A66k41J33J24J0l19Q7L64j69k61J72J13O6j94k10K1M9K67j34L8k76L8L73
$$ plain form
6340 -66 -289 -375 -30 40 -53 360 10 -155 -69 7 72 -87 27 60 -229 173 -11 52 59 188 152 30 114 -178
6364 -178 93 -99 34 -68 71 44 -121 58 93 74 -84 -6 134 -18 11 -42 108 53 36 96 -8 68 39 -314
6388 -314 139 149 83 122 14 -5 -395 -30 -200 -17 -74 60 -112 -312 -231 -235 83 25 -185 -91 -66 -77 62 -112
6412 -112 -215 7 74 -70 14 158 -150 -32 -72 -187 -198 309 3 -72 -38 6 126 -53 107 -285 -45 102
6434 102 -54 106 34 143 266 299 117 -379 180 320 -26 202 -198 -91 230 231 76 -112 142 29 -35 334
6456 334 -320 -81 -232 -24 66 -65 -40 23 394 -29 -44 -15 -15 -39 -138 -2 79 -221 -31 34 -49 87 56 185
6480 185 -46 -156 67 -72 -60 -243 383 17 -99 -199 63 -170 48 19 238 211 -17 33 23 -50 -25 -101 166
6503 166 -75 58 182 192 -127 -40 324 155 -106 66 179 245 51 -159 -138 -89 178 44 82 -194 -156 217
6525B17k04L2k28L18J44o9n19K45K03OJ35j72J33k04J42j92k25N63n84M08L2l00
6547a19K19k04K20q5J29K00l80k5k4j2J83L5P6l56j53K32m5M87k78n1j8K10q9
6570A52j19J36R9j49k77m6K84l83J04L19o5r2Q2J03j61p9k1J5M14j48j56J3l22
6593b97K58Ol67L71J5n6J12k07K57k18N1pK54j95lr5P6J99j94j02j69J29K57j23
6617d8N2j08K44k34J66j16MJ54M7k45j72K96J30j0k09l64K85M06m05J11l09O06
6639B81l87K35j57J01j30J73q0J00n8j44J6j60K69k85J36j93K49J70o70M92j73
6660b15J90m9j1l5J43J61k55jo4L48k97J3L40j77p0k1mJ50k58p5L6K35k56R8J11
6685C7J72k61K1P1p5Lq2j39M47J17o86K53K87o5k95K0L67k17j8J74l44lj4L17
$$ plain form
6525 217 13 45 -183 135 279 210 -309 -64 139 145 280 108 241 37 179 -13 -238 325 -259 149 181 -119
6547 -119 100 -104 116 31 160 360 -20 -45 -69 -81 102 137 213 -143 -296 -64 -109 378 100 49 31 241 152
6570 152 33 169 268 119 -158 -204 80 -303 -199 120 55 -37 45 148 -13 -92 -113 -98 316 168 12 25 -297
6593 -297 -39 -33 -400 -29 -14 -70 42 -165 92 -126 -75 -82 172 -23 -26 -121 -45 154 -40 -142 -311 -182 75 -48
6617 -48 4 -104 140 -94 72 -44 -40 114 161 -84 -256 40 170 160 -49 -413 -128 278 -127 -16 -325 281
6639 281 -106 129 -28 73 -57 116 36 136 78 -66 -50 -210 59 -226 -90 -283 -34 136 -534 -42 -215
6660 -215 -25 -74 -85 -120 23 184 -71 -72 -136 212 -85 -72 268 91 21 0 -4 146 -112 -187 -151 84 -172 -74 37
6685 37 209 -52 -31 40 -35 -32 -114 -253 194 311 -375 -122 165 100 -195 -175 192 -25 -43 131 -213 -216 -230 87
6709H7k88K26J63j04J06k08J47J79k66J07l72L88Nj35J79k94J39j05j84R3J76
6730C9K2j79K97j11K5q4j41K4J72n1J94j97k6OO3l76K64j34J61J5J17%K6j46L
6755a7N7J05p7J85k56P8J85l86O6K37m62M35m6j82L23k24L7J30k00o5k51L79q9
6778c8J9j6j0p3K67j02k27j02L43k92oK78J54j27k88J43p2J68J24L2k3N9l10O1
6802c8J26k52K34L8k5j85j2q4O9J76O8p5k02K83k05K9J96k26L1j94J92J18j95
6825a33J07n3L04j29l5j36J25kK54m11J02j74L97n19L77lN4l02m1K52l72M73k02
6848f7K57n37M49N2j45k37M39k91J03j8J57m3rl40N29j71J2K0q5l2m57O00q3j84
6872h1K76j18L01j76n61L25n0N3PJ1Q3j45j90J32M19l39m4J27p9J58k50M32j35
$$ plain form
6709 87 -201 25 188 84 190 -18 129 308 42 149 -223 165 170 35 214 -80 59 -46 -230 -137 39
6730 39 61 -118 179 68 93 9 -132 -108 64 13 207 10 -16 -10 53 -323 -59 -193 -32 -17 100 100 126 -20 -17
6755 -17 40 145 68 253 -3 75 260 -126 -60 177 -285 150 104 -78 245 21 58 188 -12 -77 -328 51 -38
6778 -38 -19 -35 -45 -118 149 47 -180 -282 61 -231 -237 41 195 68 -220 -77 -149 19 143 175 152 211 -99 -38
6802 -38 88 -164 70 108 83 -102 -114 -198 -129 47 115 40 -162 121 -84 -55 141 -85 -54 -248 -56 62 -133
6825 -133 -26 -79 225 96 61 -75 50 48 302 -109 -7 -181 216 -303 74 71 125 -177 -218 34 -338 135 -67
6848 -67 190 -347 102 154 9 -228 211 -80 23 5 162 119 110 -230 299 128 140 160 75 43 -414 186 103 -81
6872 -81 195 77 378 202 -359 -34 -84 -31 -24 -13 70 -75 -265 -133 286 -53 -97 30 -49 109 -141 291 156
6895A56k21k76K40J46j99m9L40K47p24P66n85L14l43Q5J98o2M4o6q0l02N89m24
6917b06R7N6o3j30L06j72J17P6j74L6n6j89J77k25J59M13l67M03k26j1l02N23
6939B42l45J53j15p6J77R5k59K18r7K4r1P6O7j39N1O5j50L36m45K38J4q3j96L11
6963G1j06J05k54K55k17r7M96n81N4J67j27R3J62K23l24m9mK49j47j30o8K55j65
6986a39J56j57K19L2Q1j13m7o5j14J85Ok51J08J09R2j58kL21j81r5q4j58N09j15
7010A39J20j55k36L06k08M33n05L11N3k5j93m23J66J87k10n5M37K08m84K11k48
7031a71J77L99m24L6J41p8k73J67L38k05j25k1M2K09r5n8l43L93j80P0n4j59L57
7054A43k52L76p3l04J85J36n16K37L4j46M28j11j1l5m78O20j48l21j00M02N7K43
$$ plain form
6895 156 -65 -341 -101 45 -154 -203 137 384 -340 426 -159 155 -188 -103 95 33 77 11 -69 -371 218 -206
6917 -206 -109 -53 -116 -246 60 -112 5 81 -93 -57 -113 -302 -125 -350 -191 222 -145 258 32 21 -281 242
6939 242 -103 50 -65 -141 36 131 -128 90 -7 17 -74 2 69 -70 -19 46 -104 232 -213 25 39 -44 -240 71
6963 71 -35 70 -184 71 -146 -243 253 -328 -274 -107 -234 -141 21 244 -80 -129 -133 116 -31 -161 -229 26 -139
6986 -139 17 -140 79 111 192 79 32 -33 -147 38 44 -207 -99 10 102 -56 -58 263 82 -13 -97 -255 254 139
7010 139 259 104 -132 174 -34 399 -106 205 258 233 40 -383 -217 -30 -240 -295 142 350 -134 77 -171
7031 -171 6 405 -19 17 158 80 -193 -26 312 107 -18 -39 3 212 117 59 -284 109 -71 -1 -55 -214 143
7054 143 -109 267 194 -110 75 211 -305 -68 -34 -180 248 137 126 91 -387 233 85 -236 -336 66 123 366
7076C66j27k62M5M1q0l08L51Jk11J41j01K82m11J42j37nk62P79j62q4N0n6o8Q9
7100A3p3M2R1k03P9J67k29o2M08j40j21j25K70l74O46k61rl51M38l33K42N2j64
7123Cn7K7K6j32J87k91o0M59q8m52M09j70K90j15j22mJ10Q3N5J04l68L09j81k88
7147b66L16N7j44J48j49ok75J28k1J87J07q8k7J18j43Q3k23P7M65p17jJ47K66
7170C9j7j80K59j19J34J88k04R6J18j69o1l7j14J82J01l76M21j64r5l70K50p3
7192a91J50n9p2K04K67K9k78j94L46k70J32Q7j30J91m23L25k08r3J99Q9j53J06
7214E4j7p5L56ln12M3K4J65J30j12J52J58l64j07J65J46j96J2K4j93J98J0l2J8
7238D4j80m5R7K69k63L6j6M8j57K48l04L20k25K14J9j92K66k44Q6j64K06J20j81
$$ plain form
7076 366 239 -23 22 63 -17 -325 26 27 -184 -43 -144 138 -273 -131 -268 -273 -535 244 82 -2 48 -8 -76 13
7100 13 -60 -18 73 -130 -51 116 -113 -175 233 93 -28 -153 117 -257 389 128 119 -232 206 -127 115 167 3
7123 3 -54 -27 -1 -133 54 -237 -297 162 74 -378 31 -139 151 36 -86 -90 20 103 158 262 -106 203 22 -266
7147 -266 50 107 -37 111 -38 -44 -319 -191 -212 -25 82 -6 -33 85 -58 25 -198 -121 344 -373 -374 -227 39
7170 39 22 -158 101 -18 116 304 100 196 314 145 84 47 -67 115 216 -160 261 97 2 -368 -118 -191
7192 -191 -41 -100 -172 32 299 328 50 -144 202 -68 64 151 21 212 -211 114 -94 -187 12 101 -52 54
7214 54 37 -38 318 315 -197 -154 -130 35 165 53 205 363 -1 -108 57 203 7 19 43 -150 48 58 26 44
7238 44 -136 -181 -84 185 -78 -42 -58 -10 -167 81 -223 97 -128 86 105 -87 179 -65 21 -143 63 183 2
7261Bj14m8J55j64K8J41j55O9R5j94L71j93R5k34K45m4K5j61J58q1J37l49K16
7284@J46j31M55l18l08R0J02J57j18K09R4j00l60J40j2l33K84j76J43N8P4J18
7306B14j87L4k47J87Mj3K2m1K55K9j96o2Nj96RK95l23O3L57j94l7J14k27K43n6
7331E2J02j69l6k81K29J2o5j5K99Q3k92K47m2j41rk8m8K38k57K77j36j18J29K6
7355E7j64M1j0l8J55J91p7k73M4q4R4L09l84K00K23j4J6q5k11jJ47j76J0K22J79
7380C71n56J09K33j37k32J19J8K75l12J32k4K7K47N9j49j34K12l90L5p6K49J20
7402A96q5lQk8r0L3j57J40N6J7j94J74m10K87K45k70L57m97M1J04n4Q5J42np6
7427A6J90k83j11K98q3J67j19j94j40J42K18J05m70N9K16l2j98J95J78j04q9L98
$$ plain form
7261 2 -112 -160 -5 -169 -141 0 -155 -86 9 -185 186 -7 88 -146 99 55 80 -81 77 -4 133 -216 0
7284 0 146 15 470 152 -156 -66 36 193 75 284 378 278 -82 58 46 -287 -3 -179 -36 22 96 214
7306 214 27 61 -186 1 5 -8 14 -27 228 257 61 -1 4 -192 -183 112 -211 -148 209 15 -22 92 -135 108 52
7331 52 154 -15 -51 -332 -103 -91 -156 -171 128 211 -81 166 124 -17 -26 -54 -102 136 -121 156 20 -98 31 57
7355 57 -107 -66 -76 -114 41 232 155 -118 -74 -158 -64 245 -139 61 284 270 286 201 -10 -11 136 -40 -30 192 371
7380 371 -185 -76 157 20 -212 -93 -75 200 -112 20 -4 23 270 329 180 46 258 -132 -97 -173 76 196
7402 196 111 108 116 88 -2 31 -126 14 70 87 -107 67 -343 -56 189 -81 276 -221 -180 -76 -130 -45 97 92 16
7427 16 206 -77 -188 110 27 194 75 -119 -259 -117 101 206 -264 -205 11 -21 -219 -24 154 50 -39 359
7449C59j59k35L2j46pJ97j25M94l63O0j38P3J61k42K3K03l42K54N4k32J78k04
7471a05M60n20K57m0j81J12q4L65l21j8L23l08K6J6J96j88k42L02P8l19P1M03
7493B83l6k55K99k34L3J5j24o8J74r4k27K63j22J37K4l4%m8j26P0L96j70l65L16
7517A07k95J70n2k71K72L06k28J1k58M9k92N20N7j96K12j87l0r6K50l33L82nm9
7540D4J97k48m3k5K27k41j66L39k3L9k62P4J43O1j10Q8l15K6rJ6L91l45N47k68
7564A37q5j21J16k23k32M62K0o0N8k76L75m0p8j70J34p1J03n3l68K50J63k3k3
7587ej44L5R5l8Oj29OK85j06j4R2j79K53j8o9M0j90K10k37Q0J89K72l40K9j69
7612d6p0J49j46P7j62K47O4J41k12m9l13M38l72M15j53q6p7J53N4J48k32j41N5
$$ plain form
7449 359 200 -35 -3 -149 -156 41 -84 410 47 107 -31 42 203 -39 -16 187 -155 99 153 -79 99 -105
7471 -105 355 -165 92 52 -129 -17 -101 264 -57 -75 248 -60 -34 -18 178 -10 -252 50 128 -191 -120 283
7493 283 247 -8 291 57 90 105 -19 -87 87 -7 -234 29 -93 44 68 34 34 -14 -140 -70 326 156 -209 107
7517 107 -188 -18 -70 -341 -69 237 9 20 -238 -189 -481 39 96 -100 112 -75 -105 -201 49 -284 98 93 44
7540 44 241 -7 -50 -75 152 -89 -255 84 61 100 -162 -88 55 116 6 94 -221 -195 -204 -188 203 -142 405 137
7564 137 52 -69 47 -176 -408 54 74 14 72 -204 171 131 53 -117 17 -54 49 -4 -372 -122 41 18 -5
7587 -5 -149 -114 -19 -57 -51 -180 -174 111 5 -9 83 -96 157 139 70 110 -80 130 -107 -27 162 434 94 123 -46
7612 -46 -116 33 -113 -36 -198 49 113 254 42 -7 -320 118 -254 161 8 -78 -155 -2 52 200 -32 -173 -118
7635a18J40k9K3RJ72m83K67j49r0K79n7J98J22n08L23Q6m29L76k22L59j33j22
7657A4K37mm31K88j45J90k57K01l62P66n48J55N5j07l76M18j36o5J65J05J80m53
7679a10J79K36m85p1k9J31lj01P13k33o9j16J86n92L71j82J53q8l11K30J85m6
7701e2J47n6q5P5l73M20J01k57J55j9j60N7J93k44Q0m1J60r5J49k87j44p2J76
7724a72J88K6J03j29j8n4L8J81j22j47K91p63K98M62j61n5M8k70N93l42j75J46
7746c4Q7Q4J01k37j81J75J3K88j89k87L80k77J28m4p8Q0j46J28q5K31l85K89K18
7769B59l89L98j18l13j40K34N4J77l25L43q2l14L23k54L32k6j39l90M66m84M11
7790B3L08m80m2P50q77N91n50L65o7Q6j72r6J98j04Q4Q5j22J98J45q5r7m74K45
$$ plain form
7635 -118 22 -7 16 25 197 -286 -19 -168 -258 21 -36 162 284 -224 99 185 -244 132 -90 269 136 14
7657 14 251 247 -184 104 -41 149 -108 93 -269 497 -51 104 159 52 -324 94 -42 -107 58 163 343 -110
7679 -110 69 305 -180 -251 -280 -149 -152 -253 460 227 158 42 228 -364 7 -175 -22 -110 -421 -191 -6 -52
7701 -52 95 39 -46 29 -344 76 177 -80 75 56 -104 -47 146 -98 -18 -59 101 6 155 -132 -276 -348 -172
7724 -172 16 42 145 16 -2 -56 -18 163 41 -106 185 -578 -280 182 21 -34 14 -256 337 -5 -180 -34
7746 -34 53 137 238 1 -180 -5 8 296 107 -180 200 -77 51 7 -71 9 -137 -9 -94 137 -248 41 259
7769 259 -130 268 150 -163 -303 -69 -15 162 -163 180 98 -216 107 -147 185 159 20 -370 96 -388 23
7790 23 331 -149 -191 559 -318 273 -277 88 21 107 -65 -161 37 -67 17 102 -20 178 323 238 141 -333 -88
7813h8J62l19P4L03k48OJ48L1j94j59N77l79K6K06o0p4L5J40p71M92O8L5K66l52
7837g5J4Q0j65J38j39L34L2l87M25j42j72q7K36K14j38J42m15K31l85K59j76J03
7859g3J05l0j99J98N2k30L20l69j19n2L58j93K31J32m81K97J71r1J59l21L43k91
7881h3k4K92r4Q7J83m85K2L86p2m96J19K4p6K16O0k0J5j21J21n0q4K53j94L21
7905C00n76M64l9l21K56KK70m10j19M06n23L66k29K90j78j13L47nj89n3J01J49
7927A96l81K63j82m7J49q8K46m40L10q2J01K39k16K16m08K14J98k32J1J31l35
7948a37K34KM7Q0k98j52Q5j3R9K48m47J88J12j0j74J54l65J37j95L00R4J95j27
7971E7n3J80l22K90j57l2J81p0m7O4O6l7j38j36N57k87l70M44j31J8q6K30l03
$$ plain form
7813 -88 74 -245 -171 132 -116 -110 38 69 -125 -284 293 -86 -60 146 86 12 47 187 -584 -92 -24 11 277 -75
7837 -75 -61 19 -146 -8 -147 187 219 -168 257 115 -57 -144 92 306 168 310 -105 126 -259 0 -176 -73
7859 -73 32 2 -197 1 53 -177 143 -226 -345 -397 -39 -232 -1 131 -350 -53 118 27 186 -135 208 -83
7881 -83 -107 185 91 178 361 -124 -102 284 212 -284 -165 -141 -217 -1 59 39 54 -67 54 4 -80 173 -21 300
7905 300 -276 188 149 -172 84 86 356 -54 -173 233 -290 76 -153 137 -41 -154 193 188 -1 -54 47 196
7927 196 -185 78 -104 -151 -2 -90 156 -284 26 -56 45 284 68 284 -124 90 288 56 67 198 -137
7948 -137 97 99 146 226 -72 -224 -139 -152 -53 195 -252 -64 48 38 -136 18 -347 -210 -405 -105 -11 184 57
7971 57 4 184 -138 152 -5 -37 144 74 27 91 157 120 -18 -154 403 116 -254 190 59 77 -9 221 -82
7994h2K02j78O0k26Q9J75Pl6K18p3M6n1m22K81qJ37m74M74J9j80K22o4m02J17
8018a49N5P2N0j21J67j13P4m0pM54k85r5Nj2K85m24J25Rj76r0N4O6j47J94k32
8043b81L43m42M33j1n8j67L49k44J73j64j63R2K9K4P6M76n80K36j49n7NK95l6
8066A79k71r9K17n5L7m4j80O6K11r1RP9J21j06r5k05K8L29qk31MM01n84L95L2
8091A39k82P2j16J78K14k65K7L6J02Pj5L3K06l59J24M2j45P3j12J20j30j64J25
8114i0m7K55j17J72o7R3r1o0k45L48N2m4j37j07k5L77j42J46l14K61k25k2J53
8137A24P7k51Q9j41J33r6O4L9k23Q5r5L21o0O0Rj16r6Q6m9j8J93l7k7j03J05j41
8163f8n7J52Q1j12J15j64j44K18k1m4J85k40J55J95o28K78J90k7K71l93O3P6o6
$$ plain form
7994 -82 120 -58 2 -224 -135 40 47 11 229 156 202 151 -271 10 2 139 -335 139 158 -22 200 136 -266 -149
8018 -149 -94 -22 28 -93 74 -39 35 -5 -12 442 157 62 67 55 340 -84 41 50 -126 -216 -162 -96 -243 -49 -281
8043 -281 62 -380 53 42 -16 -183 166 -78 95 -69 -232 -140 -111 -87 -11 465 -115 121 -28 -85 -80 215 179
8066 179 -92 -191 26 -29 8 -36 -216 -150 61 -30 -21 58 179 73 -22 -227 -199 130 122 -109 -105 296 -288 107 139
8091 139 -143 -71 -187 -9 205 -60 -33 3 105 112 97 130 336 -23 101 143 -2 71 -41 79 -51 -215 -90
8114 -90 -137 118 1 173 106 199 108 48 -197 151 203 159 22 -85 -110 267 125 271 -43 218 -7 -29 124
8137 124 201 -50 39 -102 31 -65 -1 38 -185 -100 -195 126 66 126 135 19 -77 9 -40 -58 135 98 71 -32 73 -68
8163 -68 -125 27 108 -4 111 -53 -197 21 0 -44 141 -99 56 251 -377 -99 91 64 335 -58 5 81 15
8186A5l9j06J25Q8J60
$$ plain form
8186 15 -24 -130 -5 83 243
8191B43
$$ Imaginary data points
##PAGE= N=2
##DATA TABLE= (X++(I..I)), XYDATA
0@%%%qJ6j6K4m0M8n6P2r5J19j44J83k24K67l21L82m47N19o06P03q09R30j066J217
27F48j384J568j770J994k240K507k803L129l484L875m303M771n286N852o473P158
43C759p917Q765r715J0784j1997J3386j4994J6879j9124K1849k5240K9586l5367
56a9346M3460n5637P6153j19105L35102j87687k24793L36738o18057P44387l99049
67h7834P4656K88375n98753N39018m53577J99057L57106n46879N17471n71357
77b82717K19017K41858m00562N93879n52558J67009O6118l55364O60631m89473
87a32162K31017m4255l65568N74572m84002L69354k2916l28848M32436n69112
97c39484M49287j329k00608L70302o14778M20691q5179j00001M06750n51808M06932
$$ plain form
0 0 0 0 0 -8 8 -8 16 -24 24 -32 40 -55 64 -80 103 -121 146 -175 207 -240 279 -327 376 -433 497 -569 648
27 648 -736 832 -938 1056 -1184 1323 -1480 1649 -1835 2040 -2263 2508 -2778 3074 -3399 3759
43 3759 -4158 4607 -5108 5676 -6321 7065 -7929 8950 -10174 11675 -13565 16021 -19346
56 -19346 24114 -31523 44630 -74475 260627 72940 -151853 184885 -433172 311215 -87834
67 -87834 -13178 275197 -323556 215462 -238115 -39058 318048 -228831 288640 -282717
77 -282717 -63700 178158 -222404 371475 -181083 -14074 52044 -303320 357311 -132162
87 -132162 98855 54600 -310968 263604 -220398 148956 126040 -202808 229628 -339484
97 -339484 109803 108474 -92134 278168 -336610 84081 -1098 -101099 305651 -246157 160775
108A60775k42400q5159M03118m42970M68534l29412q3858K97049m03788N28219
118B70108l03427j7985J89238m43047N11823k82400R9582J61178m52525M49917
128A82462l46180J75702J66243l65919M21692m29991J70832J26004k63254M49535
138B87126m51204J67935L0887k29703M61391m14340K36507n3646k32546L95163
148A97570l88245L25037p3630j97544L05583m08223L53576p7034j12830K72517
158A96777m28082L30032j32951l3061K72918l88839L17689k09806q233K42459
168A58903l24507L47428k45347k363J73362k99955L81547k44482M3773J05878
178I4237l00019L71033k54050J17278P5505k77064L28578k90850J63184O3060
$$ plain form
108 160775 -81625 -166784 236334 -206636 261898 -67514 -151372 145677 -258111 270108
118 270108 -33319 -51304 137934 -305113 206710 -75690 23892 185070 -267455 182462
128 182462 -163718 11984 178227 -187692 234000 -195991 -25159 100845 -162409 287126
138 287126 -164078 3857 34744 -194959 266432 -147908 88599 34953 -197593 197570
148 197570 -190675 134362 60732 -136812 168771 -239452 114124 37090 -75740 196777
158 196777 -231305 98727 -34224 -67285 205633 -183206 134483 -75323 -83556 158903
168 158903 -165604 181824 -63523 -65886 107476 -192479 189068 -55414 -11641 94237
178 94237 -205782 165251 -88799 28479 103984 -173080 155498 -135352 27832 90892
188I0892k19862L08256l30908J75673K0653j61060L11267l32922J91057m6034
198G012j30165K94902l05149K27502r0359j14426K49713k94021K64931j04732
208E208p7296K03693l04148K76502j25333j8095J75189k95604K65242j62376K4363
219c2655J56612k62779K65686k00590M3504J23474k26765K80362k20439O7390
229f200O9903k00815K78979k19870J05805K6292j82944K53490k23285J43074N848
240E0277j53207K25575k42159J65203j6764j07616K10387k50732J71687n4635
250a984o9040J99273k36394J81933r1738n1477J79019k21385K06223j15864k9469
261e0903J41911k15626K23600j29470P953J07577k10018K18925j44650M6038Q7941
$$ plain form
188 90892 -128970 179286 -151622 24051 44704 -116356 194911 -138011 53046 7012
198 7012 -123153 171749 -133400 94102 3743 -110683 139030 -154991 109940 5208
208 5208 -72088 131605 -172543 103959 -21374 -39469 135720 -159884 105358 -57018 -32655
219 -32655 123957 -138822 126864 -73726 -30222 93252 -133513 146849 -73590 -6200
229 -6200 63703 -137112 141867 -78003 27802 54094 -128850 124640 -98645 44429 50277
240 50277 -102930 122645 -119514 45689 28925 -78691 131696 -119036 52651 -1984
250 -1984 -71024 128249 -108145 73788 -17950 -69427 109592 -111793 94430 -21434 -50903
261 -50903 91008 -124618 98982 -30488 -22535 85042 -124976 93949 -50701 -4663 83278
272H3278j94770K10542j71017P2652O7843j65798K10500j93970R0187L2945j34969
283i2577K10254j96533J07296l922j17075K00753j91319J33464l0420j01871J79061
294I7111j95644J59396m8456p1227J53445k01333J66967o7212l4776J38097j97288
305a00920J66689r4417q324J26328j82449J75726j23432J1737R9037j62157J85876
316I3694j37186L2341O5012j49899J87604j41070N8369M0088j41590J78554j52208
327f6291Q8441K1730j21934J65296j66930J06426J846r1700J56869j74370J13685
338C3068k4320o8250J53146j71481J27157n4189n2123J39829j64731J47207p5582
349a0269l2968J14295j61128J59531q6029q453R3137j60293J60571j00585K0247
$$ plain form
272 83278 -111492 99050 -71967 685 68528 -97270 113230 -80740 9447 42392 -92577
283 -92577 117677 -78856 28440 24518 -92557 108196 -83123 50341 19921 -81950 97111
294 97111 -98533 60863 12407 -58820 94625 -106708 60259 -6953 -41729 96368 -100920
305 -100920 65769 -28648 -36972 89356 -93093 82633 -40799 -29062 69975 -92182 93694
316 93694 -43492 -11151 53861 -96038 91566 -49504 8865 48953 -92637 85917 -66291
327 -66291 22150 43880 -78054 87242 -79688 26738 28584 -63116 93753 -80617 33068
338 33068 8748 -59502 93644 -77837 49320 -4869 -56992 82837 -81894 65313 -10269
349 -10269 -43237 71058 -90070 69461 -16568 -25021 68116 -92177 68394 -32191 -11944
360a1944P9249j52004J58191j22878M3249O1547j30382J56969j37669N5828L8620
371C8776j11113J59037j42848P1586J1217r9602J55627j43719R3776j1953q5491
382f4707J38980j46126J12550k6128o4615J22719j51374J20142l9977l9995J14598
393G6067j53204J24802o3346j7337J04275j42401J30855q4934l333Q6474j28887
404g0969J39751r6469J0329O4953j24036J46550j04190L3763M3984j18742J42322
415F7246j14174N8385K9434j05453J32373j26186P2865J6748q6572J30107j36963
426f2190Q2146m658o7896J29035j37813R4268k9814n3669J19685j31782J09089
437D6401m7428m1882J03239j30352J22316n7952k2965Q6325j32401J27519p0893
$$ plain form
360 -11944 67305 -84699 73492 -49386 -6137 55410 -74972 81997 -55672 156 38776
371 38776 -72337 86700 -56148 15438 26655 -72947 82680 -61039 32737 20784 -64707
382 -64707 74273 -71853 40697 14569 -50046 72673 -78701 41441 1464 -38531 76067
393 76067 -77137 47665 -15681 -33018 71257 -71144 59711 -25223 -28556 57918 -70969
404 -70969 68782 -27687 -17358 47595 -76441 70109 -34081 -318 43666 -75076 67246
415 67246 -46928 11457 40891 -64562 67811 -58375 14490 31238 -55334 74773 -62190
426 -62190 19956 15298 -52598 76437 -61376 32892 3078 -50591 69094 -62688 46401
437 46401 -1027 -42909 60330 -70022 52294 -5658 -28623 57702 -74699 52820 -18073
448a8073J746P3397j27329J25106q7462K0807O3695j13968J24866j03837L2939
459h113M8244j00345J30542j12333M5747K3749q7958J28364j12870O2418M626
470B2071p9260J18498j14360P9523o889o7575J08103j22115R2650k0178m7253
481c6785R8716j25901R8170l6823k8930R2956j21199J01920n4944j6936Q4669
492E4913j14469J12266p1095m593O8177j07984J20756q0287J2241M9335j02359
503f3099J19379q6680L0491L7831r6538J15648r8729M7134K6732q3565J12657
514F1261j09818N8804J1212o7547J08787j12313O7786n717n6336J04254j11570
525e1197P9510k1582m6525R5172j11242R2178l5351l1768Q1752j10088R8728m5972
$$ plain form
448 -18073 -16327 57070 -70259 54847 -32615 -11808 51887 -62081 62785 -41052 -8113
459 -8113 40131 -60214 70328 -42005 3742 27491 -60467 67897 -44973 17445 22071
470 22071 -57189 61309 -53051 26472 19583 -47992 60111 -62004 30646 10468 -36785
481 -36785 61931 -63970 34200 -2623 -31553 61403 -59796 42124 -12820 -29756 54913
492 54913 -59556 52710 -18385 -22978 45199 -62785 57971 -22316 -10075 39260 -63099
503 -63099 56280 -30400 91 37922 -58616 57032 -41697 5437 32169 -51396 61261
514 61261 -48557 10247 21459 -46088 62699 -49614 18172 12455 -43881 60373 -51197
525 -51197 28313 6731 -39794 55378 -55864 36314 963 -30805 50947 -59141 39587 -6385
537f385j6261P1235j07256J01288n7838j484O2137j01873J05630p2248J1960M9016
549C7921r2080J07105q0553K3385L4988q3323J06620q6649L6048K2801p6019J04547
561E4791r4277N0054R739o3831R9403j00777O1029k980n1563R3628j02546O9897
573B2567j6418m1615Q8386j03920Q1228k9525k9893P8136j03653R0566m1053j5671
585b0865O6217j00726R4430n1123k604N7872r7323R7153o3740J0604M7967q9058
597e1196R9897p5004K1467L3584p7905J01281q0331L0647J9477p0534J00183q3621
609c2055M3539P682o3782R3646q9697N7279j650n0828Q5235r5279O4039j1362
621F767l6399Q0903r7018O7462k3836k5044P6731r3996P5572l9319j5456O5937
$$ plain form
537 -6385 -22646 48589 -58667 42621 -15217 -16701 45436 -56437 49193 -23055 -11095 37921
549 37921 -54159 52946 -27607 -4222 30766 -52557 54063 -32586 3462 26263 -49756 54791
561 54791 -39486 10568 20307 -43524 55879 -44898 16131 13151 -38412 55216 -47330 22567
573 22567 6149 -35466 52920 -51000 30228 703 -29190 48946 -54707 35859 -5194 -20865
585 -20865 45352 -55374 39056 -12067 -14671 43201 -54122 43031 -20709 -10105 37862 -51196
597 -51196 48701 -26303 -4836 28748 -49157 52124 -28207 2440 21917 -48617 51566 -32055
609 -32055 11484 19166 -44616 49030 -40667 16612 14962 -35866 49369 -45910 18129 6767
621 6767 -29632 51271 -45747 21715 -2121 -27165 49566 -44430 31142 -8177 -23633 42304
633D2304q8831Q4411m7802o388N1201q5072Q9382n1874O071M0002q5283R0351
645C8472n9728K2034L1656p8727Q7089p1511L2971K4152o5727Q6910q0264L6198
657C525J1813n4286R0450q3251M3901m836m7657Q7872q1830N7305j7350m0115
669c4459P5414q2512O8042k1759k8929O5523q8739P2427k8148j2387O0136r0481
681d5872P2388m1158R27N5297q1301P3776n3629N427M6179p1794Q1399n8773R895
694g239L0973o9317Q7035n9759K3810J6087o7469Q1723o2586L8606J1037o0363
706c7462P3807p1784M5665O597m6045P3270q1118M8498p406l1950P4593p8986
718c2321N1799k2824k6593P0002p2597O1250l1764k2383N8523p3331P1599l4915
$$ plain form
633 42304 -46527 37884 -9918 -16306 34895 -50177 39205 -12669 -6598 33404 -51879 38472
645 38472 -21256 778 32434 -46293 40796 -30715 2256 26408 -39319 47591 -32673 3525
657 3525 15338 -38948 51502 -31749 12152 7316 -40341 47531 -34299 23006 5656 -34459
669 -34459 40955 -41557 26485 4726 -24203 41320 -47419 25008 -3140 -15527 44609 -45872
681 -45872 26516 -14642 -13715 41582 -39719 34057 -19572 -14145 32034 -39760 41639 -17134 -7239
694 -7239 23734 -45583 41452 -18307 5503 21590 -45879 35844 -26742 11864 22901 -37462
706 -37462 36345 -35439 10226 16823 -29222 44048 -37070 11428 4022 -27928 46665 -32321
718 -32321 19478 -3346 -29939 40063 -32534 28716 -3048 -25431 33092 -40239 31360 -3555
730c555j0555M6276p6938P2963l9400O198L9726p5307O8263m8562J6434L7667
742C3210o8089P0105o1326K1285K7740n7318P6599o6381K6519J0925n0875P7677
754D0071o3309L6228r56m9169P1211o3477M8740p060m1410O1981o9981N5184j1508
767F545k6175N6159p3464N3832k0462j4207N6471p0588N4098l3093q184N2591
779C3523o3933O2234m3522m132M0586o0127O9110m3817M525K7615o1605O8829
791B9286m4989J8315K2399o0904O3958n3960L0590J7965n0020O1033o3437L3634
803C870R061l8173O3719o4869L4994m006l2995O4558o1468M3517j5766l0201N7310
816B9551n9184N3359k0096k3517M6850o2270N7038k1742j2285M2743o5760N5532
$$ plain form
730 -3555 -14110 32166 -44772 28191 -11209 -5011 34715 -40592 27671 -20891 -4457 33210
742 33210 -34879 35226 -26100 -4815 22925 -34393 42206 -24175 2344 13269 -37606 40071
754 40071 -23238 12990 12034 -37135 34076 -29401 19339 12279 -29131 32850 -37131 18053 6545
767 6545 -19630 36529 -36935 16897 -3565 -17772 38699 -31889 22209 -10884 -19068 33523
779 33523 -30410 31824 -11698 -15830 24756 -35371 33739 -10078 -5553 22062 -39543 29286
791 29286 -15703 2612 25011 -35893 28065 -25895 4695 22660 -27360 33673 -29764 3870
803 3870 12931 -25242 38477 -26392 8602 4596 -28399 36159 -25309 18208 2442 -27759 29551
816 29551 -29633 23726 3630 -19887 26963 -35307 21731 -11 -12296 30447 -35313 20219
828B0219k9894N45M0559o1984N5624m2116O874L5453n2593N9184m8149R498K4348
841A7568m8372O4150m8469J7290J2331m7499O2439m9626K9948N377m3424N4565
853B6278n3098L7139L068l4737N0843n8910L8537l037k4564N1534o0002M0444
865A3495j5607j7240M9888n5299M5253k4821j4106M2995n2415N2334k8222q945
877a2690L4617n4499N7221l1868K784K7091n4221N4593l7462J3263K3635m8996
889b6532N1666m4884J7755J9495m1366N4051n0596K1477R213l4857N5366n0201
901a9413K7241r51l1730N1829m7916L4398o075k8954M6051n0844M1295r766k0875
914a5710M1234n4393M3419j5654j0490L8190n2713M2962k3981m311L6048m8718
$$ plain form
828 20219 -9675 -9130 31429 -30555 25069 -17047 -10173 25280 -27313 31871 -16278 -6780 17568
841 17568 -30804 33346 -15123 2167 14498 -33001 29438 -20188 9760 15137 -28287 26278
853 26278 -26820 10319 13387 -21350 29493 -29417 9120 6083 -18481 33053 -26949 13495
865 13495 -2112 -19352 30536 -24763 20490 -4331 -18437 24558 -27857 24477 -3745 -12690
877 -12690 21927 -32572 24649 -7219 -4435 22656 -31565 23028 -14434 -1171 22464 -26532
889 -26532 25134 -19750 -1995 17500 -23866 30185 -20411 1066 10279 -24578 30788 -19413
901 -19413 7828 6877 -24853 26976 -20940 13458 7383 -21571 24480 -26364 14931 5165 -15710
914 -15710 25524 -28869 14550 -1104 -11594 26596 -26117 16845 -7136 -11447 24601 -24117
926b4117M5764l1186n66K9394m4308N0120l5510N795J9885m2256N0573l5512J2918
939I94J4001m0989M8099l9012K0478J1028l6433M5903m4933K5869M861k8549M5407
952B6724m8001K8230k681k2701M4874m6772L1951j0326j9970M2420m6047L9063
964A6764j6923j4409L5437m6195M3294k0272o748K9643m6202M2526k3648Q48K6930
977B1045m5062M3150l0627O625K3356m0102M4213l5569R852J6589l4935M5455
989B3990l7347J4820R199l3055M5241l7770K0812L808l0446M2174m0543K7303
1001H186m97k3976L7846m2850L0185m996j7429L6805m4116L1833j2159j1710L5059
1014B2181m1972L4959j9412p719L0354l9051L8498k2403l253K3465l8686M1390
$$ plain form
926 -24117 21647 -9539 -10105 19289 -25019 25101 -10409 -4614 15271 -26985 23588 -11924 994
939 994 14995 -25994 22105 -16907 3571 14599 -21834 24069 -20864 5005 9866 -18683 26724
952 26724 -21277 6953 4272 -18429 26445 -20327 11624 1298 -18672 23748 -22299 16764
964 16764 -159 -14568 20869 -25326 17968 -2304 -9052 20591 -25611 16915 -6733 -5885 21045
977 21045 -24017 19133 -11494 -4869 18487 -21615 22598 -12971 -3119 13470 -21465 23990
989 23990 -13357 1463 10662 -22393 22848 -14922 5890 9698 -20748 21426 -19117 8186
1001 8186 7689 -16287 21559 -21291 8894 3898 -13531 23274 -20842 10991 -1168 -12878 22181
1014 22181 -19791 15168 -4244 -11963 18391 -20660 17838 -4565 -7818 15647 -23039 18351
1026A8351k4172K588J8814l8404M0692k8634J0937J5089l5272L8927l3579J4959
1038B96J1841k9580L9027l7047J7069N953k5491M1281l8459K1400j961k2180L8827
1051B0976l7362K6983o899j8741L3452l7509L0914r033j3895K9532l9959L3220
1063A1679j3018o507K7353l9907L3418j9230o41K4984l6052L3878k3939J279K1088
1076A4385l2560L7228k7206M617J4426l1252L9277k7817J0461Q335k9588L6429
1088A6735k8910J6362N715k7047L4555l3207K0405L123k0983L3048l6718K2299
1100E377k620j5164L2454l5770K4219r357j2124L1087l3787K8277j3661j0302
1112a1371K6537l3425L2665j6270m704K0869l3832L3294j8239J676J7269l3604
$$ plain form
1026 18351 -5821 -3233 15581 -22823 17869 -10765 172 15261 -20011 18916 -14663 296
1038 296 12137 -17443 21584 -15463 1606 7559 -17932 23349 -15110 6290 4329 -17851 20976
1051 20976 -16386 10597 3698 -15043 18409 -19100 11814 2781 -11114 18418 -21541 11679
1063 11679 -1339 -7846 19507 -20400 13018 -6212 -6853 18131 -17921 15957 -7982 -6703 14385
1076 14385 -18175 19053 -8153 -3536 10890 -20362 18915 -8902 1559 9894 -19694 16735
1088 16735 -12175 4187 9902 -17145 17410 -15797 4608 7731 -13252 19796 -16922 5377
1100 5377 2757 -12407 20047 -15723 8496 -861 -12985 18102 -15685 12592 -1069 -11371
1112 -11371 15166 -18259 14406 -1864 -6568 14301 -19531 13763 -4476 -2800 14469 -19135
1124a9135L2088k1601O659J6250l0842L2464k7722J0069J2191k5907L4041k9537
1136a0982J1713N615k1949L3918k9087J5395N19k1314L2528k9696K0971l108j7734
1149a3211K8341l1277K4524n570j2088K5641l2987K4521q628p263K5090l2923
1161a5830K5997j4283l792K3117l0106K7983j8897l91J7992k7156K9869j9898
1173e395K340J3386k7286L1377k1412P921R302k6380L0154k4543J3049O423k2578
1186a3642K8562k7439J4930L748j8155K8392k8761J6579j343j5445K8960k8739
1198a2353J9882o616j2088K5960k7996K2985r819q883K2445k8540K5392j1549
1210a180n085J9711k9403K6386j4969L84J7383k7688K6003j8489L514J4689k4339
$$ plain form
1124 -19135 12953 -8648 -1989 14261 -16581 15883 -11839 -1770 10421 -15486 18555 -10982
1136 -10982 731 6346 -15603 18315 -10772 4623 5142 -16172 16356 -13340 7631 4523 -13211
1149 -13211 15130 -16147 8377 2807 -9281 16360 -16627 7894 -734 -7997 17093 -15830
1161 -15830 10167 -4116 -7908 15209 -14897 13086 -5811 -6202 11790 -15366 14503 -5395
1173 -5395 -3055 10331 -16955 14422 -6990 931 10233 -16147 14007 -10536 2513 8936 -13642
1186 -13642 14920 -12519 2411 6159 -11996 16396 -12365 4214 2871 -12574 16386 -12353
1198 -12353 7529 913 -11175 14785 -13211 9774 -45 -8928 13517 -15023 10369 -1180
1210 -1180 -6265 13446 -15957 10429 -4540 -4156 13227 -14461 11542 -6947 -3433 11256 -13083
1223a3083K6251k0820N624J0754k2746K8346k2753R173O489k1120K7609k3456
1235i732J4051J998j8966K5668k4525J6273K54j5401K4071k6464J8456l156j1794
1248i267K3525k6724J9765p977p830K1808k5240K1311j1316n488J9148k4433K3557
1261A0839j3474k759J6208k4933K5576j6087K405J2361k3959K4743j7930N959
1273a051J0746k1967K4150k0448Q202Q037j9056K4799k2906J1332L277j6598K4865
1286A3382k2876J3857o89j4708K3227k2457J6141k653j2601K0872k3791J8916
1298F620n035r169J9705k5126K0129q571m732J8190k3548K0183j1799k591J6515
1311A0771k1898K1693j4939j0J3083k0778K3838j6668L496Q894j9810K3377j7247
$$ plain form
1223 -13083 13168 -7652 -2028 8726 -14020 14326 -8427 746 7235 -13885 13724 -9732
1235 -9732 4319 6317 -12649 13019 -11506 4767 5021 -10380 13691 -12773 5683 2527 -9267
1248 -9267 14258 -12466 7299 -678 -8508 13300 -11940 9371 -1945 -7433 11715 -12718 10839
1261 10839 -2635 -5394 10814 -14119 11457 -4630 -2225 10136 -13823 10920 -7010 -1051
1273 -1051 9695 -12272 11878 -8570 -368 7669 -11387 13412 -9494 1838 5115 -11483 13382
1286 13382 -9494 4363 3674 -11034 12193 -10264 5877 3224 -9377 11495 -12296 6620
1298 6620 1585 -7584 12121 -13005 7124 -1447 -6179 12011 -11537 8646 -3153 -5744 10771
1311 10771 -11127 10566 -4373 -4383 8700 -12078 11760 -4908 -1412 7482 -12328 11049 -6198
1324f198O523P124j9179K2109j8914J0608M573j6891K1760k2026J2952J712j2734
1337h581K0591k1809J3917k256j0531K0558k1644J5720n496r070J9981k2126J8987
1350H241q232o266J5727k1355K0499r933k891J3537k1247K0144j1682O18J2239
1363I399k0431K0250j4801L557J0168j8133K0894j7208M968P248j5782K1086j7506
1376f291O977M021j5205K1450j8647J0266J441j3564J9732j9322J3146p17j0893
1389g606J7719j9835J4396k844q342J7046k0685J5759o116n361J6038k0324J7411
1402G256r222l227J3632j8319J8287j1166p54J1449j8561J9464j2472J451R273
1415G091j7508J9823j4653M750O808j6139J8965j5506P004M840j4095J8665j7405
$$ plain form
1324 -6198 325 7449 -11730 10379 -8535 2073 6646 -10245 11515 -10511 2441 4153 -8581
1337 -8581 12010 -9799 4118 1862 -8669 11889 -9755 5965 469 -8601 11380 -10746 8241
1350 8241 9 -6257 9470 -11885 8614 -1319 -4210 9327 -11920 8224 -3458 -2840 9399
1363 9399 -11032 9218 -5583 -2026 8142 -9991 10903 -6305 -1337 5911 -9871 11215 -6291
1376 -6291 686 4707 -10498 10952 -7695 2571 4012 -9552 10180 -9142 4004 3287 -7606
1389 -7606 10113 -9722 4674 1830 -6512 10534 -10151 5608 -508 -5869 10169 -10155 7256
1402 7256 -1966 -5193 8439 -9880 8407 -2759 -3513 7936 -10625 8839 -3633 -2182 7091
1415 7091 -10417 9406 -5247 -497 6311 -9828 9137 -6369 635 5475 -8620 10045 -7360
1428g360R014K676j2741J8525j8313J1398m42j0577J7359j8170J2708k680q019
1441f622J5799j7977J4356n352o028J4995j8654J6184p961l145J2777j8087J7241
1454G526r621j124J0603j6863J6999j0485P13R420j6626J7649j2614L299P540
1467F416j5134J7335j4404N700M751j2742J7353j5087P044K622j1900J7407j5731
1480f370Q883O3j0273J6467j6648J2111k594q134J4624j6292J3019m097n867J3481
1494H373j7075J3714n668l476J2573j7376J5113q480o87J0344j5512J5111j0134
1507c180O85Q921j4572J5951j1450K122O714j3665J6821j2706M971M017j2605
1520g976J5642j3512P193K692j1214J4911j4429Q598Q97q802J4444j5613J0112
$$ plain form
1428 -7360 1654 4330 -8411 10114 -8199 3199 2757 -7820 9539 -8631 4077 1397 -6622
1441 -6622 9177 -8800 5556 204 -5824 9171 -9483 6701 -1260 -4405 8372 -9715 7526
1454 7526 -2095 -3219 7384 -9479 7520 -2965 -2252 7168 -9458 8191 -4423 -1124 6416
1467 6416 -8718 8617 -5787 -87 4664 -8078 9275 -5812 1232 3854 -8046 9361 -6370
1480 -6370 2513 2576 -7697 8770 -7878 4233 1639 -6495 8129 -8163 4856 759 -5108 8373
1494 8373 -8702 5012 -656 -4132 8441 -8935 6178 -2302 -2989 7355 -8157 6954 -3180
1507 -3180 -2495 6426 -8146 7805 -3645 -1523 5191 -8474 8347 -4359 612 4629 -7976
1520 -7976 7666 -5846 1347 4039 -7175 7736 -6693 1905 2802 -6000 8444 -7169 2943
1533B943j394o956J3759j5418J0737l718n153J2798j4605J2077n857l704J1767
1546G276j5176J3416o680j843R548j4710J3852p955R59P564j4369J4343r827K537
1560a065O966j3380J4591j1495L467N572j1658J4790j2695N786K318j0017J4095
1573G275j2569P067J016r033J3623j3669R151q04p845J3051j4437J0644k857n080
1587d467J1424j4137J1158m485l351J0641j3696J1809o237j871R559j3534J3031
1600E844p947K16P597j3066J3395q958J665O137j1680J3014r812L015N213j1478
1614f845J3857j1405M625L207r781J3379j1686N802J166q138J2763j2306P828
1627B466n04p274J2144j2983R697k284n841J1330j3479J0425l884l160R955j3249
$$ plain form
1533 2943 1549 -5407 8352 -7066 3671 -47 -5200 7598 -7007 5070 -787 -4491 7276
1546 7276 -7900 5516 -1164 -3007 6541 -8169 5683 -2272 -1313 6251 -8118 6225 -3602 -1065
1560 -1065 5901 -7479 7112 -4383 -916 4656 -7002 7788 -4907 879 3197 -6820 7275
1573 7275 -5294 1773 2789 -6244 7379 -6290 2861 2057 -5788 7263 -7174 3470 613 -4467
1587 -4467 6957 -7180 3978 -507 -3858 6783 -6913 4896 -1341 -3212 6347 -7187 5844
1600 5844 -2103 -1887 5710 -7356 6039 -2919 -1254 4883 -6797 6217 -3595 -580 4633 -6845
1614 -6845 7012 -4393 232 3439 -6342 7037 -4649 1153 2319 -5819 6944 -5362 2466
1627 2466 1962 -5312 6832 -6151 3546 1262 -4579 6751 -6728 3697 -187 -3347 6608 -6641
1641f641J0925n402j589Q929j2242J1215p630r2P870j1549J2073q354J189N183
1655C885j0523J2652r030K674M245j0444J2487r808M330L386r887J2238j1258
1668e053O284J841p958J1259j1775O679N78o364J1137j1660P122j409n568J1361
1682F474j1567Q990l744m283R503j0922J0213m428k999P748j1699J0960n269o59
1696a682O887j1958J1258o967J614N732j0527J0791q707K333N185q906J0944r600
1710c603K735L559q518J2332r911M478R38p907J1264r650O977n39p023R744r917
1725e041P628n64n809R261j1574Q413j487l983R190j1985R065m110j972Q732j0737
1740d973R402n917j595P310r025J0238o635r73N831r886J1468p122J902L355r337
$$ plain form
1641 -6641 4284 -1118 -2707 6222 -6020 5195 -2435 -2527 5343 -6206 5867 -2487 -1298 3885
1655 3885 -6638 6014 -3016 -342 3903 -6541 5946 -3862 468 3854 -6033 6205 -5053
1668 -5053 1231 3072 -4886 6373 -5402 1277 1855 -4509 6628 -5032 2090 681 -4887 6474
1682 6474 -5093 3897 153 -4130 5373 -5549 4664 236 -2763 4985 -6714 4246 -1023 -1682
1696 -1682 5205 -6753 4505 -2462 -848 4884 -5643 5148 -3559 -1226 3959 -4947 5997 -3603
1710 -3603 -868 2691 -5827 6505 -3406 1072 2010 -5897 5367 -4283 2694 2155 -4868 4876 -5041
1725 -5041 2587 2023 -3786 5475 -6099 2314 827 -3156 6034 -5951 3114 -996 -2968 5764 -4973
1740 -4973 4429 -1488 -3083 4227 -4798 5440 -1195 -2168 3663 -6223 5245 -1877 25 3380 -5957
1755e957J0317p467L699L192q978R755r020M918K670p029R632j0358N382R58n966
1770d252J0380j0109N844j371m658R628r500P208k655m503Q155r248Q855l064
1784G10l406O913j0309R524l749q78N948j0109Q454m812J04O690r436Q911p549
1799b994J222N292q086J0016q115K084K698o847R795p455L042J286p056R482p574
1814c210M720J041p153Q964q750O119K87n287P861r182O180j063l390Q136r423
1829d150O344k539l207Q568r346Q043m287k179O662q483Q778m882j171N201r145
1844e793R209m652P82M313q975Q619n879K233L532p035P935p296K369K856n708
1859c490Q655q555L461J199n398R239q090M508o30m925Q444q174O066j412m144
$$ plain form
1755 -5957 4360 -3107 592 3784 -5194 4561 -4459 459 3129 -3900 5732 -4626 756 1714 -4252
1770 -4252 6128 -3981 1863 492 -4166 5462 -4038 3170 515 -3988 4167 -5081 3774 710
1784 710 -2696 4217 -6092 3432 -317 -1195 4753 -5356 3098 -1714 -1610 5080 -4356 4555 -2994
1799 -2994 -1772 3520 -4566 5450 -2665 -581 2117 -4730 5065 -2390 652 1938 -5118 4364 -3210
1814 -3210 1510 2551 -4602 4362 -4388 1731 2018 -3269 4592 -4590 1590 527 -2863 5273 -4150
1829 -4150 2194 -345 -3552 5016 -4330 3713 -574 -2753 3909 -4574 4204 -678 -1849 3352 -5793
1844 -5793 3416 -1236 -454 3859 -5116 3503 -2376 -143 3389 -3646 4289 -3007 -638 2218 -3490
1859 -3490 5165 -3390 71 1270 -4128 5111 -2979 1529 899 -4026 4418 -3756 2310 898 -3246
1874c246P082q270O907j664k839O437r238P149l033j032O339q764P244m786j26
1889a840N628p612P861n464l12M441o945Q746o015J345K521p292Q992o259K780
1904E75J961o394P235o619L683K152n705P369q141M315R60m003P803q804M809
1919A196j312k924P600p567N279k307l196O777p214O946k864k900N684p776P954
1934C376l537p88M130p689P201m094P41M336p372O668n441J609L969o392P560
1949D277o804J821K461n547Q483o814K523P96n126P612n922L427L40n374P204
1964C357p163N553j58m413O515p977N830j092k226N912q017N258k477n98N961
1979D265p268N660l747j018N063n982O766m691o94L953o628P703m358P72K663
$$ plain form
1874 -3246 3836 -4434 2473 809 -2030 4407 -4831 2318 -715 -1747 4592 -4172 3072 -1714 -1840
1889 -1840 3788 -3824 4037 -1427 -1739 2702 -4243 4503 -1512 -167 2354 -4938 4054 -2205 575
1904 575 2536 -3858 3377 -3242 441 2593 -3112 4257 -3884 431 1391 -2612 5191 -3613 1196
1919 1196 -116 -3040 4560 -3007 2272 -35 -3231 3546 -3668 3278 414 -2486 3198 -4578 3376
1934 3376 -161 -949 3181 -4508 2693 -1401 -660 3676 -3696 2972 -2469 -860 3109 -3283 4277
1949 4277 -2527 -706 1755 -3792 4691 -2123 400 1196 -3930 3682 -2240 1187 1527 -3847 3357
1964 3357 -3806 1747 1589 -2824 3691 -4286 1544 452 -1774 4138 -3879 1379 -1098 -1696 4265
1979 4265 -3003 2657 -1090 -2108 2955 -3027 3739 -952 -1646 2307 -4321 3382 -976 -204 2459
1994B459o425O652m646K259K861o428O185o097L550J836m819O053o300L187R15
2009A242m120O801o598L571q37l112O979o904M921j840k730N506o177N752j961
2024D93k231M567o714N889j783j514M756p340O203l370j23M320o324O080m845
2039a936J223L116n626O599m631N89K523n184O827m970J518J395n125O898n601
2054b385L331N32m407N906n637M037rl951N836o390M350n23k909N690o428M246
2070A289j364j622M951o194N261k800j246M580n736N345k962r09L792n905O297
2085B777l785L70K994n688O065m336J545K103m837N492m526J845J907m934O005
2100B997n216K433J263m076N584n287K930j2k910N365n790L625j45l162N323n684
$$ plain form
1994 2459 -3966 2686 -1960 299 3160 -3268 2917 -3180 370 2206 -2613 3440 -2860 327 1242
2009 1242 -2878 3923 -2675 896 59 -3053 3926 -2978 1943 103 -2627 2879 -3298 2454 493
2024 493 -1738 2829 -3885 2004 221 -1293 3463 -3877 2326 -1044 -1167 3153 -3171 2909 -1936
2039 -1936 -713 2403 -3223 3376 -1255 -666 1857 -3327 3500 -1470 48 1443 -3682 3216 -2385
2054 -2385 946 1478 -2929 2977 -2660 1377 1368 -2583 3253 -3137 1213 690 -2219 3471 -2957 1289
2070 1289 -75 -1697 3254 -2940 2321 -479 -1725 2855 -2881 2464 -498 -1407 2385 -3520 2777
2085 2777 -1008 -638 2356 -3332 2733 -1603 -58 2045 -2792 2700 -1826 19 1926 -3008 2997
2100 2997 -2219 214 1477 -2599 2985 -2302 628 616 -2294 3071 -2719 906 761 -2401 2922 -2762
2116b762M384j450k235M573n368M357j547j564M380n682N019k832n19L694n754
2131c306N606l395L03L118n496N702l940Q99K655n042N422m312J653K049m437
2146b521N531m625K076O17l848N736m964L071m1l602N177m644L198m48l019N044
2162B738n191L896j143k166M692n571M331j567j613L936n124M217j881n75L487
2177B466n051M679l107p9L439m604M607l206L87K231m411N326l539P23J594m140
2193b685N019l957K023R73l855M854m473K600N48l016M371m307K655Lk413L946
2209B286m161K803n34k344M312m624L519j166j715L694m225M064k206p67L149
2224B085m512M146k445K1K523m120M412k777L43K289l989L762k791Q66J943l812
$$ plain form
2116 -2762 1622 172 -2063 2510 -2858 1499 -48 -1612 2768 -2914 2105 -727 -1246 2448 -3306
2131 -3306 2300 -1095 -792 2326 -3170 2532 -1408 -509 2146 -2896 2526 -1786 -133 1916 -2521
2146 -2521 3010 -1615 461 1078 -2770 2966 -1998 1073 1032 -2570 2607 -2037 1161 713 -2306 2738
2162 2738 -2453 1443 300 -1866 2826 -2745 1586 19 -1594 2342 -2782 1435 -446 -1021 2466
2177 2466 -2585 2094 -1013 -1092 2347 -2257 2350 -856 -469 1762 -2649 2677 -862 -139 1455 -2685
2193 -2685 2334 -1623 400 1373 -2482 2372 -2101 499 1047 -1969 2402 -1905 750 753 -1660 2286
2209 2286 -1875 928 394 -1950 2362 -2262 1257 91 -1624 2070 -2155 1909 -297 -1064 2085
2224 2085 -2427 1719 -726 -705 1818 -2302 2110 -667 -324 1965 -2024 1738 -1053 -187 1756 -2056
2240b056M450l790J425J333l656M982m290K064L05k828M253l696K163j07k724
2255b172M598m439L061q39k217M260m507L560j181j550L838n058M069j578o31
2270g86L292m395L581k370j55K681l887L851k467J9K296l677M142k873N49J582
2286A383l814M428l148J213J271l426M240l773K075O75k988M055l839K123J89
2301F64k370M099m062K295l74j946L824l723K686j097j457L539l709K828j322
2316a25j143L268m065L845k179l99K593l958L861k522L11J960l339L744l079N79
2332f48K289l683M093l112P52J301k650L836l357J286O41k485L717l313J800M49
2348I16k654L748l703K351j77j835L429l553K358p02j372L051l152K255r84j126
$$ plain form
2240 -2056 2394 -1396 29 1362 -2294 2688 -1602 462 767 -2061 2192 -1504 659 552 -2172
2255 -2172 2426 -2013 1048 209 -2008 2252 -2255 1305 124 -1426 2412 -2646 1423 -155 -786
2270 -786 2506 -1889 1692 -678 -833 1848 -2039 1812 -655 -636 1660 -2017 2125 -748 -199 1383
2286 1383 -2431 1997 -1151 62 1333 -2093 2147 -1626 449 1124 -1864 2191 -1648 475 664
2301 664 -1706 2393 -1669 626 252 -1694 2130 -1593 1093 -4 -1461 2078 -1631 1197 -125
2316 -125 -1268 2000 -2065 1780 -399 -798 1795 -2163 1698 -824 -513 1447 -1892 1852 -1227 -648
2332 -648 1641 -2042 2051 -1061 -309 992 -1658 2178 -1179 107 748 -1737 1980 -1333 467 916
2348 916 -1738 2010 -1693 658 481 -1354 2075 -1478 880 178 -1194 1857 -1295 960 -24 -1150
2364a150K943l617L035j587q65K971l849L833k376J11J787l322L390k128N55J606
2380A337l273L566k664N82J779l173L660l192J697N78k546L287k962J811J6k010
2396a507L329l716K795l96j997L295l508K478m45j511K506l138K816j007j267
2411a273K698l405K717r97l49K064l200L138j947j76K216l017K816j902K58J777
2427A418k932K878k073N64J332l054L549k859J156P69k518L157k325J308L50k348
2443a628L465k897J417K87j837K756k824J703j74j249K548k930K018n55j311K796
2459A585l014K581j392q20K703l196K882j541m78K358l210K787j735M07J113k665
2475a635L226k299P92P86k229K827k537J063J141k434K862k843J148P43j791K902
$$ plain form
2364 -1150 1793 -1824 1211 -376 -1241 1730 -2119 1714 -662 -551 1236 -2086 1304 -824 -269 1337
2380 1337 -1936 1630 -1034 -452 1327 -1846 1814 -1378 319 897 -1649 1638 -1324 487 503 -1507
2396 -1507 1822 -1894 901 505 -1492 1803 -1705 773 328 -1183 1323 -1815 1001 -6 -1273
2411 -1273 1425 -1980 737 -260 -609 1455 -1745 1393 -554 -730 1486 -1531 1285 -617 -359 1418
2427 1418 -1514 1364 -709 -145 1187 -1867 1682 -1177 -21 748 -1770 1387 -938 370 720 -1628
2443 -1628 1837 -1060 357 644 -1193 1563 -1261 442 268 -981 1567 -1363 655 100 -1211 1585
2459 1585 -1429 1152 -240 -1060 1643 -1553 1329 -212 -690 1668 -1542 1245 -490 -83 1030 -1635
2475 -1635 1591 -708 84 870 -1359 1468 -1069 -6 1135 -1299 1563 -1280 -132 611 -1180 1722
2491A722k826J477j42j531K916l023J943j63j596K738k683K367j241j158K757
2506A557l169K741j065p77K027k889K475j127k29J671k561K077j284J4K128k907
2522a318K870k345M58J282k059K422k168Q54M40j900K709k110R88R75k593K714
2538A219k238J641p8j812K606k551J564j5j235K273k514J807m68j027K227k661
2554a262J932j064m13K041k684K187q59n45J811k529K243r34m34J474k406K313
2570H71j396M74J177k592K416j642O84J223k195K242k131J121J43j904L112k353
2586g50R46K76j691K776k283J066P2j652K305j942J708n67j211J930k443K155
2602F95n54r09J819k660K063o32m99J682k331K197j106j04J447k198K151j614
$$ plain form
2491 1722 -1104 373 231 -1300 1616 -1407 536 373 -1223 1515 -1168 1199 -42 -1200 1557
2506 1557 -1612 1129 64 -713 1314 -1575 900 -227 -456 1215 -1346 731 -553 -539 1589 -1318
2522 -1318 1552 -793 -335 947 -1112 1310 -858 -4 436 -1464 1245 -865 123 1098 -1495 1219
2538 1219 -1019 622 544 -1268 1338 -1213 351 336 -899 1374 -1140 667 199 -828 1399 -1262
2554 -1262 670 -394 -807 1234 -1450 737 -122 -667 1144 -1385 858 -76 -510 964 -1442 871
2570 871 -525 -51 1126 -1466 950 -692 -8 1215 -980 1262 -869 252 395 -1509 1603 -750
2586 -750 196 472 -1219 1557 -726 340 412 -1240 1065 -877 831 264 -947 983 -1460 695
2602 695 141 -768 1051 -1609 454 -178 -677 1005 -1326 871 -235 -339 1108 -1090 1061 -553
2618e53nJ424k062K403j678P6R74j939K358j498L91R16k074K153j698J434p4j522
2636i74K107k245J357K54j116J707k222J577l77q88K076k089J481n48q52K130
2652A378k605K190j079n41J730k349K169j228k45J578k172K005j042m33J291j873
2668a226K067j535M42P50j433K042j648O96K60j386J945k015R97O41j722K395
2684A270k211J036K09j176J942j784R55J25q59J390j557J603q31q59J863k205
2700a089J693o48m47J271j979J880p33k85J300j997J469l53l96J036k045K341
2716A018j606K10J225j636J506j243M65M86j078J629j514O44L59j427J795j431
2732e98P07M55j497K038j815R69K31j060J167j375J367m62q03J736k144J248j61
$$ plain form
2618 -553 -558 866 -1196 1207 -471 -395 579 -1360 998 -500 -109 807 -1267 886 -812 622 548 -974
2636 -974 1133 -1112 245 499 -617 1090 -1132 445 68 -820 1256 -833 648 100 -752 1378
2652 1378 -1227 963 -116 -657 1073 -1276 893 -335 -580 998 -1174 831 -211 -644 647 -1226
2668 -1226 841 -694 -252 498 -935 1107 -541 155 415 -971 974 -1041 -44 597 -1125 1270
2684 1270 -941 95 304 -872 1070 -714 241 366 -493 897 -660 943 112 -747 1116 -1089
2700 -1089 604 -44 -491 780 -1199 681 -52 -337 963 -1034 435 82 -314 722 -1323 1018
2716 1018 -588 -378 847 -789 717 -526 -61 425 -653 976 -538 106 465 -962 833 -598
2732 -598 109 564 -933 1105 -710 259 490 -570 597 -778 589 127 -676 1060 -1084 164 3
2749Cm67J614k017J424q18l09J292j317J082j098K42P26j270J869r65m40R78j414
2767h85J728j390K83P74j508J910j672R63K75j301J616j168M18J94p19J284j455
2784f53P91j11o94J703j720J337o48o54J685j842J244m86n46J426j581J352m28
2801A75o99J219j654J637o71l55P25j072J485q78K55N73j900K067j420L80Q75
2818G42j670K030j319K08L79j062J416j440P92P5p97J559j372R36m13q69J564
2835G59j420Q99P0p43J132j620J259j16n65J376j847J281m45m64J339j672J566
2852G89q94j63Q77j414J485r22J23L26n97Q78q24J13Q05j538J683j151K56O16
2870D48j463J622j092O12J3j083J690j060L29K05p60J326j369Q83k55n20J213
$$ plain form
2749 3 -464 1150 -867 557 -261 -570 722 -595 487 -611 -369 357 -913 956 -9 -449 529 -885
2767 -885 843 -547 -264 510 -998 912 -760 203 478 -823 793 -375 43 237 -482 802 -653
2784 -653 138 27 -667 1036 -684 653 5 -649 1036 -806 438 -48 -594 832 -749 603 175
2801 175 -524 695 -959 678 7 -348 377 -695 790 -88 167 740 -1160 907 -513 -133 742
2818 742 -928 1102 -217 -9 370 -692 724 -716 76 151 -646 913 -459 477 64 -805 759
2835 759 -661 238 308 -435 697 -923 336 220 -345 1031 -816 465 20 -444 895 -777 789
2852 789 -105 -268 609 -805 680 -242 -119 207 -390 488 -336 -223 582 -956 727 -424 -168 448
2870 448 -1015 607 -485 127 140 -943 747 -313 16 221 -539 787 -582 301 46 -474 739
2887G39j557J126n65k63J198j667J249l67l39J296j578J089l56l90J107j558J155
2904C19p56J01Q59r62J135p98P2J03p78J141n08K5P39j166J005r62M51N46r51
2923c85R46r55L74J52r78J452j171Q02k0q55J174r15P02k24p79J453j498J024
2941B99l52m23J020j064R48o75P3N88j003P56n44J05J009r72O96p51k46P29m96
2960c03J032r10J16L37r56J638q91L2K19r64J256r74M98Q0n68R50j004M06K97
2979B91p48J149j229P97n9n88J073j096Q89o51l93J606j349R86q96j86P17j030
2997g17R84j09n09O04p89O73m08J64P03j423J235o72L62N29q43O54o68L49K80
3016C99j033J310j010L81K74r25J140p97L67r7m49J138p34L91j44p92J095r60
$$ plain form
2887 739 -818 308 -257 -520 678 -989 260 -107 -446 850 -728 361 5 -385 722 -836 319
2904 319 -437 -336 523 -439 696 -102 -30 73 -705 436 -72 -47 692 -474 531 -431 20 566 -385
2923 -385 561 -394 -20 132 -846 606 -565 237 217 -638 536 -379 323 99 -680 773 -725 299
2941 299 -53 -476 544 -520 428 -247 -174 414 -589 167 -377 -272 737 -235 461 -290 -536 193 -303
2960 -303 729 -181 -65 272 -684 954 63 95 314 -650 606 -368 130 210 -358 592 -412 -6 291
2979 291 -457 692 -537 260 201 -387 686 -410 479 -172 -565 1041 -308 678 -218 -404 313 -717
2997 -717 267 158 -351 253 -536 137 -271 -107 596 -827 408 -264 98 627 -216 438 -230 119 399
3016 399 -634 676 -334 47 321 -604 536 -261 106 9 -440 698 -36 355 211 -581 514 -446
3034d46O12j03l9M42j067O88Q7l59R11j163N59j17m08J006j093J213q61m8N23
3053C37q07R16o57M1L30o13P55n06Q0O86r63Q40q68L89J4m42R60r44N61J81l04
3074a4R12j060M17l25m99Q48n81N85j07o73J100j015R81p37k2P84j028R52k35
3093B83m14N33r85P97j42j93N76r20R08o65J38N32r42J015l71n56Q34p64N60l59
3113a35m8L02p66J064o60O03j3p20O64r58Q56J34p29R82r26L90J64q11R61n94
3133b40K49O8n16R53j017O18p1m3O69j064P01j87K4K80r03N55k46M16L0o11O67
3154C32l76R5K11m22N44q33L47L15l36N03n55K58l09k6N39m64K47M4l83N68n14
3175b15P72m75l78M36m52L93k72p9P12n62K88j52l32Q37r65O70k01o1M94q45Q09
$$ plain form
3034 -446 166 63 24 466 -601 87 174 -185 726 -437 122 5 -403 603 -490 723 -138 -186 337
3053 337 -470 446 -211 -170 160 -453 302 -204 -124 562 -401 439 -429 -40 -26 -468 492 -452 109 290 -14
3074 -14 898 -162 255 -70 -569 279 -302 283 176 -497 603 -412 569 -168 -190 594 -434 518 283
3093 283 -131 402 -583 214 72 -121 455 -465 443 -222 -84 448 -494 521 150 -406 428 -336 224 -135
3113 -135 -183 119 -647 417 -243 360 347 -373 291 -667 189 323 -406 576 -350 40 204 -607 354 -240
3133 -240 9 77 -439 514 -503 115 44 1 670 -394 307 120 144 424 -479 76 -170 246 276 -335 332
3154 332 -44 51 262 -160 384 -449 -102 213 -123 380 -175 83 -226 -252 287 -177 70 114 -269 299 -215
3175 -215 557 82 -296 140 -312 81 -191 -270 442 -120 168 16 -316 521 -444 226 25 -36 458 -387 422
3196D22r6m36K52n18R27o57K0L60n80O87j34l28J07o09R99n35K90J51o43P39j112
3217f94N73K68k2K97n49K86J77m09L61n06L33k18l81O67m96L12k10j87P28o89
3237c59Q40n10n32O49m64O70k02k42J95n29Q63l32j5j7k09P58n73J21k87j26O09
3258C08m20j39M15n59O18m71L24j59j20O11m73J64j21n91J010o86N99j34l17K24
3278H3o48R47l34j55L80p33O80j78k89N50m61N84o46j43M52l59P44n95p6M09n39
3299c27P97l93j69Kk17R35o22Q0o1m29P94n89J44J21j33L97n72L41mm74O06m88
3321b61N20q5m79O22k99J91q0q3J49j67pp1n44P25k98K68l24R7N35p21N05j97
3343dl4J19m15M17j85L14R1l48K44l8m06N97l65L40k04k18P8P1J92k22rk39K09
$$ plain form
3196 422 326 -110 142 -376 551 -106 -86 274 -306 381 247 -81 26 -583 416 -119 171 322 -321 418 -694
3217 -694 -121 147 125 422 -127 159 336 -73 288 -218 115 -103 -484 183 -313 -1 -211 -398 330 -359
3237 -359 481 -29 -561 88 -376 294 92 -150 45 -484 379 47 32 15 -194 564 -9 112 -175 -301 308
3258 308 -112 -251 164 -395 223 -248 76 -83 -203 408 -65 99 -22 -613 397 -289 310 176 -141 83
3278 83 -565 382 48 -107 273 -460 220 42 -247 303 -158 426 -220 -363 89 -270 474 -121 -197 212 -327
3299 -327 470 77 -92 -90 -307 628 6 86 25 -404 390 -199 -55 66 -67 330 -242 99 95 -379 227 -261
3321 -261 259 174 -305 317 18 209 129 46 195 28 21 -50 -594 131 -167 101 -223 -126 409 -312 193 -4
3343 -4 -38 81 -334 83 -102 212 303 -45 199 161 -245 352 -13 327 123 -95 -17 54 246 24 15 -224 -15
3366a5N72o84J73k33j74P94o66L84j13J40q9k75L77k29k20N34n76M56M9l41M96
3387C60l18J51l74l00N40l64L20r6K76r6o8L67m34J8K25n83P94j73l19J58j59
3408g5J81k94L15j29o9K84p57Q06k82j31N52o46K70m5j77O24p21J30R0l38K49
3429a63j19N87l36p5M92n13K81r1J8J80m46L21n06K99j5j56K95r4J32J40n38J96
3451a11r4J31L37l82M36k81j61J13j16L21k00J8Q2l03L58m17M31J94o43J60J44
3472A7M90n29J13J74n43M32k12j39L71n51M28J96n44O02n12n5J30j11O74p83M95
3493A43j88LJ16n16J304p37l68K48k17N23n11J52J79k18L59m74K50j78j21L17
3513F6k63K78o3j74N04o59K52Km0L57k29J64n13J04O47o96M39l07j03L26n29P80
$$ plain form
3366 -15 557 -127 46 -187 -361 433 -233 151 38 178 89 -186 191 -38 -258 276 -300 156 205 -136 360
3387 360 42 193 -181 -481 59 -305 15 -81 195 99 31 398 -36 -18 207 -376 418 245 -74 84 -75
3408 -75 106 -188 127 -2 -71 213 -544 262 -20 -151 401 -245 25 -20 -197 427 -294 -164 -74 -412 -163
3429 -163 -282 305 -31 -106 386 -127 154 63 81 261 -185 136 -370 -71 -86 -242 53 -41 91 231 -307 -111
3451 -111 -205 -74 263 -119 317 36 -125 -12 -128 193 -7 11 93 -210 148 -269 162 356 -287 -127 17
3472 17 507 -22 91 265 -278 154 -58 -197 174 -377 51 247 -297 305 -207 -262 -132 -243 431 -352 143
3493 143 -45 -42 74 -442 862 125 -243 5 -212 311 -200 -48 131 -87 272 -202 48 -130 -251 66
3513 66 -197 81 18 -156 348 -311 -59 -57 -97 260 31 195 -318 -214 433 -263 176 -131 -234 92 -437 343
3535C43l61j03K49j56L72j49k74j30K22L58n50K00J28o50R65m43J66j58p1J26
3555H4J55m34M22m81K92j57Q8o4J97K19n66L85M0k21J85l82K79Kk59n6j49O38
3577B17q4j77K23n49N89n58J85L52l70K64l02J32l10J92M12k81Q6J51k89L22l89
3598a84J76K72k90K34j75r2J37j89M16m47L12l39L02j94j46k7J84j89L23j33k73
3619c22J55Q2M74m13N7j37j69K1j10L23k0L83J4l34J78k95R0P7m87M62k69N01
3641B61j70l26N54l16j34L53m10K33R5k03M5k54M85o15N49m28N3N83n70Q6K42
3662A13m18L67pk09J12j24J74P6M2q1k9M26m54K61j78k17K66MJ89m38j6M37o48
3685c52M09j27J05K82m13j8q3n5K91k53J19p2q2K17j9M31m13K79k15j73K70p9
$$ plain form
3535 343 -18 -121 128 -28 344 195 -79 -209 13 371 -179 21 149 -501 464 21 187 29 -42 84
3555 84 239 -195 227 -254 38 -119 -31 -95 102 321 -245 140 180 -41 144 -238 41 43 -216 -272 -421 217
3577 217 133 -44 179 -370 219 -339 -154 198 -172 92 -210 -78 -388 -196 216 -65 21 172 -117 205 -184
3598 -184 -8 264 -26 208 33 -59 78 -111 305 -142 170 -169 133 -61 -207 -234 -50 -239 84 -49 -322
3619 -322 -167 -85 389 -24 33 -104 -273 -252 -362 -39 -59 324 338 4 182 -113 -23 54 -433 29 -240 261
3641 261 91 -235 319 3 -131 222 -188 45 140 -63 -18 -272 213 -402 147 -281 -228 355 -215 -129 113
3662 113 -305 62 55 -154 -42 -166 8 84 126 45 16 442 -12 249 71 -146 120 124 313 -125 -141 296 -352
3685 -352 57 -70 35 317 -96 -114 -197 -252 39 -214 -95 -167 -249 -32 -51 380 -33 246 31 -142 128 49
3707D9K7qk86N91k67J0j60m9m5R8l9K41j16J72m13L17P7l38K71k96J60k83n8K57
3731h8Q4N3l6n8K04l21L38o39M08R9l23L86J02j44j21K9K10j11o6q4p0L39m05
3754b14O3L9m9M02m88K89K2j16K87m70J80rJ46R9J02k90p0m2K10k33K99m57J94
3777a06L73l41m0K18j01K44o42O34l42J42J84l39K20Q5k19J87n09O54k21L4K3
3798A38k09K85m84J33J93j70L66k21R4j5j43j1J07J92M7l68J30j74M24k10l17
3819b13N30m84O8j6K90k88j8J77j86L25mm14J88k56K39r0J92q7l0L00l34j64M40
3842A65m89J86K81k04J2N1J27l56q7P03n50Q4K02J40k01j77K76o0l8K87m44L7
3864e5P0l80N64m1k67J46P9j97M1J06P8j64J91q9K15o68L52L59n30L83m12J16
$$ plain form
3707 49 76 68 -218 373 106 116 -44 -93 -138 -40 -79 162 46 218 -195 122 199 -139 132 -164 -4 -287 -345 -88
3731 -88 -4 49 13 -45 159 -162 176 -463 -55 44 -279 107 209 65 -56 -27 183 72 6 -78 -148 191 -214
3754 -214 -151 -112 -161 241 -247 42 64 -52 235 -235 -55 -64 82 181 283 -7 -77 -119 91 -142 157 -300 -106
3777 -106 267 -74 -114 104 3 247 -395 239 -103 39 223 -116 104 189 -30 157 -352 302 81 115 138
3798 138 -71 214 -270 -137 56 -114 252 31 125 110 -33 -44 63 255 302 -66 64 -110 314 104 -213
3819 -213 317 -167 -99 -115 175 -113 -131 46 -140 185 181 -233 -45 -301 -62 -152 40 -47 -77 223 -111 -275 165
3842 165 -324 -138 143 -61 -49 2 129 -227 -314 389 -161 -77 125 265 64 -113 163 103 65 352 -92 -55
3864 -55 15 -365 199 158 -109 37 116 -81 -40 66 144 -20 171 82 297 -371 -19 340 -190 193 -219 -103
3886a03K82l22K46k96L77J90p06J58mN1J10J24n7j39K05k19J32L35n46J35N1k4
3908b0J7j39J31K42j95L10k0j44l19RL53m93M79k92J52q0Q7j24j7q9K49k19K4
3931i8K28m65M69k47K19LJ35K4p1K51r16M93J73n13M00k5n3J49k49m0K28j05J41
3954A31j9J65m82K33n0J50j29l79M72j02n6J91j36k31p2K60q4k10N07m0k10J85
3976I4j49M1J83l71L77k45k51K23K76Kn26M53j90jK22j55p2K37O0j87k03K70l07
3999b19L65j5j46K65m00L24m10L24n8k12L36R7n06L9K88J14m5j21n6RL2N4O4j32
4023il05M91o0l1J68m63J41J4J09J61m49M99m93K37k30O3N16l10k48N19o59M12
4045G3J50k17l30J06J98j56P7M05m15J80r4RRj3M34p82L44K5L4m3k2k6O2j24J90
$$ plain form
3886 -103 179 -143 103 -193 184 374 -332 -174 -178 -127 -17 107 50 -89 116 -103 29 364 -182 -47 4 -20
3908 -20 -3 -142 -11 231 36 346 326 182 -137 -128 225 -268 211 -81 71 -9 78 -46 -63 -152 97 -122 -98
3931 -98 130 -335 134 -113 106 109 244 268 197 448 -468 25 198 -315 85 60 7 156 -93 -133 95 -10 131
3954 131 112 277 -205 28 -22 128 -1 -380 92 -10 -66 125 -11 -242 -314 -54 -138 -348 159 119 -91 94
3976 94 -55 -14 169 -202 175 -70 -321 -98 178 180 -346 107 -83 -84 138 -17 -89 148 208 21 -182 88 -219
3999 -219 146 131 -15 250 -150 174 -236 88 30 -182 154 251 -255 -216 72 186 141 20 -36 -27 5 59 123 -9
4023 -9 -314 177 117 86 254 -209 -68 -54 55 216 -233 266 -227 10 -220 -157 359 49 -199 320 -339 73
4045 73 223 6 -324 -218 -20 -176 -99 306 -109 71 -23 -14 -5 -18 416 -366 -22 3 37 -6 -28 -54 8 -116 74
4070G4j49L24j95n2j47KJ18l79J84L42p8Rl7k6J4k78N8q1L40lj29q6R1K48m01
4095b37J88p1K06q2j13O9J85P5j74n2j65N8L1O4k7j76L78J27j67k03J65J82n15
4118b54J27L65j97m85L72J71j73P4j79L65j14p6K36j64k34L05n5k20N12l43j27
4139i4l15N00K4k08n7n0L50n28M23o5l43N03j44j56K8K43j19J15l20L16k60J74
4161A7m01K25l2J09J24l68M10J82o93O23j49J82l5k97L29n23K80R9J65l74j22
4182b49q4J65K16l9J21m38M20%k6j52Q1j36Ok2M9J8K74j01j69l50K30M58l99J63
4206C6p5n1K34k22L45m09K11k40j42P99o72N48n91J21K8j11N71m54L18j9k50q7
4228a12J01j5ok92K49j46L22j38J72Q6l33J78j97L53j98jk8l6M2O6O3K38j40l27
$$ plain form
4070 74 -75 249 54 2 -145 -143 -25 -404 -220 122 44 53 16 -10 4 -274 -216 -297 43 40 -89 -175 -84 164 -237
4095 -237 -49 -120 86 4 -109 -40 145 220 46 -6 -171 -113 -82 -18 -45 -221 157 284 117 -86 79 261 -254
4118 -254 -127 238 41 -444 -72 99 -74 0 -179 186 72 -4 232 68 -166 139 84 -136 376 33 -94
4139 -94 -409 91 115 -93 -150 -200 150 -378 45 -20 -363 140 -4 -160 -132 111 -8 107 -213 103 -157 17
4161 17 -384 -159 -191 -82 42 -326 84 266 -427 196 47 229 194 -103 226 -297 -17 82 247 -127 -249
4182 -249 -333 -168 48 9 130 -308 112 112 86 -66 15 -121 -115 -137 -88 -70 204 103 -66 -416 -186 272 -127 36
4206 36 -39 -90 144 -78 267 -142 69 -171 -313 486 -186 362 -229 -108 -80 -191 380 -74 244 225 -25 -112
4228 -112 -11 -26 -32 -324 -75 -221 101 -37 135 221 -112 66 -131 222 24 23 -5 -41 1 67 130 368 228 -99
4252i9K43m60K15n3N6K12m88M19M9l51N14k27r4qmj15o0N02j64q9J82j34J47l14
4276a21LqK1M04j13p8j79k67M98k96J2J90k29L52j20j80Q1L1j61J49J23o7o8k4
4300d7j11J64j63n1M29j26j4j41K13j21k54K76q5ON1P2L1j8J59j47k14N4n2K2
4324f7K40n76L48l6J47K4l37J57J2p6J89r7J18QL84m51k31K34j65P2L06J3j68
4347D8q6L40j32j75k52J20J80l6K62j10k08J61l7n5j85J86J37Q2l50K4R9q9j8
4370i4P4J67j39K5l02K95K50l08j02J89J10j04j80R6K6m5Rm21N86m77J55K71k03
4393a22Ll6L77k25j92M22o69M59M1L6q0j52K21k24R1K04k33o4j3J79k86M00q9
4416D8O5k05R9P4r1k36J33J79k24L27l75K54J12k53j35L0J50J62j72J83r6J09
$$ plain form
4252 -99 144 -316 -101 -154 -98 114 -374 45 94 -257 257 30 -64 -72 -76 -191 -251 251 87 -2 180 46 193 -121
4276 -121 -118 -126 -105 299 186 108 -71 -338 160 -136 -124 66 -163 189 69 -111 -30 1 -160 -11 112 45 -23 -47
4300 -47 -158 6 -157 -208 221 95 81 -60 153 32 -222 54 -31 -25 26 98 129 111 270 123 -91 -37 -89 -67
4324 -67 173 -403 -55 -91 56 80 -257 -100 -88 -164 25 -72 46 54 438 -13 -244 -10 -175 -103 203 216 48
4347 48 -38 302 170 -5 -257 -137 43 7 269 159 -49 112 75 20 -165 21 158 240 -110 -86 13 -76 -94
4370 -94 -20 147 8 33 -269 26 276 -32 -134 55 165 61 -119 -23 3 -42 -33 -454 132 -345 -190 81 -122
4393 -122 -119 -155 222 -3 -195 227 -442 17 58 94 14 -138 83 -141 -50 154 -79 -143 -156 23 -263 137 48
4416 48 113 -92 7 81 -10 -246 -113 66 -158 169 -206 48 160 -93 -228 -198 -48 114 -58 125 29 138
4438A38j55L9k84K12o6K44o5o8l2K31j70j40R2o1J59l9O1l45K19J55qm27K14p4
4462a70K94O6j37J2n9k16P1J74J43j46O7O5l12J81p3J97j46M6J03k41J81Lrk74
4486a80L07J71l06j17K4K81o3k26Q7R5j50K83m25K95L0q8R5N4l01M0M3K84m67
4509b34K71j87j79K67J69R6k43L9k97J15J56k6K5J29k69J17L9kO0m4m7o7lp6K44
4534E3o9j7j71K18o7j1r1J74K00k65j04K20N9k8l53K83k5O0p0K41k49r2J37L9
4558G2j12K04o5N4q0m10M99k19J24nR7r4j84J45j57N7J73k75M45l12r9l8J70J30
4582A20j24J8J48k89L23m22K68p8k68M37p6m07J03K84j67p9M60j62k25Q38n74
4603A28j12J26j03p3K57k86n5N6r9j50J95J56m0L87n34L84q6k1J70j45j17j53
$$ plain form
4438 138 -17 22 -262 -50 -116 128 63 -5 -37 194 24 -116 -24 -85 74 35 96 -249 -30 125 117 -310 -96 -170
4462 -170 124 190 53 65 6 -210 -139 35 178 32 99 164 -148 33 -40 157 11 57 160 -81 100 103 94 -180
4486 -180 127 298 -8 -125 -101 180 117 -109 -22 73 -77 206 -219 76 106 18 113 167 -134 -94 -51 233 -234
4509 -234 37 -150 -329 -62 107 203 -40 -1 -298 -183 -27 -53 -28 101 -168 -51 -12 -14 46 2 -45 -112 -115 -191 53
4534 53 -16 -33 -204 14 -53 -64 -155 19 219 -46 -150 70 129 101 -252 31 6 66 -4 237 -12 -104 33 72
4558 72 -40 164 99 153 73 -337 162 -57 67 62 159 65 -119 26 -131 -74 99 -176 269 -43 -142 -180 -10 120
4582 120 -4 14 162 -127 196 -226 42 -36 -304 133 57 -350 -247 37 -130 -209 251 89 -136 702 128
4603 128 16 142 39 -34 223 -63 -118 -62 -161 -311 -116 40 0 387 -147 237 151 130 300 155 38 -115
4625a15q4K02K7J48l41J15j8k46J28R2P5L8j75P4J89k30J36j5L94k25q6p2Q6j81
4649h4K47rl69%M15j62K90l96j2K15k6J17j50o6K65j30n65M64L1k19J74j1N8l80
4673c03N72n79M13j36j31k0K26j19O1K87r7O8k18q3J63J00j34J19k97k50M19l56
4695b95N02j49K4j03nj30m56M42m1K88l03J04j30K72n0M33p72L62J24j16J30l11
$$ plain form
4625 -115 -199 3 30 178 -163 -48 -66 -312 -184 -92 -17 21 -154 -80 109 -121 15 0 394 169 83 11 97 -84
4649 -84 163 154 -215 -215 200 38 328 -68 -80 135 109 226 76 10 275 145 -420 44 75 -144 30 19 77 -303
4673 -303 269 -310 103 -33 -164 -184 42 -77 -16 271 174 242 24 -59 104 204 70 189 -108 -358 61 -295
4695 -295 207 58 82 -21 -26 -156 -612 -170 -211 77 -226 -122 -252 20 -30 403 -369 -7 117 1 131 -180
$$ [...]
8191h1
##END NTUPLES=NMR FID
##END=
