##TITLE=1H_B1X-1
 CDCl3
 8 sc, 
 30.10.2024
##JCAMPDX= 6.0         $$ Bruker NMR JCAMP-DX V2.0
##DATA TYPE= NMR FID
##DATA CLASS= NTUPLES
##ORIGIN= UXNMR, Bruker Analytische Messtechnik GmbH
##OWNER= root
$$ XWIN-NMR		Version 3.5
$$ Wed Oct 30 14:27:06 2024 Russian Standard Time (UT+4h)  she@DPX200
##.OBSERVE FREQUENCY= 200.1318
##.OBSERVE NUCLEUS= ^1H
##.DELAY= (6, 6)
##.ACQUISITION MODE= SIMULTANEOUS
##.ACQUISITION SCHEME= undefined
##.AVERAGES= 8
##.DIGITISER RES= 18
##SPECTROMETER/DATA SYSTEM= spect
##.PULSE SEQUENCE= zg30
##.SOLVENT NAME= DMSO
##.SHIFT REFERENCE= (INTERNAL, DMSO, 0, 15.7039)
##AUDIT TRAIL= $$ (NUMBER, WHEN, WHO, WHERE, WHAT)
$$ ##TITLE= Audit trail, XWIN-NMR		Version 3.5
$$ ##JCAMPDX= 5.01
$$ ##ORIGIN= Bruker BioSpin GmbH
$$ ##OWNER= she
$$ F:/spectra/data/she/nmr/H-F/1/audita.txt
$$ ##AUDIT TRAIL=  $$ (NUMBER, WHEN, WHO, WHERE, WHAT)
(   1,<2024-10-30 14:25:51.71 +0400>,<she>,<DPX200>,
      <created by zg, POWCHK disabled, PULCHK disabled
       configuration hash MD5:
       00 E9 B6 7A A2 85 ED C7 34 08 36 98 17 FE 4E 26
       data hash MD5: 16K
       17 B0 AF 17 9B F6 A9 F2 42 66 EA 76 3A 7A A5 4A>)
$$ ##END=
$$ 
$$ hash MD5
$$ BF 0C 64 43 33 AE CD 95 DE 82 F3 68 52 C8 15 F9
##$RELAX= 
##$RELAX= 
##$RELAX= 
##$RELAX= 
##$RELAX= 
##$RELAX= 
$$ Bruker specific parameters
$$ --------------------------
##$DU= <F:/spectra>
##$EXPNO= 1
##$NAME= <H-F>
##$PROCNO= 1
##$TYPE= <nmr>
##$USER= <she>
##$AMP= (0..31)
100 100 100 100 100 100 100 100 100 100 100 100 100 100 100 100 100 100 
100 100 100 100 100 100 100 100 100 100 100 100 100 100 
##$AQSEQ= 0
##$AQ_mod= 1
##$AUNM= <au_zg>
##$AUTOPOS= <>
##$BF1= 200.13
##$BF2= 200.13
##$BF3= 200.13
##$BF4= 200.13
##$BF5= 200.13
##$BF6= 200.13
##$BF7= 200.13
##$BF8= 200.13
##$BYTORDA= 1
##$CFDGTYP= 0
##$CFRGTYP= 5
##$CHEMSTR= <none>
##$CNST= (0..31)
1 1 145 1 1 1 1 1 1 1 1 1 1 1 1 1 1 1 1 1 1 1 1 1 1 1 1 1 1 1 1 1 
##$CPDPRG= <>
##$CPDPRG1= <>
##$CPDPRG2= <>
##$CPDPRG3= <>
##$CPDPRG4= <mlev>
##$CPDPRG5= <mlev>
##$CPDPRG6= <mlev>
##$CPDPRG7= <mlev>
##$CPDPRG8= <mlev>
##$CPDPRGB= <>
##$CPDPRGT= <>
##$D= (0..31)
0 1.2 0 0 0 0 0 0 0 0.06 0 0.03 0 0 0 0 0.0002 0 0 0 0 0 0 0 0 0 0 0 0 
0 0 0 
##$DATE= 1730283951
##$DBL= (0..7)
120 120 120 120 120 120 120 120 
##$DBP= (0..7)
150 150 150 150 150 150 150 150 
##$DBP07= 0
##$DBPNAM0= <>
##$DBPNAM1= <>
##$DBPNAM2= <>
##$DBPNAM3= <>
##$DBPNAM4= <>
##$DBPNAM5= <>
##$DBPNAM6= <>
##$DBPNAM7= <>
##$DBPOAL= (0..7)
0.5 0.5 0.5 0.5 0.5 0.5 0.5 0.5 
##$DBPOFFS= (0..7)
0 0 0 0 0 0 0 0 
##$DE= 6
##$DECBNUC= <off>
##$DECIM= 24
##$DECNUC= <off>
##$DECSTAT= 4
##$DIGMOD= 1
##$DIGTYP= 9
##$DL= (0..7)
0 120 120 120 120 120 120 120 
##$DP= (0..7)
150 150 150 150 150 150 150 150 
##$DP07= 0
##$DPNAME0= <>
##$DPNAME1= <>
##$DPNAME2= <>
##$DPNAME3= <>
##$DPNAME4= <>
##$DPNAME5= <>
##$DPNAME6= <>
##$DPNAME7= <>
##$DPOAL= (0..7)
0.5 0.5 0.5 0.5 0.5 0.5 0.5 0.5 
##$DPOFFS= (0..7)
0 0 0 0 0 0 0 0 
##$DQDMODE= 0
##$DR= 18
##$DS= 0
##$DSLIST= <SSSSSSSSSSSSSSS>
##$DSPFIRM= 0
$$ [...]
##$SUBNAM2= <"">
##$SUBNAM3= <"">
##$SUBNAM4= <"">
##$SUBNAM5= <"">
##$SUBNAM6= <"">
##$SUBNAM7= <"">
##$SUBNAM8= <"">
##$SUBNAM9= <"">
##$SW= 24.0689170037331
##$SWIBOX= (0..15)
0 0 2 0 0 0 0 0 0 0 0 0 0 0 0 0 
##$SW_h= 4816.95568400771
##$TD= 16384
##$TD0= 1
##$TE= 0
##$TE2= 300
##$TE3= 300
##$TEG= 300
##$TL= (0..7)
0 120 120 120 120 120 120 120 
##$TP= (0..7)
150 150 150 150 150 150 150 150 
##$TP07= 0
##$TPNAME0= <>
##$TPNAME1= <>
##$TPNAME2= <>
##$TPNAME3= <>
##$TPNAME4= <>
##$TPNAME5= <>
##$TPNAME6= <>
##$TPNAME7= <>
##$TPOAL= (0..7)
0.5 0.5 0.5 0.5 0.5 0.5 0.5 0.5 
##$TPOFFS= (0..7)
0 0 0 0 0 0 0 0 
##$TUNHIN= 0
##$TUNHOUT= 0
##$TUNXOUT= 0
##$USERA1= <user>
##$USERA2= <user>
##$USERA3= <user>
##$USERA4= <user>
##$USERA5= <user>
##$V9= 5
##$VALIST= <valist>
##$VCLIST= <CCCCCCCCCCCCCCC>
##$VD= 0
##$VDLIST= <DDDDDDDDDDDDDDD>
##$VPLIST= <PPPPPPPPPPPPPPP>
##$VTLIST= <TTTTTTTTTTTTTTT>
##$WBST= 1024
##$WBSW= 4
##$XGAIN= (0..3)
0 0 0 0 
##$XL= 0
##$YL= 0
##$YMAX_a= 78647
##$YMIN_a= -78268
##$ZGOPTNS= <>
##$ZL1= 120
##$ZL2= 120
##$ZL3= 120
##$ZL4= 120
##$ABSF1= 10
##$ABSF2= 0
##$ABSG= 5
##$ABSL= 3
##$ALPHA= 0
##$AQORDER= 0
##$ASSFAC= 0
##$ASSFACI= 0
##$ASSFACX= 0
##$ASSWID= 0
##$AUNMP= <proc_1d>
##$AZFE= 0.1
##$AZFW= 0.1
##$BCFW= 1
##$BC_mod= 2
##$BYTORDP= 1
##$COROFFS= 0
##$CY= 11.3945322036743
##$DATMOD= 1
##$DC= 2
##$DFILT= <>
##$DTYPP= 0
##$F1P= 15.6554695791079
##$F2P= 12.8336369535428
##$FCOR= 0.5
##$FTSIZE= 0
##$FT_mod= 4
##$GAMMA= 1
##$GB= 0.15
##$INTBC= 1
##$INTSCL= 1
##$ISEN= 128
##$LB= 0.24
##$LEV0= 0
##$LPBIN= 0
##$MAXI= 10000
##$MC2= 0
##$MEAN= 0
##$ME_mod= 0
##$MI= 1.114404
##$NCOEF= 0
##$NC_proc= 0
##$NLEV= 6
##$NOISF1= 3.799351
##$NOISF2= 2.8
##$NSP= 1
##$NTH_PI= 0
##$NZP= 0
##$OFFSET= 15.70392
##$PC= 1
##$PHC0= -26515.21
##$PHC1= 23.18743
##$PH_mod= 1
##$PKNL= yes
##$PPARMOD= 0
##$PSCAL= 0
##$PSIGN= 0
##$REVERSE= no
##$SF= 200.130013532006
##$SI= 16384
##$SIGF1= 3
##$SIGF2= 2
##$SINO= 400
##$SIOLD= 16384
##$SREGLST= <1H.CDCl3>
##$SSB= 0
##$STSI= 0
##$STSR= 0
##$SW_p= 3612.71676300578
##$SYMM= 0
##$S_DEV= 0
##$TDeff= 0
##$TDoff= 0
##$TI= <>
##$TILT= no
##$TM1= 0
##$TM2= 0
##$TOPLEV= 0
##$USERP1= <user>
##$USERP2= <user>
##$USERP3= <user>
##$USERP4= <user>
##$USERP5= <user>
##$WDW= 1
##$XDIM= 8192
##$YMAX_p= 0
##$YMIN_p= 0
$$ End of Bruker specific parameters
$$ ---------------------------------
##NTUPLES= NMR FID
##VAR_NAME=  TIME,          FID/REAL,        FID/IMAG
##SYMBOL=    X,             R,               I
##VAR_TYPE=  INDEPENDENT,   DEPENDENT,       DEPENDENT
##VAR_FORM=  AFFN,          ASDF,            ASDF
##VAR_DIM=   8192,          8192,            8192
##UNITS=     SECONDS,       ARBITRARY UNITS, ARBITRARY UNITS
##FACTOR=    0.0002076,     1,               1
##FIRST=     0,             0,               0
##LAST=      1.7004516,     0,               0
##MIN=       0,             -78268,          0
##MAX=       1.7004516,     78647,           0
$$ Real data points
##PAGE= N=1
##DATA TABLE= (X++(R..R)), XYDATA
$$ [...]
1558f0K001l572P64K892k911n12L322j705j933L033n39k486K016J183l012Q52
1574f67K588k702o67L362j958j827L604r70k992L338L54l657K342J706l748J191
1590g03L077l744j17M080l001j565M286k003k565L931p76l244L004Q24l345J815
1606d6J948l106M83K761k612r10L071j395j909K764k53k447K050R97k670Q11K232
1623A769k347p41L112j758j922L457q23k971L039O16l463K237J823l816J364K662
1639B238l188k63L431k709j386L699j571k382L490l47l046K805P61l076J445J747
1655A648k793K61K617k241r60K939j121j909K268L48k541J743J284k784O40K251
1671A650k398o77L009j572j724L029n85k773K985N12l381K086J724l518J101K541
$$ y = [-60, 1941, -1631, -867, 2025, -886, -1398, 1924, 219, -1714, 1319, 780, -1706, 310, 1493, -1519, -667, 1921, -781, -1448, 1914, -44, -1871, 1733, 763, -2229, 1109, 1463, -2194, 148, 1854, -1894, -703, 2374, -1370, -1487, 2593, -408, -1973, 2313, 310, -2255, 1676, 900, -2344, 660, 1484, -1861, -46, 1902, -1204, -721, 2040, -572, -1482, 1589, 194, -1715, 1049, 796, -1651, 399, 1396, -1274, -463, 1769, -578, -1319, 1793, 35, -1887, 1570, 747, -2224, 815, 1431, -2032, 205, 2028, -1788, -424, 2238, -950, -1213, 2218, -491, -1877, 1822, 251, -2131, 1359, 1012, -2034, 771, 1532, -1544, -99, 1648, -1145, -884, 1733, -508, -1468, 1471, 350, -1559, 709, 1057, -1484, 259, 1543, -1241, -601, 1650, -748, -1425, 1584, 12, -1712, 1317, 732, -2041, 944, 1456, -1925, 161, 1885, -1633, -532, 2009]
1687B009l294m6L149k176j440L488j125k391L207m26k877K410R28l010J364J737
1703A507k555K34K359j779j022K616p85k182K370L58k672J566J339k639P23K278
1719A716k320o46K839j311j889L024n83k798K789N74l385J991J690l354J029K573
1735A939k817n5K767k156j235L013j126k171K813l4k653K000J090k660R80J849
1751A544k353J18K138j584j168K313n11k070K073N56k559J608J376k560N19K176
1767A616k228m87K813j791j570K836m37k550K408P51l031J833J557l047P78K341
1783A792k558l04K540j807j193K663p58j970K292L79k497J734J039k561R47J792
1799A530k300k95K342j412j249K353o20j744J940N96k306J260J333k560N76K094
$$ y = [2009, -1285, -1331, 1818, -358, -1798, 1690, 565, -1826, 1381, 955, -1922, 488, 1416, -1594, -230, 1507, -1048, -814, 1545, -234, -1256, 1360, 575, -1607, 763, 1121, -1551, 15, 1354, -1285, -562, 1716, -604, -1250, 1589, 278, -1611, 1413, 830, -1968, 821, 1395, -1990, 1, 1691, -1663, -634, 1939, -878, -933, 1834, -322, -1557, 1456, 330, -1841, 972, 938, -1715, 285, 1375, -1285, -305, 1544, -809, -691, 1447, -137, -1305, 1008, 497, -1573, 500, 1056, -1503, 105, 1481, -1079, -560, 1616, -612, -1099, 1714, -77, -1647, 1189, 752, -1798, 610, 1361, -1670, 163, 1720, -1327, -549, 1792, -766, -1070, 1470, -337, -1530, 1133, 375, -1595, 697, 1076, -1421, 313, 1352, -1209, -262, 1530, -770, -1065, 1277, -135, -1384, 969, 349, -1395, 545, 1141, -1165, 95, 1428, -1132, -556, 1538]
1815A538k113n91K552j342j472K605n25k182K057O09k604J512J347k594O54K102
1831A553k328m17K826j633j230K389n84j936K000K74k404J471J264k356O13J981
1847A483k032l44K269j352j168K252m32j973J626N88k269J163J501k284K29K208
1863A465j933o87K682j444j360K273l28k227J969O01k525J410J490k332M50K103
1879A607k087l91K154j462j101K244n27j843J758O72k232J180J243k037M55J765
1895A398j818m72K073j182j235K012k62j919J927N13k121J007J325k061K98J854
1911A337j772o29K159j154j151J919j81j839J805M25j949J013J335k224K94J940
1927A328j870m75K051j084j131K021k79j713J709M27k180J082J118j752Q7J854
$$ y = [1538, -575, -1166, 1386, 44, -1428, 1177, 652, -1530, 527, 1136, -1468, 44, 1391, -1203, -549, 1553, -775, -1192, 1634, 1, -1229, 1160, 576, -1360, 640, 914, -1490, -19, 1245, -1111, -498, 1483, -549, -893, 1376, 24, -1144, 1108, 676, -1297, 329, 917, -1352, -189, 1312, -972, -743, 1465, -468, -1155, 1527, 83, -1277, 996, 668, -1559, 410, 1011, -1514, -104, 1386, -946, -496, 1607, -480, -871, 1283, -179, -1280, 964, 437, -1406, 352, 1024, -1208, -28, 1215, -822, -367, 1398, -420, -892, 1181, -1, -1236, 776, 514, -1405, 522, 1035, -1086, -79, 1246, -815, -517, 1337, -435, -1064, 1095, -59, -1210, 709, 528, -1311, 494, 919, -1030, -17, 1318, -906, -612, 1328, -542, -1017, 1034, -50, -1181, 840, 561, -1152, 557, 984, -1196, -114, 1004, -748, -661, 1193]
1943A193j649m58K064j278j171K124j40j864J569N16j944J123R60j757J30J786
1959A204j555n77J999q31j337K027k12j861J461N00j884Q21J343j796q8J865j307
1976b28o83J958p39j480K014j69j891J630K65j777J002J220j892L16J548j348
1992b54o56J978r65j212K025m14j655J485M64j841Q62J110j544J47J578j378m14
2009f84J627p90j149J582n0j776J533N24j744Q86J050j616K10J545j200r48J967
2026I67p56j391J751m4j794J618M61j784P49J365j561m3J588j583k74J706r01
2043G4j205J789l85j371J530L66j696Q44R91j467K27J033r39n00J450o67j008
2060i34J503N7j508J054P86j795P19J068j611J96J385j050p69J670m91j301J691
$$ y = [1193, -456, -914, 1150, -128, -1299, 825, 685, -1179, 390, 906, -1038, 85, 1045, -712, -582, 1204, -351, -928, 1071, 240, -1097, 930, 718, -1143, 318, 818, -1066, -245, 1098, -698, -786, 1079, -228, -911, 1047, 308, -1172, 842, 673, -1218, 412, 677, -1100, -98, 1122, -770, -454, 1094, -254, -910, 1068, 103, -1109, 916, 502, -1153, 332, 796, -1045, -183, 927, -617, -470, 1108, -270, -684, 943, 153, -996, 586, 536, -1240, 293, 817, -927, -41, 1009, -607, -397, 1148, -52, -1000, 967, 211, -1180, 571, 527, -1267, 351, 812, -972, -223, 1142, -419, -462, 1126, -457, -731, 975, 74, -1131, 658, 273, -1098, 432, 798, -898, -54, 937, -530, -303, 730, -209, -709, 741, 74, -934, 569, 626, -882, 172, 958, -837, -118, 950, -661, -465, 920, -130, -899, 771, 280, -1021, 670]
2077F70o8j682J421O10j887R44J044j770L52J229j236m65J656p27q80J337q3j390
2095i25J432O9j334O82Q89j377J10J460j184l68J227l58j104J270P0j538J184
2112B05M77j591O47J188j478l2J716j201p38J662o28j227J616j26j482J209N57
2129G74j690Q80J032j641K20J541j501j92J421q52p18J188o9j258J077L74j323
2146g37N38Q70j089O6J094r22m16J263n48q67J090Q3j301R41P35j494L91J362
2164A059j466j33J449j067o70J420n07j221J549L2j329J105O76j655O75J010j495
2181e68K00J162j150l46J395o24p80J277k59j037Q96O26j415M44Q86j136o3J234
2199G42r74k79J102m72q24J084L0r28M91P28j366M17J074j279n8J388j063n96
$$ y = [670, 602, -1080, 341, 951, -936, 8, 1052, -718, -366, 863, -373, -838, 818, 91, -789, 548, 465, -925, 507, 576, -758, -76, 813, -564, -454, 1006, -178, -546, 681, 323, -781, 489, 559, -979, 205, 682, -909, -262, 926, -552, -584, 1132, -69, -807, 855, 227, -1000, 616, 490, -992, 217, 774, -916, -36, 996, -645, -425, 1116, -385, -577, 844, -8, -726, 462, 393, -865, 212, 586, -737, -199, 671, -418, -352, 742, -180, -596, 667, 119, -748, 342, 425, -876, 65, 800, -694, -303, 1059, -407, -540, 909, -158, -828, 592, 85, -1136, 413, 445, -884, 221, 897, -758, -83, 927, -568, -368, 794, -356, -702, 693, 69, -711, 566, 307, -730, 166, 792, -623, -179, 707, -429, -492, 742, -232, -511, 591, 119, -705, 379, 409, -519, -28, 700, -666, -249, 825, -454, -512, 876, -187, -783]
2217g83J631p36q54J382k22j313J231L46j483O53R59j344O9J229j153j55J257
2234G14o86o23J140k01j070Q47M61j120L02P80q23k19J342r78m84J198k96r93
2252g09J082J1j269R17N83j226J56J251j218j54J533j048n90J442n01j071J266
2269D55q0j210J112K94j173N69P79j190K66R44r25k26J067p16n79R67j28q81P85
2288A30M96j030K36P19q57k24J145o56m75J006k66j128J061K21j008P75M80j036
2306d11K09J119j128k86J161q05m69J206m83q46J277j28j056R27K28j088O62M63
2324E52r49R1R37q33k76R60l91p96J119j30q02Q20J91r44J55R11q63j79Q72m83
2344c8m81J030j96p82P68K87j354P98N54j219M63P21r26q8J185q19n77J301m79
$$ y = [-783, 848, 112, -742, 640, 418, -895, 336, 682, -801, -148, 811, -533, -464, 765, -388, -543, 714, 28, -595, 545, 344, -726, 121, 582, -538, -236, 544, -279, -498, 844, -134, -618, 580, 284, -709, 373, 384, -885, 32, 615, -611, -455, 796, -422, -576, 957, -91, -681, 761, 260, -811, 455, 375, -835, 277, 571, -602, -33, 746, -444, -178, 766, -159, -385, 682, -34, -613, 354, 226, -655, 130, 626, -404, -168, 551, -306, -530, 615, -41, -516, 490, 224, -904, 157, 378, -630, 145, 625, -411, -202, 917, -211, -497, 664, -141, -610, 596, 113, -733, 544, 416, -640, 287, 515, -573, 89, 552, -397, -306, 631, -202, -478, 482, 91, -705, 414, 284, -518, 302, 493, -451, -296, 615, -248, -427, 445, -38, -519, 511, 315, -467, 301, 588, -766, 32, 586, -633, -170, 551, -375, -463, 722, -97, -674, 627, 148]
2363A48p59R17R9j145R92K92j150N79O24r52R2P45o65j16P45k35p16Q14m9q40
2383e80P30K25q40L49N84o60r5Q89o30m87R51k20q59Q51J88r94N64O26j250M69
2403a89R06r69j34R69o76m28R79m23p81R56N3q91P48K62p70L50O01r67O1Q75p33
2424b01k66Q03k18n38O33J44q66N47M88q48K76N65o96p9P59n19n23R01k66o21
2444e25Q09J63j048P28M80j139M03Q18j082Q3R52p87l75R88l56o79Q67l9q43P63
2464A81K47j010O23M03p81n6P46n17k71P88j38o50O53J46o79M78K55p95K24N97
2484D44q10L3Q02m94k94O23l1q35P38K25q75N76L76r63K61Q72j010K35N27n57
2504a57l00J025m87o68Q48J2p33N02M22r29L31O82q59J76N35m78k05P53m67n27
$$ y = [148, -611, 306, 405, -740, 252, 544, -606, -27, 597, -355, -263, 482, -183, -299, 446, 211, -505, 309, 260, -580, 150, 375, -465, -116, 468, -192, -287, 602, -28, -515, 436, 216, -643, 208, 396, -598, -34, 592, -658, -189, 717, -252, -386, 583, -93, -521, 458, 35, -746, 210, 263, -628, 120, 382, -388, -38, 563, -404, -343, 532, -201, -467, 336, 118, -420, 213, 357, -509, 38, 526, -322, -46, 519, -177, -256, 503, -16, -539, 362, 96, -525, 284, 447, -601, 127, 607, -532, -129, 689, -393, -310, 642, -145, -520, 468, 112, -567, 300, 261, -582, 181, 428, -582, 41, 444, -337, -393, 353, -164, -435, 353, 215, -435, 218, 364, -315, 163, 418, -377, -153, 444, -366, -333, 469, -25, -319, 304, 273, -562, 176, 401, -474, 102, 478, -485, -224, 648, -362, -127, 400, -157, -457, 568, 81, -587, 261, 273, -460, 42, 464, -465, -134, 548, -311, -135, 400, -78, -283, 470, 3, -524]
2524e24P21J64q98M42N02q17K91N96o93q4Q31o35l14Q56k87o60P15Lo44N12M94
2545E71q25J54O83p63kP42o68l74P99l08m33P41j07o00O25J94p80L08M18n93J3
2566b05O40n26j77O47k50n53P86o4n75M76J50p40J61P00p33m0P22n76k71P10j17
2587A65n06N53K4o74L63M91q52K88O10o71q3O70m61l97Q90k92n24P60r0n98L81
2608D7K32o14K72L84n01q1O07m87k93P93k92n32P46O8p67M97L60p87K39N94p38
2629b53o7P00m74k03P27k90n59P68j30o83O00J95o66J84N95o18M9O04n13l54Q24
2650D36l86l64O97k20l64K68K52o68K07N01n96R2N47n03k50P34l07n16O03J5o62
2671d84N58K58o47J19M85m37o8O09n65k70O63j30n64P26l0m57M34J46n58R7M96
$$ y = [-524, 197, 361, -537, -95, 407, -410, -119, 477, -216, -300, 531, -104, -418, 438, 151, -509, 206, 209, -435, 77, 571, -254, -100, 583, -180, -182, 560, -108, -482, 317, 9, -424, 317, 210, -390, 235, 429, -351, -43, 375, -218, -205, 435, -91, -268, 379, 129, -424, 362, 298, -277, 199, 349, -391, -230, 470, -263, -303, 419, -157, -428, 282, 165, -341, 212, 236, -438, -75, 416, -436, -148, 462, -209, -292, 378, -83, -480, 410, 118, -406, 354, 264, -334, 47, 279, -335, -63, 321, -180, -261, 346, -141, -434, 359, 67, -465, 281, 349, -418, 79, 439, -348, -109, 485, -253, -320, 380, -94, -297, 430, 140, -419, 349, 219, -464, 136, 331, -335, -151, 444, -174, -125, 479, -34, -388, 436, 50, -314, 383, 163, -201, 67, 319, -349, -142, 359, -237, -145, 402, -101, -351, 383, 76, -440, 163, 178, -484, 74, 332, -315, -196, 289, -148, -216, 393, -172, -442, 221, 91, -473, 253, 223, -234, 200, 346, -212, -115, 381]
2692C81n37j43N79l26l55P20j62n55O57J21p83M23L03o32J56N45o64j6N12k70
2712d6l75P92k44m87O68p2m90M31j2n22K73L00l54j17N65l59l90Q43m03l34N71
2733B38j26m21L52K86p87L28M36o02J16O29m84l01O14o0n23N85j26m34L14L98
2753D32p47K14M08n76J25N16m15j35N48k33m88N59ln64M40K26p17N47L22o17N6
2774a02M22l20l80O89j41n31N89M9p26M37L01o40L38L65n59J06N05l38l66N71
2794B69M0p05O02J13p84N25K53o77L65L25n57J57L68l02l05O37j77n46M98M5m49
2815c05M20K15o18L32K43m57K3L98l93o9M15k77k08L71J01m62L89K28n27J70M00
2836C89n75pM40k71m29P82l44l17N86K0n85L78K40o74K40M22n97J23M57k37l45
$$ y = [381, -156, -299, 280, -46, -401, 319, 157, -398, 259, 380, -403, 20, 323, -309, -153, 392, -272, -288, 224, -46, -421, 371, 127, -360, 308, 236, -254, 177, 165, -357, -84, 216, -138, -255, 310, -49, -439, 404, 1, -333, 238, 112, -309, 43, 329, -458, -130, 306, -296, -180, 449, -35, -336, 278, 218, -305, 280, 154, -280, 34, 432, -315, -101, 307, -269, -144, 372, -43, -178, 370, 137, -351, 208, 205, -359, 81, 307, -410, 137, 459, -158, -102, 320, 0, -380, 309, 168, -363, 226, 275, -451, -14, 287, -353, -15, 350, -209, -103, 402, 64, -302, 269, 309, -396, 206, 319, -465, 60, 313, -364, 1, 326, -231, -74, 294, -8, -313, 324, 147, -399, 99, 144, -305, 115, 330, -288, 44, 287, -170, -147, 251, -142, -211, 204, -73, -281, 90, 191, -271, 118, 346, -181, -11, 389, -186, -193, 247, -24, -453, 329, -15, -332, 254, 274, -311, 67, 307, -367, -127, 295, -302, -179, 278, 41, -304]
2857c04N75j68m09M93r7n24M23K16o07L63K67l62kM00j89l29M69j12l84L70K24
2878C13p33L42K81m34J54M61m06r4M52m35n6M74j24m53M84O7o25J84M68o62J08
2899b34N19n08N1M30k25k83N48k72l05L94q1m09K95L24n03J46M68n12N0M12l21
2920a6k64L57rm77M47P4n18L71L64m99J32L81m58J8L67m43j60N23n8m67M23J18
2942B06n51L98J81n07J36M42n08L6M34l77j93N30k31k33L92J09n22L58J14m84
2962b70J25N08m81j75N05k26l58N93o8l26M25j9n45L04L74p43K63N29n11j62O71
2983D13n54j53N92k20k43L83P1o67M96J48o03K47L22m86J67M67m60j67N28j83
3003I8k69K31R8m44L48J24m17K18L20m22LM33l50k18M97j04k87K69J11m58Q8L47
$$ y = [-304, 271, 103, -306, 187, 90, -434, -11, 205, -402, -39, 228, -134, -136, 264, 75, -254, 215, 103, -281, 89, 313, -420, -78, 203, -231, -77, 384, -22, -116, 336, -99, -155, 319, 195, -258, 226, 293, -332, -148, 320, -342, -234, 285, -223, -172, 258, 33, -250, 298, 26, -279, 115, 34, -375, -80, 244, -259, -113, 355, -157, -107, 305, -16, -280, 77, 68, -409, 38, 112, -406, -35, 329, -170, -38, 343, -115, -97, 270, -173, -333, 190, 132, -335, 88, 206, -345, 53, 234, -273, -137, 305, -203, -167, 267, -110, -303, 227, -4, -237, 155, 264, -258, 100, 214, -270, -145, 363, -118, -293, 212, -14, -372, 221, 153, -173, 252, 233, -312, -8, 366, -377, -114, 415, -96, -258, 413, -141, -294, 298, 78, -165, 218, 289, -378, 118, 266, -337, -90, 232, -254, -87, 380, -80, -247, 281, 98, -171, 60, 158, -286, 62, 186, -231, -13, 307, -115, -112, 321, -29, -247, 250, 146, -141, 128, 239, -219, -131, 216]
3025B16m31J13M09l75k01N50k89l10N97k29k65L60Om37L55J04m18J51M89m69j22
3046a96M63k59l28N09j74l42N09j42k12J3L56m03O2L97l87o0N17k67k88L84j27
3067B5l61L64J55l79K71L2j68L9J43k96j07N14k09m20P62k11m88M84k2l70L17
3088G5L39n64O1L49l90LN26m63j06K86j24k97M44R0m32K39J67l60j0K76m8k54
3110a93M09j01l67N04j20l16L95K0m14L03O5l26r7N47l43k47M86j55k20L67m1
3131A56n16O11j27l50K12J21k89J10L01m30J60J93p2l07L71j9l84K96J88m48J33
3152i0K84k52j9K75j78k56N32k56j81K57J3m23L54N5l84K67K43m43L9L25j07k34
3174a79L82k22j43J85K19m56K94J63n04K44K62k49j37K97k80k3L57j60j76K06
$$ y = [216, -215, -102, 307, -68, -269, 281, -8, -318, 279, 50, -215, 145, 151, -286, 69, 173, -245, -94, 395, -74, -196, 267, 8, -320, 189, 15, -327, 182, 40, -172, -159, 197, -206, -144, 253, -134, -194, 323, 56, -232, 152, 25, -336, 28, 183, -196, 75, 107, -61, -22, 121, -175, -282, 232, 23, -397, 365, 154, -334, 150, 128, -242, 75, 414, -150, -89, 260, -130, -127, 399, -64, -170, 116, -8, -305, 139, 229, -203, 36, 203, -157, -167, 109, 61, -193, 216, 115, -252, 252, 132, -184, 211, 231, -183, 120, 185, -141, -238, 309, -34, -281, 205, 50, -170, 197, 156, -360, 251, 124, -226, -14, 107, -182, -72, 229, -201, -41, 152, 80, -227, 144, 125, -259, 37, 225, -223, -90, 194, -58, -77, 198, 20, -236, 296, 40, -141, 116, 129, -294, 60, 115, -269, -2, 241, -202, -163, 162, 55, -179, 203, -19, -162, 23, 242, -214, 80, 243, -261, -17, 245, -4, -141, 156, -124, -147, 210, 50, -126, 80]
3194H0L1m01K64J94m13K56K24k25p5K17j64q0K69j87j91K58q5k20R3M18m33K02
3216C2K61m37J98J19k59j82M89l67o6K50r3k03L02J99l55J86J45m33J95K92l39
3237f6j73L46j85m0J91J3k85J86K73n17J43L88l70r6L18q3m91O43q1l63M48j25
3259G4k38J90J90l80J24O5r5l9K29k73J9L30k31j48K06L1k83K73L9l55K38K75
3281B41l50oK28j11j32M65k09k96L18M3l54J86J73k87j23M22k36q6L46k66k12
3302b46M11k24k32L91N1l82K60K10m60K56J93j39k73M38l73P9J58m6l68M80j50
3323C4k15K55R1m41K10K03l17R1L31k61j43K05mj72J01J20k37K2J83l15K28K49
3345B18l45j09L98j29KJ28j91l03L13J44l68M48j9l74K9L24k40m8K24j12k60L90
$$ y = [80, 111, -290, -26, 168, -245, 11, 235, 10, -65, 152, -12, -92, 177, -10, -201, 57, -28, -248, -155, 263, -170, 32, 293, -144, 54, 173, -86, -268, 221, -146, -212, 38, -55, -258, 44, 243, -112, 74, 219, -214, -19, 273, -66, -239, 107, -78, -118, 73, 86, -199, -13, 260, -257, -114, 274, -96, -192, 126, 43, -448, 195, 114, -249, 199, 74, -164, 26, 216, -164, -40, 25, -70, -109, 120, -153, -134, 196, -35, -183, 23, 54, -229, 44, 83, -272, -34, 241, -109, -115, 113, 2, -130, 335, 126, -170, 148, 191, -163, 23, 196, -91, -214, 208, -28, -114, 232, -34, -246, 165, -59, -291, 100, 151, -231, 29, 239, -221, 35, 228, 89, -184, 254, -119, -40, 118, 72, -296, 184, 34, -181, 74, 165, -276, -66, 137, -180, -89, 242, -19, -162, 43, 39, -133, -32, 88, -149, -127, 56, -259, -31, 218, -127, -236, 162, 33, 35, 163, -28, -331, -18, 126, -242, 206, 187, -187, -158, 166, -74, -122, 102, -10, -270, 120]
3367A20j73j24J84M1j42l3M44m96R0K58k63L9J55p4l26L83l6j61K09K0k38R2K12
3390A81m19K58J51l60Q5K02k29J48K48r6j85J22j8k06R8J28k98J02J57r6j34K76
3412A15l6k84M35k46j49L68j07k04J82Jj31MJ01n2j43L76k60j49N08l38p7K14
3434A28q6k24J65K6n7K3k7KOK62j78l56M79r6l05K16Rj47R2K34l62K43J03j22
3458B8j29J99Ml72L98l9k30K80Kl77L01M1k80R2K25j49o7J51Ql68M18j77k64K54
3482e1J96k04J53J16m15J45J33k02J15J77j87p1J45J8k84M29q7l00L53j10j30
3503f1j1K48j89j53L26j36k40J86J09l17K28K00m09L20Q6k50J36N0j61n4L14l07
3525h5M9J58l6k57J78J17j33LQ0k84J74J85l32Q4J73j34l8L36n5k46K05L0j55
$$ y = [120, -53, -177, 7, 48, -94, -127, 317, -179, -89, 169, -94, -55, 100, 26, -300, 83, 47, -114, 95, 115, -123, -31, 181, -238, 20, 171, -189, -104, 98, -131, 17, 265, 169, -16, 106, 88, -118, -20, 108, -190, -88, 69, -27, -161, 115, 79, -205, 230, -16, -165, 203, 96, -108, 74, 75, -56, -52, 49, -3, -146, 230, -30, -179, 329, -9, -86, 128, 42, -182, -17, 9, -48, -25, -52, -50, -44, 218, 40, -316, 163, 67, -238, -22, -13, -160, -68, 166, -196, 47, 150, 28, -101, 98, 102, -270, 128, 89, -141, 139, 141, -236, 65, 106, -174, -82, 143, -6, -73, 78, 86, -282, 136, -41, -305, -51, 145, -59, 94, 210, -205, -60, 73, -129, -14, 163, -24, -95, 50, 68, -216, 213, 126, -174, 179, 69, -61, -72, 176, -13, -166, 160, 24, -216, -30, 79, -238, -10, 190, -219, 101, 187, -63, 73, 123, -38, -92, 222, -85, -36, 122, 86, -171, 7, 124, -9, -6, 74, -210, -36, 149, -183, -99, 74, -60, -98, 238, 183, -63, 142, 172, 17]
3548A7k6R7j71N4J73r8k18L63k35k2K58J1l40J14J13k41K30J31l34N7K74k46j2
3571e1J27j88m9K09k0k08K30j1k49J56K13l69J67J65j38K2J52j60k7J64j0k21
3593i6N2J65k66J13J07j00o3K87j61j69K70j89j52J65R8l76L79L0k05K56N7l17
3615a15O8K39k51J16J09j92j67J55qo3L0N5k53L48J14k83Q3J47k61O0kJ13k30
3638a88K94J4r8O0r5p1J28J38l40L1L05k09r5K68j45j47K59nj79J08K9k61J00
3661i9K63k32L1J84j91m4J58m5o5K78k38j53J21J60l51J47M3M0q7J76j21k0J20
3684G5j06rO2L32m98J27Q0o0o7K50l23l5M10k70j47M27k18j52J39j6k06R1K25
3707A11k62O2K50k82j4K74j85l6J93o8r5j5J67j94J45M5o9k6J32j07j55K16o0
$$ y = [17, -9, 88, -83, -29, 144, 46, -172, 191, -44, -66, 192, 203, -137, -23, 90, -151, 79, 210, -124, -67, 207, -39, -51, 76, -112, -161, 48, 28, -180, 50, 39, -210, -54, 159, -210, -43, 122, -16, 6, 158, -2, -29, 135, 125, -96, -44, 121, -145, -32, 75, -25, -88, 199, 38, -131, 139, -50, -202, -37, 61, -315, 64, 94, -111, 145, 202, -115, -47, 192, -59, 57, 166, -26, -193, -38, -46, -109, -79, -24, -277, 71, 185, -98, -15, 132, -129, -69, -71, 42, -188, 106, 120, 22, 82, -13, -84, 44, 182, -158, -127, 178, -31, -126, 142, -3, -150, 109, 104, -75, 33, 62, -199, -99, 164, -68, -37, 147, -44, -88, 70, 25, -40, 238, 0, -153, -32, 128, -223, -76, -33, 7, -80, 96, -25, -45, 75, -31, -40, 22, 354, -144, -17, 63, 3, -64, 186, -137, -172, 238, -32, -179, 248, 30, -122, 17, 1, -205, -114, 111, -151, -89, 161, -121, -135, 139, -46, -82, 111, 43, -52, -67, 100, -94, 51, 96, 27, 1, 133, 26, -129, 87, 27]
3730B7j83K28J07l03J33O7r3P8O0j12K6O2j04p3K44j14p4Q9j66J1J85j48r6J18
3754c1J51k32J33R6k23LJ78k9j16K58k85j33L58p5j21K40j68j78K55J6j22n4J44
3777F5j53o9K23l7q0L9J88r1l6M0j48p2K29j77N6J10j14L5R2j33M2O6r8n0J54
3802H1Jk30J09P8r4j0J64J3j54P4O3l55K74l8k6R3k4q0P6m2j27J75jj09MK80j51
3829D4j13k5J15k13J32J66o3pO9j14n4Q7L4j98K10O6k42J7J24j99R6n6J1K16P
3854A10k02KK27k64Q8K62p2k80K30j34o0J83K8p4J03q7k72kJ11J10k6L5Q1j16
3878a9Q9j38jR1P2k18J94O1j84P2L0J7j97J94L2j56j28K13j45K10J11j06jm4j60
3903a11K2K29k54K3J36j23J03N9n0j56J82R9p4r9O6j5J3m4K6j35J16O6j23O1%
$$ y = [27, -156, 72, 179, -124, 9, 76, -17, 61, 121, 9, 35, 97, -7, -80, 164, 50, -24, 65, -101, -90, 95, -53, -149, -31, 120, -112, 21, 117, -106, -103, 75, 46, -70, 188, -97, -230, 128, 53, -68, 172, 4, -174, 81, 97, -25, -79, 65, -88, -157, 66, 29, -51, -12, 176, 85, 49, 89, -59, -131, 98, -79, -23, 87, -27, 8, 100, -33, 9, 75, -23, -73, 81, 82, -148, -39, 39, -55, -65, 99, 112, -42, 32, 95, -260, 14, -24, -50, 43, 19, -61, 15, -27, -154, 21, 20, -89, -85, 195, 44, -69, -94, 21, -192, -60, 106, 43, 36, 105, -9, -63, 24, 58, -140, 70, 136, -106, -89, 35, -164, -68, -124, -113, 103, 110, -92, -90, 137, -127, -39, 223, 151, -129, 101, -33, -93, 90, 118, 44, 147, 60, -212, -214, -103, 7, -19, 16, 97, -19, 70, -68, -69, 22, 94, -124, 70, 131, -53, 19, 49, 66, -131, 63, 95, -61, -189, 24, -121, 89, 200, 94, 93, 49, -111, -89, 140, -114, -91, 45, -78, 25, 84, 34, -122, 60, 159, 85, -14, 52, 37, 50, 6, 32, -103, 13, 79, -44, 17, 17]
3928A7o5j13K06p9P2P0k43j0K90j41n0P4m1J25r2J05k65J11J0j37J48M8m8j15
3952a23K11j93J05L6J8j94J93n5k38K74M5j44J19o2J5m1P8k3j32j8J25O3j25J7
3976d9o8K02j5j30Q8K14l84J91J30j63m0R7m0j51N8J1p2J55m1r2J45N3k74K67
4000I2j11p9J71o2j2n3J21j37J42j4N4k03Q4o9L9n8K43o3j58M6LkJ6O1j14L1M3
4027A1n4n7J21j24J00M5q5l5J00Ok2lJ49r0m8M8j26J02L6j26J56j27J5j02J56
4052D6N4j74PQ2j05J28l7l4q0J95j7k40K37ll1K9M7j72J81j18L6M0m2n5p2P4M
4079b0j03J21J00j84J58Q4k65J57J4n1n4J34q9q6J63Oj31J10l7k04J97j3o7Q7
4103B7m8r4O8K27j95K6O9j29j6K35k98L5K53j56k6P4n4j0PRk4k5rJ6M8R6j29m1
$$ y = [17, -48, -161, 45, -34, 38, 108, -135, -145, 145, 4, -46, 28, -13, 112, 20, 125, -140, -29, -19, -156, -8, 40, -8, -123, 88, -105, 0, 36, 54, -140, 53, -2, -240, 34, 79, -65, 54, -8, 7, -34, 44, 21, -111, -129, -4, 59, -66, -49, -117, 85, 70, -60, 28, 242, -142, 49, 179, 16, -24, 73, 33, -118, -60, -49, -121, 34, -7, -99, 46, 99, -175, 92, -19, -98, 73, 11, -1, -54, 67, -70, 72, 58, 112, -91, -7, -76, -37, -95, 148, 85, -73, -27, -24, -26, -10, 51, -63, -32, 11, -43, -100, 21, -103, -3, 42, -43, -78, 22, 28, 6, 3, 152, 62, 14, 62, -64, 38, 74, -52, 104, -23, -8, -110, 46, 100, -74, -67, 15, -90, 38, 1, -33, -113, 82, 65, -175, 62, 59, 28, 57, 104, -68, 113, -5, 31, 71, 29, -26, -98, -24, -20, -123, -2, 98, -86, 72, 156, -109, 48, 62, 11, -43, 91, 2, -84, 79, 85, -46, 64, 27, -177, 20, 7, -60, 27, -21, -115, -47, 180, -15, 11, 80, -49, -65, 170, -128, -93, 160, 4, -22, 52, -2, -12, -5, 4, -20, -45, -54, -38, 10, 106, -23, -64]
4131f4j8L8Q0O1j11K9M3r5J25k01R2k4nJ58j44j55J83j05J00M5M5j4r6P3q4J10
4157F6N0j88N9L6m3j5N6L6j04M3M6j63J60q3J2P8j14M8j38J61Rj16K24r2l3P7
4183G2J0k13J27J9j28J70r0o8j4J26lQ1o1nK0L8M2q1p6Mj9R3Q0j62j7L2N3q5J70
4212A15j24K7J3Pn7k1N7o6J33j6j26n3J58L9j76M4N7j30K70n3j29N2Q9k18L6P7
4238Ep4J02M4j21j7J55m0j18J10L7j30p5N1O1q5K47j50J9o0J01r6Q4p2r8K08j05
4264a7n5J15L2j32N4Q0j50M1J59j10p4J53p7l6r0J96jl4Kj53m4K24j45q9J54p
4290dj73K10R9j66J1N9k0k5l8M5pN6q5k0J88k04J2J59q8k1J0J1j06J46p1M8p9
4317e3N2l3J8J27p1k9n8O9j29K32j39o2l2J00n5O3R6j09L5P2k0j25J90o5r4J13
$$ y = [-64, -82, -44, 36, 97, -14, 15, 58, -37, 88, -113, -21, -45, -50, 108, -36, -191, -8, -113, -13, 32, 77, 63, -33, 40, -44, 66, 116, -72, -13, 23, -20, -35, 21, 57, -47, -4, 42, -121, 39, -44, -32, 46, -68, -20, -158, 3, 12, -104, 120, 28, -5, 72, 82, -131, -4, 15, -113, 57, -33, -101, -115, 11, 8, 89, 28, 23, 43, 81, 123, 42, -34, -30, -49, 44, 124, -38, -55, -23, 30, -55, 115, -9, 18, 31, 38, -19, -40, 17, -49, 84, 68, -58, -111, 47, 86, -90, -46, 11, -119, 151, 98, -31, 21, 110, -108, -72, 5, -69, 33, 77, -44, -61, 94, 54, -64, 46, 83, -47, -122, -71, -10, -95, 152, 2, 21, -39, 62, -34, 50, -22, -120, 88, -17, -72, 43, 75, -57, -3, 77, -73, -32, 127, 17, -57, 96, 19, -17, -107, 89, 88, 54, 56, -97, -141, 83, -62, -151, 3, -4, -177, 33, 132, -34, -23, 36, 16, -9, -47, -2, -9, 47, -38, -58, 130, -74, -62, 97, 9, -12, -2, 9, -97, 49, -22, 26, -53, -1, -34, -16, 111, 40, 11, -47, 22, -107, 125, -14, -76, -108, -8, -63, 0, 96, -13, 22, 94, 74, -51, 139, 74, -20, 93]
4343I3jk36J53J5n9N5M9oj62K97k62Q2J12j96J59o9J68l95J58J05j16N3J36j92
4367e9R9o3j9j8N4J33q0k9l6j2Q3m7n5J23p4o5R2Ql5j98K84j20L2lK1N7NM4j09
4396A3m0J40p5j87J69n3j09J88l7J50k52J49N9j55j7qj1J6M6O1M4k95J45J02l1
4421A2j85J93j7j9n0J02k03J07J36j43L7J46k14Q7J30j98J09M2j16n7K35p9j40
4444h5L5J31m0r4j5K5L1J54o7l2j17J93k68J57J53N0k63J43j4p7N9o2R6l4j91
4469a32K6Q5j00J08JP7j02k8l8P9oL8K3r3J99j79r6J75nq8K7NO5jo1K3o4J60j79
4498h1Q7J19j43P2J3P5j55L1Nq3q9L02m6j01N7j03L8J11j98N2J41r6jJ42j96L7
4524a0P9j7l4j16K69j85L9M6k4qj01J5RJ39K9r2oj61K52k13J35m4j77K51J4j18
$$ y = [93, 92, -144, 9, 24, -35, 20, 69, 63, -99, 198, -64, 18, 130, -66, 93, 24, 192, -203, -45, 60, -56, -3, 133, -59, 40, -23, -42, -60, -6, 127, 47, 18, -18, -30, 53, 6, -49, 74, 0, -65, 27, 35, 0, -198, 86, -34, -2, -5, 16, 73, 78, 122, 13, -27, 113, 38, -149, 20, -33, -142, 46, 9, 159, -93, 56, 115, -40, -57, -65, -76, -60, -14, 47, 91, -204, -59, 43, 12, -173, 20, 3, -16, -66, 36, -167, -60, 76, -67, -30, 116, -98, -11, 119, -79, 30, 72, -44, -101, 134, 55, -85, -50, 81, 41, -53, -68, -43, -12, 142, 75, 43, -74, 119, -149, 8, 161, 211, -52, 91, 77, 0, 59, -3, 93, 59, -132, -106, -21, -121, -13, -12, 65, -37, -65, -103, -24, -30, 8, 31, -62, 137, -42, -138, 37, 32, -56, -29, -24, 41, 40, -21, 2, -62, 98, -81, 6, 125, -18, 54, 67, 142, -13, 18, 23, -60, -149, 153, 107, 6, 63, -40, -2, 109, -89, -37, 104, 8, 7, 149, -47, -10, 69, 52, 18, -98, 171, -14, 25, 71, 47, 39, -62, -47, -38, 101, 130, 38, 32, -129, 123, -90, 45, 1, -176, 75, 89, -29]
4550b9K8k3J1Q9r6n0L8J1j2l4N1j2O0rR8p6m0J04j50J2O2j23N9Qr5R1M4n0K5Q0
4580G2n0j88K06o4K2N7J0j72J24j67J07Q9J7J9Nj08K1j19J12K62k66r5K07N8k50
4605i1Q9Q7j17Rj13P1J27j58P1m7O8p5J60l0j49J12J49j60K2Q7j20r2l3K43O4
4630A74j16j68K2L2J21l6k0J40j48m1L1j7l0m3J71j44J5j9J55j08J3q5J96q0P3
4655H8j63M1J49k35J88j6l3r4J22J10j27J91k83J68nj05m1J41j89J19Po8J41p6
4679C0L4o0o8J35j66J03J02q4k3P9m3m9j48J92k5L8R5j29O4k6j36K4J21j11P9
4704B8p1LN4Qj25N2m1j1j6J82o7k7P5P1r3m6J81j66R0%r1J6j1J8Oj6k3j6R6q2
4734b2K3j8L0j08lN6r6J00J8LJ7jJ7O6p0K5n4r6J81p4k4P8L2j24M1R9o6k0p4J48
$$ y = [-29, -1, -24, -13, 76, -20, -70, -32, -21, -33, -67, -16, -28, 32, 23, 121, 45, 5, 109, -41, -29, 33, -90, -31, -23, -118, -27, 17, -33, -8, 72, 22, -166, 40, -24, -2, 55, 65, -107, 17, -150, -43, 46, 63, 82, 87, -21, 0, -119, -7, 255, -11, -106, 101, 159, -91, -2, 85, -32, -23, -136, -65, 62, -96, -25, -72, -4, -79, 81, 51, -98, 14, 163, 3, 25, 112, -8, -100, -133, 110, 174, 58, -110, -88, -56, 65, 29, 9, 149, 1, -40, -9, -26, -56, -99, 72, -72, -57, -76, 79, -29, -16, -101, 95, 15, 88, -75, -34, 115, -120, 68, 52, 19, -75, 47, 157, 30, 221, -62, 106, 101, -4, -45, 96, -93, 26, 33, -35, 106, 30, 64, 4, -64, 71, -95, 8, 110, 26, 3, 82, 39, -10, -158, 34, 9, 47, 142, 13, 77, 51, -85, -61, 60, -51, 28, -43, -40, 14, 22, -103, -51, -92, -103, -119, 63, -4, -31, 44, 115, 22, -24, 157, -9, 81, 81, -10, 6, -5, 13, 19, 3, -20, -36, 60, -22, 1, -17, 13, -95, -98, -42, -138, -38, -20, -17, 0, -1, 16, 82, 12, 37, -17, -113, 68, -6, -30, 48, 80, -44, -3, 96, 30, 10, -64, 84]
4764H4j6L1q1m0KM7q7J61n3j97R6O3j0Q7j00K5J3r3J36j10J05q9O7oM3j59J48
4791F7j68Q3M0J26j41K0O3r9j3rL1p4J7j00K60p4K7n7k8J12o7m7J30o2j47J63
4817E3q2N9j01M6m0R7J12o6o8po1l0J16O9l2j46j9J43J6P9j99J55j51Q0p3R5j07
4844f2L3qR6j92N8O0J05j7o8n3k0J67j59M3m5K1q4J83q0J36k71K12j13R0J12k05
4870f1J4J38k5m2j00P3n2P3q4M3J26j11O7m6lr7pK4J40JJ17j7k13MR9p9mR6l4
4899D0n9j32O9M2R9j14J68n6j43M3K27j42o5J23j55q2J34J6N4j71J12p2m4J97
4923H9r4K1n3J36k36J39R6q6p0J17q5Q2j35R9j53K37j82J04Q6N9k14p9J73r6P6
4948C1q4R8L9k5J02k19%J28p2lN2m3o3M9k5oR3om9L0R4k18J38N9j60J43k3o1l0
$$ y = [84, 68, 99, 18, -22, -20, 27, -60, 101, 48, -149, -53, 10, 0, 87, -13, 12, 25, -68, 68, -42, 63, -26, 41, 35, 78, -81, 67, -101, -18, 22, 148, 7, 27, 90, -9, -22, -31, 0, -74, -57, -157, 103, 29, 56, -1, -29, 83, 16, -31, 99, 37, -110, 53, -29, 30, -71, -25, -65, 32, 144, 78, 10, 3, -58, -88, 28, 97, 65, -81, -100, 43, 59, 138, -61, 94, -57, 23, -50, 45, -62, -29, -37, 59, -133, -75, -15, 90, 73, 5, -48, -68, 99, -60, -17, -62, -41, -125, 58, -22, 114, -157, 55, -58, 32, 144, -61, -47, 91, 66, 24, -76, -3, -55, 18, -66, -23, 103, -8, 59, 13, 10, -87, -94, -70, 70, 71, 188, 171, -42, -38, 61, -18, -22, 74, 40, -19, -151, -82, -40, 59, -55, 113, 57, -86, -43, 184, 42, -23, 100, -55, -137, -3, 13, 67, -104, 8, -64, -108, 89, -5, 16, -37, 99, -137, 2, 98, 12, -58, 59, -26, 56, -79, 20, -133, 104, -78, 26, 112, 171, -43, -122, 51, -45, 31, -53, 45, 84, 59, 161, -58, -58, 70, -2, -5, 47, 4, -59, -10, -35, -41, 52, 46, -3, 27, 121, -97, 41, 100, -60, 83, 60, -1, -31]
4977c1J17j24k2J33m6P1j23o3M3J67j05j03O8K7K4q2P5j8o3O7ojJ65j10n3p0R3
5004C0m0O0N4j78M9J54j65R8j30JM2J05qj51J4J71j71J00M1m1j04j1k3J02N7k9
5030B7j43J12J18k21P9O7l2j15J44P4j18J5O5p4o3J88j29J42j63K0P8L5j09k1
5054b4P5J7j3j45%J7L6J27m8j6N6j44J04P5j27r2K2R1L9k27J30lM5K8k8J2JO7
5082G5j13M7j54J12R2m8q1J65k6l1L6m7o2J55lj8M6j24K4J15k10m3K17j07J4r5
5108f4L3Q3j36J32q3n6R8K2N9q4p6O1M4n5R4j51J43R1k19J65j0p8k5j04J28P1
5134H3q3J8l4m1O2L2N4k7o7P3q7LN5n3l1l0J30k37K02n9N4m0L6p7K1R6n3N5j04
5163d9P7Mq9P4lJ50j57Q3l2j27K07j96N4kn6L4qk0N5J20j14qL8O1j78J84j89J09
$$ y = [-31, 86, -38, -60, 73, 27, 98, -25, -88, -45, 122, 17, -86, -18, 9, 33, -49, 26, 8, -55, 12, 6, 5, 170, 60, 7, -63, 30, -10, 50, 104, -74, -25, 129, -36, 62, -68, -67, -25, 80, 72, -79, -65, 106, -65, 35, 76, 35, -69, -80, -103, -1, 56, 27, -116, -4, 114, -107, -28, 39, 7, -108, 36, 110, -8, 7, 72, -2, -65, 123, -6, 136, -27, -7, 71, 106, -3, -24, 51, 68, 55, -90, -90, -73, -37, 90, 42, 26, 82, -62, 42, 117, -10, -102, -80, 11, 50, -177, -47, -50, -5, 23, -5, 7, 8, 75, -38, 9, -145, -33, 59, 11, -70, 95, 69, 38, 74, 27, -35, 120, 117, 99, 145, 21, 45, 160, -50, -93, 124, 17, 31, -64, -31, 52, -84, 48, -35, -91, 7, 29, 88, 4, -72, -11, 33, -22, 72, -79, 64, 155, -64, 101, 91, 13, -12, -116, 12, 83, 0, 18, -16, -57, 5, 37, 91, 64, -3, 70, -17, -14, 41, -12, -43, -73, 57, -180, 22, -37, 17, -23, 13, -64, -43, 53, 0, 55, -49, 28, 32, -57, 17, 14, 164, 7, 90, 58, -69, 138, -58, -4, -6, -62, -28, -36, -56, -1, 119, 5, -3, 35, 96, -82, 102, -87, 22]
5191B2O9j95Q9J24j09k02J60O9p9J20L0j41j51J65l5M3j48J15J7J18j56Q2j15
5214a08O2m6Q5r3J05Mr5P2K9k5J86j48j37J53j9L9j10M7p8J78k7r8j9K2n0P7N7
5241F3k12R6NR4j2j8q6P8m0N9j11NQ4L6o8OK4p4Nn3J52K6r6NP6l6J5j28M1jQ3
5272A8j0J38j26m1n3Q3J3j70R6J39j23P4m3j3MO1R9k80J83j21J1LP5l0K03j82
5298HR1k55O7OO2P1m4m9j7M9J77k15j4O7O4np0n2K9O6j35N5Q7N3j54O4j38P3j3
5327g2Q4q2kJ61j98J04K5j13J1R6R0o9L4k03J80m6n1O3k5R1m2k06K23m6R2j8j28
5354d7J03M8k84J46j4Q6L7l4j19J15l7N7j5M8q4j4mj9M3o2O6PomJ63k43K01m3
5382I1j43J23k37O4J41m9l1Q4jkp0N1l7j4K7J1m1o6P6R0p3j23J46r6Q9%L5P7j20
$$ y = [22, 91, -104, -15, 109, 0, -202, -42, 27, -52, 68, 98, -43, -194, -29, -64, -21, -169, -54, -37, 81, -75, 7, -108, -46, -92, -7, -100, 5, 9, -86, -14, 15, -10, 176, 28, -109, 44, 25, 64, -46, 1, -77, 101, 74, -24, -43, -21, -71, 6, 63, -149, -53, -48, 46, 34, 16, -70, 8, -32, 27, -84, -79, 5, 41, -27, -21, 3, -71, -66, -119, 33, 59, -37, -32, 44, 8, 23, -105, -64, -65, 18, 8, 146, 20, -21, -74, 9, 22, -148, -52, 87, -36, 38, -5, -18, -14, 47, 146, -134, 49, -72, -61, -58, 17, -13, 190, 8, 99, -156, -89, -83, -21, 50, 6, -43, -60, -11, 166, -49, -63, 4, 68, 63, -7, -59, -30, 36, -99, -44, 43, 96, -58, 6, -132, -59, -72, 12, -70, -72, 89, -109, -5, 20, -93, -82, 14, 104, 35, 69, -134, 46, 0, -51, 12, -13, 78, 36, -170, 53, 7, 99, 81, -47, 56, 104, -180, -34, -48, 38, 75, 41, -78, 37, 0, 57, 42, 90, 6, -8, -12, -31, 12, -50, 16, 23, 17, 13, 176, -67, 134, 91, -52, 71, -166, -102, 39, -10, -41, 43, 42, 40, -30, 21, -16, -30, -3, 8, -33, -99, -23, 67, -6, -129, 17, -79, 10, 10, 45, 122, 2]
5411Bj35J80o5M6O5j29k0K33j60j03Q2l8k5Oj13K14J6j8ln5o7J81j48J79m9n3
5437B3Lq0n3J71j38J05k6J3KJ20k48R5j2j0M8J6l1J12j93J8P9O4Kj25L7M4J8L7
5465I1j30j8L9M9k3p1K7M5J5M4Q0j78P7j37Q2J7n6J63o0j27J07m8l3rJ89k38M3
5492f0P4n5rJ78j18OJ21m0j17J21n4p4o3J3J5OP2r2L1M1n3J53j77J30k44K38n4
5519a1OJ25j49O8j15M7J4N2J6j14lP7p0Q0K7k7n9J8M4j02J23r8J40j60rP5J7o4
5547e2M4J2M0k0J3J2j52O6p6J84l0J1j96J51L9%j37Q8j0Ok3p6M9M9j4L6o1N8K8
5576C9k0r1J51p8m3j7N5Rj61K11L9k28O7L4k5J56j93P5K7M8Lq1m1P9m0Oq2K9J47
5605G5j44J7N7K6JK5j18K5o6J09J1M8r8O0Q3o8M0j08N9r1lJ12q1J08m7q2L5j28
$$ y = [2, -133, 47, -18, 28, 93, -36, -56, 177, 17, -86, -4, -42, -67, -61, -174, 40, 56, 38, 35, -20, -87, 94, -54, 125, 76, 23, 26, -54, -107, 64, -74, 31, 5, 18, 20, 140, -108, -13, -25, -35, 13, 29, -2, 110, -83, -65, 14, 78, 80, -45, -8, 36, 54, 91, -39, -57, -18, 31, 8, -63, -36, 9, 24, 68, 148, -30, 47, -90, -8, 9, -47, 116, 56, -71, 36, -12, -45, -54, 135, -103, -60, 14, -41, -50, 128, 10, 16, 137, 97, -20, 101, 47, -27, -90, -77, -62, -56, 16, -76, -45, -4, -57, 96, -81, 49, -195, 43, -11, -5, 120, -29, 39, -76, -29, -15, 37, 53, -61, -64, 13, -57, 23, 50, 23, -36, -18, 26, -76, 47, -51, 89, -71, -80, -5, 12, -52, -8, 4, 44, 24, 37, 49, -103, -37, -113, 71, 41, 52, -144, 7, 46, 46, -91, -3, -13, -7, -30, -106, -57, -8, -22, 14, -47, 11, 39, 19, -72, 79, 1, -42, -59, -4, 5, -156, 55, 94, -134, -67, -33, -58, 98, -95, -20, 7, 55, 58, -23, -64, 15, -25, -19, -101, -72, 75, -69, -52, 5, 31, 32, 57, -61, -36, -102, 7, 18, 66, -32, 28, 111, 43, 83, -25, 34, -57, -60, 52, -29, 79, 32, -50, -15, -143]
5633a43J78j36O1nq6J52n9R4m3pj11J95j96J01O9j73O1J54l3p6L9j42K07j65M2
5658b2qP7p7j6K70k85M5n7J83j43L8K6p1j2N2lN6lj28O9j9j07J08j01J09Kj6R3
5686F0j06j5N6k3l5Q8Jn1Q9N2j32o9R2p8J6J13qMl2J4j24J19j60J31o8N0L9j22
5714i9J35km4l1Ok9o1P0J3L4M7j79M0K1L4O7j45R3J3p0J63j53j3R0N9J1q3m3P2
5743A6q7J20j08PL8J3n4p0R5Q3j31Q7J1m1J12o3J8j37K9M6o4M3p1J86j57J09R7
5770A27j35Mm5o1K50q5pL4Nk1m7jJ8K6L2j32j43J65j0J18o0N8n5r4K4M0K2m2o0
5799g5n4J84j13O8k9R8o8k1J46l3r6J31k8j39J1O2k1p5m8J53n3Qp0J48j42J85
5825A29j60j13K41j97L7Q7N3j17J39j15j2J04o8k7Q1k13J00J64l8j6k1j01Q8n9
$$ y = [-143, 35, -101, -40, -45, -131, 21, -38, 56, 13, 6, -105, 90, -106, -5, 64, -109, -48, 106, 73, -3, 36, -106, 101, -64, -22, -30, 47, -30, -46, 224, -61, -16, -73, 110, -33, 5, 31, -40, -52, 0, -3, 53, 50, -78, -9, -28, -135, -27, -128, -19, -17, -33, 60, -46, -61, -5, -28, -63, 25, 26, -25, 64, 116, -16, -85, 7, -71, -55, 58, 50, 54, 22, 36, -88, 31, -129, 2, -66, -16, 23, -99, 36, 34, -10, -41, -35, -64, -125, -55, -42, -8, 39, -140, -100, -79, -45, 22, -123, -30, -17, -87, 76, -77, -90, 0, 59, 70, -13, -56, 16, -71, 49, -59, -52, -14, -1, -55, -125, -30, 53, -78, 9, 20, -21, 91, 28, 46, -91, -62, -16, -80, -37, -108, 78, -79, 30, 127, -8, -4, -49, -110, 140, 55, 48, 82, 87, 66, 19, 18, 36, 62, 94, -38, -181, -16, -26, 92, 32, 90, 35, -59, -35, 5, 27, -15, -75, -129, 55, -58, 10, -19, 79, 11, -10, 136, 103, 7, 138, 110, -29, -18, 44, 23, -52, -100, 53, 0, 8, -62, 86, -56, 129, -31, -144, 97, -100, -63, 24, 77, -40, 99, -16, -28, 76, 8, -19, 62, -151, -51, 113, 75, 59, 38, -63, 25, -34]
5849c4N5o1J27P8l08O1M8q3J88j13J94p8o1J6j38J05K6p4j0J35j08L0r6R5J4R8
5875A06j61J41j09%j8L3o6K5P6p7K4n2N0k1k2J83Rj60J26L3k4k33J70k1p2P9p1
5902e2P2L2p8J7m2J66j8j6n7Qn9L0L6j6n7M1lL5p7N0r2O4k7r7J89j51K50j36Q0
5931I2k29N9K58j80Rj29K95j25mM3j74J09o9NK0r2R7k6R6j05k0k0K07j65J14j65
5957i9J30l1Pj08n9J33M4JN7k7p4q4Q0m2N9P2o5Rm9k5R8R2j24k8J02j12j1p8Q1
5986e1J53m6P5j92m7J99j19L8j9r0O8L3k4MJ1K0K1J7mj61J55oj19J74j34L2J95
6013A83j64q7O1J5j05LQ8l6M7m1n7Q0O5l3jJ6Mr8k0K19r9q2J16j36Qj1J06j27
6041h6J06Rl5q7J53q3P2P2j10N4j81J59q9K4M7n6n8K16p5o1n3k5L0J25m7N4o8
$$ y = [-34, 21, -40, 87, 165, -143, -82, -34, -117, 71, -42, 152, 74, 13, 29, -109, -4, 22, -52, -62, 73, -35, -5, -101, -6, 8, 106, -55, 86, -23, -23, -41, -8, -74, -49, 27, -50, -26, -78, -28, -49, -71, 112, 121, -39, 87, 120, 96, -137, 33, 12, -60, 19, -52, 20, 52, -26, -9, -51, 115, 97, 81, 24, 32, -27, 3, 39, 23, -34, 7, 4, 39, -38, 12, -80, -16, -43, -140, 49, -102, 148, 12, 92, -137, -78, 180, 0, 9, -120, 175, 50, 46, 89, -85, 24, -45, -40, -20, -112, -15, -41, 55, -50, -70, -90, 117, -48, 66, -99, 31, 0, 7, -101, -160, -27, 17, 18, 75, 48, -26, -110, -30, -72, -13, 59, -6, 3, -46, -71, 27, 119, -5, -33, 69, -43, -54, -132, -51, 102, 56, 131, -61, -108, 91, -28, 10, -9, -99, -31, 2, -22, -18, -7, 13, 34, 51, 47, -114, 41, 35, -84, 90, -44, -12, 183, 19, -68, -7, 8, -97, -94, -6, -42, 5, -36, -93, -13, 52, 19, 18, 34, 38, -60, -80, 139, 40, -42, 74, -62, -54, -65, 41, -86, 20, 29, -6, -93, 60, -23, 49, 121, 11, 65, -116, 43, -46, -22, 25, -31, -89, 127, 52, -9, -62, -87, -57, 68, 21, 75, 7]
6068GN5J16j75j13J36M2k6j29P5j6p8J16N0L9k4p1l7j10J32N2j7K3j47K22j97
6093g5J55rK3n7n6J2n6K7L4k7l6K2J45n1Q0j40l1M1q4J55j73l2K86j04l9k8l4
6120e2R5p7j1j0R8N7j75N4nK13r3j59J34j16K9J2K9n7kn6K6J01q9l1J60j07RR4
6148G1o8R5j39j9k8J01m4r0J63n8J36k44n6N4K24j96L9R5n1J32l8q9R2n7l6R9
6174H8k71J67kK8J0n2j7lJ47j54J82l6j45R7n7Q1l4Km1kO9k9k7K22l60Q9J65j12
6202En4O6j10Q7L4m6L1m8J73pl1j78J08o7R3q5o6L7O3q1K1Mj2l2K85j64L7j38
6230g5P4l5J08j9m2p1J03o9j75J21J48p9R9j47q7J08P2%P3n6o6J5j02J18l9l0
6256e3lJ7r9J71n1M4M2j9mp0K4n8N3p3J62j15OQj8O1QoL5p9M0o1L3P5j60N6Q4
$$ y = [7, 62, 178, 3, -110, 26, 68, 42, -87, -12, -28, -106, 10, 60, 99, 75, 4, -33, -143, -11, 41, 24, 47, -100, 122, -75, 80, 71, 94, 37, -19, -7, -63, -36, -2, -29, -65, -43, 102, 51, 131, -9, -40, 1, -83, 72, -101, -133, 153, 49, 10, -18, -52, 43, -34, -45, -55, 43, 100, -75, -21, -26, 187, 94, -65, 69, -47, -18, -6, 23, -34, -36, -92, -66, 35, -54, -85, 75, -32, -23, 71, 3, 98, -41, -60, -88, 13, -31, -121, 42, -16, 120, -124, -180, -126, 98, -98, -59, 36, -15, 117, 79, -10, 82, 25, -11, 88, -183, -16, -18, 10, 20, -32, -49, -52, 95, -59, 123, 87, -58, 39, -18, 63, 29, 31, -10, -12, 57, 28, 1, 223, -137, -48, 117, 5, -49, 17, -93, -6, 28, -18, 13, -35, 138, 131, 100, -78, 30, -37, 56, -29, -95, -58, 5, -76, -55, -51, -63, -95, 190, 26, 63, -75, -1, -36, 72, 53, 11, -60, 43, -26, -201, -80, 68, -11, 88, -59, -146, -38, 34, 34, 107, 51, -15, 0, -102, 16, -23, -53, -56, -39, -138, 33, -18, 26, 68, 49, 45, -25, -1, -59, -6, -79, 83, -32, -26, -18, -36, 25, 33, 27, 62, -17, 23, -38, -5, 70, -90, -34, 50]
6287E0q1M8k9P1O5l05J53q6N8J87j11m9P8o5J15l7q6J44j66q0J02n1R0j41J90
6312F4j56J13j2Jk4j25J38M4%j26k9J23J1K3r1j15J58q1l0R5qJ11j46P9J3j3O7
6339H4j55O8P2j4j02N6L9j10N9M8k5j07P7O2j45J14j01M7O4j51J74q0j6J9l7l3
6365i3J14jLj6O0j27RO6P7m3r4P4l1J11k05J33p5pO1Q5q9m7l0N3J05r2K5Q9L8
6394A53j69J7J6j4L3j2P2j25l3l5J27j26K05k1j21p2O1J68j92k3J04K5j29J19
6418B8Qk7KN1r8K3moK09p0o3j4KMj69O1J05j26J73k01J36Nk9J8k9K1L0j56O4m7
6448i9M8N1j32J14m5J11N4k54K08o7J19k5j8J0n7m1l8lk9J50l9krL1j61R6j5J17
6476G5r9j32J55J9l8j11Q4J41j5j79K06j33j08K49j38Q2j49Q9R0j42rM6O8m1m0
$$ y = [50, -31, 17, -12, 59, 124, -181, -28, -114, -56, 131, 20, -29, 49, -16, 99, 62, -24, 120, -46, -126, -24, -75, 15, -126, 64, -92, 21, 9, 10, -14, -139, -1, 43, 43, -83, -112, 11, 22, 45, -46, -161, -3, -84, -114, -19, -27, 84, -62, 17, 30, 17, 84, -71, -3, 69, 55, -47, 9, 48, -62, -3, 45, 20, -87, -10, 52, -93, 21, -80, -33, 31, -120, 54, -26, -42, -23, -60, -93, 21, 20, 23, 7, 67, -60, -51, 15, 92, 49, -45, 29, -2, 109, -96, 37, -38, -45, 16, 101, 12, -35, -65, -12, 93, 1, 26, 115, 153, -16, 1, 17, 3, 36, 24, 96, -29, -62, -97, 30, -96, 109, 88, -33, -105, -44, 124, -68, -91, 13, 38, -91, 28, 36, 9, 11, 62, -36, -13, -17, -23, 186, 116, 53, 39, 41, 45, -124, -63, 42, -84, 89, -112, 24, 29, 0, 18, -11, 10, 40, -116, -52, -99, -51, 0, -132, -18, -63, 48, 102, -152, 56, -11, 108, 83, 65, 75, 18, -23, -61, -64, -93, 57, 18, 16, 7, 38, -123, -27, -42, 75, -24, -156, -1, 18, -20, -131, -47, 94, 79, -100, 106, -27, -135, 114, -24, 58, -91, -2, 88, -54, -63, -17, 51, 10, -30]
6501c0j8L7n6J25p6J10j01J06j87M4J0lM5p9J45p2nJ27j71O5p0MK9m3O5K8q0Q0
6529B9j21O4o0P0q0J26n9Oj7l1J28j09O5k3N7J7J2j85Q5J26j3j53l7N8N1q5J12
6556C3j53J60k1o4L6M3J30j89J30j45K2o1J53j45J21K8j39J6N0K4j5o0N9l8J02
6581G7q7J04o5j26J60M6j72K23j35OJ8J5j2j05l2J12J7j23J07j15K12j77rK19
6605A58j32J9q1K6m2nK8o9O3J1O1j56R4o9K21m4r9k7J6M6j9o9R9k3J23k66J15
6632b1Q4j65J75k27J82r2M8q0K7k9N9k8J88l4j02l0k3J07j09J12j17K30p9o7j4
6657eJ9p3p6N5R3j2J7J4j06J24o8m4M1j64J93P5j96RJ02J03m2j5P6j01J75j46
6683D8k0Q2j01o7J13m2J8m5Q4j24M0J5M0j73R9J32j64l2K06OOj25J16j20J9J62
$$ y = [-30, -48, -11, -67, 58, -18, 92, -9, 97, -90, -46, -36, -39, 6, -73, 72, 0, -5, 122, -49, 16, -54, -50, -21, -64, 1, 29, -51, 29, -92, -28, -88, -18, -98, 28, -31, -25, -42, -73, 55, -54, 11, -12, 45, 62, 74, -111, -26, 100, 87, -66, -103, -45, 6, -79, 33, -120, 40, 19, -45, -9, 34, 164, -25, 105, -40, -18, -79, 74, -71, 50, 78, -61, -45, 5, 29, 14, -46, 13, -25, 77, -10, 94, 29, -97, 63, 109, -63, 160, 25, 31, 49, 64, 52, -53, -85, 27, 44, -79, 28, -87, 125, -52, -61, 158, 26, 45, -36, -10, -52, -57, -29, -98, -35, -24, 37, -119, -25, -94, 127, 83, -16, -43, -27, 19, 0, -69, 30, 7, 130, -136, -21, 63, -102, 73, -154, 28, -64, -16, -96, -69, -98, -39, -67, 121, 87, -15, -45, -68, 39, -70, 42, -75, 155, 76, 9, -5, 14, -59, -135, -80, 13, 1, 18, 32, -74, 50, -18, -62, -21, -185, 8, 83, -113, -104, -2, 101, 59, 44, 120, 19, 194, 48, 28, 110, 9, -58, 55, 13, 31, -14, 70, -54, -14, 1, 41, -132, -33, 99, -65, -97, 109, 115, 121, -4, 112, -8, 11, 173]
6709A73k48J55m5j83J15jm5J32m5QK8Q0j73j9J51j3k10R8M8r8R2j1o9J15k6O6
6735G5m0r6j4M0P6l0j34Q0J87j51l9O1j85K00m7L4K4JO5p0l8l5l5L3R9j22m8P6
6763c3M3j10P6L4j36K00j04Q9j75J18l2m2mJ49n7j35k0Q5l4j2J03q5L4mpQ3k2
6790Br0J13K1q8j2L7J31j63j4Q2j0l3M9K1L5j13J6L0j34O9O2l4P1ljk0nj6R3j28
6820c2P8o5j6M0j31J68l6N0NM4j96R7m4oJ18K9j21L2N5j4l9oJ6K8j42Q8q4L3l2
6849h3J33q1mj6O4kP1k6Kj12Q3N4l7Qr3n1R5J7J08o7j00J74j87M4J9J31j17j09
6877h2J99j13P2n6n7J57l7j1q9MR9k06J33m4j0j3j3jPQ3K3J7n2J55j25j11M9J45
6905A23k00R5q7j0M3Q6j07N9j25J93q8k2lJ05o9%r7J87j64p7J59l2J13j74J40
$$ y = [173, -75, 80, 35, -148, -33, -34, -79, 53, 8, 16, 44, 124, -49, -68, 83, 70, -140, -42, 6, -92, 0, -11, -80, 35, 9, 75, 35, -61, -75, -35, 41, 11, -123, -43, 144, -7, -46, 15, -170, 30, -17, 17, 41, 42, 107, 37, -1, -36, -71, -38, 61, -61, -109, -33, 10, -100, -24, 10, -126, 74, -30, 59, -116, 2, -30, -72, -76, 73, 16, -119, -139, -54, -88, -100, 3, -82, -48, -52, -59, 24, 2, -88, 25, 46, -42, -54, -17, 114, -49, -63, 19, 9, -24, 25, 46, 81, -32, -16, 14, -120, -51, 11, -23, 48, 45, 44, 24, 19, 3, 96, -32, 46, -19, -35, 5, -126, 42, 6, 56, 61, 105, -91, 6, -38, -44, 74, 103, -18, 14, 69, 55, 16, 10, 26, 54, -88, 0, -84, -51, -83, 50, -31, -35, -51, 13, 11, 82, 56, 58, -54, 29, 83, 46, 54, -39, -90, 5, 22, 130, 63, -37, 137, -50, -6, 13, 144, 27, -82, 117, 4, 76, 20, -37, 120, 83, 72, -17, -13, 86, -120, 13, -31, -41, -54, -67, -68, -61, 22, 45, 62, 10, 165, 40, -71, -22, 123, -77, 18, -69, -79, -36, 50, -57, 2, -123, 70, -18, -40, -43, 62, -7, -7, -104, 83, -81, -158, 1, -31, 82, -92, 48]
6930D8L9p0J9m8P8n1Nj0r0j02K43j19lL1j04J78K0K3j51L9Q7J0Lj10JQ1j7L0k1
6959C9n9j8K5k4j8k4R6j02J41j30J18j74J22q8J76j02J9K0j52K67j88J33j41R2
6983B8K6m2j0j6l6J05j50K27j41j9kM4m3J08j23J1R8k20P5P2o5n1K27j33j6jL8
7010iO1N0r7pLk9O9k8K5j04J31N0j24j3o7K6j6O5O1q2O8m7J35j95lN9R8j46J80
7039A14j21Q7k11L5MjK3L0j12J35J33p8m5J6O3k8o5P5l0m9J9l6j9L6M6o6j7Kj15
7068a75L29j05j1Nj0j49J02o1K0K8N8j56R0J13j12K3j35J71p4M5%J3j57J70P7
7093I9j27O5j30PP7L7k8n8Q8k7M9J8j65R5kj54K03o5p5%K16m7Pr2k4N1K3m6K7
7122B2r1J1K7k3J35mj27J4N1j4P8n5p1J58m7p4p8m5J31KK2k0J63j37j41J88p4
$$ y = [48, 87, 17, 36, -12, 66, 15, 20, 10, -80, -182, 61, -58, -61, -30, -134, 44, 64, 87, -64, -25, 62, 72, 75, -35, -34, 47, 30, 60, 39, -20, -38, -13, -37, -55, -79, 17, -85, 56, -74, 44, -130, -8, -96, 80, -22, -3, 17, -135, 132, -56, 77, -64, 28, 54, 12, 2, -14, -50, 55, -95, 132, -9, -28, -30, 14, -29, 79, -44, -33, 65, -155, -80, -8, -73, -124, 103, -30, -46, -47, -9, 52, 102, 5, -2, 1, -28, 41, 13, 38, -66, 65, 115, -9, -22, -89, -63, -79, -14, 47, -35, 33, -14, 121, -74, -77, -18, 80, -66, 114, -7, 80, -131, -96, -92, -93, -70, -40, -152, -17, 116, 38, -7, 9, 72, 44, -21, 54, 24, -25, -6, -42, -61, -25, 21, -45, -62, -60, -175, 154, 49, 38, 43, 33, -116, -14, -75, -55, -27, 31, -125, -35, 78, -34, -11, -146, 25, -49, -4, -4, 9, -148, 22, 99, -28, 37, -93, -86, -9, 28, 0, -58, 30, 3, 52, 70, -95, 0, -2, -156, 47, -18, -93, -93, 123, 76, 83, -9, -33, 18, 41, -5, 22, -69, -58, -31, -54, 81, 77, -50, -36, 15, 1, 79, 24, -47, 111, 64, -10, -88, -133, -2, 0, 22, 2, 165, 28, -113, 75, 1]
7149AP1n9l6m2J81k28R7K0M6k0R6l22K16m3m3J86n3j36J27Pp2O5M3p4j57J69o9
7176b9O0M3o0n3J4l2R3j00N8m3K3M7n7R9L6O3o8j52O0O6k3Rj36J22j3J58q1r6
7204HM1l6P6k10J80m5l1P4j9j1j43N3J17pj41J98j43k7m3K34k00L8P0q1KP6k8
7231Bk9J28j55O8k0R2j44J35l7L7o3p4m2J17m9K1O2p0R2n9M8r1K66k14Q2j03k7
7258b7k2j33J33oL4j05J28k2p5J09O2j01J01r7J30j55n1J28Q2j61O4j8L1m9k0
7283d0J7O3n1l2Q9n4P8j60NN0j1J25n5J1P1p5P7k53J18kj05J3K5O5p1J66j04J06
7311F6j73K04n6k6l2Q0O9j97P5N6m9Q9j98J04J86l03L4J92j08k5R2j60J14l4j0
7336a0K8n0J8j1J8J33j99J36m1q0J47k2j31J11j1OJr0J07m9M1j64J57L1O4j59
$$ y = [1, 72, 13, -23, -65, 116, -112, -15, 5, 51, 31, 127, -195, 21, -22, -65, 121, 68, -68, 59, 66, -6, 59, 102, 28, -129, 40, -29, 31, 74, 14, -39, -25, -57, 36, -64, -6, -49, -26, 21, -36, 63, 99, 162, 94, -58, 2, 68, 45, 54, -82, 40, 27, 185, 104, 8, 49, 13, 89, -121, 59, 14, -17, 57, 38, 27, -116, -63, 54, 47, -94, 104, -39, -66, -109, 125, -75, -37, 33, -48, -46, 30, 2, -27, 101, -54, 14, -6, 86, -58, 77, 40, 77, 14, -60, -102, 15, -34, -13, 49, -21, 71, 12, 60, -31, 235, 21, 103, 0, -27, -49, -182, -49, -55, -21, -126, 2, -20, -95, 14, 76, -25, 76, -21, 109, -46, -97, 31, 113, -48, 16, -2, 29, -20, -40, -23, 40, -11, -43, 46, -8, 70, -90, -85, -35, -46, 79, 24, 35, 106, 31, 108, -145, -27, -29, -134, -121, -96, -31, -102, 64, -40, 66, -107, 97, 41, 15, -17, 63, 132, -65, 10, 66, 17, 106, -92, 12, 198, -105, -71, 121, 13, -12, 80, -80, 34, 0, -10, 18, -32, -14, -25, -7, 126, -73, 63, 22, -58, 89, 67, -64, 47, 36, 42, 43, -47, 60, 11, 52, -112, 45, 76, 140, -19]
7362a9K3j18J9J8N4P9r3P0l2L1ml9j9Q2j43R6k7l2J67K6jk13J61j44N1o7M6J21
7390I3j45Q9j03j5Q3o5J36j13M6o6O9m4R9m7j05Q5J6J6n8N8j64J53Ok0qR2l3j60
7418a05n3J94o0r3K9j2K0P9r0o0K12r3q0J35n7J4nk1J44k8J3K6j20O4o4J2K1J2
7446C4r5N4p2O9k0P9o4J63j35p3O4J23j53L1M9l7k1j70J67jl2N2Jn9J38l2l1q8
7474e9J42p8l1pP8p8Q5j02K5nK7L5K4l5l9L1J10k04P2K8M5P7j52M9M4j56J08k6
7502Ho2r6J63O6o4L7l8j9m2M8Q0n1o4R7n8J72j51L2j01J4O1o0m5J65j02N6j18
7529g2Kj02K97k37J30L3p5P8m3l4m6J1O1O5q4j31J10J24j3l2j07K7n4kJ01Q5o1
7556C1n8L1L9j08J64j97J67j73K10r8j6k7J60J3j61r9J41J0r9R9j18J77J00k81
$$ y = [-19, 4, -114, -95, -77, -23, 56, -37, 33, 1, 32, 28, -11, -30, 52, -91, 5, -22, -54, 113, 139, 138, -75, 86, -58, -7, -74, -28, 93, -52, 37, -66, -81, 2, -63, 73, -40, 6, -60, 9, -35, 64, 17, -88, -3, 13, 29, -29, 29, -135, 18, 24, 4, -4, 88, 55, -105, -158, 36, -24, -117, -88, -100, -80, -1, -91, -151, 61, -32, -112, 23, -34, -20, -25, -46, 98, 70, 83, 109, -11, 53, -11, 1, 22, 34, -61, -7, -79, -10, -30, 49, -15, 148, 13, -60, 4, 127, -26, 5, 54, 17, -4, -174, -7, -8, -40, 12, 13, -46, 92, 60, 29, -59, 83, 5, -26, -33, 45, -33, 52, -50, -25, -30, -3, 32, 56, 21, -18, 13, 123, -81, -9, 19, 64, 141, -11, 38, 82, -74, 34, 8, -54, -150, 13, 79, 15, 52, 14, -5, -47, 1, 81, 30, -34, 63, 5, 177, 26, 58, -43, -29, 32, -28, -73, 92, -10, 46, -72, -70, -172, 125, -112, 18, 51, -24, 54, 11, -23, -69, -58, 3, 68, -16, -147, -37, 87, 74, 42, -65, -38, -92, -94, 7, 92, 31, -27, 4, 43, -65, 99, -98, 69, -104, 106, 8, -8, -35, 125, 138, -23, -122, 19, 29, -70, 29, -89, 88, 188, -93]
7580i3J77o5Q7j36J42j32n8M7L9j0N9l8n2J01j79J87k24K14o3JP7o1rpL9L5j3
7607F5P5k11J10l5P0o7J01p7m6q8Q3J20j33rK0l6J41m6p2K8p6R3LnJ8l1R9j09
7635a5K04p0j14N3j61J17O1j6m3P9k79J21J76m5l9o4K0q3J68L8q5j1L9q5L5Q2
7661H3m6j25J57R4j63o1N6L5j64L2J73M5q7l9L2j42J75j12O1m2nR6j33L6N4J37
7687A47k54M6k6J55K0p1pq7J28L6j27O4j4j01J70KJ35j68M1j82J31j01J9l5M1
7712c8J03k8L8j61N5P1n5Q7p5K4j04O6K7n1P8p8J24l6p7M0O2M5j22p4N9q4J73
7739F9P2j78K0K2J2J04j59J21p3J0j60J89n5Q7j21J65j34J42J1j19Oj37J51L4
7763G9p2L6J0j14Jm1O9j01K48Q2l01K4OJ13j67K71q6j25J50p5o9J51j13k4R4r5
$$ y = [-93, 84, 19, 106, -30, 112, -20, -78, -31, 8, -2, 57, 19, -33, 68, -111, 76, -148, 66, 3, 4, 81, 20, 11, 4, 43, 78, 65, 140, -71, 39, 4, 74, 7, 108, 31, -15, -103, -20, 100, -33, -42, -22, -58, 83, 37, -35, -7, -83, 10, 13, 8, 26, -5, 94, -15, 189, 119, 5, 58, -103, 14, 75, 59, 16, 95, -184, -63, 113, 68, 29, -35, -15, -98, 70, 108, 23, 12, 51, -34, 1, 83, 37, -88, 69, 163, 0, -61, -5, 30, -134, -102, 71, 116, 29, -10, 22, -120, 55, -57, 4, -38, -43, 53, -80, -44, 10, 147, -107, -61, -87, 68, 88, 17, 10, -77, 51, 87, -40, 24, 10, -91, 79, 81, 216, 48, 89, -93, 38, -63, -44, -79, -38, 65, 37, 75, -86, -31, 40, -15, 72, -3, 21, -83, -17, 10, -41, 37, -41, 83, 47, -30, 10, 72, 117, -5, -79, -20, -104, 69, 141, -37, -17, 5, 17, 121, -38, 83, 10, 20, -140, 49, -6, 81, -40, 125, -9, 133, 144, 25, 31, -106, 45, 79, 7, 43, 53, -61, -60, -101, -32, -133, 115, 197, -104, -80, -74, 39, -128, 143, 57, -68, 82, 7, -62, 89, -24, -48, 46, -49]
7789d9J5j2J10Kk1q2P9km9m0J52j10J21j77J13q5n5J64Oj22N6K1K8L2j66O3o5
7816g3J13k54J05n5J97j88J36j29J35K4n8J39L0n3n1Q4q8j6Q0k07N7O4m3J50k3
7841G6O1p4K8q5R2j22P2j18K5m5N1J89j42l7J20n0o5N8k17J75lQl7P1N6j34N9
7868A2j4Kk7Nj71K91L1k36J0P3M5Oj20R3j8rK5K4m9q0K8J71N0j02k2J9K5j1o7
7897a6K9J3p2J5J27r5Q0L9k8ko9P8o8J7r5m4J94O0l27J48Q2m4o2J21K9j12l4K09
7925A73k56J12l6J6j48J34j23O7Q9j0k5%K14k73L8J12OO9r9k40J77m0j40J72J9
7950HQ0k60L07n1q4n8l1P8p5M3L2Q0M2o4Q9j01m7J02j25j0J96n3j45L5o4l4P0
7977d0J07N5j69J94j15N3j66N4J05M9j17n0kP8n6M9r0J48j36P3RL4o0r1J71j31
$$ y = [-49, -34, -46, 64, 66, 45, -37, 42, 40, -9, -49, 103, -7, 114, -63, 50, -35, -90, 74, 80, -42, 14, 35, 63, 95, -71, -8, -73, 40, -214, -109, -164, 33, -155, -19, -148, -13, 11, -47, 92, 122, 69, 18, 102, 14, -2, 78, -129, -72, -8, -51, 99, 76, 137, 63, 91, 6, 98, -24, 48, -70, -45, -90, -39, 150, 8, -29, 91, 41, -24, 34, -183, -8, -11, -3, -40, 31, 87, -47, 12, -2, 0, -27, -22, -193, 98, 129, -107, -97, -24, 21, 27, -93, 0, -18, -27, -2, 22, -27, -107, -79, 92, 142, 40, 18, 37, 62, 51, -16, 13, 26, -46, -31, 96, 1, 81, 120, 92, 90, 21, 99, 31, 48, -47, -91, 103, 163, -164, -16, 66, 22, -40, 81, 110, -2, -36, 173, -83, 29, -7, 9, -139, -5, -128, -61, 28, 18, -7, -7, 207, -66, -28, 84, 90, 159, 60, -180, -3, -43, -183, -11, 8, 88, -172, 135, 84, 0, -58, -89, -11, -86, -43, -11, 69, 111, 47, 136, 35, -12, 90, -35, -45, 151, 98, -47, -12, -76, -110, -40, 67, 122, -47, 147, 32, 85, -81, -27, 78, 127, 10, -40, -42, 36, -20, 29, -61, 87, -49, 24, 33, 67, 7, -84, 87, -44]
8003d4K2M0j7R9j6r5Q2o6P4j19O5Q7n2p1K8o3P4j32J57R8l2j25m2R1R0j2j24K7
8031B4l5K9J02j21J5K0j5J10j3j03L7j22KL1L5kk5o2K18j08j1j32J26J10j28l4
8057e2J02j24K3J26r8K5L4n4M9l5r0K70q3j59J96j65M4m2k6O7L8L9J5M4r0j07
8083e3N0OPo5K5r9J60p%r9L00j88M1j11Q0j25J02j03J48j53R6J8k23J50RR4l9
8110B1m0O3N2j52p1J16Q8j35O6l8k9Q0o1NON8K4j0L4j5p6jk4Q7O7r0J14j46O8
8139F1j40N1N3J6j44J08k38K01n1J5k4J30M4o7Q0j79J15m0J7k9j24J00kJ07o4
8164dl6o0J51m2O8J8k51K14j32R1N8j00R2L7j24q8Q1J1O5n9O2m1O9j04KK3j16
$$ y = [-44, -22, 18, 1, 100, 84, -11, 71, 5, 79, -40, 25, 112, 60, -11, 17, -46, 28, -104, 53, 151, 119, -6, -48, 43, 133, 121, -3, 24, -11, 18, 120, -1, 14, 34, 19, 129, 116, 13, 50, -72, -70, -39, -4, -6, -31, -93, 125, 17, 6, -126, 0, 110, -18, -52, 50, -74, -51, 75, -23, 2, 36, -18, 31, -4, -94, 176, 93, -66, 130, -35, 9, -33, -59, 8, 46, 85, 100, 144, 54, -53, -3, 3, 10, -55, -30, -129, 31, 24, 24, -75, 225, 37, 78, -33, 47, -78, 24, -79, 69, -84, 12, 30, -193, -43, -34, 60, 21, -19, 44, 96, -56, -127, -11, 77, -58, 8, -30, -59, 21, -40, -35, -29, 29, 53, 43, 77, 62, -14, -15, -39, 48, 115, 25, 139, -7, 61, -79, -28, 25, 41, -103, 5, -233, -32, -83, -68, -92, 38, 82, 15, 95, -84, 31, -9, 8, -21, -145, -45, -47, 60, -4, -40, -100, 51, 9, 77, 95, -156, 58, -74, 17, 75, -25, 67, 104, -20, -108, -27, -16, 49, -10, 52, 11, 80, -24, -22, 1, -115]
8191a15
$$ Imaginary data points
##PAGE= N=2
##DATA TABLE= (X++(I..I)), XYDATA
0@%%%%%%%%%%qJ6j6J6j6J6k4L2l2M0m8N6o4P2q4R3j05J20j36J53j75J98k20K45
34A29k74L06l41L79m19M64n14N70o31O97p72Q57r53J063j190J336j510J720j976
53a059K301k726L308m160N514p980J3777m6781k5877J41294r1828m1720J25366
66F9429o1451q6246J19679p001r0923Q0028K1188j00644M6762N7015p3690N574
78b0280O1548n2520k4362O3127j1303m7333M1190J8105n7177J6832N0932n4179
90a5420j4802O8926m0109m2003P8436j8279o6704P5074Q423q3382O0036L3229
102D3425r1591M1698N9335r0324J6090P4761q0968n389Q7598o3525l0963Q3485
114D3632m2492m5383P7740j6379n8915N6661P223n7291L8513K8135n3021R701
$$ y = [0, 0, 0, 0, 0, 0, 0, 0, 0, 0, 0, -8, 8, -8, 8, -8, 8, -16, 16, -16, 24, -24, 32, -32, 40, -44, 49, -56, 64, -72, 81, -94, 104, -116, 129, -145, 161, -180, 199, -220, 244, -270, 300, -331, 366, -406, 451, -502, 561, -629, 707, -803, 917, -1059, 1242, -1484, 1824, -2336, 3178, -4802, 8975, -37806, -63683, 77611, -14217, -55937, 69429, 7978, -78268, 41411, 34410, -56513, 23515, 44703, -55941, -9179, 47836, -25854, -20280, 41268, -11252, -35614, 27513, 16210, -31123, 10067, 28172, -29005, -12173, 38759, -15420, -30222, 38704, -1405, -43408, 35028, 16749, -49955, 25119, 33542, -49840, 10196, 43425, -48166, -6468, 52867, -37457, -21367, 53394, -27574, -32963, 54635, -8890, -39853, 43632, 1140, -44243, 33497, 17118, -41797, 14864, 22087, -35204, 3309, 31444, -21577, -11876]
126a1876L9299l6114j0141M2697j7800l2454L5019Q908m1620K1072L2418m7659
138a8251j418N4838m0711k5861O6957k8562n0691P1187n852o9415O3546J8519
150C4286q0896M7741M4596q2865K3436O3507p5350k135P5918n9012k7292P6863
162C8797l5460m4410O8232r584n5298M9355J4945n4369K4765L2776m5688j740
174a7679M3301k6825k3922M2288n025l9692L2620J9691m6350J3637L8744m4416
186a3628q570N4390l3801l1630O0699j7158m9596N9600L174o2801M8972K2995
198C2646o7468L2233M0439o4741J1348N2914n3845q271N8848l8278k5591N6741
210B6975j9663l7020M7259j847m2079L1827J4638l9645J3769K6492l0448m911
$$ y = [-11876, 27423, -8691, -18832, 23865, 6065, -26389, 8630, 17538, -24082, -3010, 29408, -18251, -19669, 35169, -5542, -31403, 35554, 6992, -43699, 27488, 21636, -47779, 15767, 34286, -46610, 1131, 45727, -37138, -13702, 49805, -25545, -27680, 48238, -10774, -38066, 38797, 3337, -41073, 27159, 17575, -37723, 11632, 26577, -27792, -3027, 29749, -15939, -17679, 25622, -1203, -25125, 17163, 12138, -27554, 5066, 24757, -21593, -7956, 30788, -13628, -22198, 32192, -1609, -33239, 27460, 10302, -39294, 20306, 23480, -39321, 9651, 32646, -34822, -2589, 37850, -26891, -15543, 37371, -16474, -24745, 34103, -4175, -29766, 26975, 7312, -29708, 17551, 15704, -26375, 5452, 20090, -19555, -5786, 20706, -9742, -14653]
222a4653L3160j6445k1641L2211J1l3680K4550J7072l9290J0909L2509l7170n387
235a7844M3922k8758k2906M9455j5779l8263M8229k95m9928M1031J5673n4426
247b9889K8521L0437n2416J2560M1298m3817m718M6002l0955k0339M4863j5178
259F369l1583L7522J106l6195K5345J5751l4090R390K5977k5945p574L0638j3194
272C517k2618K9165K158l3179K2562J8140l7740J0664L1869l5625m596M0986k7692
285b389k0725M4687j4950l4451M2637M73m3850L5346J5451m7041K3236K7838m4357
298a8095Q334L5724l6067o493L8613k3581j9026L6183q709k7425K8845N463l0911
311a7145J7496J6982k8692L764K4342k0981r999K7467r373k1347K5368M075k9324
$$ y = [-14653, 18507, 2062, -19579, 12632, 12643, -21037, 3513, 20585, -18705, -7796, 24713, -12457, -17844, 26078, -2680, -25586, 23869, 8090, -30173, 18056, 17761, -32167, 8864, 24537, -29889, -1368, 29069, -23347, -10787, 30511, -13306, -18024, 27978, -2977, -23316, 21547, 6369, -25214, 12308, 13414, -22781, 2564, 18315, -15775, -6385, 19592, -6353, -13927, 16711, 3517, -19101, 10064, 12222, -20957, 1605, 19745, -17995, -7331, 24538, -11087, -15683, 25303, -2389, -23114, 21573, 6623, -27828, 14809, 15282, -28568, 6778, 22229, -24812, -1576, 26262, -18095, -9761, 25963, -10104, -16597, 22016, -1565, -20591, 15592, 6883, -20542, 8303, 13766, -17145, 351, 17333, -11359, -7595, 16747, -4234, -14233, 13234, 3861, -17486, 7882, 11957, -17367]
324a7367J8482J7115l2812Q271K7494l1033m036L4685k4072j6374L7424j2947
336D830k7248L5294j50l5092K8521J2477l8687J8362K2754l6552O456K9830k9197
349h402n871L2515j8554j6583L0312o049k4595K3466O551k7844J3378J6976k5860
362a0560J951K4269j9105r877K6704q855k0355K4068K971k7679J7400J5269l0703
375a4502Q269K5152k8560k829L1798k2001j4048L3465j2262k3672L0381o99l0070
388a9578K3690J1106l2335J4501K0589l0061L861K6640k3886p012K8124j4384
400A255j6408K5194l077k2373J8982Q139k4389R871J7538k2499l88K3051j6554
413a658j1005K4735q069j9426K2347K546k4694J6171J3525k6859P466K2147k4884
$$ y = [-17367, 1115, 18230, -14582, -6311, 21183, -9850, -13886, 20799, -3273, -19647, 17777, 4830, -22418, 12876, 12726, -22366, 6155, 18632, -20055, -1693, 21061, -15491, -9035, 20795, -8402, -14273, 18242, -312, -16895, 13417, 7368, -17227, 6239, 12790, -15054, -1676, 15300, -10560, -8609, 15660, -3445, -13322, 13382, 4527, -15828, 8240, 11211, -16468, 932, 16201, -14502, -6233, 18919, -9641, -12470, 19328, -2673, -16721, 16744, 4482, -19190, 11191, 10492, -19578, 4112, 15218, -17117, -2616, 17973, -12088, -8227, 18413, -5473, -12485, 15639, 1255, -15153, 10041, 6964, -15409, 3573, 11712, -12677, -2806, 14732, -7767, -8155, 14896, -1658, -12663, 12072, 4003, -15423, 6924, 9470, -15224, 947, 14472, -12387, -4921, 17226, -7658]
426g658k929K7799j9500j2829K8986j0607k0602K6348O0k5708K0031J0345k7100
439a3364J0862J8692k5392Q75K3971j9672q740K5569j1000j6340K3004j000k1136
452a3671J6683Q930k2856Q001J6806k0856j801K2038j5281j0802K3676p122j7865
465a4120K1047K177k2236J4987J1065k3617O462J8685k1486k609K3434j5749j1156
478a3116K4836q077j7708K2004P85k2252J6072R253k3103P858J6755k0792q93
491h378K1621j5433r429K2970p876j6454K0396K78k0301J4618Q744k1303O860
504c687J6024j8859j714K0781j3816j0014K1949o764j6755J9488J365k0560J3794
517A232R654k1239O470J6330j8372k046K0282j3075j0316K1281o360j6603J8717
$$ y = [-7658, -10587, 17212, -2288, -15117, 13869, 3262, -17340, 9008, 9068, -16640, 3391, 13736, -13364, -2502, 16190, -9202, -8327, 15644, -4028, -12768, 12801, 1801, -14539, 8465, 7465, -13671, 3012, 11942, -10914, -2913, 13893, -6963, -8764, 13274, -2007, -12809, 10867, 3745, -14120, 6927, 9104, -13132, 1855, 12920, -10697, -4235, 14450, -7036, -9645, 13789, -1960, -13116, 11720, 3643, -14065, 7939, 8724, -13528, 2544, 11797, -11306, -3448, 13307, -7485, -8378, 13243, -2190, -11619, 11351, 3475, -12979, 7417, 7695, -12606, 2012, 10756, -10547, -3687, 12337, -6522, -8236, 12545, -1271, -11285, 10664, 3900, -12855, 6633, 7998, -12562, 1232, 10886, -10353, -3883, 12447, -5925, -7971, 12311, -764, -11080, 10201, 3841, -12762, 5955]
530E955J642k0059J3646R433k0319O167J5750j7628k270J9690j2685j0249K0477
543I550n916j6108J8125J757j9553J3387R195j9547O065J4873j7003j782J8226
556A1269j2310r334J9249n877j4885J7181J659j7878J2331Q420j8218N484J3934
569A1025j5673k385J7140j0777r486J7778l825j5244J6037K974j7878J1046R626
582A0358j8277M291J4839j5708l212J7963j0777j0109J8747m277j5328J6813K365
595G688j8461J2179Q779j8776N757J3533j6230j320J6739j1172p992J7277m942
608C059j3023J5086J585j6026J0485P399j5910M256J2290j3614k098J4924q615
621b02q341J5305k583j3583J3112L811j6615Q720R494j6529L160J4266j4070l349
$$ y = [5955, 7597, -12462, 1184, 10617, -9702, -3535, 12215, -5413, -7683, 12007, -678, -10927, 9550, 3634, -12474, 5651, 7408, -12145, 1242, 10437, -9110, -3045, 11828, -5175, -6957, 11269, -1041, -10375, 8874, 2997, -11888, 5293, 6952, -10926, 1405, 9825, -8393, -2909, 11025, -4648, -7033, 10107, -670, -10156, 7622, 3797, -11447, 4590, 7564, -10314, 732, 10358, -7919, -3628, 11211, -4497, -7709, 10254, -523, -10632, 8115, 3838, -11490, 5323, 7688, -10773, 1406, 10185, -8591, -2834, 10699, -5531, -6851, 9888, -1284, -9276, 8001, 3059, -9964, 5122, 6707, -9319, 1166, 8565, -7345, -3089, 9201, -4413, -6511, 8413, -202, -8543, 6762, 4179, -9404, 3708, 7519, -9096, -376, 9118, -7411, -4251, 10015, -4055, -7404]
635g404J6932r427r470J7022l462j4529J4767K589j7071J0747Q280j7311N389
648b948J2676j4573q41J5060j0306o901J5020m369j1582J2511J859j4064Q527
661F9P649j4147L275J1689j1651k842J3840p223q702J3656j382j3228J1343M662
675G008j5549P284J0412j5374K058J4140j3047l851J6010q734r416J5753l194
688C500j3378J3467K889j5557R564Q103j5500M507J1504j3143j067J3146r185
701a150n963J2717l553r647J0543K203j1755O544P157j1776J667J0502r755l412
715e678J1973n491q320J1760l57j1622R524N155j3823N605R925j3888Q50J3343
729H956j2107l814J5011q141q315J4845l189j1814J2616J905j3986Q744O921j4144
$$ y = [-7404, 9528, 101, -9369, 7653, 4191, -10338, 4429, 7018, -10053, 694, 8974, -8337, -2948, 9728, -4845, -5686, 9374, -932, -7833, 7187, 2818, -8764, 3747, 5606, -8458, 69, 7718, -6429, -3154, 8535, -3116, -5958, 7882, 659, -8043, 5613, 4231, -8997, 2346, 7008, -8541, -1257, 9155, -6219, -4161, 9979, -3068, -6919, 9091, 357, -9059, 6694, 3500, -9878, 3589, 6478, -9079, 485, 8588, -6912, -2405, 9099, -4044, -5111, 8035, -1150, -7113, 5604, 2051, -7596, 2947, 5150, -6605, -61, 7096, -4680, -3013, 7489, -2266, -5678, 6295, 804, -7516, 4244, 3887, -7735, 1789, 6944, -6879, -1274, 8651, -5237, -4387, 8956, -3151, -6965, 8046, -95, -8410, 6435, 3246, -8568, 4048, 5953, -8033, 711, 7632, -6512]
743f512M078J0322j2099o96J2047q143n112J1600l149q610R127J813j0428N454
757c08O426j0462Q61R827q202l840J1790m807q131J1210j11j1412Q749M817j3110
772f703M858R718j2795M49J2894j0841m025J4268p446q062J3892l112j1237J1460
786C318J781j2682P914O115j2129L398R581j0266j172J0891p045n296J0250k576
800B082q151P929K166r278M339O482q766n7R528p050m597J0771l803q444J0325
815C476N19j1093Q069N089j2128M436R248j1831L73J1782r875m208J3154o671
829C40p893J2719k528j0198J0561J810j1251O920N630j0711K659Q239q859j526
843d088R526n780m908R108j756p362P114K219q386L675N845p775o24Q402n978
$$ y = [-6512, -2434, 7888, -4211, -4907, 7140, -1003, -6115, 5485, 2336, -6274, 2853, 4666, -5762, -308, 6118, -4344, -3483, 6344, -1858, -5698, 6092, 1285, -6846, 4364, 4253, -7159, 1590, 6407, -6703, -1845, 7873, -4922, -4473, 8421, -2420, -6445, 7823, 377, -7685, 6207, 3095, -8142, 3318, 5099, -7583, 331, 6446, -5683, -2285, 7296, -2970, -4142, 6749, -296, -5592, 4658, 2082, -6069, 1860, 4026, -5252, -913, 5569, -3197, -3254, 6274, -776, -5373, 5398, 1595, -6849, 3476, 3995, -7098, 971, 6060, -6068, -1632, 7616, -4215, -3842, 7940, -1935, -6143, 7011, 340, -7553, 5166, 2638, -7560, 3001, 4811, -6440, 480, 6110, -4601, -1942, 6297, -2562, -4088, 5438, -342, -5250, 3858, 2102, -5260, 1854, 4073, -4313, -638, 5207, -2568, -3192, 5210, -768]
858g68m548R801k895p978R563P43j0259P600M493j1170M056P994j0467n2J0652
873F765q658l745J1662n757p048J1648j998r353R264J737j0283O113M885r522
887d290K238P310p601j520Q618m522m966Q396j209p313O241K552q097L145N642
902D624p403l70Q055n364m280R182k453p697Q742Q94j0012O853M571j0663L963
917a358P280r650N05R462p728l167J0232m860o407R803j588q704Q145J906r299
932e428N446M800q488J961O680o347j944P563l756n069P153k76p068N649K869
947C745p707K917N708p100l50P577n203m005Q321k271p333Q200Q21q864O271M233
963D960r773L973O656r049O03Q420p335k804R121m340n734Q716j210p484P114
$$ y = [-768, -5316, 4485, 1590, -6388, 3175, 3918, -6341, 1259, 5752, -5418, -1362, 6632, -3835, -3887, 6765, -1893, -5638, 6024, 267, -6781, 4867, 2869, -6484, 2780, 4517, -5766, 347, 5232, -4290, -2052, 5258, -2343, -3863, 4755, 233, -4733, 3663, 2454, -4859, 1382, 3934, -4163, -1018, 4624, -2779, -3149, 4906, -458, -4738, 4444, 1991, -5706, 3036, 3930, -6082, 771, 5342, -5321, -1358, 5922, -3728, -3223, 6239, -1489, -4656, 5576, 716, -5691, 4112, 2524, -6180, 1965, 3871, -5428, 18, 4818, -3670, -1709, 4971, -1376, -3320, 4243, 487, -4582, 2571, 2295, -4773, 876, 3745, -3962, -1045, 4663, -2437, -2787, 4790, -413, -4418, 3903, 1632, -5701, 2499, 3320, -5544, 727, 4960, -4813, -840, 5816, -3233, -2630, 5790, -1545, -4349, 4772, 432, -5302, 3414, 2204, -5280, 1834]
978A834K096q246M333M672p783J048O411n847j923O964k913n091O788J75o592
993d074M911L164p515K348N746o941o41P400m949l707P838k161o268P392P97q209
1009d869N664L842q932L293O120q359M01P749o274k491Q179l638n034P418m46
1024B623p059N747K186p437L292M744o906P59O249n251k136O757k570m868O081
1039B211L57o607M425L250p269K169N846o628o03P253m909l339P485k356n785
1054d500O719M94p268M998L440p782K806N779p239K58O966n615k399P307l314
1069F50m691O509l18o319M921K538o754K650M888o249J17O057m659k528O254k233
1085H33m801N563P37o095L911L486o446J577N524o030r04O790m760l082O819k166
$$ y = [1834, 3930, -4316, 17, 4689, -3094, -2046, 4365, -1482, -3405, 3559, 646, -4445, 2343, 2518, -4074, 837, 4001, -3514, -1166, 4580, -2361, -3002, 4398, -551, -4258, 3580, 1419, -4849, 2543, 3340, -4869, 795, 4637, -4295, -1002, 5118, -3241, -2840, 4909, -1365, -3856, 4323, 685, -4349, 3069, 2623, -4436, 1311, 3497, -3940, -648, 4096, -2810, -2051, 4198, -1053, -3189, 3568, 998, -3870, 2211, 2568, -4039, 386, 3636, -3633, -1464, 4382, -2246, -2849, 4404, -505, -3844, 3641, 1285, -4500, 2219, 2713, -4555, 443, 3883, -3899, -1093, 4686, -2553, -2295, 4671, -944, -3343, 3964, 650, -4041, 2468, 2150, -4169, 752, 3290, -3464, -814, 4074, -2175, -2058, 3999, -660, -3188, 3066, 833, -3968, 1595, 2332, -3763, 148, 3634, -2812, -1235, 4289, -1741, -2645, 4145, -615, -3697, 3122, 956]
1101I56n200O116O10o492M708K995o928K310N334o559k92O660m999k816O892k604
1117F91m629O205r4n836M504K499o172J946M606n600o13O060m290k620O416k038
1133A035m646N514N90n831L825K865o109J595M853n458r16O334m123l047O493
1148B974j841m831N595M85n932L931K862o230J799M792n574n86O117l921k857
1163c217O375k107m445N352L62n703L782K533n697J524M665n060o92N927l822
1178b23k840O186j939m698N319L37n562L799K584n715J588M650m946q37N807l541
1194c1k919N652j577m630N013O61n529L467K780n491J422M687m896p74N498l326
1210Gl152N722j534m668N236M58n533L728K738n471J508M546m936q08N482l625
$$ y = [956, -4244, 1872, 2482, -4010, 698, 3693, -3235, -925, 4409, -2150, -2442, 4218, -781, -3597, 3295, 691, -3938, 2267, 2173, -3663, 841, 3340, -2832, -886, 3720, -1880, -2493, 3567, -723, -3343, 3073, 1035, -3611, 1903, 2493, -3338, 487, 3352, -2757, -1162, 3691, -1767, -2683, 3651, -472, -3519, 2974, 1133, -3698, 1897, 2382, -3550, 381, 3243, -2987, -1188, 3604, -1970, -2556, 3561, -360, -3217, 3158, 1051, -3394, 1958, 2320, -3383, 399, 2932, -2765, -1241, 3424, -1636, -2328, 3599, -223, -3063, 3123, 1184, -3514, 1805, 2142, -3420, 379, 2963, -2752, -1164, 3486, -1460, -2297, 3510, -31, -2950, 2702, 1125, -3505, 1508, 2169, -3360, 107, 2887, -2604, -1182, 3505, -1391, -2165, 3333, 7, -3145, 2577, 1043, -3625, 1611, 2069, -3464, 264, 3002, -2469, -961, 3585, -1351, -2159, 3323, -302]
1226c02k873N744j608m624N164N56n239L700K480n462J620M003m449p35M951l183
1242b57k644N125j151m257M573Q21n019K950K811n094J117M156m105j416N231
1257B841k896l036N367r57m696M753R46n411L338K859n605J378M279m776p10N423
1273C097l413k719N588j411m277M780N37n249L428K380n128J507L708m286n55
1288b013M515k480k552M632q34m049L973R32m788K522K849m802O39M244l831j190
1304b233M877k394k945M884n78m766M271J338n461K894L061n473J366M302m456
1319a313o87N026l112k586N036j311m052M272O64m828K900K491m624J317L608
1334B801l880n95M121k266k469L940o18l814L456J379m519K159K831m228N54M015
$$ y = [-302, -3175, 2569, 961, -3663, 1501, 2057, -3182, 518, 2998, -2464, -844, 3159, -1290, -2025, 2926, -257, -2901, 2224, 1073, -3184, 1389, 2210, -2809, 141, 2952, -2142, -1025, 3131, -974, -2390, 2841, -55, -3091, 2276, 1319, -3377, 1376, 2322, -3089, 249, 3108, -2497, -1119, 3160, -1616, -2326, 3097, -316, -3035, 2553, 1142, -3135, 1645, 2182, -3067, 361, 2741, -2387, -880, 2828, -1458, -2013, 2502, 22, -2530, 2102, 1268, -2781, 1192, 2124, -2664, -142, 2707, -2095, -1456, 2788, -1043, -2233, 2644, 250, -2695, 2189, 1611, -3155, 1116, 2454, -3007, -113, 2948, -2525, -1159, 3143, -1313, -2000, 3026, -86, -2672, 2364, 1053, -2999, 1273, 1937, -2891, 9, 2500, -2124, -807, 2801, -1079, -1674, 2447, 181, -2288, 1652, 1034, -2780, 676, 2055, -2464, -305, 2526, -1702, -1148, 2867]
1350B867l603j353M760k388l172M734n55m446L991J459n125K822L083n179J149
1365i56M164m471o00M555k963k406M702j314l532M045P30m382K572K333m238R15
1381h46L476l664p13L776k032k417L730j15l508K940J597m346J736L151m264j5
1397a514M378l643j603M875k181l167M661k72m314L774J337m844K359K929m862
1412b087Q30M151m186p71M702k786k173M401j137l257L440N65l898K163K128l731
1428a646M92L347l076q85L900j876k448L541l5l525K589J745m228J379L291m050
1444a485j53M326l233j708M624j909l140M461m70m130L738J065m639K537K433
1459B317m250R53L843l820o84M125k515k126M124j317k856K896O88l239J547K393
$$ y = [2867, -736, -2089, 2671, 283, -2889, 1845, 1290, -3156, 835, 2294, -2831, -9, 3074, -2105, -956, 3208, -1263, -1863, 2692, -271, -2677, 2025, 711, -2821, 1224, 1954, -2428, 144, 2477, -1761, -846, 2630, -1034, -1747, 2029, -3, -2420, 1310, 1195, -2313, 627, 2224, -2122, -386, 2765, -1499, -1514, 2864, -779, -2382, 2493, 312, -2855, 1806, 1534, -2780, 994, 2331, -2513, -154, 2775, -2087, -1257, 2894, -1292, -2063, 2639, -147, -2320, 2081, 944, -2313, 1127, 1692, -2206, -43, 2085, -1646, -1154, 2193, -883, -1768, 2132, 256, -2192, 1349, 1314, -2211, 378, 2123, -2105, -726, 2565, -1485, -1638, 2688, -545, -2253, 2371, 462, -2678, 1783, 1313, -2817, 921, 1986, -2653, -116, 2317, -1933, -980, 2863, -957, -1641, 2484, -31, -2157, 1967, 650, -2206, 690, 1378, -1861, -314, 2079]
1475B079l289L73L049k615j137L423j432k622L263k4l453K726J620l877J333L119
1491B536l707l01M102l078j767M583j991l150M457n79l809L538J263m339K201
1506d1K474m140P89L383l335q69L891k322j956L723p76k882K956N32l008J433
1522a48K062k907j07L032k217j551L516q88l014L400L88l716K486J882l883J097
1538e68K941l540m07L925k868j834M559j669l162M317m00l851L424J108m186J998
1554b13K450l926P22L287l138p10L570j967j885L223n57k699K494O55k892J358
1570b28J829k711j25K950j752j723L330p80k801K995M69l548K344J786l823J044
1586g44K880l368l07L908k597j665L891j348l080L842j75l794L312R26l843K121
$$ y = [2079, -1210, -837, 2212, -403, -1540, 1883, 451, -2171, 1092, 1068, -2385, 341, 1961, -1916, -583, 2536, -1171, -1472, 2630, -448, -2215, 2368, 377, -2773, 1684, 1105, -2704, 834, 2097, -2242, -41, 2433, -1707, -918, 2465, -870, -1739, 2152, -170, -2126, 1597, 821, -2061, 895, 1427, -1581, -148, 1914, -993, -1100, 1932, -285, -1836, 1680, 792, -2222, 1178, 1566, -2150, 336, 2218, -1665, -568, 2373, -1167, -1574, 2351, -517, -2351, 2208, 539, -2623, 1694, 1294, -2557, 867, 1975, -2211, -213, 2237, -1689, -967, 2320, -818, -1528, 2042, 75, -1810, 1413, 856, -1843, 651, 1306, -1586, -228, 1601, -1110, -1235, 1715, -37, -1760, 1570, 790, -2011, 984, 1453, -2095, 249, 2035, -1788, -744, 2136, -1232, -1539, 2369, -228, -1893, 1998, 650, -2430, 1412, 1237, -2557, 755, 1681, -2162, -41]
1602d1K071l413N38K853k576p62L163j713j878K830j94k826K280J048k825J215
1618b30J925k426k74K734j757j741L064n55k785K684P42l298J995J802l476R99
1634e97K875l214l58L477k463j706L768j268k801L515Q0l540K828J157l571J817
1650aJ909l094L68K548k322q12K742j038k037K582J03k584K023J202l013R91J980
1667A547k495k32K530j481j530K882n24k493K577P59l258J809J904l613R29K667
1683A978k933k63L157k188j462L346j133k354L042ml031K305J073l195J376J932
1699A646k853K19K711k060q13K522r58j819K203J55k440J518J284k706P90K134
1715A533k270k86K535j371j638K674m68k477K316P32k976J569J903l299R60K566
$$ y = [-41, 2030, -1383, -845, 2008, -568, -1330, 1833, 120, -1758, 1072, 878, -1948, 332, 1380, -1445, -230, 1695, -731, -1005, 1729, -28, -1769, 1295, 740, -2045, 639, 1381, -1917, 78, 1880, -1596, -597, 2278, -936, -1294, 2183, -280, -1986, 1782, 514, -2287, 1228, 1308, -2232, 596, 1753, -1818, -1, 1908, -1186, -818, 1730, -592, -1404, 1338, 300, -1737, 845, 948, -1636, 387, 1589, -1424, -433, 1547, -948, -1180, 1350, -131, -1661, 1221, 697, -1796, 781, 1540, -1718, 91, 1995, -1618, -689, 1978, -955, -1218, 1939, -249, -1711, 1635, 502, -1852, 1190, 1186, -1845, 460, 1533, -1662, -286, 1646, -1207, -988, 1723, -337, -1150, 1372, 414, -1405, 798, 953, -1487, 31, 1315, -1391, -601, 1533, -737, -1023, 1512, 141, -1497, 1177, 709, -1768, 548, 1280, -1696, -127, 1776, -1523, -563, 2003]
1731B003k740l53L063k115j294L007j081k227K523J40k760K062J325l022J286
1746a83J859k499P9K415j739j232K587r56j887K053N37k493J484J415k576N16
1762f20K311k235n49K597j571j506K687n46k266K227P68k850J586J713l010O91
1778e73K421k565m76K817j959j165K661q97j870K273L04k423J785J046k572P93
1794d00J907k245k03K381j655j163K434n85j821J925M09k294J341J290k365L36
1810g08K344k258n72K558j366j405K550n12k128K242M13k652J531J559k763M23
1826g44K493k432m44K625j680j177K665p37j972K066L17k391J471J174k287M80
1842e73J824j724l60K211j493j009K259o04j836J727M65k089J077J268k071L14
$$ y = [2003, -737, -1090, 1973, -142, -1436, 1571, 490, -1737, 786, 926, -1834, 228, 1553, -1469, -183, 1676, -823, -744, 1671, -68, -1300, 1287, 331, -1556, 497, 1034, -1459, 25, 1440, -1136, -620, 1691, -544, -1093, 1504, -67, -1573, 1114, 568, -1698, 529, 1297, -1553, 33, 1746, -1264, -573, 1848, -717, -1193, 1624, -335, -1500, 1161, 264, -1606, 667, 971, -1452, 333, 1379, -1193, -400, 1507, -738, -941, 1440, -215, -1378, 1056, 471, -1350, 575, 984, -1310, 31, 1321, -1044, -708, 1636, -622, -1194, 1364, -2, -1407, 1143, 631, -1497, 745, 1158, -1494, 37, 1596, -1167, -744, 1749, -683, -1127, 1498, -182, -1359, 1306, 569, -1403, 663, 980, -1411, 60, 1234, -1053, -573, 1251, -473, -833, 1378, -115, -1124, 1135, 531, -1305, 422, 887, -1202, -125, 1143, -928, -614]
1858f14K044j841p53K550j184j665K624m79k178K010L82k335J354J375k258M51
1874e17K115j999n99K260j319j327K415n72j860J852N21k217J216J267k054L81
1890d37J750j603o61K117j106j397K159k82j862J763M05j978J165J253k116M29
1906d01J765j728o70K188j060j421K157j62k001J856N42k088J028J222k007J48
1922f32J918j735n54K104j106j301K294l17k069J836N60k051J095J226k078K85
1938e25J690j502o79K106r21j400K052k36j821J666M64k121J145J349k084K54
1954e63J636j500n76K082q92j263J853m2j806J546M34j976J091R76j922L85J620
1971A083j411o51K052q27j342J850j87j798J620O72k196J075J047j843K93J811
$$ y = [-614, 1430, -411, -1164, 1386, 202, -1463, 1161, 682, -1496, 514, 896, -1439, -85, 1290, -968, -517, 1598, -401, -1000, 1260, -59, -1386, 1029, 457, -1403, 449, 970, -1247, -31, 1236, -818, -437, 1313, -290, -951, 1166, 60, -1337, 822, 540, -1322, 441, 846, -1132, 33, 1286, -830, -401, 1364, -364, -1034, 1154, 94, -1327, 830, 668, -1333, 523, 1065, -1023, 5, 1227, -780, -632, 1286, -449, -1003, 1101, -5, -1306, 988, 671, -1398, 438, 998, -1053, 42, 1268, -810, -525, 1165, -337, -1016, 1090, 169, -1231, 821, 585, -1236, 430, 894, -1227, -82, 1267, -817, -563, 1073, -427, -1003, 1079, 187, -1076, 777, 735, -1071, 475, 909, -1067, 24, 1000, -922, -537, 1083, -328, -979, 1073, 246, -1096, 754, 567, -1231, 389, 1061, -1135, -60, 987, -856, -563, 1248]
1987A248j498n12J964j140j169K024m39j648J549N15k000R33J214j857O31J406
2003A221j481l30J609r88j024J730j91j577J200O35j760P65J260j820L27J656
2019A232j395n50J669p52j239J547n2j725J525Q17k123J005J095j723K66J502
2035A099j408m97J719r70j099J729j85j565J540M25j811J007J087j848L03J514
2051A040j359m04J568q76q71J572r8j534J272N34j654P50J049j462q7J541j174
2068a93o23J643o56j126J434K35j628J151O96j886P34J233j718J01J659j402m39
2085g85J735q99r00J638l39j485J426M39j679P13J073j625J64J410j020n20J435
2102G81n62r52J302j49j347J047N22j399L75J117j325mJ520j006o77J558m82j192
$$ y = [1248, -250, -762, 1202, 62, -1107, 917, 478, -1170, 379, 894, -1106, -173, 1041, -816, -185, 1221, -260, -590, 1019, 31, -993, 737, 546, -1031, 169, 804, -956, -191, 1069, -751, -424, 1232, -163, -713, 956, 204, -1035, 512, 460, -1265, 260, 1077, -1046, -41, 1054, -669, -403, 1099, -309, -806, 913, -57, -1156, 573, 388, -1177, 363, 788, -1023, -16, 1071, -777, -474, 1040, -319, -723, 845, -31, -902, 670, 572, -962, 310, 844, -810, -60, 989, -473, -560, 981, -193, -816, 827, 171, -955, 479, 714, -914, 237, 933, -953, -219, 1014, -704, -603, 1056, -346, -785, 950, 51, -849, 789, 450, -1035, 391, 830, -849, -136, 937, -688, -524, 886, -134, -654, 781, 219, -733, 569, 420, -927, 120, 642, -757, -382, 735, -590, -594, 926, -80, -757, 801, 319, -873]
2120h73J499oj563J047O14j717Q11J088j493J69J428j300k86J405p10q59J388
2137F42l16j204J114L54j420P61Q23j230K4J391j238k87J276o22q99J230j2j164
2155g77R99M37j249K91J099j063l16J493j105n07J575p47j006J188K4j169R44
2172A11O84j655P39R40j359Q6J265j014n27J524p49q35J317k68j003J029K79j139
2190e75M59Q73j239qJ237r41m79J149l16p98J000J57j015P35M98j181Q8J099j078
2209c35l93J516q13p86J578o03j100J546n2j469J132M68j480O91R54j414J36J244
2227H20j132l80J499p17o79J075r2j058Q60L66j128M32P32j013M0J041p99l81
2245e14J207n03q71J019J29j190O94P22j140K23R02j055k03J395o50r58J411l84
$$ y = [-873, 626, 620, -943, 104, 718, -999, -188, 900, -593, -424, 1004, -296, -582, 823, 113, -746, 642, 326, -878, 236, 590, -830, -69, 754, -476, -452, 939, -299, -586, 690, 68, -831, 399, 387, -777, 222, 659, -590, -299, 800, -263, -579, 914, -191, -698, 877, 130, -876, 312, 336, -833, 111, 795, -860, -121, 819, -540, -454, 811, -203, -730, 794, 45, -790, 527, 259, -744, 285, 564, -575, -116, 757, -482, -490, 747, -194, -673, 476, 160, -638, 362, 519, -496, 239, 737, -444, -356, 743, -335, -728, 788, -25, -811, 767, 164, -936, 610, 558, -911, 221, 689, -791, -100, 854, -560, -424, 820, -312, -692, 807, 90, -589, 486, 394, -664, 196, 562, -566, -134, 598, -415, -375, 666, -133, -514, 693, 190, -681, 338, 467, -723, -29, 693, -447, -224, 678, -377, -580, 815, 165, -793, 618, 234]
2263B34j118J472q6j379R75M01j285Q28P43j271K09J083q70m90J099m96p48J120
2281D21j76r10R74R2p63L81N06r24O2Q59m38o61Q33J13r95R66J84j128O96O06
2301F98j166L57P80j021j31J205p85o39J222k87j056J232J34j327J015N05j340
2318f04O02O50j043MJ081r86k93J116m28o11J011r8r14P46L16j069M32O46q68
2337c10r3Q07l95m85Q97j34q64P57K52j078O76O97j267K61R31j045p1J072o56
2356d8o39J308m16q97J024J84j247R42K38j167P25P08j172K82P13p72k6Q79n91
2375B8m47P89j19p89N25M69j074N14O60q30Q5O49m09m21P44k61o58P25J51r53
2395f22N64M30q63K35R18q20j92R47p03m61J025l78p95R08J34j087P91N44j124
$$ y = [234, -884, 588, 502, -877, 98, 499, -786, 42, 785, -486, -277, 806, -64, -554, 545, 49, -699, 421, 245, -665, 309, 401, -362, 19, 525, -399, -337, 522, 84, -577, 256, 369, -626, 340, 524, -604, 92, 698, -468, -111, 669, -352, -483, 722, -63, -702, 520, 233, -823, 409, 543, -784, 231, 736, -604, -2, 648, -395, -391, 690, -296, -589, 527, 99, -512, 499, 401, -513, 233, 549, -520, -88, 558, -310, -403, 404, 9, -476, 421, 287, -577, 180, 432, -646, 30, 727, -540, -279, 652, -393, -464, 608, -48, -687, 621, 205, -692, 332, 516, -731, 211, 449, -718, 7, 715, -457, -175, 538, -234, -260, 619, 28, -419, 370, 251, -538, -13, 456, -618, -104, 556, -274, -189, 460, 51, -370, 374, 113, -545, 180, 331, -622, -58, 372, -491, -256, 662, -158, -350, 597, -106, -567, 458, 80, -715, 193, 327, -760, 31, 575, -549]
2414e49N01O43q16QQ34p40l32R19n00l66O58R8r32N70L98p85L28O50p77k11R53
2435E52n81m13P42k57o18Q45M9q29M71N77j001L51P26r46q7R48p58k00Q24l70
2455B5n26R42j43p43O67L14j040M88M55r62J73P08o28j23Q81m17l75O58J61q75
2475c60N11K78q26J66O95p12m4P76n65k41P82j84p60P46J72q74L85M21r03M14
2495a23O13r93J11R60p45j56Q35m02o77R15j12p42O04K33p06K10O70p26mQ44p18
2516a09l25P50j92m64N02J02q27N56L55p89K11P91p42j00Q46o25j87O68m38n11
2536e28P20n0o34M94L40o82L08N72o54j62P06m36m45R48m12o36P91j12o07N68
2556H9M16q85L32N78q00J6N86n42k56P80k17o77Q70k21n07M47M37p06J82N72n55
$$ y = [-549, -48, 595, -221, -213, 621, -119, -451, 468, -32, -398, 260, 358, -574, -4, 394, -391, -63, 587, -190, -401, 552, -29, -442, 300, 43, -575, 270, 319, -510, -39, 538, -463, -112, 614, -332, -419, 529, -229, -429, 395, 25, -501, 441, 298, -445, 222, 536, -504, -16, 439, -523, -350, 358, -270, -393, 488, 71, -304, 354, 515, -360, 151, 429, -397, -231, 464, -248, -292, 484, -81, -322, 460, 276, -484, 262, 434, -440, -55, 366, -537, -123, 490, -503, -392, 568, -177, -333, 502, 100, -577, 338, 226, -516, 88, 321, -385, -175, 495, -231, -235, 609, -109, -434, 316, 124, -340, 162, 264, -563, -7, 348, -441, -230, 561, -181, -281, 565, -60, -247, 421, -17, -528, 192, 142, -492, 2, 342, -340, -32, 540, -114, -276, 430, -6, -451, 497, 85, -551, 240, 128, -479, 89, 505, -380, -48, 530, -270, -254, 332, -210, -466, 314, 97, -580, 290, 69, -438, 9, 446, -260, -78, 494, -61]
2577f1j78P21n95l18Q24l67m87Q79j22o30L14M47q43K19P22r02R1O24m02n09J045
2598D72l60n31Q95j68p95M92K69n76J71N23p24J04N84m52k18N95k28m89O90n5
2618A99o11M69J84o92L68M99o25p1O68l85k20N49Lq60Q42q1p13N34L25p54L28
2639d4M89p41M9P04m63l27P10l37m72M96J07o49M69K90p37K36P36o76n2O84n33
2660f1m59P70k80m31O58k5o40N61L32p60J91O52o89L2M85l68m17O42j03n57N50
2681H3J30o22N87K15p34L22M88n85j26P57o06k73O61j66n32O47J12p64N19L00
2701D13o07J11N05n79j20P14n78k23O85k48m58O29o8n68N36J41o31K99M00o53
2721c00J69M54m76j42N20j57m67N61J15o64N61J26p29K95L57m96M4N21l36k08
$$ y = [-61, -239, 482, -113, -431, 393, 26, -461, 418, 296, -334, -20, 427, -416, -197, 525, -377, -286, 338, -64, -573, 472, 112, -419, 476, 308, -487, 5, 274, -302, -131, 392, -332, -228, 356, -96, -314, 281, 53, -436, 254, 199, -412, 57, 241, -451, -83, 416, -209, -280, 388, 3, -217, 332, 335, -525, 317, 236, -477, 57, 382, -372, -44, 445, -296, -247, 457, -6, -333, 377, 40, -432, 64, 171, -478, -9, 281, -456, -220, 516, -160, -212, 472, -61, -520, 250, -30, -461, 197, 172, -468, 93, 425, -335, -144, 508, -181, -149, 336, -32, -449, 193, 90, -467, 83, 213, -409, 178, 393, -341, -19, 469, -116, -242, 515, -91, -364, 297, 131, -401, 246, 358, -406, 113, 413, -194, -83, 422, -157, -277, 437, -141, -364, 321, 73, -385, 244, 176, -392, 144, 285, -346, -47, 353, -300, -131, 323, -153, -295, 225, 68, -399, 162, 277, -387, 174, 300, -429, -134, 223, -273, -229, 292, -44, -252]
2741b52L62P9o14O77q8n96M60L66o75J79M13l43j70O72n85j88P04j73o08O07m9
2762A78o49N86K49q65K77N23m54m5N02k95j93M98q4o32O18jm90K83L37o75J97
2783a35M63o87K16N14k85l67N11j98m28N19J35o88N77K20n53J01M54m84m9O87
2803E23o27j62O84l95l49M47J75o90N30K65p78L73L63n61k2O63n30k52N99j88
2823F8l33N28J2o07L81L42o64K09L67m83j10O16m30k90O45j93m27O07j17m36K33
2844h2M91p09J41N37o57oO84m35k70N20j23m10N66n4n92N05J84n62J39M24n43
2865b52J31M22l23j38M51Qn40L66K02o21L44J58m33N6M89n39N8O22l89l55O36
2886C53k33n34M11K65o01K88L91o92K22N52n51k52Q04n40r9N94k74m42M68P3o58
$$ y = [-252, 110, 189, -425, 252, 164, -432, 28, 394, -281, -102, 311, -32, -202, 470, -115, -303, 401, 228, -380, 227, 178, -471, 115, 364, -501, -224, 299, -155, -200, 302, 7, -186, 312, 228, -404, 214, 213, -277, 6, 343, -332, -135, 328, -359, -143, 371, 86, -281, 230, 32, -396, 123, 258, -430, 147, 367, -186, -85, 369, -115, -164, 523, -104, -266, 418, 23, -326, 121, 296, -394, 136, 401, -377, -4, 359, -202, -224, 439, -91, -343, 256, 68, -265, 263, 275, -332, 49, 391, -273, -64, 303, -180, -290, 326, -104, -394, 251, 58, -369, 238, 121, -315, -82, 409, -300, -159, 378, -279, -285, 399, -36, -306, 214, 91, -319, 247, 193, -399, 106, 290, -272, -133, 291, -252, -121, 301, -22, -160, 291, 299, -241, 125, 327, -294, 50, 208, -225, -169, 320, -219, -161, 461, 72, -283, 353, 120, -414, -3, 262, -339, -51, 340, -352, -130, 422, -129, -381, 423, -117, -216, 378, 104, -338, 130, 203, -455]
2907d55M53J28m29K81L34m46j43O72n54n2M30p3m30L24L3l79M11K09m83Q4L94
2928C09m71o9P24m86m14O23j07m30M68o0k64K52K51n20J20M30m14k11N70l13l61
2949c73N09j53l12N70n2m98M34J89n74Q7M96o08J07M50m15j65N56j29m53N81J9
2970B66l94K39K12n50J36L95n30j13O16k79k89N49q0m65O01r4n53K77L19m65K2
2991a80M43l44j35N63m43k05N00j71j58K73n2l77K85J32m85L50K02l44j04M59
3011B09k07k89M42j27k24L90l0m15K36K89m89K8M80l06l23O76l01k18L73n4m29
3032b89M27Pm97K87L66m10J66K57l70n9M82l44k15K93j46k82L72Rl68L10J88k52
3054f8K6K34l27l2M15k48l21M42%m46L43K09n51L64J65k93p6L93k97j10L52j96
$$ y = [-455, -2, 126, -303, -22, 312, -134, -277, 395, -159, -211, 219, 146, -284, 40, 73, -306, 105, 314, -169, -85, 309, -162, -231, 493, 7, -407, 216, 109, -321, 147, 87, -177, 75, 326, -194, -74, 356, -58, -269, 301, -12, -373, 136, -17, -329, 241, 189, -309, 125, 314, -260, -173, 323, -285, -178, 272, -143, -308, 248, 119, -334, 247, 266, -128, 111, 323, -227, -91, 304, -226, -339, 277, -2, -291, 258, 178, -287, 314, 220, -333, -56, 263, -202, -180, 263, -81, -216, 347, -96, -301, 199, 28, -130, 143, 91, -286, -1, 131, -354, -4, 198, -146, -250, 209, 2, -287, 155, 28, -196, 194, 164, -251, -15, 274, -215, -187, 293, -13, -336, 340, 39, -179, 194, 140, -289, 138, 145, -352, -65, 301, -109, 57, 314, -56, -115, 367, 23, -192, 101, -45, -327, 45, 54, -314, -4, 184, -68, -42, 192, -135, -167, 248, 0, -321, 121, 121, -325, 18, 227, -324, 40, 205, -88, -164, 229, -68, -178, 174, -22]
3076b2k13N79j56n05M37P5l92J99K86n25J70L87n00L8K75j57k38M15o9k48L28
3097A64l5k18K35J27m95J14L99l41j83M12j01k88M32o8m22L19O9k37J16L58m87
3118a30n4L77k75j16N51l79k24N24j71l42L08J15m62K40L63n19j2L77j65j30L51
3139B27j95j74L28j00l31L48J04m06J57J97l84N1L78l79J7N06k42l78M13o2m06
3160c31L65L28o01L71Q4l34l6M19l01j04K60j40k10L91n1l91K56J04l35K21K55
3181B20m75J72L80l77N7K81l72L4J38J9l33L10J16k92M9K28j74P3K13l72j18M19
3203A96j89k82L82N9m27K67J35k88J22K99m19N8K59k37j49L53j32l29M74m0k68
3224a56J21L39n04K23K37l83n5N17m32p0L23r3l83N09p0k43J24K09l37M9L27l60
$$ y = [-22, -235, 344, 188, -317, 120, 195, -197, 2, 288, -237, -67, 320, -180, -142, 133, -24, -262, 153, 84, -164, 164, 129, -89, 146, 273, -222, -108, 291, -50, -233, 179, 78, -210, 222, 154, -268, 51, 120, -117, -1, 357, -130, -184, 193, -82, -198, 353, -26, -250, 274, 103, -239, 69, 184, -278, -38, 325, -194, -206, 171, 6, -124, 227, 32, -142, 186, 86, -245, 103, 207, -199, -42, 155, -229, -178, 200, -179, -162, 344, 102, -276, 137, 75, -331, 34, 362, -239, 132, 216, -118, -154, 265, -36, -140, 120, -20, -230, 161, 110, -281, -25, 79, -256, -35, 220, -255, -83, 297, -80, -23, 258, -114, -80, 58, 77, -256, 54, 170, -122, -73, 155, -19, 54, 267, -105, -223, 196, 7, -275, 107, 166, -261, 6, 141, -147, -25, 274, -145, -87, 172, -65, -214, 139, 7, -322, 152, 112, -156, -35, 304, -200, 23, 260, -123, -178, 339, -93, -163, 160, 67, -316, 193, 123, -120, 4, 213, -124, -75, 252, -108]
3246a08n8L68l39JL21k05j57L33O1k07J09L5j91j21L93l51m1M22k70j61M25k48
3268A1j09L21j64l24K09K07m24L22O5l47Q2L71k41p9K40j60j81K98q3k19K43m
3290C4j59J19N5k06J6K92j12k21L63j74j69K98K3l27K83J8k47j4M10l87P6K90
3312B61k15j37K05l5k56L22q3k75K98O5l01K6K97l19R4K96l00k29N04j08l27L84
3334A67l6k41J81J68m43O3K16j26j0L28k90q0K78j13l10K53P9k81K11K59k86J9
3356FJ41k92RL48k70j84L89j37j34J94Q6l37K64R2j57l2K24j87j19J91j01j79
3378a85L57j63k07L37K4l03J32J79l53O5L57m11j06L45n5k51M03k1k25J77m0k52
3400a96K43J57l30N4J63j36k4K06l7k16L41j21k85K67K4j70P2J82k66K37n1j99
$$ y = [-108, -166, 202, -137, -136, 185, -20, -177, 156, 217, 10, 119, 154, -37, -158, 235, -116, -157, 265, -5, -166, 259, 11, -98, 223, 59, -265, -56, 151, -273, 49, 114, -233, -151, 220, -21, -100, 140, -20, -201, 97, 14, -205, 38, 34, -125, -6, 49, -157, -141, 151, 39, -182, 181, 7, -162, 136, 159, -168, 115, 133, -114, -128, 282, -105, -29, 261, 46, -91, 114, 79, -177, 145, 62, -213, 85, 150, -151, -125, 172, -147, -53, 243, -57, -286, 218, 110, -217, 167, 131, -110, 71, 239, -204, -141, 75, -51, -61, 267, -23, -103, 175, 62, -248, 5, 84, -197, 14, 273, -13, 6, 147, -145, -136, 212, -58, -242, 147, 10, -124, 70, 156, -181, 83, 175, 18, -14, 210, 23, -96, 95, -6, -185, 172, 9, -198, 139, 163, -140, -8, 171, -182, -117, 240, -171, -277, 68, 13, -238, 165, 144, -81, 96, 56, -196, 47, 204, -126, -72, 91, -45, -69, 137, 100, -116, 225, 104, -181, 86, 110, -60, 12, 194, -72, 165, 114, -85]
3422h5l6K30j29j50L83j74m7J00Kl67J45K00j98M1J82k41k4L57j77j28J68nj85
3445a38K35L2k44J10J08k24J40K51k60o5L30k48j49J32J81m08K40mo9Q4J68k31
3467b9j04L48l49M8Q2qk36L05M4m31K75J60j51N1K17l51N6K29k52k0R2J9o9K40
3491A66q8k50J59J99k82R6K26l74R5L04k74j29K37q5j15J44O9k71K02J21j70k3
3513d3K31l69J82J18j34j22K66j71j33K59Mk20O6K16k60P1K13l18J21J32j21q5
3535i7J19j08o5L44j09j10Q9M6j55N2J16j96p2K41j13j64L29k5k88K81o1l03L75
3558A26J20m65K42J31j07j37J43q2j3K33j53j65J93m0k02J51R8k85J68K17k16
3579d3n0K26j76r1K92k39n5J98l4j35J81K6o2MJ51k79O0J43q2j0J71j55k18L61
$$ y = [-85, -121, 109, -20, -170, 213, 39, -8, 92, 94, -273, -128, 72, -126, -85, 97, -144, -168, 189, 12, -116, 52, 47, -138, 97, 129, -115, -5, 103, -121, 19, 270, 10, -55, 275, 27, -122, 10, 191, -217, 23, 19, -50, 34, 202, -29, -133, 215, -134, -86, -4, -12, -248, 57, 101, -330, -55, 105, -46, 5, 222, -129, -73, 156, -96, -116, -24, -5, -74, 166, 78, -172, -13, 186, -96, 0, 226, -148, -53, 251, -23, -152, 85, 0, -115, 29, 98, -173, 29, 150, -20, -43, 188, -181, 1, 119, -15, -137, 129, -42, -175, 84, 88, -132, -66, 150, -110, -39, 174, -144, -23, 109, -12, -97, 22, -86, -151, 193, 84, -26, 63, 109, -46, 6, 122, -74, -146, 95, -18, -182, 147, 122, -166, 115, 54, -249, 126, 246, -219, 23, 154, 47, -90, 53, -29, -42, 191, 38, -127, 66, 26, -176, -25, 73, -212, -44, 173, -43, -93, 133, -43, -134, 158, -81, -136, 62, 28, -107, 74, 100, 38, 42, 193, -86, -26, 117, 35, 25, 196, 41, -177, 184]
3603A84q9k95J62O8j94K25j6%k7J15ok22J19L4j78J83n7k6j3J44k69J88J40j08
3627F2m0J22k15J6J19O4k43J80k0j21M2M8o0J7J31j85n8J92o1j19J24J3k2R7M
3652H7j98K35j2j32L9R6k25o2K86j82l5K36p5j52R7J26k74J84J40k18M4J58j52
3675A1j01R8M7j58L32k75P1J39k5k97K00R2j87N8J66k59N1K28k08O6M1O9j68J17
3699A08Pj71J52p4jj5J01k2r0J02k6j94K19kk74L31j16j44J38m0j1j27L82l36
3723a03P0K10j78j26R6k2o3K15j26j06J71J7l9Op8j06R4L39j45k32K20j05j02
3746i3oL14j99J30M2k42J17Q2j99N2J07j65o0P8P3j15M2M4j16J45P9j68j5J90
3770A17n0l5N5o0j54K14j25j55L73q2j75J55Mj15K2Q0q1J3M0R0k16J43o9j28K16
$$ y = [184, 95, -200, -38, 30, -164, 61, 45, 45, 18, 133, 127, -95, 24, 58, -120, 63, 6, -20, -33, 111, -158, 30, 170, 62, 22, 144, -71, -55, 64, 128, -115, 65, 45, -76, -34, 14, -46, -29, 102, -83, -141, 51, -10, -129, -5, 8, -14, 83, 87, -111, 124, 112, -20, 19, 115, -110, -172, 114, -68, -103, 133, 58, -94, 3, 129, -145, 39, 179, -39, 5, 163, 11, -90, 8, 55, -103, 229, -46, 25, 164, 139, -158, 42, 134, -53, 5, 171, -88, -37, 191, -17, 49, 90, 159, -9, 108, 115, -56, 96, 22, 21, 6, 107, 85, -5, 97, 71, -123, 96, 94, -180, 151, 35, -109, 29, -11, -22, -149, 233, -103, -33, 177, -1, -127, -31, -53, -116, 99, -27, -133, 38, 55, 16, 22, -56, -162, -68, 271, 126, -106, 114, 9, -93, -99, 215, 16, 146, 188, -54, 63, 145, -54, -2, 105, -60, -120, -42, 31, -84, -42, 2, -114, 31, 110, -58, -73, 117, 67, 32, 87, 27, -127, 87, -38, -193, 180, 98, -77, 78, 82, -33, -11, 69, -12, 1, 41, 131, -85, 58, -11, -139, 77]
3795G7m0j03J29l4N6q9J34k23J48jj97J51R3j7j87J98n3j45J66p7j06J55r6L3
3819b8Q8Q5j58k3J55q1m7L8J21j80j4J02j67J18kj05N2J81j50n8J92m5j51J92
3843A15j31m4J4L5j46J91O3q3p5K46k97J4K34j36m7J11o8k0O1M5j63R4lp0l7J07
3869A0L0j04P9k7q4J30Q1k26Q0J02j32N5J2j60M0K42j77n1J07On5LJ85k89Q8J81
3895A26j49K1J31k57OJ17O6q1Nj5r1K36j4q1mK19j33j35J36j70l2J83r8o3J17
3920D0n1L9J85q8k92J83M4j82J29j1p2o9J77o4r5J99r2o4R0Q4o0j45R8r7J04K9
3946A9m5K2P5k1j92K41j88j4J88K6k91K95j25j35K41o1j01P4J8l0j36K99n0k47
3970a38J88j4j02K9l6j7N4P4j04J9K27k67KM6M7j97J13K5l5N4ppN8J0k2l7J06
$$ y = [77, 37, -66, 63, 29, 85, -4, 130, -93, 55, 54, -143, 8, 101, 84, -103, 95, 42, -103, 63, -14, -120, 35, -61, -28, 60, 145, -13, -36, 119, 38, -9, 29, 150, -30, -44, 58, -109, 9, 7, -98, -46, 135, -15, -73, 119, 74, -77, 115, -16, -60, -46, -11, -157, 34, 97, 14, -61, 185, -112, -98, 136, 0, -47, 64, -4, -24, 37, 82, -81, 13, 10, -60, -97, 10, 40, -64, 15, -12, -96, 34, 115, -111, -31, 71, -61, -6, 6, -154, -114, 128, -49, -100, 7, 13, -42, -39, 146, -143, -55, 126, -23, -2, 129, -128, -122, -5, 61, -20, -15, -30, -121, 115, 101, 20, 16, 235, 102, -33, 103, -67, -99, 84, -14, -77, 40, -11, 28, 213, 125, -167, 16, 60, -122, 7, -4, -76, -145, 32, -32, -127, 72, -20, -84, 6, 90, 30, -115, -17, -114, -10, 19, -26, -4, 71, 50, -142, 99, -89, -103, 85, 111, -180, 115, -10, -145, 96, 35, -66, 8, 26, -4, -140, 159, 109, -138, 50, 36, -66, -37, -73, -90, -36, 38, -66, -47, 180, -87, -85, -39, 8, -189, -76, -51, -86, -32, -39, -46, 12, 22, 0, -37, 69]
3997F9n7N1k6k5k07J39j6j11L03j02J18j85M6j44K7K02j80k5J98j35p9J91j9k7
4021Fn7R3Km8J37j49J13j03k4r2K27j79O4R3j22K7m0J13k01J31N8n0j47K64j02
4046A4q1L4J57p5n1J7J38k31J13j5j15J48j69J32Jo1q3K44j15j06P3R5j22J04
4070D6j8j10K3O3n3J9Q5j42J3J37q4K4J28j40n3N9K5r2K5m3pN9Q5O9l38J43MJ41
4098F8j3j23K4r3K32q5pJ99j31r7OR6k18K36l1j44mJ80j73R7n1J12M3j46N1n1
4124b3J37j21K6J3l1p5Q2j22n8L57j45j9J05r2j58J53p2N5k3N8rj53J19o4j6J46
4150G0p6p2J14kK7j74J71j01M5J09o8j71J21K1m4J39n7mP7j05p6L2M9p4m4N1K9
4177a3o0J09J8l8m0J25k52J27J46k57O9J69j25r0J26J3k72L16J2j79L1J08q8J5
$$ y = [69, 12, 63, 37, 12, -195, -56, -72, -183, 120, 18, 136, -49, -3, -147, -120, 82, -98, -123, 75, -60, -139, 52, 33, 6, -51, 42, 44, -4, 133, -16, 97, -6, -30, -122, 105, -74, -10, 83, -39, -12, -52, 61, -140, -9, 49, -1, -148, 116, 14, -67, -33, 124, 49, -2, 15, 153, -78, 35, 20, -95, 53, -116, 16, 17, -44, -127, 117, 2, -104, -31, 64, -58, 46, 28, -82, -59, 4, -49, -30, 55, -87, -74, 63, -21, 3, 131, -9, -62, -3, 22, -70, -45, -88, -95, -36, 49, 118, -220, -77, -73, 68, 55, -68, -44, -137, 95, 10, 3, 202, 71, -26, -20, 76, -142, 94, 63, -81, -85, 95, -78, 19, -32, 80, 123, -23, 28, -23, 114, -7, 19, 32, 1, -74, 8, -114, -172, 185, 40, 21, 126, 34, -124, 29, -43, 12, -11, 47, 38, -115, 4, -60, -76, 70, -6, -78, 36, 34, 61, -113, 58, -43, 2, 111, 43, -128, -7, 14, -30, 109, 52, 48, 125, 20, -56, -24, 25, -49, -93, -42, -13, -73, 36, 54, 16, -24, 101, -151, -24, 122, -135, -66, 103, -22, -112, 14, 27, -245, 71, 83, -96, -65, 43, -45, -30]
4201c0R9k17O1K74j42j0K2Qj26l8J82k00J41ORj17J26O1q8j11J17j51J40n9J5
4226b8Q1l4poL5n7n7J86o2j07J21o1j09K24j0j01p4M9o3J57Nj41J11m7j65K64
4252A04oj86M3MJ02k89J48J84n3K1j0p8n8K10q6r4PK1K8J09m2k32J53L2j32K11
4278A11n3r1Q6P9j40m3J67k46R8n0P6L6k1j9K8J62j57j30J55m8J9l0J8l5M2L6
4304E0p4J8O9k9L7K7%j37P4m3o7O2J1r8J5K13j51mP3o4Qq7K13j73J9M9p5p4K67
4333A29%j90J69j21j27K45j55n4J79J5j21j19K85k10J17M3Rr4M1r4k1qJ13o2P6
4358D5k8k8K1J27j72l6J97k48j4J33n3P5n4j9jJ2P4j21Q1R4r6m8K15j74R0N1j38
4385a5K4M6j56j21L26j42M7m6J44k51P3J99k06L9J67j06j43K07n1k2L9r9jJ1Q4
$$ y = [-30, 69, -148, -87, 187, 45, 35, 57, 65, -61, -99, 83, -117, 24, 30, 39, -78, 48, 109, 21, -90, 27, -124, 16, -43, -28, 53, 19, 12, 6, 41, -16, -73, 113, 51, -56, 65, 4, -105, 119, 109, 8, -66, -17, -80, 77, 82, -59, 52, 5, -160, 104, 98, -88, -45, -41, 61, -228, -80, 104, 51, 72, 62, -16, -74, 136, 50, -44, -37, -16, 12, 121, 79, -153, 0, 32, -100, 111, 58, -33, 53, 132, -8, -51, 116, -130, -32, -82, -6, 30, 9, -10, 18, 180, 23, -107, 48, 0, 19, -11, 7, -28, 14, 50, -24, -6, 63, 34, 71, 98, 98, -39, 35, -8, -75, -13, -2, -100, -85, 128, -23, -27, 46, -18, -10, -97, 116, -57, -38, 11, -64, -138, 129, 129, -61, 108, -13, -140, 105, -50, -104, 75, 90, -31, -150, 135, -75, 42, 85, 94, 0, 41, -53, -74, -82, 31, -31, 45, 17, -11, 10, 137, -35, -71, 126, -122, -136, -3, -56, 19, -35, -54, -55, -43, 31, -90, -9, 85, -11, -59, 156, -18, 72, 123, -15, 9, 55, -101, -222, 104, -38, 9, -37, 107, -144, -71, 128, -78, -39, 128, 22, -121, 86, 35, 13, 52, -47, -48, -37, 47]
4410D7j03q8K20nj03oL0j51K00O2k74J97M8j92J66J0Q3j59J55j97N2R3m3K0R4
4435A56j32j87R4J5J1k4k5NJ38L9j40o6P1O7k6L9r7m0J69p8p2J67r1k6o6P7k5
4462d7j1K06k44K42l5p2J0j5J07k09J64nN7j78N6r2M9R4j27n4O4R8j43J46M5m4
4488F2r6M6J9n9Q6M0o7j05J12m1J33j67j02J35M4k88J82O3K2r7J52k5Rj81O4J13
4514E4J9j07Pm8M7O6l6K9p1q2K32j21n4J68o8j16R7n1J18p6J9J2r1M6Pn4J29K
4542G7j12ML3n9Q7K3q1M8m4L2k8O0n7P7n2l0r3J50lm4Q3p9J05j81J99j38J13J9
4570A09j30J12m4pr4J00O5j51L7J9r7M4Q2j5j76J56r5N1J29j28k0J05N1q2j12
4595i1K09k39O1J71m6m7k3J01j94L61l51M0J48q1p7P9o0%M9o3N2j40J52m1Q8m0
$$ y = [47, -56, -144, 76, 71, -32, -38, -8, -159, 41, 103, -171, 26, 74, -118, 48, 58, 141, -18, 137, -60, -8, 85, 42, 62, 156, 24, -163, -69, -54, -43, -67, -92, -87, 51, 90, -50, -116, -45, 22, -4, 35, -62, -102, 67, -11, -83, 84, -7, -33, -99, -22, -47, -58, 148, -96, 146, 111, 39, 49, 34, 141, -68, 96, 91, 148, -30, 26, -66, -17, 77, -50, -104, -40, 58, -85, 61, 106, 62, -34, 12, 31, -28, 58, 98, 31, -74, 38, -3, 130, -37, -139, -4, 40, -248, -66, -3, 19, -78, 74, 49, 58, -123, -59, 54, 73, -34, -27, -75, -28, 38, 2, 31, -40, -122, 110, -11, -65, 103, 35, -81, 16, -35, 83, 7, 26, 38, -53, -7, 0, -54, 75, 77, -35, -31, 2, -57, 30, 53, -28, 20, -24, 8, -20, 40, -17, 60, 8, -22, -115, 35, 32, -12, 71, -8, 97, -84, 115, -23, 90, 109, -21, 91, 47, 40, -54, 46, 111, -40, -3, 16, -81, -37, 45, 30, -146, 10, -85, -34, 95, -33, -53, 52, 103, 21, -91, 118, -121, -60, 111, 65, 18, -5, 96, -98, 263, -88, -48, 100, 19, -58, 21, -39, -39, 10, -53, -1, -141, 11, -30, 58, 18]
4621A8O5j40O1j7k0m6J22k1Ln8j08k5K37jk6m2N8j41Q8K9o4J01q1pn7P2Q7n0j6
4650B1J24l16J94j03o4K64k57J56o3Q8j45K84j95R5r4Q4j04m5M1n4n0J69k2l0
4674b2L8j50rN3J62j54P7Q1j34k6L1k2J5J59l2j14J09L0m7j01J79j56J42j76J19
4699E2j34J57j20R7lq1Q6L9q8j37J04M7l2p5R6Kk5J43J1j95R5j6j39O3J63j17
4725gRJ06k66K06m7Q6j36Q0J6p0R6kj39J02n7j8q3J32J1J19j00o9Oj31K41k33
4751a48J43O4L6q0j4K1qN1p5KO5mj1r6L8J1R2j14M7n2QJ00j06J89j49L6J06j14
4779C8j00OJ47j23nP6mq5J05n7pj8P1q0J15m9j48R5j1L5m9n1J39P6Jo4J6l3j03
4808f7J47J9j51R3m2j29J21Lm7J47j67J22n3L9Q9q0r9R0L8k2m0j02Q4K4j03P8
$$ y = [18, 83, -57, 4, -13, -33, -79, 43, 22, 25, -33, -141, -166, 71, 70, 44, 2, 60, -81, 7, 36, -28, 73, -8, -15, -72, 0, 87, 37, 21, 145, -171, 23, -80, -144, 120, -137, 19, -44, 44, -101, 183, -12, 83, -11, 73, -31, -76, -35, -89, -139, 30, 8, -22, 16, -134, -143, -90, 72, -82, -5, 76, -58, -84, -53, -75, -60, 99, 67, -47, 62, 92, 45, -56, 123, -33, 109, -67, 52, -82, 75, -45, 52, 49, -32, 54, 93, 5, -132, -28, 19, -13, -88, 8, 10, -15, 128, 139, -56, 39, 23, -116, -53, 110, -7, 2, 108, -158, 48, 1, 87, -49, 31, 47, -23, 73, 71, -68, 34, -23, -41, -124, 8, 19, 138, 38, -31, -25, -156, 85, -148, -5, 59, 95, 15, 1, 22, 14, 65, -10, -8, 57, 53, 42, -54, -16, -5, 87, -27, 20, -32, -24, 76, -30, 159, 10, 46, 152, 38, -62, -56, 91, -32, -37, 39, 35, -50, 55, -2, -9, -27, 44, -36, 79, 30, -118, -23, -34, 1, -48, -99, 40, 116, 117, 53, 69, 36, -67, 80, 99, -52, 41, -1, -130, -9, -6, -53, 94, -73, 49, -4, 35, 124, 44, -55, 35, 73, 51, 11, -91, -7, 17, -86, -8]
4834hp1N8j61J54R8J4j97J29jQ0n5Mp0M7R0j72J30J1j16m5J60j23P3J3k6lj0l5
4862c2L9k5J37j51oJ45q8o2J13m8j26J07J9m0NM6m4R6p8p5O2N4Lj06J44j59P0
4889@J31j48jJ0J11p7L2k2j37J22L9j10j27J79n3M7Oj66K86k04J58r7K3J06j44
4914c6m0L56l14k7M6q5R8K3K1j31J20J22j83N0J0K0j11J38r3j47K42p4l5O6Jp0
4940c3j34J53Rl6K4j27K45p1p5R4O2o1j35M1L4j8P7r3P6J4j1L3k8l9q4j7P4j18
4968a44J55p5M9j51J40p3J06Q0j28J75n7Jm4o1P7L2j01L8l0l4O2p4J20o8M2l7
4994@j65K81N4j38m8O4l9M7j02P7j9P0k94K20j7O3j67J75l9j60J27k4J17n1M9
5019H1j01M5nk6j0n2J20j6k1J9pJ28k03N1P3j6j40k4N4m9J50j36L1R3r4J25p7
$$ y = [-8, -79, -21, -182, -28, 70, 84, -113, 16, 15, 95, 40, 44, -26, 21, 111, -61, 69, 80, -36, -81, 79, -44, 29, 42, 16, 13, 3, -32, 7, -18, 119, -32, -38, 107, 19, -43, 70, 22, -104, 3, 22, -18, -13, 33, -11, 85, 7, -68, -6, 48, 51, -55, 89, -70, 0, 131, -17, -18, -8, 103, 26, 58, 36, -101, 21, 60, -50, -177, 2, -51, -4, 2, -164, 122, -82, 76, -21, 2, 108, -36, -76, 280, -34, -61, -15, -100, -2, 21, 42, -89, 31, 153, -30, 20, 30, 50, -61, 77, -16, -163, 79, 5, -30, 36, 37, -33, -167, -14, -5, -41, -17, -144, 101, 30, -45, 49, 111, 50, -85, -44, -10, -28, 49, -44, 32, 46, 35, 68, 40, 1, -83, -100, -26, -144, 11, -64, -15, -166, -26, -99, 7, 87, -41, 134, 77, 78, 34, -27, 50, 82, -19, 19, -11, -45, 17, -57, 63, -5, 37, 0, -165, 116, 170, 32, -16, 48, 9, 56, -46, 31, 12, 82, -212, 8, -9, 54, -113, 62, 23, -137, -10, -34, 83, 32, 81, -20, 25, 20, -6, -16, -68, 52, 36, 15, 34, 27, 155, -48, 3, 76, 60, -80, -104, -50, -99, 51, -85, -54, 39, -55, 70, -7]
5046gMK4Lj5o7N2Q7j29n2J54r2j8Q3q2n5J08P2qj38J3J3l9o3K07n0M9j6q3J7N2
5076B4m0J20m4j0m7Q6Jj12R6R5j52POMj20J16R6j79O8j03Q3j01J25n4O2k7J4p
5104Gp0J66j96M5Q1O9%N2k85J27n5Q9M9M1j18o6mJ98j15m7j25R1p8J16j46K87
5130A13j84mM0O5n4n2J89j01K5q0J24Nj20L9l1M0R4k5j21J9j24O4J61j66J13j38
5156a09J26p2J02q6Q5M5j85J21j09L8qO7p2N7m2K6J10q0j34J28N0M0p2L9j30j11
5182a76J37m3M2n5q5K60n5j06J81o6n3Q7k2j34J4Q5l9K5J0N9j37k9J87j9j22Q1
5208B7q2J2L5j3R1n0J4j54J33O7n5Qm0j0J9P7j36L9J9k6l2l0MN5N6j00K0l2P8
5237fj61J00nO1n3N3J04j25L9Q1l5Nj34J17q9J52q3k9m5nK3N4J1l9j1j0J3M7j00
$$ y = [-7, -3, 21, 24, 9, -58, -6, 81, -48, -100, 54, -38, -56, 27, -55, -110, -2, 70, 62, -76, -63, -50, -89, -152, 55, 5, 54, 38, -45, -28, 24, -16, 104, 60, 50, 3, 89, 90, -22, 74, 169, 17, 24, 30, 34, -86, 30, 126, -53, 15, -88, -5, -106, 19, -35, 27, 0, 14, 7, -63, 103, -93, -48, 33, 102, 102, 154, -131, -4, -59, 30, 79, 120, 2, -64, -68, 130, 15, -32, -157, -66, -144, -28, -174, 113, -71, -75, -35, 30, -24, -76, 113, 12, 37, -43, 81, 86, -34, 5, -26, 14, 108, 83, -38, -19, -143, -79, 82, -84, 29, -109, 17, -55, 47, -39, 46, 91, -94, 27, -82, -44, -52, 15, -57, 0, -42, -16, 94, 14, -120, 8, 58, 98, 26, 65, -65, -176, -39, -82, -40, -95, -180, 80, 25, -81, 100, 34, -19, 68, 46, -88, -74, 11, -28, -3, 7, 66, -71, -100, 87, 68, -54, 27, -55, -43, -8, -21, 70, 20, 34, -120, 13, 80, 25, 33, -7, -17, 2, 79, -57, -18, 1, -25, -57, -87, -83, -28, 28, -72, -52, -84, -6, -167, -67, -72, -11, -64, -11, 93, -32, 7, 88, 53, 58, -76, 41, -48, 104, 21, -8, -53, -58, -35, 19, 30, -9, -20, -30, -17, 30, -70]
5266g0J10R3p8J26j25p6M3Q0j40R0m4j4j1k7K53k46J80m0o0k1j48J83n6r7J51
5291E6m0j06J17O2j04J00j03n3mP3J9j05J16p9R8j83P4J48r6J43j60jL4J0M3N1
5317A10oj73%O0M0l4PJ9J29j84n6O7Jl0Q6Ro3O7k4N3k31J7JJ05J8M4j0M1j22l0
5347h9R2n2K9K4P4k1l7k0oj7l7J64r2K8K8r1K1j0p1R1r3P1J3j2J62n9j06P6k4
5376C6q0O8j2J05p8q7j6j02J61K2l2L4Rj07N2M9K4j9m8Mk7J49j73m8J10n9J5k5
5404g5L5Q3j00P1K9j4L3L2k9Q0o4J33k75M2R7r7O3k4K3n8NO5KO4k07Q6QJ20k09
5433h1J15Mk9mKJ10j81J8j35J81q9m5R1m3R1N1q0p2J10k9k7J63k36J49j28Q4K5
5460A5L3r6r1Q9o8N2P5kj1J16j93O9J5K6m6J12l0j57J90q8k4n4J3L0l1l2j33K48
$$ y = [-70, 40, 133, 55, 181, 56, -20, 23, 103, -37, 53, 9, -5, -16, -43, 210, -36, 144, 104, 44, 23, -125, 58, 2, -95, 56, 16, -90, 27, 89, -15, 85, -18, -71, -75, -2, 17, -88, 28, -51, 47, -136, -62, 86, -10, 133, -27, -28, 6, 16, 59, 110, 104, -69, -69, -9, 31, -3, 4, 23, 152, -32, -88, -21, -20, -50, 36, 45, -18, 49, 25, 78, -153, -136, -135, -30, -12, 32, 22, 63, -59, -89, 3, -49, -20, 4, 78, 57, 20, 0, -6, -23, -60, 104, 12, 40, 68, -23, -2, -12, -83, 8, -85, -14, -1, -13, 149, 90, -16, 60, 36, -44, 24, 12, 117, 39, -48, -64, -166, -5, 17, -15, 19, 28, -79, -27, 22, 46, 27, -21, -17, -44, 105, -68, -116, -6, -65, -50, -75, -40, 43, -57, 14, 43, 29, 62, 94, 65, 145, 81, 214, -61, -19, 78, -19, 44, 20, 43, -15, -10, 55, 57, 121, -86, 0, 8, 128, -81, 34, 38, 9, 5, 7, 117, -64, -46, -181, 0, -89, -134, -43, -86, 5, 56, -24, -96, 14, -15, -42, 121, -115, 34, -94, -10, 15, 48, -48, -139, -50, -118, -66, 9, 7, -4, 112, -81, -12, 3, 29, -17, 95, 65, -92, 98, 10, -14, -68, -55, -25, -56, -88, -221, 27]
5488B7j73J03L5L5j23O9J17j16K8j06OJ24p3J09M3m9Lq2JqM2K1j50R9R7m1j21
5515h3J20l8j8M6m1L2r0l6J30K5J00j19j8J14r6j29Q1lM6r3KOo6J00L5Q9j11j3
$$ y = [27, -146, -43, -8, 27, -96, -27, 90, -26, 2, -104, -98, 26, -47, 62, 105, 56, 59, -23, -22, -30, 12, 33, -117, -18, 79, 38, -83, 37, -1, -19, 27, -14, 18, -72, -108, 22, 47, 147, 28, 10, 124, 28, -101, -20, -23, 23, -70, -68, -62, -128, -28, 7, 96, -15, -28]
$$ [...]
8191i9
##END NTUPLES=NMR FID
##END=
