##TITLE=1H_B0406-2
 CDCl3, 8 sc, 
 5.6.2019
##JCAMPDX= 6.0         $$ Bruker NMR JCAMP-DX V2.0
##DATA TYPE= NMR FID
##DATA CLASS= NTUPLES
##ORIGIN= UXNMR, Bruker Analytische Messtechnik GmbH
##OWNER= root
$$ XWIN-NMR		Version 3.5
$$ Wed Jun  5 14:10:09 2019 Russian Standard Time (UT+4h)  she@DPX200
##.OBSERVE FREQUENCY= 200.13155
##.OBSERVE NUCLEUS= ^1H
##.DELAY= (6, 6)
##.ACQUISITION MODE= SIMULTANEOUS
##.ACQUISITION SCHEME= undefined
##.AVERAGES= 8
##.DIGITISER RES= 18
##SPECTROMETER/DATA SYSTEM= spect
##.PULSE SEQUENCE= zg30
##.SOLVENT NAME= CDCl3
##.SHIFT REFERENCE= (INTERNAL, CDCl3, 0, 15.7039)
##AUDIT TRAIL= $$ (NUMBER, WHEN, WHO, WHERE, WHAT)
$$ ##TITLE= Audit trail, XWIN-NMR		Version 3.5
$$ ##JCAMPDX= 5.01
$$ ##ORIGIN= Bruker BioSpin GmbH
$$ ##OWNER= she
$$ F:/spectra/data/she/nmr/H-F/1/audita.txt
$$ ##AUDIT TRAIL=  $$ (NUMBER, WHEN, WHO, WHERE, WHAT)
(   1,<2019-06-05 14:08:23.90 +0400>,<she>,<DPX200>,
      <created by zg, POWCHK disabled, PULCHK disabled
       configuration hash MD5:
       00 E9 B6 7A A2 85 ED C7 34 08 36 98 17 FE 4E 26
       data hash MD5: 16K
       CB 8A 66 D4 AE 29 73 DE B0 46 2A 53 2C B4 82 8E>)
$$ ##END=
$$ 
$$ hash MD5
$$ 3E E5 AF 7C 0C 0A 46 04 C1 8E 5A 49 D4 E4 55 F0
##$RELAX= 
##$RELAX= 
##$RELAX= 
##$RELAX= 
##$RELAX= 
##$RELAX= 
$$ Bruker specific parameters
$$ --------------------------
##$DU= <F:/spectra>
##$EXPNO= 1
##$NAME= <H-F>
##$PROCNO= 1
##$TYPE= <nmr>
##$USER= <she>
##$AMP= (0..31)
100 100 100 100 100 100 100 100 100 100 100 100 100 100 100 100 100 100 
100 100 100 100 100 100 100 100 100 100 100 100 100 100 
##$AQSEQ= 0
##$AQ_mod= 1
##$AUNM= <au_zg>
##$AUTOPOS= <>
##$BF1= 200.13
##$BF2= 200.13
##$BF3= 200.13
##$BF4= 200.13
##$BF5= 200.13
##$BF6= 200.13
##$BF7= 200.13
##$BF8= 200.13
##$BYTORDA= 1
##$CFDGTYP= 0
##$CFRGTYP= 5
##$CHEMSTR= <none>
##$CNST= (0..31)
1 1 145 1 1 1 1 1 1 1 1 1 1 1 1 1 1 1 1 1 1 1 1 1 1 1 1 1 1 1 1 1 
##$CPDPRG= <>
##$CPDPRG1= <>
##$CPDPRG2= <>
##$CPDPRG3= <>
##$CPDPRG4= <mlev>
##$CPDPRG5= <mlev>
##$CPDPRG6= <mlev>
##$CPDPRG7= <mlev>
##$CPDPRG8= <mlev>
##$CPDPRGB= <>
##$CPDPRGT= <>
##$D= (0..31)
0 1.2 0 0 0 0 0 0 0 0 0 0.03 0 0 0 0 0 0 0 0 0 0 0 0 0 0 0 0 0 0 0 0 
##$DATE= 1559729303
##$DBL= (0..7)
120 120 120 120 120 120 120 120 
##$DBP= (0..7)
150 150 150 150 150 150 150 150 
##$DBP07= 0
##$DBPNAM0= <>
##$DBPNAM1= <>
##$DBPNAM2= <>
##$DBPNAM3= <>
##$DBPNAM4= <>
##$DBPNAM5= <>
##$DBPNAM6= <>
##$DBPNAM7= <>
##$DBPOAL= (0..7)
0.5 0.5 0.5 0.5 0.5 0.5 0.5 0.5 
##$DBPOFFS= (0..7)
0 0 0 0 0 0 0 0 
##$DE= 6
##$DECBNUC= <off>
##$DECIM= 24
##$DECNUC= <off>
##$DECSTAT= 4
##$DIGMOD= 1
##$DIGTYP= 9
##$DL= (0..7)
0 120 120 120 120 120 120 120 
##$DP= (0..7)
150 150 150 150 150 150 150 150 
##$DP07= 0
##$DPNAME0= <>
##$DPNAME1= <>
##$DPNAME2= <>
##$DPNAME3= <>
##$DPNAME4= <>
##$DPNAME5= <>
##$DPNAME6= <>
##$DPNAME7= <>
##$DPOAL= (0..7)
0.5 0.5 0.5 0.5 0.5 0.5 0.5 0.5 
##$DPOFFS= (0..7)
0 0 0 0 0 0 0 0 
##$DQDMODE= 0
##$DR= 18
##$DS= 0
##$DSLIST= <SSSSSSSSSSSSSSS>
##$DSPFIRM= 0
$$ [...]
##$SUBNAM2= <"">
##$SUBNAM3= <"">
##$SUBNAM4= <"">
##$SUBNAM5= <"">
##$SUBNAM6= <"">
##$SUBNAM7= <"">
##$SUBNAM8= <"">
##$SUBNAM9= <"">
##$SW= 24.9336996594482
##$SWIBOX= (0..15)
0 0 2 0 0 0 0 0 0 0 0 0 0 0 0 0 
##$SW_h= 4990.01996007984
##$TD= 16384
##$TD0= 1
##$TE= 0
##$TE2= 300
##$TE3= 300
##$TEG= 300
##$TL= (0..7)
0 120 120 120 120 120 120 120 
##$TP= (0..7)
150 150 150 150 150 150 150 150 
##$TP07= 0
##$TPNAME0= <>
##$TPNAME1= <>
##$TPNAME2= <>
##$TPNAME3= <>
##$TPNAME4= <>
##$TPNAME5= <>
##$TPNAME6= <>
##$TPNAME7= <>
##$TPOAL= (0..7)
0.5 0.5 0.5 0.5 0.5 0.5 0.5 0.5 
##$TPOFFS= (0..7)
0 0 0 0 0 0 0 0 
##$TUNHIN= 0
##$TUNHOUT= 0
##$TUNXOUT= 0
##$USERA1= <user>
##$USERA2= <user>
##$USERA3= <user>
##$USERA4= <user>
##$USERA5= <user>
##$V9= 5
##$VALIST= <valist>
##$VCLIST= <CCCCCCCCCCCCCCC>
##$VD= 0
##$VDLIST= <DDDDDDDDDDDDDDD>
##$VPLIST= <PPPPPPPPPPPPPPP>
##$VTLIST= <TTTTTTTTTTTTTTT>
##$WBST= 1024
##$WBSW= 4
##$XGAIN= (0..3)
0 0 0 0 
##$XL= 0
##$YL= 0
##$YMAX_a= 248340
##$YMIN_a= -214222
##$ZGOPTNS= <>
##$ZL1= 120
##$ZL2= 120
##$ZL3= 120
##$ZL4= 120
##$ABSF1= 10
##$ABSF2= 0
##$ABSG= 5
##$ABSL= 3
##$ALPHA= 0
##$AQORDER= 0
##$ASSFAC= 0
##$ASSFACI= 0
##$ASSFACX= 0
##$ASSWID= 0
##$AUNMP= <proc_1d>
##$AZFE= 0.1
##$AZFW= 0.1
##$BCFW= 1
##$BC_mod= 2
##$BYTORDP= 1
##$COROFFS= 0
##$CY= 11.3945322036743
##$DATMOD= 1
##$DC= 2
##$DFILT= <>
##$DTYPP= 0
##$F1P= 18.9103706918063
##$F2P= -1.10871071338519
##$FCOR= 0.5
##$FTSIZE= 0
##$FT_mod= 4
##$GAMMA= 1
##$GB= 0.15
##$INTBC= 1
##$INTSCL= 1
##$ISEN= 128
##$LB= 0.24
##$LEV0= 0
##$LPBIN= 0
##$MAXI= 10000
##$MC2= 0
##$MEAN= 0
##$ME_mod= 0
##$MI= 1.114404
##$NCOEF= 0
##$NC_proc= 0
##$NLEV= 6
##$NOISF1= 3.799351
##$NOISF2= 2.8
##$NSP= 1
##$NTH_PI= 0
##$NZP= 0
##$OFFSET= 15.70392
##$PC= 1
##$PHC0= -8658.252
##$PHC1= 16.40018
##$PH_mod= 1
##$PKNL= yes
##$PPARMOD= 0
##$PSCAL= 0
##$PSIGN= 0
##$REVERSE= no
##$SF= 200.130013532006
##$SI= 16384
##$SIGF1= 3
##$SIGF2= 2
##$SINO= 400
##$SIOLD= 16384
##$SREGLST= <1H.CDCl3>
##$SSB= 0
##$STSI= 0
##$STSR= 0
##$SW_p= 3612.71676300578
##$SYMM= 0
##$S_DEV= 0
##$TDeff= 0
##$TDoff= 0
##$TI= <>
##$TILT= no
##$TM1= 0
##$TM2= 0
##$TOPLEV= 0
##$USERP1= <user>
##$USERP2= <user>
##$USERP3= <user>
##$USERP4= <user>
##$USERP5= <user>
##$WDW= 1
##$XDIM= 8192
##$YMAX_p= 0
##$YMIN_p= 0
$$ End of Bruker specific parameters
$$ ---------------------------------
##NTUPLES= NMR FID
##VAR_NAME=  TIME,          FID/REAL,        FID/IMAG
##SYMBOL=    X,             R,               I
##VAR_TYPE=  INDEPENDENT,   DEPENDENT,       DEPENDENT
##VAR_FORM=  AFFN,          ASDF,            ASDF
##VAR_DIM=   8192,          8192,            8192
##UNITS=     SECONDS,       ARBITRARY UNITS, ARBITRARY UNITS
##FACTOR=    0.0002004,     1,               1
##FIRST=     0,             0,               0
##LAST=      1.6414764,     0,               0
##MIN=       0,             -214222,         0
##MAX=       1.6414764,     248340,          0
$$ Real data points
##PAGE= N=1
##DATA TABLE= (X++(R..R)), XYDATA
0@%%%%%%%Qj6J6k4L2m0N6o4P2q8J05j29J52j76K08k40K78l22L68m20M80n45O14
30C25o93P80q74R80j094J221j362J513j676J859k063K281k522K794l098L433l808
47b004M239m733N299n960O749p708Q900j0430J2476j5372J9813k7553M4803j46832
61a18313N5086K91107k45088j95809J70818J69663j76325p4438J60571K7695j89110
72a24143K3597J96565j7904k03136P459J70194K9884j19169m5174M7015N6243
83B1431J6363l9769o1431K8126P4962j8077o3194L7486L7232p4718j3957J33075
95G7529N231j85974j1692K25450K7110k33748l4853K19359K5608j87118P319J58369
107I2590n3188j38746J01192J35809j32444j38384J41707J38943j26007j23152
$$ plain form
0 0 0 0 0 0 0 0 0 8 -8 8 -16 16 -24 32 -32 40 -48 57 -72 80 -96 112 -128 150 -172 196 -224 256 -289 325
30 325 -368 412 -462 518 -576 645 -717 796 -880 979 -1084 1197 -1325 1469 -1629 1804 -2004
47 -2004 2235 -2498 2801 -3159 3590 -4118 4782 -5648 6828 -8544 11269 -16284 28519 -118313
61 -118313 -63227 227880 -17208 -213017 -42199 127464 -48861 -123299 37272 64967 -124143
72 -124143 -100546 96019 78115 -125021 -117562 52632 82516 -36653 -81827 -34812 21431
83 21431 37794 -1975 -63406 -35280 39682 21605 -41589 -4103 33129 -41589 -55546 77529
95 77529 82760 -103214 -114906 110544 137654 -96094 -130947 88412 114020 -73098 -65779 92590
107 92590 39402 -99344 1848 137657 5213 -133171 8536 147479 21472 -101680
117a01680R7759R1270o6413m4454M6051j707l7060L7177L7749n0271l5955M2596
129A5062K4252j9298L469o668m3040K5601Q4992l2254j16903K9182J28701k5625
141F7471j19316L0433R3484n0762o4784Q2093M1346j18092l1851J43231L0423
152A03676j52454l3148J39291K6596j13926j0177Q1252j9922n6219N0938L9533
163E5440p8264l5537Q8130L2819q2865k9098O0295J3496l4103R243Q102l9118
175c1460O433O2954j3035p7321J1641P3375j3083n6809K0083L0764l7655p420
187c1533N9284r711q0427J5946R0731j6848q8173J6277P1796k1451m8639L3419
199i329K4567n0522o922O6296k853p5432O156P2934p487n9621J1471L9155k0380
$$ plain form
117 -101680 -3921 87349 20936 -23518 22533 20826 -16234 20943 58692 8421 -27534 15062
129 15062 39314 20016 23485 16817 -26223 -622 84370 52116 -64787 -35605 93096 67471
141 67471 -51845 -21412 72072 21310 -43474 38619 79965 -38127 -69978 73253 103676
152 103676 -48778 -81926 57365 83961 -29965 -40142 41110 21188 -35031 15907 55440
163 55440 -22824 -58361 29769 62588 -20277 -49375 10920 24416 -9687 -444 7658 -31460
175 -31460 -25027 37927 24892 -52429 -40788 32587 19504 -37305 -17222 13542 -24113 -31533
187 -31533 27751 18040 -62387 -46441 44290 27442 -60731 -44454 27342 5891 -42748 -9329
199 -9329 15238 -35284 -42206 24090 21237 -54195 -48039 24895 17408 -42213 -30742 8413 -11967
212a1967j7208L3318k14m5871J1425N3822j5491n2201J7207M2048j8767k4000
224b7899K5098N323l3461J1870M3510k1115m8202K6542M7509k6638l6811K9053
236e221K2736l1462m715L8727q214m3982J9038M8358k2242m5103K4893L8145k4625
249F333k4213K7804J1154l0264K509L5058j0408l5998J6012L4898j6989k7286
261a1390J8089J7396j8566m750K1136n963k3234J4426K4686j8588k2771K0458
273A0929J7385k0677q756K0991j096k2133R949K3300j6875k3737K0401K1571k2192
286I060j7479K2043J0350k2236l319K1789l944k2119Q665K0615j2485j8752J3193
299E381J4003j3984r466J2838K788j2862J879J0984o831j0333Q679O851j0765
$$ plain form
212 -11967 -29175 4143 3929 -41942 -30517 23305 7814 -44387 -27180 14868 -3899 -27899
224 -27899 -2801 2522 -30939 -19069 24441 3326 -44876 -18334 29175 2537 -34274 -5221
236 -5221 17515 -13947 -18662 20065 11851 -32131 -13093 35265 13023 -32080 -7187 30958 6333
249 6333 -17880 9924 21078 -9186 -6677 28381 17973 -18025 -2013 32885 15896 -11390
261 -11390 6699 24095 5529 779 21915 15952 -7282 7144 31830 13242 -9529 10929
273 10929 28314 7637 -1119 19872 18776 -3357 6592 29892 13017 -10720 9681 31252 9060
286 9060 -8419 13624 23974 1738 -1581 20208 16264 -5855 2810 23425 10940 -7812 5381
299 5381 19384 5400 -4066 8772 11560 -1302 577 11561 4730 -5603 3076 9927 -838
312h38m219J0342j126j0976M488R475r269r417J1062O676j3802n012J3734J021
326B139j5124J473J4173n276j4454O882J2478r190j1222R530P914j0683n476J0554
340f282K111j1037k67J0327j474r328K211P111k760m413L328J482l744J127M515
355g093k506m480L665L869l367j747L688k39l592L456M660m887m984O658O082
370h17o077n295O049M402m480j636M804r3m516K556O004k622o023K939O665r48
386I12m866L72L623J166n12l92m09L38J872J276o12p52k54R37K658J547l193k785
404I26M166N123k791n237K569N340j210l155J940J734k617L37M749n12n980N05
420E887P145N42o349j277N054J537k893o94Q89q53K73K105m32l473l21K897Q52
$$ plain form
312 -838 -5057 5285 4159 -6817 -2329 7146 -2123 -11540 -478 6198 -7604 -12616 1118 2139
326 2139 -12985 -11512 2661 -2615 -17069 -10187 2291 -6899 -18121 -8591 -677 -11360 -16836 -6282
340 -6282 -4171 -15208 -15475 -5148 -6622 -15950 -13739 -6628 -9388 -13801 -10473 -8991 -12735 -11608 -7093
355 -7093 -9599 -14079 -10414 -6545 -9912 -11659 -7971 -8210 -11802 -8346 -3686 -8573 -13557 -6899 -817
370 -817 -6894 -12189 -6140 -1738 -6218 -7854 -3050 -3143 -7659 -5103 901 -1721 -7744 -4805 1860 912
386 912 -3954 -3582 41 1207 695 303 -106 232 2104 3380 2768 2016 1762 2699 5357 6904 3711 926
404 926 5092 10215 7424 2187 4756 10096 8886 5731 7671 9405 6788 7125 11874 11362 5382 5887
420 5887 13032 13574 7225 5948 11002 12539 9646 8952 9841 8988 9261 11366 10934 7461 7140 10037 10889
437A0889k165j605k58O49J820j99l632j916L559K252l759l206K315J568k393o69
453C250J638j999l145K847L533m441n353L777N006l837n336K509L189k652k018
468c032J990m75l248J110L351k411m499J869L637j749l268O20J075p93L48N31
484d944k692j471L534J499m242k083L694J084l287jK288k235k046M355J994o246
500a0799k497P483K652p574k408P157J447n969P15N310k943m566N736N154p184
515h286n101Q412N734p402m259O658K822m565O85M436l406l559O734M650p378
530c825m371Q087M631o067k234M846n5k586M593K507p464k104J0529L278j0298
545e33k905R559K134o688J403M836n145l032R953L545j2704m093J4041N032j2392
$$ plain form
437 10889 8724 7119 6861 7510 9330 9131 5499 3583 7142 9394 5635 2429 4744 6312 3919 3250
453 3250 4888 2889 -256 2591 6124 1683 -3670 107 5113 1276 -4060 -1551 1638 -1014 -3032
468 -3032 -1042 -1517 -4765 -3655 -304 -2715 -7214 -5345 -1708 -3457 -6725 -6105 -5030 -5823 -5475 -4944
484 -4944 -7636 -9107 -5573 -4074 -8316 -10399 -6705 -5621 -8908 -8909 -6621 -8856 -10902 -6547 -4553 -10799
500 -10799 -13296 -5813 -3161 -10735 -13143 -5986 -4539 -10508 -9793 -4483 -7426 -11992 -6256 -1102 -8286
515 -8286 -13387 -4975 759 -6643 -10902 -4244 -1422 -5987 -5302 -866 -4272 -7831 -1097 3553 -3825
530 -3825 -8196 -109 4522 -1545 -3779 1067 1012 -1574 3019 5526 -1938 -4042 6487 9765 -533
545 -533 -3438 6121 8255 1567 2970 7806 2661 -371 9582 13127 423 -3670 10371 15403 3011
560C011l968R736J463o255K926M230p698l313J1718L956j3533m491J2734M265
574A4781j0019k040O227k170l138P291J407j2267j645J4760K315j4744l043J1632
588I347J237p577K248K956p890p73J2720k64j6367r95J6075Q69j3722k08Q234
603E890l780l978Q345j91j4063J082J6858k035j7999J584J4781l613j0670O303
617a486M786j2049r16J6771k221k1457K566K2117l347k0540M095J5350p534j0070
631a3935J2044M941j7866k210K1596J025k2887r50K0427n68j5338L662R255q828
645i632m051J4251J023j8201M09J9275r63j6670K629J1715n493n310J0545j54
659f27j5634M333K0185n877k1400O987J9854p769j4202J0767P870j4754q13K0602
$$ plain form
560 3011 -957 8779 10242 3987 6913 11143 3445 132 11850 15806 2273 -2218 10516 14781
574 14781 4762 2722 8949 6779 3641 10932 12339 72 -1573 13187 15502 758 -2285 9347
588 9347 10584 3007 5255 8211 321 -452 12268 12004 -4363 -5358 10717 11586 -2136 -2344 5890
603 5890 2110 -1868 6477 6286 -7777 -6695 10163 8128 -9871 -8287 6494 2881 -7789 -1486
617 -1486 3300 -8749 -9665 7106 4885 -16572 -14006 8111 4764 -15776 -11681 3669 -3865 -13935
631 -13935 -1891 3050 -14816 -17026 4570 5595 -17292 -18242 2185 1617 -13721 -10059 -804 -9632
645 -9632 -13683 568 1591 -16610 -16201 3074 2111 -14559 -11930 -215 -5708 -11018 -473 -627
659 -627 -16261 -11928 8257 2380 -19020 -12033 7821 52 -14150 -3383 4487 -10267 -11080 9522
673I522l106k4812N601K7252n320k4644O213J9372p476j1003J2152M282j6867
686h834J498K1903l286k3065M624K1382m504j4970O622P850r404L30J4158n831
700H473j7555R738J9634j0578j7526J1234J2711j1659m689J3911l395j6963J0452
713C788K0555j4623k2138J6296K0693j6216j5703J6266P586j7627Q15K0438q275
726A1855k3358J2501K4357j4689k2698J4922J7118j5682j0064J6596J610j8955
738f487M874K0658j0140k1706J2157J9581j3461j5293J3091Q064j3916p99J4502
751A1125o997j6051J1755J5827j5008j4547J5173R621j5212l107J4488n519j5558
764a4010J2536J6056j8194j6468K0177J3837k1049r441K0286J932k0424N398K0196
$$ plain form
673 9522 6416 -18396 -12795 14457 9137 -15507 -9294 10078 2602 -8401 3751 8033 -8834
686 -8834 -7336 14567 11281 -11784 -7160 14222 9718 -5252 1370 9220 -184 146 14304 8473
700 8473 -9082 656 20290 9712 -7814 3420 16131 4472 -217 13694 10299 -6664 3788
713 3788 24343 9720 -12418 3878 24571 8355 -7348 8918 16504 -1123 -308 20130 11855
726 11855 -11503 998 25355 10666 -12032 2890 20008 4326 -5738 10858 12468 -6487
738 -6487 -1613 19045 8905 -12801 -644 18937 5476 -9817 3274 11338 -2578 -3377 11125
751 11125 4128 -11923 -168 15659 651 -13896 1277 10898 -4314 -7421 7067 1548 -14010
764 -14010 -1474 14582 -3612 -20080 97 13934 -7115 -16556 3730 5662 -14762 -9364 10832
777A0832j2625k0808J7283J9696k0259j7445K0688J2662k0570o596J9624m69j9034
790a7021O728J8136j1699j6875J4474J4528j5048j0455J4157M936j2215J851J0943
803B440q006r521J3092Q361j5257n611J5860J965j4294L910J3010r624j0982J5655
817I98R983j9373p561K1947N218k1834p74K1389l661j9281R305J7696j3462j5015
831a4425J7506J2882j9212r273K0253N984j8849j367J7193k856j4073P702J1586
844A3051j0774q322J3188N494j3121j564J2443k501j0054P126P974j0809n081
857b950J3881K479j5103Q86J5375m472j4223Q385J2742j1942j0437J4741P719
870A7081j6537m589J7309R04j7359K680J6319o053j4989Q660J2312j1087r515
$$ plain form
777 10832 -1793 -22601 -5318 14378 -5881 -23326 -2638 10024 -10546 -17142 2482 2013 -17021
790 -17021 -10293 7843 -3856 -20731 -6257 8271 -6777 -17232 -3075 1861 -10354 -8503 2440
803 2440 -5566 -15087 -1995 6366 -8891 -14502 1358 3323 -10971 -7061 5949 -3675 -14657 998
817 998 10981 -8392 -15953 5994 11212 -10622 -11396 9993 6332 -12949 -3644 14052 590 -14425
831 -14425 3081 15963 -3249 -12522 7731 13715 -5134 -6501 10692 7836 -6237 1465 13051
844 13051 2277 -6045 7143 12637 -484 -2048 10395 7894 -2160 4966 12940 2131 -2950
857 -2950 10931 13410 -1693 -807 14568 10096 -4127 4258 17000 5058 -5379 9362 17081
870 17081 544 -4045 13264 14168 -3191 -511 15808 9755 -5234 3426 15738 4651 -4864
883d864J2162N753j3223k491J2568j189j2210M249J0024p343q397Q915N255j0398
897a189k716J0251j242j0161M258Q825q004q204J0041O251j1929m677J1813J466
911D783j1742J637J0519n570j0209Q325R040j0702q137J1246N891j1280l495J0246
925E52L1r590L161Q358o205p703Q013O483q865n126Q324K874p251j37N751l004
941d334m608N798L888p789l315Q416K517p675q83O132j364m217M455L092p119
956g006k239R209K268r472j694Q886P69o604J468N121l734l162O484K987p925
971d644k360Q869K680p547j656O200O52l619K020K448m099j099O311J474o583
986i53j273O375J461m184j24K350j563j72M076l49n816O44O912J5o171KM635n81
$$ plain form
883 -4864 7298 13051 -172 -2663 9905 8716 -3494 755 10779 3436 -4961 3954 9209 -1189
897 -1189 -3905 6346 5104 -5057 -799 8026 22 -8182 1859 8110 -3819 -8496 3317 4783
911 4783 -6959 -5322 5197 -373 -10582 -2257 6783 -3919 -12056 -810 5081 -6199 -9694 552
925 552 583 -9007 -5846 2512 -3693 -11396 -3383 3100 -5765 -10891 -2567 307 -6944 -7081 -1330 -4334
941 -4334 -8942 -3144 744 -7045 -10360 -1944 573 -7102 -7985 -1853 -3217 -7434 -2979 113 -7006
956 -7006 -9245 -36 2232 -7240 -8934 -48 721 -5883 -4415 706 -3028 -6190 294 3281 -4644
971 -4644 -7004 1865 4545 -3002 -4658 1542 2194 -1425 595 3043 -1056 -2155 4156 5630 -953
986 -953 -2226 4149 5610 1426 1302 3652 2089 1917 5993 5644 -172 472 7384 7399 1228 1230 5865 5284
1004E284k233K166O68m260K95O201j86p005m23O578Q65m985n32K797p26r97K528
1021F035j10m476R0N355L95n268j201L883J040k080j77oj683Q07L360j095m903
1038c4M2M742O12l838j423J667M79m2N27j462k717J119L729p33m457q38L191J241
1056A805j972j568m39Q8J499R54k187k860J306L020n03k906q39J117O90M52k73
1073b616k150j284K595K377k248l585J246L269j56k333n12R16J24N39P76j265
1089d307j870J234K704k15k723n73K081J443o85j342l15Q88J341L27j339q20J029
1106c142J270L6m44o46j02J157J400m21j996j5K601R94j952j047J620J214o99
1123a72k70P76l12m96J316J361j145j636J234K331l25j836k9J715Q13n32n24J34
$$ plain form
1004 5284 3051 5217 5885 1625 1920 8121 7935 930 507 7085 7950 2965 2433 5230 4504 3507 6035
1021 6035 5925 1449 1539 6894 7289 2021 820 4703 5743 3663 3486 3480 1797 2604 5964 4869 -34
1038 -34 8 4750 5362 1524 101 1768 2247 2205 2732 1270 -1447 -328 3401 2668 -1789 -2627 564 1805
1056 1805 -167 -1735 -2174 -2086 -587 367 -1820 -4680 -3374 -354 -857 -3763 -4602 -3485 -2795 -2343 -2616
1073 -2616 -4766 -6050 -3455 -1078 -3326 -6911 -5665 -2396 -2552 -4885 -5397 -4481 -4357 -3818 -3042 -4307
1089 -4307 -6177 -4943 -2239 -2454 -5177 -5750 -3669 -2226 -2911 -4253 -4568 -3680 -2339 -2012 -3351 -4171 -3142
1106 -3142 -1872 -1836 -2280 -2926 -3028 -1871 -471 -892 -2888 -2903 -302 692 -1260 -2307 -687 527 -172
1123 -172 -442 334 22 -474 842 2203 1058 -578 656 2987 2662 826 797 2512 3325 2793 2269 2403
1141B403N57N28L08l18l14J61O01O11K8r30l58J258J215j057j467P92J656k50
1159E424j463J32Q45k46l70O92k55j154J09J601j8k066m22J613O27j410j030M48
1177C057N60P3m62q27j96N61M29p93q33J75J42j85J27m2j313n00J648O91k240
1196G2j668K054J632k026j827J203J086j265l99R88q26j603J134J911j699k627
1212c860J268K391j083k214M06R90m85j71M39r56j203J212J457j377j826Q13J224
1229b975m81m36P7q79l44J922Q26k726j491K777J839k259j666J709Q34r77N10
1246c740J184j752j390K854K295k990k397K688K617j683j372J202J94o32J762
1261a160J253k618j672L381K634k737k124K162J620q48K36O67j833m17L598J370
$$ plain form
1141 2403 2960 3488 3796 3478 3164 3325 3926 4537 4565 3635 3277 4535 5750 4693 3226 4018 5674 5424
1159 5424 3961 4093 4938 4692 4322 5014 4759 3605 3714 5315 5297 3231 2809 4422 5049 3639 2609 3057
1177 3057 3617 3690 3228 2401 2205 2766 3195 2402 1569 1744 1886 1701 1828 1786 473 -27 1621 2312 72
1196 72 -1596 458 2090 64 -1763 -560 526 -739 -1138 -150 -976 -2579 -1445 466 -1233 -3860
1212 -3860 -2592 -201 -1284 -3498 -3092 -2102 -2587 -2758 -2319 -3275 -4478 -3266 -1809 -3186 -5012 -4199 -2975
1229 -2975 -3456 -3892 -3815 -4694 -5038 -3116 -2290 -5016 -6507 -3730 -1891 -4150 -5816 -4107 -3273 -4250 -3740
1246 -3740 -2556 -4308 -5698 -2844 -549 -3539 -5936 -3248 -631 -2314 -3686 -2484 -2290 -2922 -1160
1261 -1160 93 -2525 -4197 -816 1818 -919 -3043 -881 739 -109 127 794 -1039 -1456 2142 3512
1277C512m062j691M088K175k806j343K074qp55K054Q60l623j005M858J831m637
1293A522j998L825J745k231j61J137j763k86L773O60n076j051N402J482m460j069
1309A451L049j98j616K003Q72m039o94N362J027o090j230N208R01l892J9K266
1325D399j990j235L758M94n570r04O017Q75n864r16M081m06k564J781Q09m310
1341a545l44N622l1o659m05N854k53m817R04K768l095j582M741L86o585m45P109
1358A623J48p073q9N469q98l900K056K100m039r54N585J63o609o6O381j37n211
1375e451O22L134j793j137L532m86n339J283O481j448o430J594N134k055l025
1390e384L285R71m855P73O426j638p226K333P234k463o061L159M371l669k193
$$ plain form
1277 3512 -550 -2241 1847 4022 1216 -127 1947 1939 1184 3238 4098 475 -530 4328 6159 1522
1293 1522 -476 3349 5094 2863 2702 3839 2076 1790 5563 6223 1147 96 5498 6980 2520 1451
1309 1451 4500 4302 2686 4689 5561 1522 828 6190 7217 1127 -103 5105 6006 2114 2133 4399
1325 4399 2409 1174 4932 5426 -144 -1048 4969 5844 -20 -936 3145 2739 175 1956 2765 -1545
1341 -1545 -1889 3733 3702 -2957 -3362 2492 2239 -2578 -1674 1094 -2001 -3583 1158 1544 -5041 -5486 1623
1358 1623 1771 -5302 -5391 78 -820 -4720 -2664 -564 -4603 -5557 28 191 -6418 -6484 -103 -240 -5451
1375 -5451 -4829 -1695 -3488 -4625 -1093 -1579 -6918 -5635 846 -602 -7032 -5438 -304 -2359 -5384
1390 -5384 -2099 -1128 -5983 -5210 1216 -422 -7648 -5315 1919 -544 -6605 -3446 925 -2744 -4937
1405d937M994M96n935J400O806j990o612K741O092k763m142L642K214m094M58
1420a630N407j981n737L280O242l425m945M013L467m225j047N291q36n562K603
1435I15O265l582n710M536M989m891l165N483J336n690O31O067k338n860L833
1450B819N395m759m561N481K986n721j119N683r55n851K878N675m589n330N465
1465C497M224o119k857O267Q46o701J032O496k930o409M075N476n339m365N851
1480C044K533o476j086O398q21o354K092N341l739m462M634K861n806j673N933
1495B419j16o031J393N180l347m627M578L183n978k262O302O31o869P15O446k463
1511h46o134L555N062m907m058N478K383o210j020O348m96o367J657N631k616
$$ plain form
1405 -4937 57 553 -5382 -3982 2824 834 -5778 -3037 3055 292 -3850 -208 2006 -2088 -1630
1420 -1630 3777 1796 -3941 -661 5581 2156 -2789 1224 4691 466 -581 4710 3874 -1688 915
1435 915 7180 3598 -2112 2424 7413 2522 -643 4840 6176 486 1117 7184 4846 -1014 2819
1450 2819 8214 3455 -1106 4375 7361 1640 521 6204 5249 -602 2276 7951 3362 -1968 3497
1465 3497 7721 1602 -1255 5012 5858 -843 189 6685 3755 -2654 1421 6897 1558 -2807 3044
1480 3044 5577 -899 -1985 4413 3592 -2762 -670 4671 932 -3530 1104 3965 -1841 -3514 2419
1495 2419 2303 -3728 -2335 2845 -502 -5129 -551 2632 -3346 -5608 694 1325 -5544 -4829 1617 -846
1511 -846 -6980 -3425 1637 -3270 -7328 -1850 533 -5677 -6697 -349 -845 -7212 -5555 76 -2540
1526b540m571L469K914m161j196M913k69n246J608N156k391m213L415K915l953
1541d150j194M979k17n428J946N836k959n272M168M828m706l379N435K165n572
1556c520k08O121j157n992K704O115l374n125L987M161l905k144M181N12m324
1571a968J702M677k706m358L561L961l598k487L893R03l729J253M111k747m138
1586a670M206M160m639l432N049K504m892q14M844p81m537K328M687l565m539
1601a091M220M349m390l481L996K213l650n29L232j230l223K403L084l211l002
1616c10L060J920k792r35K167q21k192K196J841l697j972L930J491m213j198L580
1632B055p1l499J162K835k832k792L573K333m321k471M099J758l791j285L047
$$ plain form
1526 -2540 -7111 -3642 -728 -4889 -6085 -1172 -1441 -6687 -5079 77 -2314 -6527 -3112 -197 -4150
1541 -4150 -5344 -365 -582 -6010 -4064 1772 -1187 -6459 -2291 2537 -2169 -5548 -113 2052 -3520
1556 -3520 -3728 2393 1236 -4756 -2052 4063 689 -4436 -449 3712 -193 -2337 1844 2356 -1968
1571 -1968 -266 4411 1705 -2653 908 4869 1271 -1216 2677 3580 -149 1104 5215 2468 -1670
1586 -1670 2536 6696 2057 -1375 3674 6178 1286 472 5316 4535 -2 2326 7013 3448 -1091
1601 -1091 3129 7478 3088 -393 3603 5816 2166 1637 4869 3639 416 2819 5903 2692 -310
1616 -310 2750 4670 1878 943 3110 2289 97 2293 4134 437 -1535 2395 3886 -327 -1525 2055
1632 2055 1984 -1515 -353 2482 -350 -3142 431 2764 -1557 -4028 71 1829 -1962 -3247 -200
1647b00j53k622J205K012k455j958K636J609k611j354J819M02j152O90L90j991
1663c733l26K967J72l544j18L238j30k948R42J943j809j437K944J074l868r55
1679e588M263J068m106q82L444N75k609M14J745j240j147K354J205k723j171K903
1695a495J380k196q10J395L97k10Q69j64j632O70K618l94k445N72K324l78j326
1712h25J201P33j611J07K809j43l149L88L501N7k946M7K589n7j590P28J024j187
1730A676l50J798L32j914l13J846M90j325k11O15p0J98N33p18r28Q48J323r53
1748B877j212P43R23r58k90R97l94j354O64J743j097k024R28J975r11j837P06
1765A479J229q61p86P57J77j144k7J050k71j330M6R37j60o98j67mk31L23K24j045
$$ plain form
1647 -200 -353 -2975 -1770 242 -2213 -4171 -1535 74 -2537 -3891 -2072 -1670 -2822 -2132 -1742 -3733
1663 -3733 -4059 -1092 -920 -4464 -4582 -1344 -1474 -4422 -3480 -1537 -3346 -4783 -1839 -765 -4633 -5588
1679 -5588 -1325 -257 -4363 -5245 -1801 -1226 -3835 -3421 -1676 -2916 -4063 -1709 -504 -3227 -4398 -1495
1695 -1495 -115 -2311 -3121 -1726 -1329 -1539 -670 -834 -2466 -1796 822 428 -2017 -1445 879 501 -825
1712 -825 376 1109 -502 -395 2414 2271 -878 -490 3011 3068 122 169 2758 2701 1111 1839 2863 1676
1730 1676 1326 3124 3456 1542 1229 3075 3565 2240 2029 2644 2574 2772 3305 2587 1659 2507 3830 2877
1748 2877 1665 2408 3331 2373 2083 3080 2686 1332 1996 3739 2642 618 1546 3521 2610 773 1479
1765 1479 2708 1847 1061 1818 1995 851 824 1874 1603 273 319 1256 1096 398 231 227 -4 319 543 -502
1785e02o38R10N05j169p10P77J74r25j7O55p11q98Q74Q25j384j164J227R20j202
1804b453r45R27M06p87k13O46l35p36O31P19p69p54O12P50m38m28J53R9J25M99
1824b291k11q32K48J078nj011J2Q99J29m34L27K28n48Q3J030O9j129N8J238L71
1844f91r68p6P06P1oL48r8n68L79J158j44j017J75J048J55m91J34L02k84M36Q56
1865A425n01r15O31J364k84j044L26P54J5o3L62k29n88P45J091n74j128N61J073
1884C021k09n76J80K8j75O16M74j018p89J142J062j084j027P50N97o20j21N40
1902B791o20q29J012R94j385j366J096J215q90j104L83L26m20R2L64r45q02J167
1920A079O51j203j005P01N55n13j94J37p36l03J229J88j705o39J706L94j579l74
$$ plain form
1785 -502 -1140 -230 275 -894 -1604 -827 -653 -1578 -1595 -940 -1651 -2549 -1675 -850 -2234 -3398 -2171 -1251 -2453
1804 -2453 -3398 -2471 -2065 -2852 -3065 -2419 -2754 -3490 -2859 -2140 -2909 -3663 -3051 -2301 -2739 -3167 -3014 -2915 -2790 -2291
1824 -2291 -2502 -3334 -3086 -2008 -2013 -3024 -3012 -2113 -1984 -2418 -2091 -1863 -2411 -2328 -1298 -1229 -2358 -2300 -1062 -691
1844 -691 -1659 -1735 -1029 -958 -964 -616 -714 -1282 -903 255 111 -906 -731 317 472 -19 115 417 133 569 1425
1865 1425 924 9 640 2004 1720 676 1002 1756 1771 1708 2070 1841 1253 1998 3089 2515 1387 1948 3021
1884 3021 2812 2236 2416 2444 2269 2885 3359 2341 1552 2694 3756 2672 1645 2395 2992 2372 2251 2791
1902 2791 2171 1342 2354 3348 1963 597 1693 2908 2018 914 1297 1623 1203 1295 1659 714 -88 1079
1920 1079 1730 527 -478 223 778 265 71 208 -528 -831 398 586 -1119 -1758 -52 342 -1237 -1611
1938a611J038k24r51O79N94j383q73J711P21j872r43J531O39j382l45R18l91p19
1956b863Q38N78j392o67J439N24j270m00R31k51m83P43K61j238j34J673O0j694
1974c345O2J641k81j145P60R66j165n14J776M18j937j00K198K21j912K54J751
1991c52l40j120R76J020j312m18J877M93j834m9J862O6j221N35R50q26l79J531
2009A459J94j599J36J926k91j466O75J249q69o84J349M41j619P2J997m58j870
2026F42P61J871r65j505J361J080j526n20J803J34k033M28J990o99j814R27J521
2043C456j291j111J574N57j832j70J924k66j921N75J632j156j312J346Q21j730
2059A096o00J730j4j862L21J474q79j544J195J030j786r97J811L78k133j17J772
$$ plain form
1938 -1611 -573 -797 -1748 -1069 -475 -1858 -2731 -1020 -299 -2171 -3114 -1583 -944 -2326 -2671 -1753 -2144 -2863
1956 -2863 -2025 -1447 -2839 -3506 -2067 -1543 -2813 -3213 -2282 -2533 -3016 -2273 -2012 -3250 -3384 -1711 -1651 -3345
1974 -3345 -3283 -1642 -1923 -3068 -2308 -1342 -2507 -3021 -1245 -827 -2764 -2864 -666 -445 -2357 -2103 -352
1991 -352 -692 -1812 -836 184 -1128 -1546 331 824 -1010 -1059 803 869 -352 183 1133 307 -72 1459
2009 1459 1653 54 190 2116 1825 359 1034 2283 1414 730 2079 2520 901 973 2970 2512 642
2026 642 1403 3274 2309 804 2165 3245 1719 1199 3002 3136 1103 1531 3521 2822 1008 1935 3456
2043 3456 2165 1054 2628 3185 1353 1183 3107 2841 920 1495 3127 1971 659 2005 2826 1096
2059 1096 496 2226 2212 350 671 2145 1266 -278 917 1947 161 -836 975 1353 -780 -897 875
2076H75n21j926Q48J398j483j288J645O73k049m52J974j08k056K51J686p88j490
2093b811J132R06j622p09J809L63k033j28J844k83j440N85J048j203o54J741K62
2110a193j914l0J929j77j661N10J317r62q77J605M74j849o0K090j65k022O02J927
2128d56q27j465J238J065j523l34K066o1k186N25K448o22j979Q67J733r82r19
2145a412J734K93j853J85K507k26k398P21K176o27j381J230P92j459j5K094j25
2162B236k222O22K301o33j933J061J557j122r56J697L65j969K85K347o18k364
2178F54Q12K250r26j786J103J036j446k79J814l72k317O46K462o89k426N25J813
2195B874q98r50J002J71j640K45J967o16k255N76J839p25j443O48O79j100r3J298
$$ plain form
2076 875 354 -1572 -724 674 -809 -2097 -452 221 -1828 -2280 -306 -414 -2470 -2219 -533 -1321 -2811
2093 -2811 -1679 -773 -2395 -3104 -1295 -932 -2965 -3093 -1249 -1532 -2972 -2387 -1339 -2542 -3196 -1455 -1193
2110 -1193 -3107 -3137 -1208 -1385 -3046 -2536 -1219 -2181 -3058 -1453 -979 -2828 -2888 -798 -963 -2985 -2383 -456
2128 -456 -1283 -2748 -1510 -445 -1968 -2302 -236 -297 -2483 -1958 490 -132 -2111 -1244 489 -493 -1412
2145 -1412 322 615 -1238 -1053 1454 1228 -1170 -449 1727 1100 -281 949 1741 282 267 2361 2236
2162 2236 14 636 2937 2304 371 1432 2989 1867 911 2608 2973 1004 1289 3636 3018 654
2178 654 1466 3716 2790 1004 2107 3143 1697 1418 3232 2860 543 1189 3651 2962 536 1061 2874
2195 2874 1976 1026 2028 2199 559 804 2771 2155 -100 476 2315 1590 147 795 1474 374 281 1579
2213A579o11j826R17J825j148j925Q42J359r02p93O86j02j170P19J405j310j917
2230b372J245J720j172j507Q25N32r29J94R85r94j499J201J587j343j727J202
2246b052J115j107n43R85l13j095Q56J331j443j463J626J419j556j206J432O23
2262a391j088J35J123q29j207J544J541j808j322J626J271j211n58J097n7j025
2278b159J056J274j318j348J747J558j609r69J420O41j108J61J274p42j142J422
2294A58J359j512j131J668J104j374n54J283%q46P09R99j166r08J582J054j461
2311I64q34J259P98r73L1P93n98o48J258Q24j481q94J502Q83j173m79J048o8p58
2330A454O31O59j018p39J302O64j353o23J198K99q43j56N50l95m55Q33J46j210
$$ plain form
2213 1579 968 -858 59 1884 736 -1189 -347 1012 110 -683 3 -99 -1269 -550 855 -455 -2372
2230 -2372 -1127 593 -579 -2086 -1261 -729 -1658 -1464 -479 -1473 -2972 -1771 -184 -1527 -3254 -2052
2246 -2052 -937 -2044 -2587 -1602 -1915 -3010 -2154 -823 -2266 -3729 -2103 -684 -2240 -3446 -2014 -1391
2262 -1391 -2479 -2344 -1221 -2050 -3257 -1713 -172 -1980 -3302 -1676 -405 -1616 -2174 -1077 -1134 -2159
2278 -2159 -1103 171 -1147 -2495 -748 810 -799 -1768 -348 293 -815 -654 620 -122 -1264 158
2294 158 1517 5 -1126 542 1646 272 -282 1001 1001 155 864 1863 697 -211 1371 2425 964
2311 964 130 1389 2187 1214 1245 2038 1440 792 2050 2874 1393 499 2001 2884 1711 1232 2280 2212 1454
2330 1454 2085 2744 1726 987 2289 2953 1600 977 2175 2474 1631 1475 2025 1630 1175 2008 2154 944
2348I44l40J281J20j317j61Q73k92p32O05K58j176l35J320R4j567k08J218j12
2366D73j170J77P62p64o19R02L25j287l17J175J38j320o1R64k57q65M22M79p37
2385a580k32P73j1j036Q3R07k85q31L75O26o17l95Q02Q4j094Q1J241k59j220L99
2405b189J124n34r36O37P94q23l34Q19K64r36j6J027k3r06L05Q17k34o00M24M90
2425h30m06n8N78o1m25M65M91m04k18O71J81n10K01O81k46o00P12P88p27o95J130
2446G18P61r69m66J144M04q98j07J017Qq63L90Q80m02q09M55R55l69o80L01N28
2466A998k06j11J70j74j12K90J62l26o6K91o9k15L45k0o15k7R15K2j146k0J086
2487B172%j136N4R14l23q36N35O10q52o76Q86P34j053q31Q33N89q01l77L64O6
$$ plain form
2348 944 604 1885 2005 688 527 1400 1108 376 981 1239 63 -272 1048 1142 -425 -633 585 473
2366 473 -697 -520 242 -522 -1141 -239 86 -1201 -1518 -343 -205 -1525 -1586 -622 -879 -1744 -1322 -843 -1580
2385 -1580 -1812 -1039 -1050 -2086 -2003 -1096 -1381 -2212 -1837 -1211 -1828 -2223 -1421 -1337 -2431 -2350 -1109 -1368 -2588 -2189
2405 -2189 -1065 -1599 -2535 -1898 -1104 -1927 -2261 -1442 -1178 -2114 -2130 -1103 -1126 -2032 -1727 -910 -1144 -1744 -1320 -830
2425 -830 -1236 -1294 -716 -777 -1202 -737 -246 -650 -868 -197 -16 -526 -325 356 110 -490 222 1010 283 -412 718
2446 718 1479 510 44 1188 1592 694 587 1604 1612 749 1139 2019 1617 808 1263 2218 1849 1169 1470 1998
2466 1998 1792 1681 1851 1677 1565 1855 2017 1691 1625 1916 1847 1632 1977 1957 1342 1315 2230 2252 1106 1086 2172
2487 2172 2172 1036 1090 2004 1681 845 1380 1990 1138 462 1348 2082 1029 198 1031 1620 819 442 806 872
2507H72l76KJ82l90l20L21J31l47k71k8p0J11J41m17o18K40P41m26r53K87O38
2528e50m13n75L78J35o79l9Q05o2j260J71J154j51j053n3P73K5n33K64J29m24
2548a958o7O82K0p33mN77K11l94l2O3NK21L89l62n04N15P14n09l80L40L45k00
2570a061l2N35k58n29N42Q63n01p95N24Q95m37n07M77L27l68J19O63l04n18L29
2590c6P95j44o15K90M77k9j46L24j66k47N82M44m60m73O50M97m43j19L75o5k83
2611A208N18L47o35l53P61N97p63n33Q46J44m80P2M22l46m71N52M63o80n79O63
2631A753M78o90l30M60J4m73K34J64n71l29O59J99p33k82N62k0m73k6K44n08k09
2652A23O57rq62k07Q37kq94Q8N66m44m62N26L16r31m65J062Q7r61k41Q07L2p64
$$ plain form
2507 872 496 498 680 290 -30 291 422 75 -196 -224 -294 -183 -42 -459 -1077 -837 -96 -522 -1475 -1188 -550
2528 -550 -963 -1538 -1160 -1025 -1704 -1743 -938 -1000 -2260 -2089 -935 -1086 -2139 -2192 -1419 -1394 -1927 -1663 -1534 -1958
2548 -1958 -2025 -1343 -1323 -2056 -2060 -1483 -1272 -1666 -1698 -1635 -1630 -1409 -1020 -1382 -1886 -1371 -657 -1166 -1546 -1206 -861 -1061
2570 -1061 -1093 -558 -816 -1345 -803 60 -441 -1236 -712 183 -254 -761 -284 43 -325 -206 457 153 -365 -36
2590 -36 759 615 0 290 767 738 592 916 750 503 1085 1529 1069 596 1246 1743 1300 1181 1556 1491 1208
2611 1208 1726 2073 1438 1085 1846 2443 1680 1147 1993 2137 1657 1729 2151 1805 1334 1886 2349 1669 1090 1753
2631 1753 2231 1541 1211 1671 1685 1212 1446 1610 1039 710 1369 1568 835 553 1115 1095 622 596 840 332 123
2652 123 780 771 -91 -298 539 537 -357 -269 297 -147 -609 -83 233 -698 -1163 -101 -14 -975 -1216 -409 -377 -1141
2674a141J19M63l59n00N03K38p42j47O38L7p14N9M25j59l92L77O9n14l8O66k31
2695a343o76K29O09l39m76N33J98o34M5Q04j81p86K95R23m69o91N90P12o03m10
2715a670P71L70p72jR46j55p40M91Q13m41m47N70N13n26j62O86J07o28L82O90
2735G97m49m52O57M94n46k00P38P3o66L63P06n56m67P69N48q87l06J044J93j020
2755H33N1R97j41q98M80P99o61o96J018N44j034m79J099L27j005l7P72j96p49
2774A024N62N33p01n06P37M75q08k83O17J3n53J41L54m69k75M71O6o72k9N99j89
2795A107o89K65L55n37l66P32j13j017K0J078k20j326K08R73m76q28M31M63q54
2814g94l58R23J52j156k63J014Lr65jO27k43n53M42K72o42j35P06j63o26J57M71
$$ plain form
2674 -1141 -1022 -559 -918 -1418 -915 -677 -1419 -1566 -928 -891 -1605 -1546 -1121 -1280 -1672 -1295 -1226 -1740 -1778 -1112 -1343
2695 -1343 -2019 -1790 -1181 -1520 -1996 -1463 -1265 -1899 -1854 -1050 -1231 -2017 -1722 -799 -1268 -1959 -1369 -657 -1260 -1670
2715 -1670 -899 -529 -1301 -1302 -356 -511 -1251 -760 53 -388 -835 -265 248 -278 -440 246 353 -275 107 797
2735 797 348 -104 553 1047 501 301 1039 1112 446 809 1515 959 492 1261 1809 922 616 1660 1853 833
2755 833 884 1881 1740 842 1322 2121 1460 764 1782 2326 1292 813 1912 2239 1234 1197 1969 1773 1024
2774 1024 1586 2119 1418 912 1649 2124 1316 1033 1650 1663 1110 1251 1605 1136 861 1332 1398 726 697 1296 1107
2795 1107 418 683 1038 501 135 867 754 -263 -243 835 615 -711 -503 470 -6 -834 -403 60 -794
2814 -794 -1152 -229 -77 -1233 -1496 -482 -479 -1444 -1445 -818 -1061 -1614 -1172 -900 -1542 -1677 -971 -1134 -1760 -1603 -1132
2835a132k56l54L93L1n14L16O91n88q40O79R60q32p71Q96N89q69k96J162m3j281
2855b059L07J441k74j465M81J306m60r99O71P81p84k70R05K21r62NJ110j3q83
2874i41K62Q33k45m00M36J62l47J47O54k59n84N65O56l62l76N71J06m33L01P30
2894A476m45p31O73R85o26q70P30P29o78l01P85J94q73K25Q48k80q32L60P45m58
2914A656o11N12M54n44k42N05M7o83J99N63m05n60M35L68m50k57L06r7l35K71
2934A132M11o63n09O22L60p18k98O14q8o87K41O20n05q06N80O47q12n66P87J96
2954E58q81k17Q96j16j078L47P66n56p91N83N16p87n14O57K40p34j73N68r6o69
2974a481L04M46n70l88N38K16n33j25N03k69n14M24M43n97l86O47L14p16o1Q13
$$ plain form
2835 -1132 -1388 -1742 -1349 -1318 -1832 -1516 -825 -1413 -2253 -1574 -614 -1446 -2217 -1321 -732 -1601 -1897 -735 -778 -2059
2855 -2059 -1752 -311 -585 -2050 -1569 -263 -723 -1722 -1051 -270 -1054 -1324 -419 -198 -1160 -1155 -45 -58 -941
2874 -941 -679 154 -91 -491 -55 107 -240 -93 561 302 -282 283 939 577 201 772 878 445 746 1476
2894 1476 1031 300 973 1958 1332 462 1192 1921 1243 942 1727 1921 1048 1273 2121 1841 1009 1369 2114 1656
2914 1656 1045 1557 2011 1467 1225 1730 1777 1094 1293 1856 1451 891 1326 1694 1244 987 1293 1196 861 1132
2934 1132 1543 880 371 993 1353 635 337 951 863 176 417 1037 532 -274 306 953 141 -425 362 558
2954 558 -323 -540 356 240 -838 -491 275 -281 -1072 -489 27 -760 -1274 -617 -377 -1111 -1284 -716 -812 -1481
2974 -1481 -1177 -731 -1301 -1689 -1151 -935 -1468 -1593 -1090 -1359 -1873 -1449 -1006 -1603 -1989 -1342 -1028 -1744 -1805 -992
2994i92k33p21L45Q70m76p15O44O63p15l95R75K85r22nJ013J2q24K14Q06k48n25
3015i44M32N58m01l42N74K79m80RN83q1l76L32L56l27l0M59qm15L19N35l64m56
3037B12N78M19m67k76O35J52o29J38P55k16p14L68Q48m24o54M94N04m13k88N45
3057A567J40n45O4O19j95n84K34N25l43k40K08J47l09M3M06l77l77M20L67o37
3077A133k84M33Q4n30k7M20l13o18N26N18p14o33N27N39p18m66N06R4o44M8M84
3098C65l52o83M16M51m21n51K98K87l86k07K41j46l15L32J88n15m05O08K48o16
3118a163j42M55j37l94L07K99n44m66P47L94q05m19P25L86p09j69N38j31m91L90
3138a329M65m59n29O02M64m82l04K98K56j94K1K11l23pM78J27m35j00N36R3l00
$$ plain form
2994 -992 -1225 -1946 -1601 -731 -1207 -1922 -1278 -615 -1330 -1725 -750 -465 -1387 -1392 -379 -367 -1191 -977 -171 -419 -944
3015 -944 -512 46 -355 -697 -123 156 -324 -315 268 187 -189 143 499 172 142 601 593 178 497 1032 668 212
3037 212 790 1209 742 466 1101 1253 624 762 1517 1301 587 955 1803 1379 725 1219 1723 1310 1022 1567
3057 1567 1707 1162 1226 1845 1650 1066 1300 1825 1482 1242 1450 1597 1288 1331 1737 1360 983 1403 1770 1133
3077 1133 849 1282 1366 836 809 1229 916 298 824 1342 628 -5 522 1061 343 -123 383 477 -167 -119 365
3098 365 13 -670 -254 197 -224 -775 -477 -190 -576 -783 -542 -688 -1003 -671 -483 -998 -1403 -795 -547 -1163
3118 -1163 -1305 -850 -987 -1381 -1074 -775 -1319 -1785 -1038 -644 -1449 -1868 -1143 -757 -1466 -1635 -1097 -1228 -1719 -1329
3138 -1329 -864 -1323 -1852 -1250 -786 -1268 -1572 -1274 -1018 -1212 -1191 -980 -1303 -1310 -832 -705 -1140 -1240 -704 -611 -911
3159i11J78K15k77J6O26J13p04M0Q23K10p82K1O37R2l91K60M45m43j91P45K59
3180I81n96k33P15L55m84j02L11Q5p2J67J27l73P7M55k1l07K2K23j6o7J71j11
3202A307l20J88N34j42o70J99N85k04n17K34K91m41j12N46K6p01J6O31l5o95N7
3223G77N20j31l30k7K01l14n6L72o0n64R8K96Km42%R5j54pK18l11l89K19L41k70
3247H4n49L21J24k67k59K37m3m78J40L90l12n74K38M69l37n10K66K32k28k27L15
3268i68j69l34K03K56k23l68K36L02k57j81K73Ok34P6L05l09j99L46L46l10k51
3289a454L13K07l37J16L16j54k38K30L66l42j18L66K30l23l1K93O3k39K17K25
3309b94k19j01L97J55l09o4M46J1k05K02K67j76k14M30J32k92n8M49R1m13K16
$$ plain form
3159 -911 -733 -518 -795 -779 -153 -40 -744 -704 119 329 -453 -432 205 297 -94 166 611 168 -23 722 981
3180 981 385 152 867 1222 738 636 947 1032 960 1127 1254 881 958 1413 1392 1085 1107 1330 1314 1247 1418 1307
3202 1307 987 1175 1709 1567 897 1096 1681 1477 960 1194 1485 1044 932 1478 1504 803 819 1450 1415 720 777
3223 777 1297 1166 836 809 1010 696 640 1012 952 388 486 782 784 342 342 437 283 276 494 183 -206 13 354 84
3247 84 -465 -144 -20 -287 -546 -309 -352 -830 -690 -300 -612 -1186 -948 -479 -816 -1326 -1060 -828 -1056 -1283 -968
3268 -968 -1137 -1471 -1268 -1012 -1235 -1603 -1367 -1065 -1322 -1503 -1230 -1224 -1458 -1382 -1077 -1386 -1585 -1239 -893 -1203 -1454
3289 -1454 -1141 -934 -1271 -1155 -839 -993 -1231 -1001 -635 -977 -1095 -729 -499 -822 -853 -560 -497 -736 -519 -294
3309 -294 -513 -614 -217 -62 -371 -435 11 22 -183 19 286 110 -104 326 458 166 108 557 648 235 451
3330D51M75j98k97K77L55k77j92M58J63m02M4M52p7l45K03L33j98k63L88J53l91
3351A112l3M16p8k94J22K60k13k54K93J05k82j59K77j6l88J47K84k56m08K94K39
3372A168m37j32K07L5m01M7K34j65l77J06K30k79k46K65N3l87m2K96k34l37K57
3393a39K11l28l46L15K13m80j64L80j50l04J48J87k90k61K42K33m19j40L33L9
3413g20m58Q6K13j67k67K31K47m82j85N28L9m95J1L71j35k86L01K12m39j51M90
3434a056K44n57j41N40O3m17J24M23j79l16L80M15n19r2N30J43l75j2M91j30j95
3455f36K69K42k96j9M85J33m88R5N39m4l71K75L42k40k38O44L6n77O3O17P9m53
3477D57N3M48j39l10M71J81m07r8N04J22n85N0N01n3k90J33J74j29j63L46J1l37
$$ plain form
3330 451 926 728 431 708 1063 786 594 1052 1215 813 857 1309 1232 887 1090 1423 1225 962 1350 1503 1112
3351 1112 1079 1495 1417 1123 1245 1505 1292 1038 1331 1436 1154 995 1272 1256 868 1015 1299 1043 635 929 1168
3372 1168 731 599 806 841 440 487 721 556 179 285 515 236 -10 255 308 -79 -121 175 -59 -396 -139
3393 -139 72 -256 -602 -287 -74 -554 -718 -338 -488 -792 -644 -457 -747 -1008 -766 -533 -952 -1092 -759 -720
3413 -720 -1178 -1092 -879 -1046 -1313 -1082 -835 -1317 -1502 -974 -935 -1430 -1419 -1048 -1183 -1469 -1168 -956 -1395 -1546 -1056
3434 -1056 -812 -1369 -1510 -970 -907 -1324 -1200 -777 -956 -1272 -892 -477 -996 -1088 -558 -415 -790 -802 -311 -441 -636
3455 -636 -367 -125 -421 -440 45 178 -310 -215 324 280 -91 184 526 286 48 692 728 151 214 831 910 457
3477 457 510 958 819 509 980 1161 754 656 1160 1282 697 747 1248 1195 905 1038 1212 1083 920 1266 1277 940
3499I40p7M49o2l71J27K62r9j89J37P7l70J29L68k17m37P2M58j80l27J91J19l39
3521F61j11M63j59n98J08N13l15m75J39L46l22l11L09L2m57KM03k11n43J73L47
3542fk79l45J49J33k87j07K92k57l87L17L14m00l46K86K45l89r6L04j35l93J70
3563a217M32j94n08K88M42m01k91M27J12m18LM52o7m26K34M20l48l21L94L48l70
3584a009k32M72J40m11L8M48k16m01L74M03l27k36L79K64l77P6L16n1l43K85M45
3605C7k56l06L55K26k35ML43J30l91J99L13j17k45M10J81l05j04M95Q6l89J20
3626E51L94o3k85K84L02l60j86M95J81l97j17M26o9k38J32K58k47j94L43J46k64
3647A092j92K68k4l45J26L04j94k26K16J09l14r3L66j52m27O0M47k17m60K64K01
$$ plain form
3499 940 863 1312 1250 879 1006 1268 1169 980 1117 1194 824 953 1321 1104 667 739 1197 1017 690 881 1000 661
3521 661 550 1013 854 256 364 877 562 87 226 572 250 -61 248 280 -177 -175 228 17 -526 -353 -6
3542 -6 -285 -630 -481 -348 -635 -742 -450 -707 -1094 -777 -463 -863 -1209 -923 -678 -1067 -1163 -859 -994 -1387 -1217
3563 -1217 -785 -979 -1487 -1199 -757 -1158 -1449 -1022 -910 -1328 -1325 -873 -940 -1366 -1132 -712 -1060 -1381 -987 -639 -1009
3584 -1009 -1241 -769 -629 -1040 -1002 -554 -770 -1171 -797 -394 -721 -957 -578 -314 -691 -615 -299 -350 -693 -408 37
3605 37 -219 -525 -170 56 -179 -175 168 298 -93 106 419 302 57 467 648 343 239 734 820 431 551
3626 551 945 882 597 881 1183 823 637 1132 1313 916 799 1225 1156 918 1050 1308 1061 867 1210 1356 1092
3647 1092 900 1168 1144 799 925 1229 1035 809 1025 1134 820 727 1093 941 514 574 1021 804 344 608 809
3668H09l50j87L79On07n2N32r7n72J46K77j47l75K55K79m37l33M46M9n44O9K89
3690f5q2m46J56K30k35k68J98M7k55l4K42j30l39R2L17k39l32K02J10l08k6L92
3712g73n7m83J41M66l46k62J66L15l03k24L86J19m33N0M65j68l00J11M20j35l30
3733a175K27K72j45j09K41P0j75J67K64j86j38K72K26k07m9K56L0j77K06K65j52
3754a7k26L19K08k43n9K78Q0k04O1K89k2k93K84L02k96j55L13K31k96j67M04R6
3776H87k29K7K17p9k70L43J94l11o5K88M4k66R6K35j22j80K05J95k87j73L50O9
3798A168l38N1J85l2k49R4K17k66k30J93K06l33k12L61l0l19jK26k43k42J82J45
3820E33k85j57J21J02l30r3K76j28k57J4K03l21j54K25J28l30j26K34k3l13Q5
$$ plain form
3668 809 459 272 651 657 150 98 630 533 -39 107 384 237 -138 117 396 -41 -374 72 121 -423 -354 -65
3690 -65 -147 -593 -437 -207 -442 -710 -512 -465 -720 -754 -512 -642 -981 -889 -572 -811 -1143 -941 -831 -1139 -1165 -773
3712 -773 -830 -1313 -1172 -706 -1052 -1314 -1148 -833 -1136 -1360 -974 -855 -1288 -1238 -773 -941 -1241 -1130 -710 -845 -1175
3733 -1175 -948 -676 -821 -930 -689 -619 -794 -627 -363 -549 -687 -415 -189 -396 -445 -189 -159 -336 -130 135 -17
3754 -17 -243 76 284 41 -18 260 340 136 197 486 464 171 455 757 461 306 619 850 554 387 791 887
3776 887 658 685 902 823 553 896 1090 779 714 1002 1046 780 876 1111 989 809 1014 1209 922 749 1099 1168
3798 1168 830 881 1066 1034 785 879 1096 830 600 793 999 666 454 815 785 466 465 691 448 206 388 533
3820 533 248 91 212 314 -16 -109 167 39 -218 -204 -1 -322 -476 -251 -123 -453 -579 -345 -368 -681 -596
3841e96K04j99j81J48J54l39j61L14O5l52KK75j11j96O9J95k13p4J67J01k62n4
3863a044J58O9k02N6J88j18j56K21nj11j34K77N6k35N9K06j28o0J87J41k53PL23
3886d98k7k60J50L05j73j94K91K19j91j36L81J49l11K9L38N5k05M4K58r5j02K21
3908B48J99j62j07K98J36j83N6J94q1n6J11J80j89pJ97J09k74Q6K50j17j82K64
3930I70R6k09j17K68L4l37L0L77o2l74J70J76j10k14J69J10k23j98L42K0j55j28
3952F35J23K5j51P0K7j93l1R8N3k04p2K06r4k04J32Mj62j03J96l3k62o1K67j22
3976A44k55L7J11k59j05J50O5k60j91L36K2l60o6K63j08j85kQ4j02j02Q9K1k54
3999i27lJ75m1k08J02J6j9l5Q9j5k05Q7K38J0l11O2K12j06j47K69L9j75N7K05
$$ plain form
3841 -596 -392 -591 -772 -624 -470 -809 -970 -656 -591 -943 -941 -666 -777 -973 -904 -709 -922 -996 -829 -728 -990 -1044
3863 -1044 -886 -817 -1019 -963 -775 -893 -1049 -828 -833 -944 -1078 -801 -745 -980 -921 -715 -843 -903 -716 -575 -828 -821 -498
3886 -498 -525 -785 -635 -330 -503 -697 -406 -187 -378 -514 -133 16 -295 -266 72 127 -78 -34 224 129 27 248
3908 248 447 285 178 476 612 429 485 679 598 542 653 833 644 637 834 943 669 755 1005 888 706 970
3930 970 1066 857 740 1008 1042 705 735 1112 1050 676 846 1022 912 698 867 977 754 556 898 918 763 635
3952 635 758 783 632 702 729 536 505 603 656 452 380 586 492 288 420 424 262 159 355 322 60 -1 266 144
3976 144 -111 -74 37 -222 -327 -177 -112 -372 -563 -227 -205 -565 -631 -368 -476 -661 -663 -579 -681 -783 -694 -673 -927
3999 -927 -930 -755 -796 -1004 -902 -886 -905 -940 -851 -866 -1071 -984 -746 -736 -1047 -985 -773 -879 -1026 -757 -718 -893 -836 -631
4023f31j9k50J26K55K3l11J92K33j38j09J43J17j48PK60l9j59J44J37l2j08J07
4045b00J55j04L3J68k3k17J74K43j37j6J34J02j25J10J58j6k21K47K77j97j83
4066C62J16L05j01j79K01J75k15PK20j3k18J59K18p6k09Q9R7j8j10J65nj60O0
4089H70J31j01j57J23N6j24j02J26o2j14P5R0k86n4J97O4k43j78K03j0j47l6J08
4112D29j23k54J43J37j68k41J82N5k67k6P5K9j90N2J9j52j11J31R1j88j29J36
4134c70Kj58N2pj40o7K37k8k60m9K26K4l18P1J70j56j25J21J37k07j39K78J13
4157e93l77j9K58M6k80P7J84r4k20L08O5k04j09K76Q5j78R1N8K4l7N0J81k44O7
4181e85K89k1j35L8J66Mj07K19J91k32l4K81J13j87L4K39J0k37K12K22j27j19
$$ plain form
4023 -631 -650 -900 -774 -519 -496 -807 -615 -382 -520 -629 -486 -369 -517 -510 -250 -289 -448 -304 -167 -199 -307 -200
4045 -200 -45 -149 -116 52 29 -188 -14 229 92 76 210 312 187 297 455 439 218 465 742 545 362
4066 362 478 783 682 503 704 879 664 671 891 878 660 819 1037 961 752 841 938 920 810 975 970 810 870
4089 870 1001 900 743 866 922 798 696 822 760 646 721 811 525 471 668 732 489 311 514 504 357 321 429
4112 429 306 52 195 332 164 -77 105 160 -107 -133 -58 -29 -219 -167 -148 -300 -411 -280 -189 -377 -506 -370
4134 -370 -368 -526 -474 -481 -621 -688 -451 -479 -739 -788 -562 -538 -856 -785 -615 -771 -896 -775 -638 -845 -984 -706 -593
4157 -593 -970 -989 -731 -685 -965 -888 -704 -798 -1018 -710 -645 -849 -958 -682 -597 -775 -684 -626 -602 -639 -589 -408 -652 -585
4181 -585 -296 -317 -452 -414 -248 -244 -351 -132 59 -173 -207 74 187 0 34 273 283 46 258 480 353 234
4203B34J26J76j96RK43j1k09J17K45n7j34J10P4q9N0J41j02r2J6J65o2p8J10J29
4227I15k22PJ71l9k27J41J43j12j73J31J77j39k47L06Q0l08RJ28j9j91M9J52j22
4250F10j74J74Rj51j00R8k7j95J13J09j41j61R9L7k35j05K64n9k73o9K12j07k67
4273c39J57Q0k61j15K34R8m01m1K04K3l47P7J69j27j36J47R1k27j05J81O1j59
4295g36n0Q8O9k25O9J05o1o4J06Nj06%K70j57j15J13R6j14p7J76O2j63L6K55k0
4320d38k90R7K85j41j12R5J89j32o5K71P5k39LK37J1j42J19J68r2KP2J18j53J05
4344D3J34o7r1J32J49k4j23J83Q7j62J63J32K0l01K32K68j39j71K14J10j25k3
4366F41J71K8k43P9K34m3k30Q7K28j87pO9l1q2K2J67r9j64M2J32j58o2N3O1j59
$$ plain form
4203 234 360 536 340 349 592 581 372 489 734 677 543 653 727 638 688 829 727 635 651 816 754 676 786 915
4227 915 693 700 871 832 605 746 889 777 604 735 912 773 526 832 912 604 613 741 722 531 580 732 610
4250 610 436 610 619 468 368 466 439 244 357 466 325 164 263 300 65 -40 224 165 -108 -177 35 -72 -339
4273 -339 -182 -102 -363 -478 -244 -146 -547 -588 -384 -361 -708 -631 -462 -589 -725 -578 -487 -714 -819 -638 -577 -736
4295 -736 -786 -698 -629 -854 -785 -680 -741 -805 -699 -694 -800 -800 -530 -687 -802 -689 -593 -707 -784 -608 -546 -709 -673 -418 -438
4320 -438 -728 -631 -346 -487 -599 -504 -315 -447 -512 -241 -166 -405 -402 -165 -154 -296 -177 -9 -101 -99 -27 91 -62 43
4344 43 177 110 19 151 300 276 153 336 423 261 424 556 576 275 507 775 636 465 679 789 664 641
4366 641 812 840 597 676 910 867 637 724 952 765 758 827 796 714 736 903 804 640 682 814 656 594 647 708 549
4391E49J1R8k7k39P8K08k27k05K03J76k86j26J51M3k45J1J82j36k59J50K06k14
4413A02k16J26R9j98o2J36L1k99L5J45q8j94J08K6Lk39J03Jj03N4j2m4j64J17
4437e33L4j96m6J46N4j28q4J06p2j22J20J74k23j52K16J35j73o4J54m2k8M4J59
4460e21j66r6K24P9j47n8J55J26j17k7J66L6m6J7J55j01o2K05J10j77K7J14M5
4483e9j16K05Q6j60j6K54Q6k71QK72O8j89Q0J44p9l5J05J03j54l3K44J5j89K7
4507C96K17n2j38J18J58j01r1J67J23k31lJ68k0p1L4Q9o7L3J8j3j45M0J74n7r2
4532F54m3J84p7j04oJ69j76j32J68K6j88o8K22p2k40L6J84j56j44R7nj57m6R0
4556B16j4j80n0Q6n2k15J39j0m4p2O6p1j61M2Q1m7j48M7J08j09j44P1L2j52J1
$$ plain form
4391 549 560 658 631 392 470 678 451 246 449 625 339 213 364 407 162 173 355 219 -40 110 316 102
4413 102 -114 12 111 -87 -149 -13 18 -281 -246 -101 -189 -383 -275 -249 -246 -485 -382 -381 -484 -430 -442 -486 -650 -533
4437 -533 -499 -695 -741 -595 -541 -669 -753 -647 -719 -841 -721 -547 -770 -922 -706 -571 -744 -808 -654 -696 -724 -680 -521
4460 -521 -687 -783 -559 -480 -627 -685 -530 -404 -521 -548 -382 -346 -392 -375 -220 -321 -383 -178 -68 -245 -218 -104 -59
4483 -59 -175 30 116 -44 -60 194 280 9 17 289 357 168 248 392 313 278 383 486 332 299 543 558 369 396
4507 396 613 561 423 541 699 598 507 674 797 566 563 731 711 640 674 763 696 729 747 734 589 629 803 746 654
4532 654 611 795 718 614 608 777 601 469 637 663 475 407 629 557 317 353 537 381 237 334 329 172 126 216
4556 216 202 22 -28 58 6 -209 -70 -80 -124 -196 -130 -201 -362 -320 -239 -286 -434 -387 -279 -388 -532 -461 -429 -581 -570
4581e70J74j06j75O5J30j50p8R6J08q8p3J16Mk04L1J80n8j07N0Q1m8n6P8K7k5
4606e98l0Q4o6o1J71L9j47lJ27N5j42m8K85r0p2K02P5j04m7J21J21r7j7J38J10
4631Fk00R7J53j2m9K8K24q5j1O1P3n4K8J13k9K8N0P5j6r6J61kk1k7J69m5q5L0
4659E64R8l3m2O1R6j77L3Q7M5j70kJ65o8o8L6K8j0m3N7Jr7k8Q2J5j77J08j8o2
4687D81l8O2Rj34L0J03q1j19n3J79j22l0j2O7j20j80J14L8j82j4Q2L5j84m2J54
4712D3j67m0Lpj24PK5l7p5l0K8p3n4M7mn0q0R3p3r5O7J22j97j05J38L1r5l5J56
4741e81mj92N3J54m3j86J30J11j09J2R9J6m3j1P1O3r8M0J47m2k7K4P1p8J6P1q
4768c44L9M9K6Ml5J16R8r9j6J45J2r2P2J38p9j17J71J00k5j05J66R4r6n4K15k9
$$ plain form
4581 -570 -396 -502 -677 -612 -482 -632 -710 -614 -506 -594 -667 -551 -547 -751 -720 -540 -598 -705 -655 -574 -622 -678 -600 -573 -598
4606 -598 -628 -544 -610 -671 -500 -461 -608 -611 -484 -429 -571 -619 -334 -424 -496 -294 -219 -323 -370 -249 -128 -225 -242 -104 6
4631 6 -194 -97 56 44 -5 23 247 162 151 212 285 231 259 372 343 371 421 496 480 384 545 543 522 495 664 619 534 564
4659 564 662 629 587 648 744 567 600 687 732 562 560 725 657 589 625 653 643 600 657 658 561 533 615 630 453 561 543 481
4687 481 443 505 514 380 410 513 432 313 260 439 317 287 275 342 222 42 156 194 12 -2 80 115 -69 -111 43
4712 43 -124 -164 -161 -168 -292 -285 -260 -297 -372 -402 -374 -447 -501 -454 -458 -508 -588 -495 -568 -663 -596 -474 -671 -776 -638 -607 -702 -737 -581
4741 -581 -585 -777 -724 -570 -613 -799 -669 -558 -667 -655 -556 -540 -583 -594 -523 -460 -558 -518 -371 -413 -440 -416 -345 -423 -407 -336 -344
4768 -344 -305 -256 -230 -226 -261 -145 -47 -146 -162 -17 -5 -97 -25 113 34 -83 88 188 163 58 224 318 222 168 383 354
4794C54p8K9J53mq6M0J64o5l7J53j7j25Q3N6K3m1rJ26o2kM7pj29J01R8r8p5J06
4822F98P8j16j03J23o6J6j10J05o0j04PJ26j35r2P3Q7k05l9J04Qk44M8N8q6j05
4847F6Q6J4n6j70O4M2p1m0P3o8j07J3lm2j3N3p8l9j07J41j01n5O7L3j04o2N8J5
4875c91q6l7Q0n9j60O9J03j19oJ0P0p5l8P7M8j16j16K09l3j99J19J20o1k2Q1O
4901e26r3%J22J9n2K5O0P3r5P5K9k8J5R9n9N4J7J56p4k2J21P1p9M4J13N0o1L1
4929H5P5j4l4O7L4k2rJ44j6ml0J33rn2M5N7o7M2P3P3k8r0Q1O6r6O0Jm5m2J26P5
4960F79j41jJ30m2j09N6P5p8o3P6J8n9n9K03j06j13K0P1Pj42J0P9o2q1R8L8j93
4987C11l7J72j0j92J4Nm9n0L1m5j56M6k2L9j51J0M5j8k00R0K7j60o2J08Pj50K0
$$ plain form
4794 354 276 305 458 454 368 408 572 507 470 623 606 481 564 620 643 602 593 719 657 655 702 695 566 667 765 667 592 698
4822 698 776 660 557 680 614 630 520 625 565 461 468 594 459 367 440 527 322 283 387 395 151 199 257 171 66
4847 66 152 166 110 -60 4 46 -25 -65 8 -60 -167 -154 -157 -199 -212 -159 -237 -276 -383 -242 -343 -398 -331 -298 -402 -464 -406 -391
4875 -391 -477 -514 -434 -493 -653 -584 -481 -600 -606 -596 -526 -601 -639 -562 -514 -630 -746 -537 -570 -769 -650 -530 -591 -613 -532 -526
4901 -526 -619 -619 -497 -478 -530 -505 -445 -372 -467 -392 -363 -391 -376 -277 -336 -282 -265 -109 -183 -205 -84 -13 -92 -48 65 115 54 85
4929 85 160 146 112 179 213 191 182 326 310 306 276 409 400 348 393 450 383 425 498 571 543 453 534 600 504 564 565 520 478 604 679
4960 679 538 537 667 625 516 572 647 569 506 582 600 541 482 685 579 466 486 557 564 422 432 511 449 368 466 504 311
4987 311 274 446 436 244 258 263 214 164 195 150 -6 40 18 57 -94 -84 -39 -57 -257 -167 -140 -300 -362 -254 -247 -397 -377
5014c77rL6r4KP2l4j47J0N6j36k0J57qj67L5P5k3l2K8O4j35J0P8L7j09J5O4J4
5042e38q2J41p9M5k3QK3RQ1j3Mo8O4P1j6m1R5P3m1mL5L1j2K2J36r8n5J93K0o8
5072h7Q9Qj9jJ56L8r4L2M3M3J5lR1j01J24RJ19q4n5O3J92j33l8J16Q9j39K1J23
5100F17m2np3J22p6LmJ07p7PM3l9k6L7K1p3p6L8P5n0r0N2o5j6l2N4l6q8j8J01
5130C91m0j91J53j4j13p1J83o3j08l5R9n5j46Q4N7k13P8j1o2m6MN6m0j48J04k4
5156a71p3l2J8J6r5J2J5k8j09P9o9m3k0RJ0p9L7K6jq0M6m4J7j03L7O5j9j1QjO9
5187e14m5P9m6o6K3O9k5M0P4n9K1J7P5q7N5K8R1k5j6P7K9o6O0Q5M4o5P0J3N0j15
5217a29J17J03m6RQ0M9q8Q5N3n2jk5J71n2m8J68j2o0J2KM5MrR5r6K2J15j2n6J6
$$ plain form
5014 -377 -386 -350 -444 -442 -370 -404 -551 -541 -485 -621 -641 -484 -492 -659 -624 -549 -572 -604 -576 -512 -647 -637 -559 -522 -631 -616 -552 -538
5042 -538 -620 -479 -558 -513 -536 -528 -505 -496 -415 -428 -424 -492 -428 -357 -373 -414 -319 -246 -287 -291 -256 -225 -237 -215 -79 -177 -232 -39 -19 -87
5072 -87 2 10 -9 -10 146 184 90 122 165 208 223 220 311 210 334 343 462 378 323 386 578 445 407 523 612 473 494 617
5100 617 575 570 497 619 543 546 542 649 572 579 622 583 557 594 615 542 466 504 579 529 439 491 426 410 378 432 396 308 290 391
5130 391 351 160 313 299 186 115 298 235 127 92 191 136 -10 74 131 -82 -4 -15 -77 -123 -119 -63 -103 -251 -147 -171
5156 -171 -244 -276 -258 -242 -337 -325 -310 -338 -447 -368 -437 -480 -500 -491 -481 -560 -523 -497 -498 -578 -532 -576 -559 -662 -625 -560 -579 -590 -582 -583 -514
5187 -514 -559 -480 -526 -592 -569 -500 -525 -485 -411 -470 -449 -432 -357 -444 -389 -361 -270 -295 -311 -234 -205 -271 -211 -126 -82 -147 -77 -64 -14 -129
5217 -129 -12 91 45 54 134 183 95 180 233 181 180 155 326 274 226 394 382 322 334 336 381 385 376 471 375 397 512 500 444 460
5247D60L0P1k4l0L1K1j2qR2j07k3N2P3r9kk0N0j10O7L7l2j11K1L5qj5j17P9J3
5276D14l3j9j09j5N8j17ml1kl4N5j17Kn6n4L7Jo0J7k9J0j68M9L4k0p4q0K2j0J
5306c32P2q8Jm0n4Q1o6n2QN7j5j9j6MmM2o7p6K8N9m4M6l2Kl0J9M9k3n4P1K3l9
5338d89j8L0N7q7K9M3P7q3j9J65l4j7j3R7o2Q3rRJ9OP0O7l2jO2L5k1R7M2J9k1
5369A01KO0k1LJ01M3o9Q0L8j6L0l5J11k2pQ5m5k2M1R9p8o4M9M5O9o4j1J2k7k4
5399D64Q1qm0j8L1K5m3m1J9on6J3J9L7p5K5o0o3Q6m4k7K2p6J3k2kK3m8j04P7j4
5430A88m4j01M7QK5j00l0l6J9l5qj5q5N8n1Oj11P9q0L4l6l0Ln3%k6k9pm7Qj8J2
5462d55M3j04j4N0j0j08O8j9Qlp8J11Q6p7J5J4mp5R7M0o9J8R9m7j1K4oJ01n4K1
$$ plain form
5247 460 490 561 537 507 538 559 547 539 631 524 501 553 626 527 525 505 555 445 512 549 517 406 427 462 454 439 322 401 414
5276 414 381 362 253 238 296 179 175 144 142 108 163 46 48 -8 -62 -25 -24 -84 -67 -96 -86 -254 -205 -171 -191 -265 -345 -323 -333 -332
5306 -332 -260 -348 -347 -387 -441 -360 -426 -478 -470 -413 -428 -447 -463 -459 -463 -421 -488 -564 -536 -477 -521 -475 -507 -505 -535 -516 -467 -490 -544 -473 -450 -489
5338 -489 -507 -477 -420 -507 -478 -435 -358 -441 -460 -295 -329 -346 -359 -262 -324 -241 -250 -241 -222 -216 -146 -79 -111 -112 -50 -15 -36 61 103 122 101
5369 101 103 163 142 145 246 289 220 300 338 322 352 317 428 406 399 484 439 417 458 557 479 415 464 509 578 514 503 515 488 464
5399 464 545 537 497 479 510 535 492 451 470 464 408 421 440 477 402 427 367 304 390 346 319 341 265 278 256 254 277 229 125 202 188
5430 188 144 43 90 98 123 23 -7 -43 -24 -59 -67 -82 -167 -109 -160 -154 -265 -186 -266 -232 -268 -298 -295 -348 -348 -374 -403 -410 -457 -449 -467 -455
5462 -455 -412 -516 -530 -480 -490 -598 -530 -549 -541 -544 -622 -511 -425 -502 -487 -473 -477 -552 -455 -415 -484 -466 -367 -414 -425 -401 -407 -306 -360 -339
5492c39K4jJ2R1n1m4J04J3J9J3K0Jj5O0N9lM1qK5j9O9K1NJ0nO0K4L0l3L3LP4l6
5525B57MR3p9J05Lkj5K4O7L2p6L2Kj1O3k5K7J5J4l1n7M5rOm1P9l2n3K6P5p1l8
5557D29J0P0q0l7J8m5Jn1j7qOk5l8lq9oK6l5p7N2j6j5r9J24m6q8L4Oj28j2J1r
5589a37k2j6QL1r8o8K0J6m7J0M4p1l7J0k%Mm8%Pm2L7J9n3n1M8N0j68J07KK0p7
5621e04l7J00k5l9k1P1mj1JO0oj3K7K0p1N9P7m7R3k0j5L2Q7Lk9L3J6LP2l1MP6
5653c9J7J5K9J1K2L9l4J10m8L5jL1O6j7K0K0L8J0p0P4N8k3RO5o7l2M4LQj9O7R
5685D50k8MM8n5mQ7l7q8M8p9R1N1q7K4Oj7n9N5l8kP8j08P4l9o0J04o5m6l8J6p8
5716B08L6j0l4N3o1mp8K4l5K1n8m2l9K4m2K1n6n7J1p5K9K6j09j1K5m8Ok8Rq6M4
$$ plain form
5492 -339 -315 -316 -304 -213 -264 -308 -204 -191 -172 -159 -139 -138 -153 -93 -34 -37 4 -4 21 2 71 92 97 107 102 162 186 216 183 216 219 293 257
5525 257 261 354 275 380 383 381 366 390 457 489 413 445 447 436 499 474 501 516 530 499 442 487 478 484 443 522 490 437 463 538 467 429
5557 429 439 509 429 392 410 365 366 315 298 290 296 271 233 230 141 135 161 126 49 101 85 70 -29 95 49 -39 -5 1 -127 -139 -128 -137
5589 -137 -159 -175 -167 -136 -234 -302 -282 -266 -313 -303 -259 -330 -367 -357 -359 -359 -355 -403 -403 -396 -438 -401 -382 -435 -486 -438 -388 -556 -449 -447 -427 -504
5621 -504 -541 -441 -466 -505 -526 -455 -459 -470 -469 -409 -415 -428 -401 -381 -452 -393 -316 -363 -270 -290 -305 -273 -186 -183 -212 -179 -163 -160 -88 -119 -115 -39
5653 -39 -22 -7 22 33 55 94 60 170 122 157 156 187 253 236 256 276 314 324 254 328 386 363 372 437 370 338 382 385 393 374 441 450
5685 450 422 426 474 419 415 502 465 377 425 346 437 488 401 425 431 414 355 410 372 370 448 340 414 375 315 419 354 308 270 286 208
5716 208 244 234 200 253 192 188 110 134 99 120 62 20 -19 5 -37 -16 -72 -129 -118 -193 -164 -138 -247 -258 -233 -281 -275 -303 -294 -380 -336
5747c36j7K0l1nm9N1n0Kp0L1J00j29Q1o1Q5r9jJ3l2j4J19kpm8M9j9L7q2Q3P4n1
5778c58K2l6K6l2Q5K2ok1N9J2J1LM3Nk6N9K0L8k9J5M2JM3k3M5L3j9N8L4Km3L0
5810A15R3K0mOJ7J9l0oK2P7M0J9m7L2K7J8prJ5N9n4j9N1J8m7MM3l6Ok1J5J6Km3
5844D11P4p9j7P4k4o1m6M1j8n5K3L4m8m0K6o6J6p7j4kJ9n0l0K6o7L3r5rJ7L0K9
5875E5q1J4KJ7rj13J5o5P6l7m7J0j08Nl9N0o0K6m0M5r1R3ro1n8jkL4l3rNJ0m3
5908d49l5O8j6ML9j5k1qM4j2n6Q1J1M0p4L7l9L3jj1J09j2qK0J9k1N0K5Nj9L8Q7
5940h7j4m0Q4pP3j1J5M5q0N2Q1m2M9M2rlM6m5L2oK9J1PM7K1J7Nk3L3j4L0k9kj1
5974B96L2N4n5K9O4l3K6k1K0j5l5QO7lj8J1l0omMj5k1L9K8j9n2j04O1J6mJ7m9
$$ plain form
5747 -336 -353 -333 -364 -369 -418 -367 -417 -415 -485 -454 -354 -483 -402 -463 -378 -477 -478 -465 -497 -511 -392 -394 -401 -449 -400 -419 -382 -464 -381 -307 -358
5778 -358 -336 -372 -346 -378 -293 -271 -277 -298 -239 -227 -216 -213 -170 -165 -191 -132 -112 -74 -103 -88 -46 -45 -2 -25 20 53 34 92 126 128 85 115
5810 115 208 228 224 230 247 266 236 230 252 329 369 388 341 373 400 418 411 402 417 476 422 403 454 472 425 429 472 436 442 421 436 452 454 411
5844 411 485 406 389 463 439 378 332 373 355 300 323 357 309 269 295 229 245 168 154 152 171 121 91 117 50 83 -12 -21 -4 26 55
5875 55 -26 -12 -10 7 -2 -115 -100 -165 -89 -126 -173 -163 -271 -266 -305 -255 -315 -289 -329 -284 -375 -282 -291 -352 -410 -411 -413 -379 -412 -421 -416 -406 -449
5908 -449 -484 -416 -432 -428 -389 -404 -425 -433 -389 -401 -457 -376 -365 -325 -399 -362 -401 -368 -369 -380 -271 -283 -291 -271 -252 -273 -223 -198 -193 -212 -174 -87
5940 -87 -101 -141 -57 -64 9 -2 13 58 -22 30 111 69 118 160 151 148 194 149 181 175 204 215 222 269 290 307 312 289 322 308 338 309 307 296
5974 296 328 382 327 356 420 387 413 392 412 397 362 370 437 434 416 427 397 391 387 391 376 355 394 422 403 351 247 308 324 320 337 288
6006B88m4m1rO4n7j4k6j0k8j00O1l0n2K7m6j1r1oN2kp3L1m8k2P3p3Lr2M1K2q7
6037c00L0k3m6O5On7l2L2m0M9n8N0p8P2m6M9Lk1o0O1j1l1Q3j23R1n5k1O6Lj8L8
6068c22pM7r0J4O1lJ6q6P2J9J5M1o9J10o8K2K2N3PM9k8rJ5L8N3K6J9j7j7J7O8
6099F8lN5k7L9N1L6j5l0L9N2j5m5R0L0m0nQ3j7J6n0R1n1j2K7P3j3o2K1o3j7J11
6130D17jr3M4Nj5P2j34L6J9N2j07N4Kl6l5NO1o8n4N5l2K6p0R4j22K8l0mm9J5P2
6161B07m7n4m3J6j6q5k7L8Q3j05j0m3J6mkn8j8L9m0Rq8M3j2l2p4J6j1p4Q5n1O4
6192b78o9k9M7l6ML8qm4l2L5q1J5Q7j9Q0j01J6pqQ9j2L2l4p9J55m8l2J19p1L6
6222b35RNn3K3Q3l2P6l3J7L4m6K0N7N1m5j6O0M7j00J21KJ0k6L0M5j6K2K5jl5O7
$$ plain form
6006 288 244 203 194 258 201 187 161 151 123 23 84 54 2 29 -17 -28 -119 -125 -73 -75 -148 -117 -165 -187 -114 -187 -184 -276 -235 -213 -300
6037 -300 -270 -293 -339 -274 -268 -325 -357 -325 -365 -316 -374 -324 -402 -330 -376 -327 -324 -345 -405 -344 -355 -386 -303 -426 -335 -390 -411 -345 -342 -360 -322
6068 -322 -329 -282 -372 -358 -297 -300 -284 -370 -298 -279 -264 -223 -292 -182 -250 -228 -206 -153 -146 -97 -125 -134 -119 -81 -28 -2 17 0 -17 0 68
6099 68 65 120 93 132 183 219 204 174 213 265 250 205 295 325 285 280 363 346 362 312 403 352 340 367 440 427 365 386 323 306 417
6130 417 416 323 367 372 357 429 295 331 350 402 295 349 351 315 280 285 346 278 224 279 247 273 203 297 175 203 173 169 120 135 207
6161 207 160 106 63 79 63 -22 -49 -11 72 -33 -43 -86 -70 -74 -76 -134 -152 -113 -153 -144 -232 -189 -201 -233 -307 -291 -302 -376 -291 -342 -278
6192 -278 -347 -376 -329 -365 -361 -323 -331 -375 -407 -372 -453 -438 -351 -370 -290 -391 -375 -382 -390 -301 -313 -281 -315 -394 -239 -287 -319 -200 -271 -235
6222 -235 -226 -221 -274 -251 -168 -200 -124 -157 -140 -106 -152 -132 -75 -24 -69 -85 -25 22 -78 43 45 55 29 59 104 88 110 135 134 99 166
6253A66m1L9j1L8PLL8M2L5m2m2J33r3J6O7O8n1l5O6l0m1M6J7j5k4L0J7L8j09K3
6283C55P4l4r6J00k2k1J3o2jq8O4N4j21Q9p2K5l4mm4K1L1j17k0J4o0K5K7r9J9
6312A6j3J4p0R3o8j3n0Rl1n4L5L5j0j9k4l2n4K1jj8k9M2K1q4k7L7KKj2n3j1j1
6344c57M3J6k1m9L3Qr4L3M2J8j5o6R0l0l7j2J06Okk7K8K6o0Q6L4j18P8K6K2J7
6374a76o2Q9k1L7KJ43j33P1j5K5K4qP3jn7N5M6k3qL9J1K6k2P4JJ9l7O9km7O0L
6406B55j3nQ7l4n3R1l1P5o3K4L5p6jJ8O8k1p8J9pQ3l7K0k5K8M4n1r4J20l6j20
6436B22L3RJ9n1J1M0ml3n3j7j1m5Q2l7n3KJ07j04o0M0J7n6r6M8K4m6j2K4q2j4
6466i6J5L3j17L1l3N1n2l9J1m6L6l4P5m4j55M1L7N8q8R6o8K6o9k1R9q6J1K5JK9
$$ plain form
6253 166 125 164 153 191 198 201 239 281 316 274 232 365 272 288 355 423 372 337 403 373 332 378 395 380 356 386 403 441 332 355
6283 355 429 395 299 399 377 356 369 307 306 218 282 336 215 304 232 257 223 219 175 196 227 110 90 104 44 69 96 -3 16
6312 16 3 17 -53 40 -28 -41 -91 -82 -113 -167 -132 -97 -107 -126 -150 -182 -236 -215 -216 -234 -263 -221 -200 -284 -311 -274 -272 -270 -282 -335 -346 -357
6344 -357 -314 -298 -319 -368 -335 -327 -421 -388 -346 -328 -343 -409 -319 -349 -386 -398 -292 -286 -288 -315 -287 -261 -321 -235 -201 -319 -241 -215 -193 -176
6374 -176 -238 -149 -170 -133 -131 12 -121 -50 -65 -40 -16 -24 49 48 -9 46 92 69 61 100 111 137 115 189 190 209 172 241 239 192 252 255
6406 255 242 237 324 290 237 328 297 372 309 333 368 292 291 309 377 356 278 297 290 373 336 356 331 359 403 352 258 378 342 222
6436 222 255 264 283 232 243 283 279 246 193 176 165 120 202 165 112 114 221 117 57 97 114 58 -38 10 34 -12 -24 0 -82 -96
6466 -96 -81 -48 -165 -134 -167 -116 -168 -207 -196 -242 -206 -240 -165 -209 -364 -323 -286 -228 -316 -220 -288 -262 -331 -352 -253 -339 -328 -303 -302 -273
6496b73k8O0n6K2l0JK6n2m6J05k8rJ6N7p1J00mjj8OL7J3n7Q2LLj2o5Q5K5K0n8
6528a47M2M6K7j1oPK4rM3j6R1j42J01Q1K7K1Nm2N4l1O5o4P7l1Q7l0m5R7k8n2J10
6559C51k7K6%m4n7M2Q6l6Q4q7l5RRJJ9j9L6r6qN9qn6O7j4n6kL6P9j14l7M8k3j8
6592B15l7j14J13q3N4L7q9J6r2K5J1jJ8k2o6L6m7j8k4Q7Jj08J6k2j9q6O0L2m9
6621a56j1l%l3j5k2L9j5q3M2J02j56M3olJ9o8K6k5r3O4rnL6k7O1O9j06L7L6k1
6652b83o1N3M0l4O5l7nLN7k4k6J06k7oN2n5M3K9K4KK3J7k6M0j4M4m8J14Nn2R4
6683A13n5k3jR8j3rk1P0n0R9j04P6M0m3O5m0l7M1Q3q3PK4LK0o0Q2J5m2J6K5l2
6714B64J2O8m3j5QO5m4j7n9M7j3r6R0L5k0o3O8n8n7nK12j10q1L5L1o6j5o7P8p4
$$ plain form
6496 -273 -301 -241 -297 -275 -305 -304 -278 -330 -376 -271 -299 -308 -292 -235 -306 -206 -210 -211 -229 -223 -186 -173 -230 -148 -145 -142 -154 -219 -134 -109 -89 -147
6528 -147 -105 -59 -32 -43 -49 -42 -18 -27 16 0 91 -51 50 131 158 179 184 142 196 165 230 166 243 212 299 269 224 321 293 241 351
6559 351 324 350 350 306 249 291 377 341 425 338 303 312 321 322 341 322 358 262 254 313 305 249 316 302 246 244 280 359 245 208 256 233 215
6592 215 178 64 177 94 148 185 96 112 20 45 56 55 73 51 -15 21 -26 -44 -68 19 20 -88 -72 -94 -113 -199 -139 -107 -156
6621 -156 -167 -170 -170 -203 -218 -240 -201 -216 -299 -257 -155 -311 -268 -274 -277 -258 -326 -300 -325 -418 -354 -363 -368 -332 -359 -298 -229 -335 -298 -262 -283
6652 -283 -344 -291 -251 -285 -220 -257 -262 -259 -202 -226 -252 -146 -173 -179 -127 -182 -139 -110 -86 -84 -61 -44 -70 -30 -44 0 -48 66 71 19 113
6683 113 58 35 34 132 119 110 89 159 109 208 104 180 220 177 242 202 165 206 289 206 213 237 240 260 200 282 297 255 271 296 264
6714 264 276 344 301 286 294 359 315 298 239 286 273 177 267 302 282 219 287 229 172 167 379 269 188 223 254 188 173 106 184 110
6744A10j8ML4m6o2L9N6q5k0n5L5q7K3J5j3l5N7n8km3K4m1%j1K4n1l3N6q4P5m0
6775b32M0r7K0J8l1j3oP1K6r1rP0k6Pk8M3o1J4m7K8L3L4k4Mn0N8NL5n8P2k9n6
6807b80P1K2l6k4O9L6l0k8Q9L3j11N1M5J3k4M0M5o4rP5N7qK1L1Nj8M6J7k5L8o
6838A41K4j2P2q6P5Ln9M1Q1o6N7l3L1K0l5J4J9l9O9j7l1j8M3n6J2J5M5l9k6N0
6868B95K7j08m7J20m4l3M9Nj5o1k3M3jj7j4K0j30P7Q8q4m9L8Rj4m9M5j02L2K5
6897H2k3m8pk0JL5o4K8p9JN8n3kn3J1J04p4o0N1k3j03Q6k9On1k5K5k8k8j8K9K
6929b69m8N3K4o1N2n6Lk6M7N6l9J3K3mpn5N6ml9K6K4j8JN0j8kL3K2P1o6j1J6J12
6962d1l6j2jkqJ3R1l5r8R1M2LM2M3n9j9L0J9J4mM1Oj9M3j7pm4J33l0n0N7k1M9
$$ plain form
6744 110 92 96 130 84 22 61 117 32 12 -43 -8 -95 -72 -57 -70 -105 -48 -106 -108 -151 -127 -168 -168 -179 -155 -206 -239 -183 -267 -192 -232
6775 -232 -192 -289 -269 -251 -282 -295 -301 -230 -204 -295 -304 -234 -260 -253 -281 -238 -299 -285 -332 -304 -271 -237 -261 -257 -307 -249 -244 -209 -267 -195 -224 -280
6807 -280 -209 -187 -223 -247 -178 -142 -172 -200 -111 -78 -189 -138 -93 -80 -104 -64 -19 -83 -92 -17 40 32 53 84 89 71 117 134 109 147 141
6838 141 165 153 225 139 214 217 158 199 280 214 271 238 269 289 254 268 287 248 317 300 269 251 294 238 250 265 310 271 245 295
6868 295 322 214 167 287 243 210 259 264 249 188 165 208 207 190 176 196 66 143 231 147 98 136 145 131 82 127 25 57 82
6897 82 59 11 4 -16 -15 20 -44 -16 -95 -94 -36 -89 -91 -144 -133 -29 -103 -163 -112 -135 -238 -152 -181 -175 -226 -251 -226 -254 -282 -300 -271 -269
6929 -269 -317 -264 -240 -301 -249 -305 -302 -328 -281 -225 -264 -251 -228 -232 -239 -294 -238 -242 -281 -255 -231 -249 -248 -198 -216 -218 -185 -163 -92 -158 -169 -153 -41
6962 -41 -77 -89 -90 -92 -100 -87 4 -31 -129 -38 4 7 49 92 33 14 44 63 77 73 114 120 101 144 127 120 76 209 179 129 186 165 214
6995B14Rm1QO9JJ2nJ9k8K8L4j9k8k5N7k9J4Pl9pQ9j04J2pMl3K0rN0m4p5Q0l0k8
7029A76m2l0M0o1J1L3l4o0N0N1j15K8J6o7l7J2L6j1m7M6j04R1m8j9j5l7j2K7j9
7058a41LJ5k5J6q2N7M3r8n5J07j5n3j4Rn7PP9q4nKJ32j00l5J1%J3o5M9O7Qp5J7
7090b69N5r5O4QN9p5K6mO2m2P6m1J5j3M4km3M4J6P5J5o4K8mr3J12N6p4K4M3J6
7121A9K6J7L2l9k3Q1l2K6nj7k7P8J9K5Mn8N7J4l1K7K3Lo3J6P9m5N5m3k9K5P1k5
7153B60r1J1j7J02k1L0m3Kn6P3Pp1J2O5m8M2j8l7m8J6m3O0Lm9K6K5l0q8L6J9l6
7184I3k1O5K4j08l4jM4j50O4N0k2p5l8N0Po8P0J1j22P1K8q0J4m2N5k3o7P0m8l8
7214b21l5L1L8m8J9l2M1K9l1J7k0n0J9j3rn2R5O7p2oPM4o8R3n2M4k9%J6Ok6M7
$$ plain form
6995 214 223 182 190 259 260 272 267 286 258 286 320 301 273 248 305 276 290 297 258 251 340 236 248 241 245 212 232 223 273 229 154 234 204 176
7029 176 134 104 144 83 94 127 93 33 83 134 19 47 63 -4 -41 -29 7 -4 -51 -5 -109 -18 -66 -85 -100 -137 -149 -122 -141
7058 -141 -138 -123 -148 -132 -214 -157 -114 -212 -267 -160 -175 -228 -242 -233 -290 -283 -204 -288 -293 -291 -159 -259 -294 -283 -283 -270 -335 -286 -219 -211 -286 -269
7090 -269 -214 -309 -245 -237 -178 -253 -227 -231 -169 -211 -135 -176 -161 -174 -130 -132 -175 -131 -115 -40 -25 -89 -61 -65 -158 -46 10 -64 -40 3 19
7121 19 45 62 94 55 32 113 81 107 102 85 58 136 155 180 184 126 183 197 166 193 216 219 156 172 251 206 261 218 189 214 285 260
7153 260 169 180 163 265 244 274 231 233 177 250 257 186 198 263 215 257 239 202 154 170 127 187 190 141 167 192 162 74 110 129 93
7184 93 72 137 161 53 19 18 62 -88 -24 26 4 -71 -109 -59 -52 -120 -50 -39 -161 -90 -62 -142 -128 -170 -115 -138 -205 -135 -183 -221
7214 -221 -256 -225 -187 -235 -216 -248 -207 -178 -209 -192 -212 -262 -243 -256 -265 -317 -222 -155 -227 -233 -226 -182 -250 -157 -209 -165 -194 -194 -178 -172 -198 -151
7246a51j1o5Q8m2j8O4j3L6RPL4J6J2J3o2OJ0L7k3K8L9J7L8n0P1j1l3L2K7M9q8
7277F6O2O4r1K1L9M6r3M6L5L3p9J5P0kj01J56J3n8j0K9KNk1J7j8j4n5O4J0o2j8
7308A71N9n3J7KK9n4Jj4K0m0MMJ6m2k8N8L6j14j0L7m5L8Pm7m7kP5p3m2J46o4l6
7340ILl9N9k6j5l3L0r8QM5J9j35J5J9M1k0o1Q5p7K0N7p7p7J00l3jk0L3J0m5l9
7371b43k4K4k4OQ0j06M0%j8N7m5L1mk7K7M2j5P9o6O8q1M0l1M4L4o0J8j8K6R3j4
7402f7k8j8J01n9M8Nok9K4N6L1r4M1qK8mj9O1k9N4k3K3m7j2Q7M5j21R2N9l3K5
7433A83jj2k9M4l2K9O1m7N6o5o6J19l5K7l8O0m2Km7M8N4l2l3K4j1l6o0M9J0J3
7463A93J7q3N3KK4o4m5J4K8o0M1n6Q6l7m6M5jq8n7Q0q2M7K1p1l1KL4n7l8J04o7
$$ plain form
7246 -151 -162 -227 -139 -181 -199 -135 -148 -112 -103 -96 -62 -46 -34 -21 -83 -77 -67 -30 -53 -25 14 31 69 19 90 79 46 78 105 154 66
7277 66 128 192 101 122 161 207 114 160 195 228 149 164 234 232 131 287 300 242 232 261 263 268 247 264 246 232 177 241 251 189 171
7308 171 230 177 194 196 225 171 172 158 178 138 142 146 162 120 92 150 186 72 62 99 54 92 99 52 5 3 78 5 -37 109 45 9
7340 9 12 -27 32 6 -9 -42 -12 -110 -102 -57 -38 -173 -158 -139 -98 -118 -179 -94 -171 -151 -94 -171 -248 -148 -181 -182 -202 -169 -159 -204 -243
7371 -243 -267 -243 -267 -261 -181 -287 -247 -247 -265 -208 -253 -222 -226 -253 -226 -184 -199 -120 -186 -118 -199 -159 -190 -146 -112 -172 -154 -172 -146 -53 -67
7402 -67 -95 -113 -12 -71 -23 -18 -24 -53 -29 27 58 -36 5 -3 25 21 2 63 34 88 65 88 41 29 116 161 40 132 191 158 183
7433 183 182 170 141 185 153 182 243 196 252 187 121 240 205 232 194 254 212 214 167 215 269 237 204 228 217 181 121 170 180 193
7463 193 210 127 180 182 206 142 97 111 139 79 120 64 150 113 67 112 111 23 -34 46 -36 11 32 -39 -70 -68 -34 -91 -129 -25 -92
7494i2O3r2LP3j11lLL1m8K3N0j01%k5O4l5J21r6nmKL9j09L1J6K7J6k1L7m5k8j7
7526b33N8pJ0j9k0K9jP%J3oO1k3Nl3L6l6mN9J9k6jM1Kl4qJ15l7k5M8N0n5N5Ll5
7561HM1o0O3K1o6R9lPr%J06p1n3J06L9j39K6P8jn7JL4n3M2Q2Rl7l9J9J3j3M1R
7594B43j11J28m1M5j13k2Q1n1J5M6p2nN1o7K0L1j4N1p7o2O7n3O4m2J3o6K3%JM7
7624A30j07N3j5l4j4K3Kj0n5M1Po2K7K2Rj44L4P3p0lL1K2p4m6J8K7n0P6m3Jm5
7655a76m4P4on6K1Q2r5n9M1M5l7M5N9m0j6J5o2O9o1K1M0k7L8K4k2m3O6M0k5q7
7685a76N9N2n7mL9j8njJ12q0kl0J26r5L9L0J0M4m6mmN0K6l9K2k3k6J06p2J2k3
7716B2Q3n6OJ9K4J0LM9k9n9O6K9K3m0LK5p5Q2l0Q0qk7l7K5j1k4MJ3k4M5j3l1M0
$$ plain form
7494 -92 -29 -121 -118 -45 -156 -159 -156 -125 -173 -150 -100 -201 -201 -226 -162 -197 -76 -172 -177 -181 -179 -140 -249 -218 -202 -175 -159 -180 -143 -188 -216 -233
7526 -233 -175 -182 -172 -191 -211 -182 -183 -176 -176 -163 -169 -108 -131 -126 -159 -123 -159 -163 -104 -85 -111 -112 -71 -69 -103 -111 4 -33 -58 -10 40 -15 40 43 8
7561 8 49 -11 52 73 7 106 103 110 101 101 207 136 83 189 228 89 115 193 192 135 136 170 117 159 241 250 213 174 193 206 193 234 243
7594 243 132 260 219 264 151 129 210 159 174 220 148 143 194 127 147 178 164 215 138 76 143 90 154 112 125 59 82 82 83 130
7624 130 23 76 61 27 13 36 38 28 -27 14 21 -41 -14 8 17 -127 -93 -20 -90 -93 -62 -40 -114 -160 -142 -115 -165 -89 -132 -131 -176
7655 -176 -220 -146 -152 -208 -187 -105 -200 -259 -218 -173 -210 -165 -106 -146 -162 -147 -209 -140 -201 -180 -140 -167 -129 -105 -127 -170 -104 -64 -89 -176
7685 -176 -117 -65 -122 -126 -87 -105 -110 -111 1 -79 -81 -111 15 -80 -41 -11 -1 43 -3 -7 -11 39 65 26 48 25 -1 105 33 45 22
7716 22 105 49 55 74 98 108 111 160 131 72 138 167 190 150 153 178 103 185 155 235 227 200 163 188 177 153 157 170 146 191 178 147 187
7749A87K7m1j1k2K6M3m3L0j17L3K3L6k2q2K0K6j12Q3MRp0M3Nn7OJ5m0m9K9K8j4
7780gL5j0p7K0K7r4N3m5j8M9rk6l3O5L3n4j1K0r0K7M0m3Rq5R2m8m0M3J0kM7j13
7812b35L2L5m0P1k6n0N0l6j4KMQ6q6R3o5P4l4k8PJ9Q3j6l4kjlMk3R7j8o3N3j8
7845h2lM3L9K5k7k2L8N6m3J9l3N0n2O7K1lJ4K4j8K4q7P0k1l8N3j1K2OJ0m7O9m7
7877A16L7J5m0j4K2R3r7KJ13j10k2oO3rk9O8m3J2n1N7Kr7L4L0j8K0n%m0m3O6r9
7909B7J00qk9L4l6nJ6n2j7Ok8M0p8L9j6JRl9J1K5r5N4lm9K7Q6n8L6j38J02j19
7940a57O0L8n3n4O7l5l1j8L8lkl0j9K1j0O2L2m6p5J28q4jK9m1N4K6n9J9n9O1j
7971a43K4n3PM4j5ON7k1n8L9Q1k4r9L1P5L5k6m7K9K8j1j1N1l0L9l0j8O4L7n6j2
$$ plain form
7749 187 214 173 162 140 166 209 166 196 79 112 135 171 149 67 87 113 1 84 88 97 27 70 75 18 24 39 -1 -50 -21 7 -7
7780 -7 28 18 -59 -39 -12 -106 -53 -98 -116 -67 -76 -102 -135 -70 -37 -91 -102 -82 -172 -145 -105 -148 -139 -224 -132 -180 -220 -177 -167 -169 -122 -235
7812 -235 -203 -168 -208 -137 -163 -213 -163 -199 -213 -211 -207 -121 -207 -114 -179 -105 -139 -167 -160 -141 -58 -74 -108 -110 -111 -114 -110 -133 -36 -54 -117 -64 -82
7845 -82 -85 -42 -3 22 -5 -27 11 67 24 43 10 60 8 75 96 93 107 131 113 137 50 120 99 61 114 103 125 131 141 94 163 116
7877 116 153 168 128 114 136 229 132 134 247 137 115 109 172 163 134 202 159 171 120 177 179 82 116 146 128 148 143 143 103 60 126 27
7909 27 127 119 90 124 88 83 99 47 30 36 8 48 -30 9 -7 -6 3 -36 -25 0 -95 -41 -44 -93 -66 20 -38 -2 -140 -38 -157
7940 -157 -97 -59 -112 -166 -99 -134 -165 -183 -145 -148 -150 -180 -199 -178 -188 -126 -94 -140 -215 -87 -171 -172 -143 -184 -130 -104 -163 -144 -203 -142 -143
7971 -143 -119 -172 -165 -121 -136 -130 -73 -94 -152 -113 -32 -56 -155 -124 -49 -14 -40 -87 -58 -30 -41 -52 -1 -31 8 -22 -40 24 61 5 -7
8002gpj9J50n2lM3m5o8Q4M4k9k5M6%k4jL5j6l1pmJ02Mo8P6q9J02o8N4j8J0l2M3
8035A80k4k8K6p7nM3M1RJ5m1J6j3o1O3km5l6P2j9pr5R6o2J1rL0n3j4j6P2n3K8
8067D2O6r5J7j7Mm5l7J52q1r1K8j1P3j12N4NNm3J5j9P6p1N6Jq1j7K7j0p7M4jL
8099a40l4Rk6M8n0krK8k8P0k8l1P7o2j9K2O1k1nL5k5K8p7J41j28L2j0P0j0j4J09
8130A1m3l5m9O9l9O1p7J01m5R4k1j4j5k0K5O9p9N9J6K0n5K1K0m6J5P4l1K3j13
8159dQ2MpN8r9J2N0NJ6N9o8k0J7J4M3O0n1l5n1J72j06p4J15Lj9m1J4J2rKN7j3
$$ plain form
8002 -7 -14 -33 117 65 62 105 60 -8 76 120 91 66 112 112 88 87 122 106 75 68 64 166 170 102 178 89 191 123 177 159 169 137 180
8035 180 156 128 154 77 72 115 156 165 180 139 155 142 81 144 142 97 61 133 114 107 12 108 46 57 48 78 25 11 -5 67 14 42
8067 42 108 13 30 13 17 -28 -65 87 6 -85 -57 -68 5 -107 -53 -48 -43 -86 -71 -90 -14 -85 -29 -28 -109 -126 -99 -109 -186 -142 -143 -140
8099 -140 -174 -165 -191 -143 -193 -195 -204 -176 -204 -134 -162 -193 -116 -178 -197 -175 -114 -135 -140 -105 -130 -102 -179 -38 -166 -134 -144 -74 -84 -98 11
8130 11 -32 -67 -116 -47 -86 -25 -102 -1 -46 48 27 13 -2 -22 3 72 -7 52 68 88 33 54 74 28 43 117 86 109 -4
8159 -4 78 82 75 133 34 46 96 101 117 176 108 88 105 119 162 222 171 136 85 257 151 77 192 195 176 135 149 161 152 154 211 198
8191A98
$$ Imaginary data points
##PAGE= N=2
##DATA TABLE= (X++(I..I)), XYDATA
0@%%%%%%%%%%%%%%%nJ3j4J4j6J6j6J6k1K6k7L0l6M1m3M8n5O0o5P3q1Q9r8J06j18
40f3J31j43J61j79J95k16K44k78L16l59M17m95N93p24R15j208J684k552M426r918
60g053N1625K03768k25281k37281K03713J89359j72085j19969J65727N0355j73670
71g0792L176J93971k3420k02638J5937J90537J1916j47321l8724Q3910N3431j3403
83E6580m9345m2320L3728P1985k0839p1776K4629N0659n3329k4625J02704P297
95H5348j60884o984K08611J9166k33403l2931K29125L2634k04409j1982J71557
106I5848k9626j46880P7814J35316j19765j37277J39953J39494j36831j33824
116a15778J12516J08971q2064o9316N4151K0125m0633K1051L6310m7289l8364
$$ plain form
0 0 0 0 0 0 0 0 0 0 0 0 0 0 0 0 0 -5 8 -6 8 -8 8 -8 8 -13 13 -14 16 -20 21 -22 26 -29 31 -34 39 -42 47 -51 55 -63
40 -63 68 -75 86 -93 102 -114 130 -148 168 -191 226 -269 324 -400 515 -693 991 -1561 2865 -7053
60 -7053 44572 248340 23059 -214222 -10509 178850 6765 -113204 52523 102878 -70792
71 -70792 -67616 126355 102935 -99703 -83766 106771 118687 -28634 -67358 16552 69983 56580
83 56580 7235 -35085 -1357 70628 49789 -21987 2642 53301 -28 -24653 78051 85348
95 85348 -75536 -82520 126091 145257 -88146 -121077 108048 140682 -63727 -75709 95848
106 95848 66222 -80658 -2844 132472 12707 -124570 15383 154877 18046 -115778
116 -115778 -3262 105709 23645 -45671 8480 28605 -12028 9023 45333 -1956 -40320
127d0320M8245L1180l2725j2947N294k2972J6817O3879l1230j03668L0800J24837
139G7190k7445j27183K5723J06955l9353p9444O4654N1003j00931l5709J31886
150D7346K9900j50940l2685J47951L0856j28214k0329R7057m059o7818L5358M6306
162C0729o6228l6665Q5294L4164q7650l1926P3057K2638m7352l016K0496k3816
174c0275O75N2386j0566p1765J2980P7654j1466o6237J5732M4660k7475j8105
186c1802M8678j943p0230J4440Q7530j6382r0874J6685Q1897j7596o0233K7141
198a2689L6600m1184j4335N9487J418p1657N575P6184o271o7091R481N0504j4803
211A1219k7521K7143Q152l9361P300N1170j3541n3830J6966M8730j7171l3209
$$ plain form
127 -40320 7925 39105 6380 -6567 -1273 -24245 -7428 56451 25221 -78447 -47647 77190
139 77190 49745 -77438 -51715 55240 15887 -63557 1097 52100 -48831 -84540 47346
150 47346 77246 -73694 -106379 41572 72428 -55786 -76115 20942 16883 -50935 -15577 30729
162 30729 -35499 -72164 13130 47294 -40356 -72282 775 23413 -23939 -26955 -6459 -30275
174 -30275 -29600 22786 12220 -59545 -46565 31089 19623 -46614 -30882 13778 -13697 -31802
186 -31802 16876 14933 -55297 -40857 46673 30291 -60583 -43898 37999 20403 -39830 -12689
198 -12689 23911 -17273 -31608 27879 29297 -42360 -36785 39399 33128 -33963 -24482 26022 11219
211 11219 -16302 10841 18993 -20368 -13068 38102 24561 -29269 -12303 36427 19256 -13953
223a3953K1787J4962k8515M330L9115j6888m6236K4905M9100k6496m2745K7797
235G163L0411k9605j3611L5107k247m1422J4327M6806k1276m7600K3738M2147
247D3938k4824l1751K5843J7486k9182m290L2537p362l6314J3389L5528j7292
259A7706l1946J7100K2283j8663j1573J9190j346k2718J0185K3707j7383k4570
271a8028J9208J9977k0911j3849K0163L370k1889N279K2282j4308k4177J8589
283d294K2615k1929k0220K1773J3760k2542p242K1600p88k2299O271K1151j1166
296c310k0261J2752J6342j4032j2161J3214N905j3115n56J1831m644j1018P861
309a1192Q613j0124n710J0590J538j0829K834J0294o975r496J0336Q217j2539
$$ plain form
223 -13953 7834 22796 -5719 -1389 37726 20838 -25398 -493 48607 22111 -20634 7163
235 7163 37574 7969 -5642 29465 27218 -14204 123 46929 25653 -21947 1791 43938
247 43938 19114 -12637 13206 30692 1510 -2780 29757 22395 -13919 -530 34998 17706
259 17706 -14240 2860 25143 6480 -5093 14097 12751 -9967 218 23925 6542 -18028
271 -18028 1180 21157 246 -13603 6560 9930 -11959 -6680 15602 1294 -22883 -4294
283 -4294 18321 -3608 -23828 -2055 11705 -10837 -18079 3521 2733 -19566 -13295 7856 -3310
296 -3310 -23571 -10819 5523 -8509 -20670 -7456 -1551 -14666 -15222 -3391 -8035 -19053 -11192
309 -11192 -2579 -12703 -18413 -7823 -6285 -17114 -14280 -3986 -10961 -20457 -10121 -1904 -14443
322a4443n810J3939L334j4291M83J4882l134j4179O509J3839p867j1526R735R896
336A367r764o230J1101M195j0440p40J1259l13r411K335Q747k059n336L438L500
351A649l196L37M585j569m146L578M625l159k559L931J210l322K212M425m009
366D592m516O087N908o185n497O264N114n023k936M813Q66m442J636N429k685
381I425n896L035O563j941n789O53M315N45k073p87p6L99J325M16j444j153Q5
398G602Q40J400J13l196k270L539L932l784n524K372N210k113m602J131K131k482
414D299r44L314j000n784L23O287l77p236j503N442J091m272j712J402m22o87
430a779J110q46l267l20K980K49k980j651O29R88O25p48l076j280L579J935l971
$$ plain form
322 -14443 -20253 -6314 -2980 -17271 -16788 -1906 -5040 -19219 -12710 1129 -6738 -18264 -8529 1367
336 1367 -8397 -14627 -3526 669 -9771 -10511 748 435 -8976 -6641 2106 47 -5289 -1851 1649
351 1649 -1547 -1210 3375 1806 -2340 1238 5863 2704 145 4076 5286 1964 4176 8601 4592
366 4592 76 6163 12071 5886 389 6653 11767 6744 3808 8621 9487 5045 6681 12110 9425
381 9425 3529 6564 13127 11186 5397 6050 10365 10910 8837 8050 7974 8373 9698 10114 8670 7517 7602
398 7602 8442 9842 9955 6759 4489 8028 11960 8176 2652 5024 10234 8121 3519 4650 6781 4299
414 4299 3355 6669 5669 -115 208 6495 6118 -1118 -2621 2821 3912 -360 -2072 -670 -1092 -1779
430 -1779 -669 -1515 -4782 -5102 -2122 -1873 -4853 -6504 -5875 -4887 -4262 -5010 -8086 -9366 -5787 -3852 -7823
447g823l113K848K376k403j445J876q19k495K529L324l926m510M196N301l889
462g973n348L221M399k345k699K416Q97k537J037L473j821l829K336M433j726
477f066l386J531K417n27p5P80j281q02L512J667l594j539M330J937l149k32K940
494a537o49j784L596K256m927j726P201K891p194k243P709K378o156k23N973j442
510D123m638M752N095o213m819Q088N760p642m917P224L968n427j003M622j973
525G000l729N286M145p191m524Q110M691p209l569N465J126l796K430K354o335
540D254k280R055K702j0847l414J0069K587q485p05N436l297l954P410K935j1868
555d02l974J3554M310j3726n045J0929K749q267L18M857n671l846R626L275j3250
$$ plain form
447 -7823 -10936 -8088 -5712 -8115 -9560 -7684 -8503 -10998 -8469 -5145 -9071 -13581 -9385 -4084 -7973
462 -7973 -13321 -10100 -5701 -8046 -10745 -8329 -7432 -9969 -8932 -5459 -7280 -11109 -8773 -4340 -6066
477 -6066 -9452 -7921 -5504 -6031 -6106 -5326 -6607 -7409 -3897 -2230 -5824 -7363 -3033 -1096 -4245 -4477 -1537
494 -1537 -2186 -3970 -374 1882 -3045 -4771 2430 5321 -1873 -4116 3593 5971 -185 -408 5565 4123
510 4123 -515 4237 9332 3119 -1700 6388 12148 4506 -411 6813 10781 5354 4351 8973 7000
525 7000 3271 8557 12702 5511 987 9097 13788 6579 3010 8475 9601 5805 8235 10589 4254
540 4254 1974 11029 13731 2884 -530 9539 12126 3641 2936 8372 5075 1121 8531 11466 -402
555 -402 -4376 9178 13488 -238 -5283 5646 8395 128 446 5303 -368 -4214 5412 8687 -4563
570d563m483J3129M274j1884l509P768j13m871M454J780j0284j603J3517J716
584E328j5345l064J3234K055r817k8M908n235j756J0213q9j5188m34J6522R03
599B207j5434j035J1048j647o144N761J660j1359Q27J5755j780j7799J681J6887
613F28k401j2923M872P682q907k434J4518p32j9252K698K2293k718k1468L774
627a4370J8423n359j2407R883P524j4753k967K0216J692k2385p28K2413N71j7705
641i952K126J2538n764o143J1841K538j6163J32J9387m15j8113J968J4744l650
655E074q309Q186K597j2863K764J8434n134k1018O797K1344p049j7185R130J1231
669A3999j2248m039J7717j295k2716M712K6647n566k6328N764K2449o529j5255
$$ plain form
570 -4563 -9046 4083 8357 -3527 -7036 732 619 -4252 202 1982 -8302 -9905 3612 5328
584 5328 -10017 -13081 153 2208 -7609 -7637 -2729 -7964 -9720 493 404 -14784 -15218 1304 2207
599 2207 -13227 -14262 -3214 -4861 -11005 -5244 -3584 -14943 -14116 1639 -141 -17940 -16259 628
613 628 -1773 -14696 -9824 -2142 -11049 -13483 1035 303 -18949 -16251 6042 3324 -18144 -14370
627 -14370 4053 -1306 -13713 -3830 3694 -11059 -14026 6190 7882 -14503 -15231 7182 7753 -9952
641 -9952 -7826 4712 -1052 -7195 4646 7184 -8979 -8847 10540 10125 -7988 -6020 8724 5074
655 5074 -3235 4951 7548 -5315 -2551 15883 10749 -10269 -3472 17872 10823 -6362 2768 13999
669 13999 1751 -2288 15429 14134 -8582 -3870 22777 17211 -9117 -3353 19096 12567 -2688
682b688R669P464j4505j085J9750k872k2894M038K2558m508j8738N187J1464p906
696D934l796J1570l604j6141P918J8750j0610j9308J0819J5219j1561r030J2228
709G388L86j5598O863J8650j3268k1970J5526K1673j6706j8871J5864J1676j7136
722e523l572J8664n072k2239J0493K3928j4116k4118J4543K0222j5471j3978J5810
735d29N609j8018J845J9787p959k1590J1322K0803j2987j7903J3184J1790j3516
748h062m500J4144l348j5365R656J6133j3730j5618J5376J2443j5151o693J4894
761A79j133j4873R227J5862j5577j6461J9700J5620k0850j1789K0882N994k0063
774a3282J773K0456q951k0432J5367K0638j8777j8588K0893J5473k0478r506K0292
$$ plain form
682 -2688 6981 14445 -60 -1145 18605 15733 -7161 -3123 19435 14927 -3811 1376 12840 4934
696 4934 1138 12708 9104 -7037 881 19631 9021 -10287 532 15751 4190 -4840 7388
709 7388 7774 -7824 -961 17689 4421 -17549 -2023 19650 2944 -15927 -63 11613 -5523
722 -5523 -9095 9569 4497 -17742 -7249 16679 2563 -21555 -7012 13210 -2261 -16239 -429
735 -429 5180 -12838 -10993 8794 835 -20755 -9433 11370 -1617 -19520 -6336 5454 -8062
748 -8062 -12562 1582 -1766 -17131 -7475 8658 -5072 -20690 -5314 7129 -8022 -14715 179
761 179 -954 -15827 -6600 9262 -6315 -22776 -3076 12544 -8306 -20095 787 6781 -13282
774 -13282 -11509 8947 -4 -20436 -5069 15569 -3208 -21796 -903 14570 -5908 -15414 4878
787D878L356j9104L983J8842r142j7258J3488J6172j4700j2470J5003Q098j3002
800a856j359J1777m824r894J1027R185j4238p104J6013M200j5009R27J3890o675
814F060j1866J2859J0753j7681q804K0996O594k2035l108K1795j367k0278O464
827C82J8619j1534j6504J5664J4056j8680j1107J9876P683j9805l787J8085q58
840A2090j5761N187J2783r522j0207J2157O790j3395l805J2764n69j1482M638
853A668Q882r295o694J2277L646j4881j088J5209k886j5163O302J3305j0523j1905
867a1146J3289Q951j6103o369J6768K632j7706N68J6745m578j6030P194J3540
880G755j0120j1237J1552P498j3033m312J2875M34j2630K693J1073o003r381Q152
$$ plain form
787 4878 8234 -10870 -6887 11955 2813 -14445 -957 15215 515 -11955 3048 11146 -1856
800 -1856 -3215 8562 3738 -6156 4871 14056 -182 -7286 8727 12927 -2082 -1155 12735 6060
814 6060 -5806 7053 17806 125 -8679 12317 18911 -3124 -6232 15563 14196 -6082 382
827 382 19001 7467 -9037 6627 20683 2003 -9104 10772 18455 -1350 -5137 12948 12090
840 12090 -3671 1516 14299 4777 -5430 6727 13517 122 -3683 9081 8512 -2970 1668
853 1668 10550 1255 -5439 6838 10484 -4397 -5485 9724 6838 -8325 -2023 11282 759 -11146
867 -11146 2143 11094 -5009 -11378 5390 8022 -9684 -9116 7629 3051 -12979 -5785 7755
880 7755 -2365 -13602 -2050 5448 -7585 -11897 978 1412 -11218 -8525 2548 -3455 -12836 -4684
894d684O811r920m125J0418P37j0315K786R509o207q526R140P381j1114n498J2099
909a508L188j1746N5J1311l470j0398P273R699r532q588J1211P311j1171m652
923a1017J0964J959r752J715R145m512p949P413P345q396n838Q953M311p654j467
938d780O705j181n046M668M467o788l336Q463L142q000j592P131K7m902L092L749
954E819n689k336Q490K427r461j737R394J510p681M27O005k462l946N259L159
969I178p336k508Q642K597q294k220O996J260m906P16K854l046j680N185J222
984H660o799j404O581J381n417j081L097p47j298K715m26n161M93O325m68o802
1000c51l19N348l28l636J087J285l440j91N148n03o916k78O847M70o103r52L773
$$ plain form
894 -4684 2127 -7793 -11918 -1500 -763 -11078 -8292 1217 -4990 -13516 -4376 3005 -8109 -13607 -1508
909 -1508 1680 -10066 -10011 1300 -2170 -12568 -5295 4404 -5128 -13716 -2505 4806 -6365 -11017
923 -11017 -53 1906 -7846 -6131 3014 -1498 -9447 -2034 5311 -3085 -8923 30 4341 -3313 -4780
938 -4780 1925 744 -4302 366 4833 -1955 -5291 3172 6314 -1686 -3278 3853 3880 -1022 2070 5819
954 5819 130 -2206 6284 8711 -750 -2487 6907 8417 736 1163 7168 4706 760 6019 9178
969 9178 1842 -666 7976 10573 2279 59 7055 8315 3409 4125 6979 3933 2253 7438 8660
984 8660 1861 457 7038 8419 3002 1921 5018 4271 2973 5688 5262 101 594 6919 6451 -351
1000 -351 -670 4678 4350 714 1801 3086 -354 -545 4603 4100 -2816 -3094 3753 4223 -1880 -2832 941
1017I41j51j942J410J14l689R0M881J5n723r65M562J066l138r27Q35q93N71K389
1035e54j256m373N03M845K71m567j233K749R20q52k27q63j653J366L214j029m246
1052f985j26L960J144k619j463P07R83J044N00j889j861J901L123p86k947j64
1068e478K258J063k19n50j168k51K697K072k387k915K018L728m19k850J2J778
1084f11O82L1M62q49j186J513K669o30k743K5K672J338j371j359L64J339J018
1101C364k20j314l95J304J230l52r05k67L74R12R05p16j709L11K379N92k214j021
1119B258J722J315j130o84O82q5n40Q89Q84j332j457J233J922q40k131N8J704
1136D468M20j105q61K04N17J42k78n30m58O7L18J62m74j065l08J041N67j424j618
$$ plain form
1017 941 790 -1152 258 372 -3317 -3227 1654 1669 -4054 -5019 -457 609 -2529 -3456 -2621 -3514 -2943 -554
1035 -554 -1810 -6183 -5680 -835 -564 -5131 -6364 -3615 -2695 -3547 -3774 -4637 -6290 -4924 -1710 -2739 -6985
1052 -6985 -7111 -3151 -2007 -4626 -6089 -5382 -4399 -3355 -2855 -4744 -6605 -4704 -1581 -2367 -5314 -5478
1068 -5478 -3220 -2157 -2376 -2926 -4094 -4345 -1648 424 -1963 -4878 -2860 868 449 -2401 -2389 -611
1084 -611 71 102 564 -285 -1471 42 2711 2081 -662 -637 2035 3373 2002 643 1007 2346 3364
1101 3364 3144 1830 1435 2739 3969 3617 2712 2445 2819 3731 4636 3920 2211 2522 4901 5493 3279 2258
1119 2258 3980 5295 4165 3481 4163 4078 3538 4427 5311 3979 2522 3755 5677 4837 2706 2764 4468
1136 4468 4888 3783 2922 3126 3643 3785 3507 2977 2519 2586 2904 3066 2592 1527 1219 2260 2827 1403 -215
1155b15P94J533o99j874%R54k49p84J41j24j145K1J266k66k025l91J750N16j753
1174b550j076P75Q57l59p44n41K1O86K84q13p45M57N17k41p1K4p58k39J464N57
1194b495j904j221K095J698j962j669J503J499j155o82J075k14j203J180J787
1209a668j515k166J538K675j140k218O32J827k04n67M92k97o28J229J443j116
1225a683j583J234J846m85p66L90j1NJ582P43k149j021L036J928k447j604K181
1242A196J501j225j6J224r16j147K610J947k892k237L019K709k118j855J421J003
1258D224q02Q32R55k176j340L179K153l096k334K440J954j428p98P44j042m89
1274B976K590R28l924j549M072J944l581j877K347O72j411Q55O33k968r17M304
$$ plain form
1155 -215 579 2112 1413 -461 -461 493 244 -540 -399 -523 -1668 -1647 -381 -647 -2672 -3063 -1313 -797 -2550
1174 -2550 -3626 -2851 -1994 -2353 -3097 -3638 -3617 -2931 -2647 -3460 -4205 -3748 -3231 -3472 -3543 -3519 -4277 -4516 -3052 -2495
1194 -2495 -4399 -5620 -3525 -1827 -3789 -5458 -3955 -2456 -3611 -4293 -3218 -3432 -4635 -3455 -1668
1209 -1668 -3183 -5349 -3811 -1136 -2276 -4494 -3862 -2035 -2239 -2806 -2314 -2611 -3239 -2010 -567 -1683
1225 -1683 -3266 -2032 -186 -671 -1437 -1047 -1058 -1053 529 1272 -877 -1898 1138 3066 619 -985 1196
1242 1196 2697 1472 1456 2680 1764 617 3227 5174 2282 45 3064 5773 3655 1800 3221 4224
1258 4224 3422 4254 5209 3033 1693 4872 7025 3929 1595 4035 5989 4561 3763 4507 3465 2976
1274 2976 5566 6494 2570 1021 5093 7037 3456 1579 3926 4598 3187 4042 4675 1707 790 5094
1290E094J246m935k078M166J872l093j278J510q43p04K696J98m714r23N217J246
1306D677n209j620L744M12k486R45R64l240r48M895O47o072j355N585J128m850
1322b783p08K978j116j833K784O91m930p78N896O30o090r94M814L77l501J000
1338c563J523l026m61M849J60o359j75O378K36n421M76L731j790k014L882R98
1354e76n671l47P139L64p066j03O462j78m714J491L096k879j294M974M81n943
1370d764K4O711J49n766L57M333r60j910K792K43m327J091O194j382o440J659
1386a996O038j678l983K740K095l914M6N873j237o800K152P538k278o665K816
1401G47N479l296l171M387J399n375O39O499j703o768K445O698k765n172L232
$$ plain form
1290 5094 6340 1405 -673 3493 5365 2272 994 2504 1661 957 3653 3851 -863 -1786 3431 4677
1306 4677 -532 -2152 1592 2004 -482 463 1427 -1813 -2761 2134 2781 -3291 -4646 939 2067 -2783
1322 -2783 -3491 -513 -1629 -3462 -678 13 -4917 -5695 201 831 -5259 -6253 -1439 -1062 -4563 -3563
1338 -3563 -2040 -5066 -5527 -678 -518 -6877 -7052 -674 -438 -5859 -5383 -1652 -3442 -5456 -1574 -576
1354 -576 -6247 -6594 545 909 -6157 -6260 202 24 -4690 -3199 -103 -2982 -4276 698 1179 -4764
1370 -4764 -4740 1971 2120 -3646 -3289 1044 84 -1826 966 1209 -3118 -2027 4167 2785 -3655 -1996
1386 -1996 4042 2364 -1619 1121 3216 -698 -652 5221 3984 -2816 -664 6874 4596 -2069 747
1401 747 6226 2930 -241 4146 5545 170 809 7308 5605 -1163 1282 7980 5215 43 3275
1416C275L200l816p65M728j220n699K669O098l478n679L683M225m177k311M633
1431E366o5n447J580N943l287o165L962N289m963m149N052K195n713n47N706j650
1447C107o078K937N527m526n112N054L645n730k289N591rn985J881N635l903n684
1463e939M893M812o005l690O166J733o696R4O619k216o573L505N887m796n130
1478g336N614L390o272j827O314J89o511J470N789k896m996M223L597n289k322
1493f863N885Q21o007P60N668k356m859L989L948n178k794O341J515o609P3O794
1509A128j532o211L096N801m096m531N358L434n766j565O463L70o277J269O251
1524C192k040n039L228M012l659j929M681O57n039J087N487j940m599L024L828
$$ plain form
1416 3275 6475 2659 1894 6622 5402 -297 2372 8470 4992 -687 2996 7221 3044 733 5366
1431 5366 5301 -146 1434 7377 4090 -2075 1887 7176 2213 -1936 3116 5311 -402 -949 4757 3107
1447 3107 -2971 -34 5493 967 -4145 909 4554 -1176 -3465 2126 2117 -3868 -1987 3648 -255 -5939
1463 -5939 -1046 3766 -2239 -5929 237 1970 -4726 -4632 1987 -229 -6802 -3297 2590 -2206 -7336
1478 -7336 -1722 1668 -4604 -6431 -117 72 -6439 -4969 820 -2076 -7072 -2849 748 -4541 -6863
1493 -6863 -978 -157 -6164 -5404 264 -2092 -6951 -2962 986 -4192 -6986 -645 870 -5739 -5666 1128
1509 1128 -404 -6615 -3519 2282 -1814 -6345 -987 2447 -3319 -4884 1579 1949 -4328 -3059 3192
1524 3192 1152 -3887 -659 3353 -306 -2235 2446 3103 -1936 -849 4638 2698 -1901 1123 4951
1539D951l613k037M683N43n138J198N780k389n577L676N196m371m165N112K925
1554F774n494j218N904n19n986K055O054l128n692L785M625l930l146M016J184
1569E284m254O43M420k286m563L196M109l624l365L629J652l867K04L766k098
1584B846m240L528M033m625l895M778K836n038j897M771k6m896J512M509l226
1599I70m831L934M367m519m179M107K786l951j516L147m34l324J752L011k998
1614a678l219L106K441l139j591K284L3k211J502J803l044j947L762J793m218
1629d323j430L904N49l449O06K943j866k665L093K609l937k406M286K134l859
1644c811j483L388N31k539O96K324j760j861K551K014k676j453K359R90j397K05
$$ plain form
1539 4951 1338 -699 3984 4527 -611 587 6367 3978 -1599 2077 7273 2902 -1263 3849 6774
1554 6774 1280 62 5966 5447 -539 1516 7570 4442 -1250 2535 7160 3230 84 4100 5284
1569 5284 1030 1673 6093 3807 -756 2440 6549 2925 -440 3189 4841 974 1178 4944 2846
1584 2846 -1394 2134 6167 1542 -2353 2425 5261 223 -1674 3097 3071 -1825 -313 4196 970
1599 970 -3861 73 4440 -79 -4258 -151 2635 -1316 -2832 315 -119 -3443 -1691 1320 -1678
1614 -1678 -4897 -1791 650 -2489 -4080 -1796 -1763 -3974 -2472 -669 -3713 -5660 -1898 -105 -4323
1629 -4323 -5753 -1849 -1300 -4749 -4143 -1200 -3066 -5731 -2638 -29 -3966 -6372 -2086 48 -3811
1644 -3811 -5294 -1906 -1375 -3914 -3218 -894 -2654 -4515 -1964 50 -2626 -4079 -1720 -730 -2127 -1922
1660a922R14j255k69K584L69l272L9L522J48l006O09K521j279j479K511J402l434
1677a297q62M246J168m146r78M060R45k995n4K385o73j447J977J291k505j014
1693A01K892J414k454j049J857P56p56K84P1j166M55K172n14k482M75K373m72
1710C957j764Q19R65j410k99K144k07k948K68L204k11l375j22K837k09k135K93
1727A807J118r77p70J408K40k010n05J921K40j618n57P78L6k07J05n78r17P15
1745B29J142j096j459P50J039q72p26P63j08j321N32J442j026j975R06J943r85
1762h22k002O63J473q09j011O35M36j072j36J114j92j403J45J048k8r23r5K68
1780b711J7K01K09q23l65J053N47j139m64R74L86p69n4Q42m26o32R62Q22j102
$$ plain form
1660 -1922 -1008 -2263 -2532 52 421 -2851 -2812 710 858 -2148 -1539 982 -297 -1776 735 2137 -1297
1677 -1297 -2159 2087 3255 -891 -1869 2191 3136 141 87 2472 1799 352 2329 3620 1115 101
1693 101 2993 4407 1953 904 2761 3517 2761 3045 3116 1950 2405 4577 4063 1581 2056 4429 3957
1710 3957 2193 3012 3977 2567 2268 4412 4205 1257 1525 4729 4518 1143 1021 3858 3649 1514 1807
1727 1807 2925 1948 1178 2586 2826 816 311 2232 2472 854 297 1075 1111 904 1009 431 -486 229
1745 229 1371 275 -1184 -434 605 -267 -993 -230 -338 -1659 -1127 315 -711 -2686 -1780 163 -822
1762 -822 -2824 -2161 -688 -1497 -2508 -1873 -1437 -2509 -2645 -1531 -1723 -3126 -2981 -1933 -1961 -2884 -2979 -2711
1780 -2711 -2694 -2493 -2284 -3107 -3472 -2419 -1872 -3011 -3475 -2501 -2115 -2884 -2938 -2096 -2522 -3154 -2192 -1370 -2472
1799b472p84J269J229j123q79J150P99o51k71Q05l5m97O28Q33n52o64Q15Q89m31
1818E8m76L79L48K13K49n5n36L01J036P9j005Q3J036J23n71J49L67l02O8P84m0
1839B288r87N4J345J44j075j77Q69J85l33Q3O9m57K68R44l17j103J73J064L5q37
1859B235j9L03j89J69M87m93r88O26J156n76j235J86R23k03n40J00j62n44M04
1878A640P54p92j154M10J062m57j033J25J46k86K18J81r91p34R65R14j339j208
1896a579Q80P27q24n18M27l86o68O68P99j232j278J055J307j053j286O03O11l87
1914b134j40K58o20n25J053O96j140j042J047P68o94l02K86k15k56J046K00j465
1932c179m12J785N40j609l70J367J20r56N08P92j022o25J609Q81j873p63J851
$$ plain form
1799 -2472 -3256 -1987 -758 -1881 -2760 -1610 -811 -1462 -1733 -928 -963 -1460 -832 1 -551 -1215 -400 489 58
1818 58 -418 -39 309 522 771 716 180 481 1517 1596 591 674 1710 1833 1262 1411 1778 1476 1544 2328 2288
1839 2288 1301 1355 2700 2844 1769 1592 2461 2646 2313 2396 2465 2008 2276 3220 2903 1800 1973 3037 3072 2235
1859 2235 2216 2519 2330 2499 2986 2493 1505 2131 3287 2711 1476 1662 2585 2382 1842 1942 1780 1236 1640
1878 1640 2394 1602 448 858 1920 1463 430 555 701 415 633 814 -177 -911 54 968 -371 -1579
1896 -1579 -699 28 -796 -1314 -887 -1273 -1941 -1273 -474 -1706 -2984 -1929 -622 -1675 -2961 -2358 -1747 -2134
1914 -2134 -2274 -2016 -2636 -3161 -2108 -1412 -2552 -3594 -2547 -1779 -2473 -2775 -2489 -2704 -2960 -1914 -1714 -3179
1932 -3179 -3591 -1806 -1266 -2875 -3245 -1878 -1758 -2714 -2206 -1414 -2436 -3061 -1452 -571 -2444 -3207 -1356
1949a356Q60j368m80J144J48o87P18O64j034m72J522P08j331l28J168K68o14O22
1967A52M86r30j28J746J49j604Q1J834o9j300O08J170q97o16J584N65j852j54
1985H25K197J97j970J6J948l38j449Q40J087j240n98J616M28j909k59J819J57
2002C367j638K59J095p44p04J157K53j609j19J737k18j826M48J344q70j060J079
2019A951M91j639j83J841m29k018N16J811r56j764J134J203j552j005J714K26
2035A341k075Q0K083p17k098P17J686j259j423J343P48j821m23J797j42j996K23
2052a936J738q26j603J120J047j696p69J673K64j899L6J642o06j656J035J222
2068a214j504r70J750O35k044k06J968j41j907P48J585j065j344J551J127j807
$$ plain form
1949 -1356 -496 -1864 -2344 -1200 -1052 -1739 -1021 -357 -1391 -1863 -341 367 -964 -1292 -124 144 -470 152
1967 152 638 -292 -420 1326 1475 -129 -48 1786 1717 417 1025 2195 1298 682 2266 2831 979 825
1985 825 3022 3219 1249 1265 3213 2875 1426 2266 3353 2113 1515 3131 3559 1650 1391 3210 3367
2002 3367 1729 1988 3083 2339 1635 2792 3045 1436 1317 3054 2836 1010 1458 2802 1932 872 1951
2019 1951 2442 803 620 2461 2032 14 530 2341 1385 -379 755 1958 406 -599 1115 1341
2035 1341 -734 -654 1429 712 -1386 -669 1017 -242 -1665 -322 426 -1395 -1818 -21 -163 -2159 -1936
2052 -1936 -198 -1024 -2627 -1507 -460 -2156 -2925 -1252 -988 -2887 -2851 -1209 -1815 -3471 -2436 -1214
2068 -1214 -2718 -3688 -1938 -1303 -3347 -3553 -1585 -1726 -3633 -2885 -1300 -2365 -3709 -2158 -1031 -2838
2084b838n72J992L08j946K04J966m86j423R32J336j321p13J840N29j797j95K086
2101i8J01j736O34J318q75p19J542N02j712r4J989O0j776M70J596p07j001J395
2119H89O59j625k09K115l8j998M86K036o01j658J081J342j327n90J834J17k016
2136D97L99K388n74k214P96J907q94j247J289O59j747j9K233k97k398M52K251
2153C481o83j766Q40J097j333n22J756k28k057L03K193o81k222P93J717j263j312
2170A13J309N19j857j33K125o39k474O80K209r14k190R00J301j287p63J531k01
2187B29k173M51K426p96k607O56J973p30j380P60N41j430L5J746m90k155N21K059
2205c64o97j757P11R87q59l69J084k45j577P06J814r29j951R47J679r44j089Q36
$$ plain form
2084 -2838 -3410 -1418 -1110 -3056 -2852 -886 -1372 -2795 -1863 -527 -1848 -2561 -721 -192 -1989 -2184 -98
2101 -98 3 -1733 -1099 219 -656 -1375 167 669 -1043 -1137 852 912 -864 -394 1202 495 -506 889
2119 889 1548 -77 -286 1829 1791 -207 279 2315 1714 56 1137 2479 1152 562 2396 2513 497
2136 497 896 3284 2710 496 1292 3199 2305 1058 2347 3006 1259 1240 3473 3176 778 1230 3481
2153 3481 2798 1032 1872 2969 1636 1114 2870 2642 585 888 3081 2400 178 971 2688 1425 113
2170 113 1422 1941 84 -49 2076 1437 -1037 -357 1852 938 -1252 -352 949 -338 -1101 430 229
2187 229 -1944 -1493 933 137 -2470 -1814 159 -571 -1951 -1191 -650 -2080 -2045 -299 -789 -2944 -2423 -364
2205 -364 -1061 -2818 -2107 -1120 -1979 -2348 -1264 -1509 -3086 -2380 -566 -1495 -3446 -2499 -820 -1764 -2853 -2017
2223b017L19r31M75J262j009j651J325J871j117j692J039J091q19r1R40m82j287
2240b774J244J676j361j540J310J581j012q78J117K95r59O74J337j147j229J597
2256f9J631j537j289J590J099j197j89J257m90j033J260J417j539j396J776J531
2272B822j511q46J263K52r33N46J124j125j349J711J426j651j336J570R58j270
2288A651k32J071m32j086J005J120j391j262J615J027j440q87J285K28j031K95
2304A536Q68r48j031J448Q68j634r74J438P34j203n13R44m32p28Q57O50j418r32
2322d70J437P45j480o97R83J53r11K35O64r57p86J094O50j514p11J143M40j184
2340a166k38O07k75o27O16K60j095l88J311J49j371k10J064j75p92M63L38p47
$$ plain form
2223 -2017 -1698 -2629 -2154 -892 -1901 -3552 -2227 -356 -1473 -3165 -2126 -1035 -1854 -1945 -1005 -1487 -2774
2240 -2774 -1530 146 -1215 -2755 -1445 136 -876 -1754 -637 -342 -1301 -627 710 -437 -1666 -69
2256 -69 1562 25 -1264 326 1425 228 39 1296 806 -227 1033 2450 911 -485 1291 2822
2272 2822 1311 465 1728 1980 1047 1593 2717 1592 243 1954 3380 1729 393 1963 2921 1651
2288 1651 1419 2490 2058 972 1977 3097 1706 444 2059 3086 1646 759 2044 2272 1241 1536
2304 1536 2404 1456 425 1873 2741 1107 133 1571 2305 1102 589 1533 1101 373 1230 1880 462 -470
2322 -470 967 1712 232 -465 518 671 -240 -5 659 -298 -1084 10 660 -854 -1565 -422 18 -1166
2340 -1166 -1404 -797 -1072 -1699 -1083 -823 -1918 -2306 -995 -846 -2217 -2427 -1363 -1538 -2330 -1867 -1529 -2276
2358b276m76J219K42j463j34J435L0j240J80R05l55o99Q46M91j064l31J362K20
2376a108j195q7J161J6q15L00P56n51k91Q69J64q64J49J048k10q26M13P70m56
2395g57l84P83K51q46J38J203j27j210L90J306l78r29N86R47o07n67R82L81q76
2414B86LR91K4q96L25R15k60o52M58N67l18k66N05Pl92M18M01m00l94O10K67n93
2436A606mN98j84o28N01O76q48o63R20P02j084o75J072M20j083k97R46j04r28
2455I43J17R38n35j014M62Q20n40r09L88M12k94k77Pq7j58J82L1m66j84L69p3
2476A32l33J32pn57n1P42j31j097OJ064p4j167o2R62j76r62M48O36p64o86R13
2497a032N65j120o89Q83O82q91o11O40K70m28m2J86k79k60L67L37l60k78J21J53
$$ plain form
2358 -2276 -2752 -1533 -1291 -2754 -2888 -1453 -1423 -2663 -2483 -1578 -1933 -2632 -1786 -1295 -2359 -2690 -1328 -1108
2376 -1108 -2303 -2390 -1229 -1213 -2028 -1728 -972 -1523 -1814 -945 -781 -1645 -1496 -448 -658 -1484 -1071 -301 -757
2395 -757 -1141 -358 -107 -953 -815 388 261 -949 -559 747 369 -560 26 973 366 -201 781 1162 286
2414 286 289 1280 1304 408 733 1648 1388 736 1194 1761 1443 1177 1682 1689 1297 1715 2116 1716 1322 1932 2199 1606
2436 1606 1602 2200 2016 1388 1889 2565 1717 1054 1974 2676 1592 917 1989 2409 1326 1029 1975 1871 943
2455 943 1060 1998 1463 449 911 1731 1191 282 670 1082 788 511 518 431 273 455 486 20 -164 205 132
2476 132 -201 -69 -76 -633 -684 58 -73 -1170 -1164 -100 -174 -1341 -1403 -441 -617 -1579 -1131 -495 -1259 -1945 -1032
2497 -1032 -467 -1587 -2276 -1393 -711 -1602 -2213 -1573 -1303 -1731 -1773 -1587 -1866 -2126 -1759 -1422 -1782 -2060 -1939 -1786
2517a786lJ65j96m66M38O63l90o93L54Q66k91n26L94M33m76j5Q31L4r91J56J262
$$ plain form
2517 -1786 -1789 -1624 -1820 -2286 -1848 -1185 -1575 -2268 -1914 -1048 -1339 -1865 -1471 -1038 -1514 -1529 -698 -664 -1655 -1499 -237
$$ [...]
8191e0
##END NTUPLES=NMR FID
##END=
