##TITLE=1H_B 2705-2
 CDCl3, 8 sc, 
 28.5.2019
##JCAMPDX= 6.0         $$ Bruker NMR JCAMP-DX V2.0
##DATA TYPE= NMR FID
##DATA CLASS= NTUPLES
##ORIGIN= UXNMR, Bruker Analytische Messtechnik GmbH
##OWNER= root
$$ XWIN-NMR		Version 3.5
$$ Tue May 28 14:42:19 2019 Russian Standard Time (UT+4h)  she@DPX200
##.OBSERVE FREQUENCY= 200.1315
##.OBSERVE NUCLEUS= ^1H
##.DELAY= (6, 6)
##.ACQUISITION MODE= SIMULTANEOUS
##.ACQUISITION SCHEME= undefined
##.AVERAGES= 8
##.DIGITISER RES= 18
##SPECTROMETER/DATA SYSTEM= spect
##.PULSE SEQUENCE= zg30
##.SOLVENT NAME= CDCl3
##.SHIFT REFERENCE= (INTERNAL, CDCl3, 0, 15.7039)
##AUDIT TRAIL= $$ (NUMBER, WHEN, WHO, WHERE, WHAT)
$$ ##TITLE= Audit trail, XWIN-NMR		Version 3.5
$$ ##JCAMPDX= 5.01
$$ ##ORIGIN= Bruker BioSpin GmbH
$$ ##OWNER= she
$$ F:/spectra/data/she/nmr/H-F/1/audita.txt
$$ ##AUDIT TRAIL=  $$ (NUMBER, WHEN, WHO, WHERE, WHAT)
(   1,<2019-05-28 14:41:20.95 +0400>,<she>,<DPX200>,
      <created by zg, POWCHK disabled, PULCHK disabled
       configuration hash MD5:
       00 E9 B6 7A A2 85 ED C7 34 08 36 98 17 FE 4E 26
       data hash MD5: 16K
       F4 B9 A1 17 C9 55 FB 21 F3 F6 C5 69 F7 89 5D F3>)
$$ ##END=
$$ 
$$ hash MD5
$$ 64 83 8F B4 9C E5 C0 6E 28 A7 6D D3 DD AC 65 F4
##$RELAX= 
##$RELAX= 
##$RELAX= 
##$RELAX= 
##$RELAX= 
##$RELAX= 
$$ Bruker specific parameters
$$ --------------------------
##$DU= <F:/spectra>
##$EXPNO= 1
##$NAME= <H-F>
##$PROCNO= 1
##$TYPE= <nmr>
##$USER= <she>
##$AMP= (0..31)
100 100 100 100 100 100 100 100 100 100 100 100 100 100 100 100 100 100 
100 100 100 100 100 100 100 100 100 100 100 100 100 100 
##$AQSEQ= 0
##$AQ_mod= 1
##$AUNM= <au_zg>
##$AUTOPOS= <>
##$BF1= 200.13
##$BF2= 200.13
##$BF3= 200.13
##$BF4= 200.13
##$BF5= 200.13
##$BF6= 200.13
##$BF7= 200.13
##$BF8= 200.13
##$BYTORDA= 1
##$CFDGTYP= 0
##$CFRGTYP= 5
##$CHEMSTR= <none>
##$CNST= (0..31)
1 1 145 1 1 1 1 1 1 1 1 1 1 1 1 1 1 1 1 1 1 1 1 1 1 1 1 1 1 1 1 1 
##$CPDPRG= <>
##$CPDPRG1= <>
##$CPDPRG2= <>
##$CPDPRG3= <>
##$CPDPRG4= <mlev>
##$CPDPRG5= <mlev>
##$CPDPRG6= <mlev>
##$CPDPRG7= <mlev>
##$CPDPRG8= <mlev>
##$CPDPRGB= <>
##$CPDPRGT= <>
##$D= (0..31)
0 1.2 0 0 0 0 0 0 0 0 0 0.03 0 0 0 0 0 0 0 0 0 0 0 0 0 0 0 0 0 0 0 0 
##$DATE= 1559040080
##$DBL= (0..7)
120 120 120 120 120 120 120 120 
##$DBP= (0..7)
150 150 150 150 150 150 150 150 
##$DBP07= 0
##$DBPNAM0= <>
##$DBPNAM1= <>
##$DBPNAM2= <>
##$DBPNAM3= <>
##$DBPNAM4= <>
##$DBPNAM5= <>
##$DBPNAM6= <>
##$DBPNAM7= <>
##$DBPOAL= (0..7)
0.5 0.5 0.5 0.5 0.5 0.5 0.5 0.5 
##$DBPOFFS= (0..7)
0 0 0 0 0 0 0 0 
##$DE= 6
##$DECBNUC= <off>
##$DECIM= 24
##$DECNUC= <off>
##$DECSTAT= 4
##$DIGMOD= 1
##$DIGTYP= 9
##$DL= (0..7)
0 120 120 120 120 120 120 120 
##$DP= (0..7)
150 150 150 150 150 150 150 150 
##$DP07= 0
##$DPNAME0= <>
##$DPNAME1= <>
##$DPNAME2= <>
##$DPNAME3= <>
##$DPNAME4= <>
##$DPNAME5= <>
##$DPNAME6= <>
##$DPNAME7= <>
##$DPOAL= (0..7)
0.5 0.5 0.5 0.5 0.5 0.5 0.5 0.5 
##$DPOFFS= (0..7)
0 0 0 0 0 0 0 0 
##$DQDMODE= 0
##$DR= 18
##$DS= 0
##$DSLIST= <SSSSSSSSSSSSSSS>
##$DSPFIRM= 0
$$ [...]
##$SUBNAM2= <"">
##$SUBNAM3= <"">
##$SUBNAM4= <"">
##$SUBNAM5= <"">
##$SUBNAM6= <"">
##$SUBNAM7= <"">
##$SUBNAM8= <"">
##$SUBNAM9= <"">
##$SW= 24.9337058887773
##$SWIBOX= (0..15)
0 0 2 0 0 0 0 0 0 0 0 0 0 0 0 0 
##$SW_h= 4990.01996007984
##$TD= 16384
##$TD0= 1
##$TE= 0
##$TE2= 300
##$TE3= 300
##$TEG= 300
##$TL= (0..7)
0 120 120 120 120 120 120 120 
##$TP= (0..7)
150 150 150 150 150 150 150 150 
##$TP07= 0
##$TPNAME0= <>
##$TPNAME1= <>
##$TPNAME2= <>
##$TPNAME3= <>
##$TPNAME4= <>
##$TPNAME5= <>
##$TPNAME6= <>
##$TPNAME7= <>
##$TPOAL= (0..7)
0.5 0.5 0.5 0.5 0.5 0.5 0.5 0.5 
##$TPOFFS= (0..7)
0 0 0 0 0 0 0 0 
##$TUNHIN= 0
##$TUNHOUT= 0
##$TUNXOUT= 0
##$USERA1= <user>
##$USERA2= <user>
##$USERA3= <user>
##$USERA4= <user>
##$USERA5= <user>
##$V9= 5
##$VALIST= <valist>
##$VCLIST= <CCCCCCCCCCCCCCC>
##$VD= 0
##$VDLIST= <DDDDDDDDDDDDDDD>
##$VPLIST= <PPPPPPPPPPPPPPP>
##$VTLIST= <TTTTTTTTTTTTTTT>
##$WBST= 1024
##$WBSW= 4
##$XGAIN= (0..3)
0 0 0 0 
##$XL= 0
##$YL= 0
##$YMAX_a= 424039
##$YMIN_a= -372867
##$ZGOPTNS= <>
##$ZL1= 120
##$ZL2= 120
##$ZL3= 120
##$ZL4= 120
##$ABSF1= 10
##$ABSF2= 0
##$ABSG= 5
##$ABSL= 3
##$ALPHA= 0
##$AQORDER= 0
##$ASSFAC= 0
##$ASSFACI= 0
##$ASSFACX= 0
##$ASSWID= 0
##$AUNMP= <proc_1d>
##$AZFE= 0.1
##$AZFW= 0.1
##$BCFW= 1
##$BC_mod= 2
##$BYTORDP= 1
##$COROFFS= 0
##$CY= 11.3945322036743
##$DATMOD= 1
##$DC= 2
##$DFILT= <>
##$DTYPP= 0
##$F1P= 18.9103706918063
##$F2P= -1.10871071338519
##$FCOR= 0.5
##$FTSIZE= 0
##$FT_mod= 4
##$GAMMA= 1
##$GB= 0.15
##$INTBC= 1
##$INTSCL= 1
##$ISEN= 128
##$LB= 0.24
##$LEV0= 0
##$LPBIN= 0
##$MAXI= 10000
##$MC2= 0
##$MEAN= 0
##$ME_mod= 0
##$MI= 1.114404
##$NCOEF= 0
##$NC_proc= 0
##$NLEV= 6
##$NOISF1= 3.799351
##$NOISF2= 2.8
##$NSP= 1
##$NTH_PI= 0
##$NZP= 0
##$OFFSET= 15.70392
##$PC= 1
##$PHC0= -9017.105
##$PHC1= 15.80025
##$PH_mod= 1
##$PKNL= yes
##$PPARMOD= 0
##$PSCAL= 0
##$PSIGN= 0
##$REVERSE= no
##$SF= 200.130013532006
##$SI= 16384
##$SIGF1= 3
##$SIGF2= 2
##$SINO= 400
##$SIOLD= 16384
##$SREGLST= <1H.CDCl3>
##$SSB= 0
##$STSI= 0
##$STSR= 0
##$SW_p= 3612.71676300578
##$SYMM= 0
##$S_DEV= 0
##$TDeff= 0
##$TDoff= 0
##$TI= <>
##$TILT= no
##$TM1= 0
##$TM2= 0
##$TOPLEV= 0
##$USERP1= <user>
##$USERP2= <user>
##$USERP3= <user>
##$USERP4= <user>
##$USERP5= <user>
##$WDW= 1
##$XDIM= 8192
##$YMAX_p= 0
##$YMIN_p= 0
$$ End of Bruker specific parameters
$$ ---------------------------------
##NTUPLES= NMR FID
##VAR_NAME=  TIME,          FID/REAL,        FID/IMAG
##SYMBOL=    X,             R,               I
##VAR_TYPE=  INDEPENDENT,   DEPENDENT,       DEPENDENT
##VAR_FORM=  AFFN,          ASDF,            ASDF
##VAR_DIM=   8192,          8192,            8192
##UNITS=     SECONDS,       ARBITRARY UNITS, ARBITRARY UNITS
##FACTOR=    0.0002004,     1,               1
##FIRST=     0,             0,               0
##LAST=      1.6414764,     0,               0
##MIN=       0,             -372867,         0
##MAX=       1.6414764,     424039,          0
$$ Real data points
##PAGE= N=1
##DATA TABLE= (X++(R..R)), XYDATA
0@%%%%qJ6j6J6k4L2m0N6p2Q8j04J25j54J82k10K49k97L46m02M67n39O18p06Q06
28D29r15J036j169J313j472J648j844K059k290K543k823L130l467L840m253M709
44B474n214N780o419P141p964Q918j0037J1368j2983J4990j7571K1028k5921L3438
58A9028m6574P5983k50234P0166N19007l62341l89304K11727L69791k17305k39663
69b39719K01636K00295k62649j60383K70578J99778k60344k12986J74864K20537
79A31607q0239j56932j8048P3034O4525L2933p4303r7214N4191J28932m5404j15691
91a02609O4531J01844j16696r8250J80991J28980k32318j74369K52214K20693
101B25011k41010k42052K13440K35437j88329k05061J78314J69281j82501j39500
$$ plain form
0 0 0 0 0 0 -8 8 -8 8 -16 16 -24 32 -40 48 -56 69 -85 97 -113 136 -161 185 -217 250 -289 329 -377 429
28 429 -486 550 -619 694 -778 870 -974 1085 -1205 1338 -1485 1645 -1822 2018 -2235 2474
44 2474 -2740 3040 -3379 3762 -4202 4716 -5321 6047 -6936 8054 -9517 11511 -14410 19028
58 19028 -27546 48437 -201797 -131631 387376 25035 -364269 -152542 217249 -56 -239719
69 -239719 -38083 162212 -100437 -260820 9758 209536 -50808 -263794 -88930 131607
79 131607 51368 -105564 -123612 -50578 13947 46880 -27423 -124637 -70446 58486 13082 -102609
91 -102609 -38078 63766 -52930 -151180 29811 158791 -73527 -247896 4318 225011
101 225011 -15999 -258051 -44611 190826 2497 -202564 -24250 145031 -37470 -176970
111a76970J92002J22307j93679j11064J83554J00129j60957q0845J34331N5056
121F3864j06607k4741Q2178m312n6931L4035L3368o2686r723R3834o647j20530
133h4898J7515J41171k1145j46726K8624J42661m2643j31434O9459J27581r8823
144A342j32422J23927J48171j30320j60130J20273J59705r7666j35596Q1224R6186
155G4694p8740n1347R6173K0011j20775p419J39231J2580j36484j9026J12776
166D1674J2952p7164J4500M7888n7177l6820J01104M7218j28283o7272J31852
177C0472Q1822j14705p6313R3246N0733q0751j3295Q7726j8150j08131L2661J30256
189I5571k6495j37614R714J24759M638r3207l161N6958j4669k8066M2811J6261
$$ plain form
111 -176970 15032 137339 -56340 -167404 16150 116279 -44678 -125523 8808 63864
121 63864 -42743 -67484 14694 10382 -46549 -12514 20854 -41832 -51555 42279 35632 -84898
133 -84898 -67383 73788 52643 -94083 -65459 77202 34559 -96875 -27416 100165 1342
144 1342 -131080 -7153 141018 10698 -149432 -29159 130546 32880 -102716 -21492 74694
155 74694 -4046 -55393 40780 60791 -59984 -67403 71828 84408 -52076 -71102 41674
166 41674 54626 -22538 -8038 39850 -17327 -54147 46957 94175 -34108 -101380 30472
177 30472 112294 -2411 -78724 14522 65255 -15496 -28791 58935 40785 -67346 -34685 95571
189 95571 69076 -68538 -58824 65935 70573 -22634 -25795 31163 16494 -11572 31239 47500
201D7500o6622j7302P7806K3507p0875k1862N3848P287l5958J9756K7629m9904
213e190l0684P3797M1411q5214n1283Q4072N2067p6950m1915P1258K3405p2507
225a7733l771Q0274j1010r1052J7490R7930j7771r7465J5785Q8419j7326p4875
237c1105K3347O0090l4579m9193M6219M2331n5571l9014N9379L5517n8492l0218
249c1289N4226K1355m9391r849M5778k156m3961J2883M3166k0909m2465K6008
261C396M0187k9198l6078L0546K9787l2385k3059L3794J5277l6208q888L7720
273B4891L029l9511M94L9113l712l7772N098L3756p600k9096R667K2605j3734
286G228j8225J6508J3548k0113j1562K0265Q775j9911o897J6370K331j3461K118
$$ plain form
201 47500 -19122 -36424 41382 64889 -5986 -27848 26000 33287 -2671 17085 44714 -5190
213 -5190 -35874 37923 79334 -5880 -57163 26909 78976 2026 -39889 31369 54774 -17733
225 -17733 -21504 58770 47760 -43292 -25802 72128 54357 -43108 -27323 61096 43770 -31105
237 -31105 -7758 52332 17753 -31440 14779 57110 1539 -37475 21904 57421 -1071 -31289
249 -31289 22937 44292 -5099 -14948 30830 28674 -15287 -2404 40762 19853 -22612 3396
261 3396 43583 14385 -21693 8853 38640 6255 -16804 16990 32267 -3941 -12829 24891
273 24891 27920 -11591 -11097 28016 24304 -13468 -8370 25386 17786 -11310 -1643 20962 7228
286 7228 -10997 5511 19059 -1054 -12616 7649 16424 -3487 -10384 5986 8317 -5144 -3026
299c026J0313q042r062J2423Q443j5622q268J6523O572j6318l717J5980l86j6561
313a0748M440J7793p633j9526R429K0191j0198j9739J0795J8150j1865j6117J3267
326a761J4346j4939j3420J6083J2597j6322j1914J5703J0193j5388q612J4826
338A392O338j5015n469J4475M315j4121m523J1896K974j0391j765Q076j007q203
352a1028K806Q046m281r353L375R252k398q182J085N783j219l394K653K089m912
367i678k198O512M043o288n758M974O700k419n860J019M463j91k435J436K607
382c073k269l133L332N207k047o222R12P187J298n925j810N217J879m470p49N127
398D61J85n994j30P295Q90p850j821P579K055o968j642O612J015p151m06Q012
$$ plain form
299 -3026 7287 -755 -9817 2606 11049 -4573 -12841 3682 10254 -6064 -9781 6199 5813 -10748
313 -10748 -6308 11485 3852 -15674 -6245 13946 3748 -15991 -5196 12954 1089 -15028 -1761
326 -1761 12585 -2354 -15774 309 12906 -3416 -15330 373 10566 -4822 -13434 1392
338 1392 7730 -7285 -12754 1721 6036 -8085 -12608 -712 2262 -8129 -9894 -1818 -2825 -11028
352 -11028 -8222 -176 -4457 -13810 -10435 -1183 -3581 -11763 -10678 -4895 -6114 -9508 -6855 -4766 -9678
367 -9678 -11876 -5364 -1321 -7609 -13367 -8393 -1693 -4112 -9972 -8953 -4490 -4681 -7116 -5680 -3073
382 -3073 -5342 -8475 -5143 64 -1983 -8205 -7293 -106 1192 -4733 -6543 -1326 553 -3917 -4666 461
398 461 646 -5348 -5478 1817 2707 -5143 -6964 615 2670 -4298 -5940 672 1687 -5464 -5870 2142
414B142N69q498j560Q456K444p269k301N916J368n065K64N416j439o347J660P724
430C480k13p701j280O512K840m023k150J967J054l71J520J187k477k371K793M110
446D877n46m035j200L200K923o08k641j329J541K245M31j274j591o39J480K617
462E451L23l872k600L598M365k392m968J058M284p13k946J232J693l135j556N197
478E019K242o920l759P457M973p394n581O703M904o187l649O730K015p802q72
493b121R622M24j0921m89J1917J108j1732r42J1239M17j0386J002J0177k617j0040
508c342M257J0497n117j0786N612J0759n872j0073O030R088o454p962O773O761
522A0171p341n722P319M290p314k906P093J007p519K79P580j647p890J882P065
$$ plain form
414 2142 2711 -5787 -7347 1109 3553 -3716 -6017 -101 1267 -3798 -3534 1882 443 -5904 -4244 3480
430 3480 3267 -4434 -5714 798 3638 -385 -2535 -568 486 115 1635 2822 345 -2026 767 4877
446 4877 4331 296 -904 2296 5219 4611 1970 641 2182 4427 4858 3584 1993 1354 2834 5451
462 5451 5774 1902 -698 2900 7265 4873 -95 963 5247 4534 1588 2820 4513 1378 -178 5019
478 5019 7261 341 -3418 4039 9012 1618 -3963 2740 7644 1457 -2192 4538 6553 -1249 -2121
493 -2121 7501 7925 -2996 -3485 8432 9540 -2192 -3134 8105 8522 -1864 -862 9315 6698 -3342
508 -3342 915 11412 6295 -4491 1121 11880 6008 -4065 1965 11053 4599 -3363 3410 10171
522 10171 2830 -2892 4427 8717 1403 -1503 5590 6597 -922 -643 6937 5290 -2600 -718 6347
537F347k153n972K243L878l560k104N133M39o860l89P737O62p323r61N348o1k958
554e54K418R29n758k22Q624R18j0183j874R633J652p943M66O331m520o238Q992
570B671Q090j2594j1454J3667J4042j2596j4807J0482J2366r424q561J0247M130
583F259j3722k054J7537J968k0393m323J9995N925j7195o081J2287K851q417K177
597c186O652p705p559J1166R300j1872j0269J0207Q870q004m412P329j218q961
611i662O424J2610q929j6443R306J8710p580j8009O397J5166o548j1137R192Q335
625G832j2439o967J5463P836j6294q631J4824Q458j1713o063Q488J996o702K686
639a226O081o786o910Q575P147r419o368R187L628r882n65J0874k907j3282M868
$$ plain form
537 6347 4194 -1778 465 4343 783 -1321 3812 4251 -2609 -2998 4739 5401 -1922 -2883 2465 2404 -554
554 -554 1864 2793 -2965 -3187 5437 6355 -3828 -5702 3931 5583 -2360 -1894 4437 -83 -6321 2671
570 2671 10761 -1833 -13287 380 14422 1826 -12981 -2499 9867 443 -8118 2129 6259
583 6259 -7463 -9517 8020 9988 -10405 -14728 5267 11192 -6003 -12084 203 3054 -5363 -3186
597 -3186 3466 -4239 -11798 -632 8668 -3204 -13473 -3266 5604 -2400 -6812 517 -701 -9662
611 -9662 -3238 9372 443 -16000 -6694 12016 4436 -13573 -7176 7990 1442 -9695 -503 7832
625 7832 -4607 -11574 3889 11725 -4569 -13200 1624 10082 -1631 -7694 794 2790 -3912 -1226
639 -1226 4855 -1931 -8841 -266 6881 -2538 -8906 281 3909 -5973 -6538 4336 1429 -11853 -6985
654f985J5012o297j6393O644J5872p650j5000Q361J3290j0047j2038J1125J0437
667F331j1725q692J1566N887j1374k124J1698j692j2602N316J3945p570j4486
680a5522R320J3707j0754j1319J3670Q872j7518o856K2531O807k6276q059K8275
693F878R912k7328r993K5234Q062k2944m399K2449O51k3691J021K5389j57k5652
707a4568k640K2353N206j6428n948R112L534l136L58o0m000N08M784k26k559J458
723b252j939n760N967J2389p531j9726N831K4790k521k6303J11K4818j05k2177
737a4408L503K1171p810k2378J1893K5491j2710k7788J1498K8209q726k5219P313
750i961K0394q030j5315J0919J2208j3695j1034J5105J0904j3916r603J1121O497
$$ plain form
654 -6985 8027 1730 -14663 -8019 7853 203 -14797 -6436 6854 -3193 -15231 -4106 6331
667 6331 -5394 -14086 -2520 3367 -8007 -10131 1567 -125 -12727 -7411 6534 -1036 -15522
680 -15522 -6202 7505 -3249 -14568 -898 7974 -9544 -16400 6131 12938 -13338 -21397 6878
693 6878 16790 -10538 -20531 4703 12765 -10179 -14578 7871 8522 -15169 -14148 11241 11084 -14568
707 -14568 -17208 5145 10351 -6077 -12025 -2913 621 -2515 -2157 -2217 -6217 -5709 -925 -1151 -3710 -2252
723 -2252 -4191 -9951 -3984 8405 874 -18852 -13021 11769 9248 -17055 -16944 7874 7769 -14408
737 -14408 -10905 10266 2456 -19922 -8029 17462 4752 -23036 -11538 16671 7945 -17274 -9961
750 -9961 10433 2403 -12912 -1993 10215 -3480 -14514 591 11495 -2421 -12024 -903 5594
763E594q017j443O458l855o759P909P576r962p997J0241O071j0341k946J1266
777C795j315j3823M156J6548n764j8632N935J8724o347j7221P792J4688j0663
790b127j3214J4204J2760j6901j3380J7899J3479j7323j2278J5969R535j5347
802f724n881J6064K721j7431j073J8792J207j8440j857J6169K280j2506r46Q718
816A093j460o061M167M513o052l856O154K999m978q85L135k556j982O534J840
831B605j0246k427J2693K967j3986k855J4451J653j5177K26J6154k136j7649L303
845a0424J9085l869j9709L912J9186l916j7774M569J6012n503j4056O749J2570
858F832p652j1038Q388R723q301p930Q080O029p530l698P173J406o677R33O435
$$ plain form
763 5594 -2423 -3866 2592 -1263 -8022 -113 7463 -2499 -10496 -255 5816 -4525 -7471 3795
777 3795 2480 -11343 -7187 9361 3597 -15035 -9100 9624 3277 -13944 -6152 8536 -2127
790 -2127 -15341 -1137 11623 -5278 -18658 -759 12720 -4603 -16881 -912 8623 -6724
802 -6724 -12605 3459 6180 -11251 -12324 6468 7675 -10765 -12622 3547 5827 -6679 -7625 1093
816 1093 -367 -6428 -2261 2252 -3800 -7656 -1502 1497 -3481 -4366 -1231 -3787 -5769 765 2605
831 2605 -7641 -10068 2625 5592 -8394 -11249 3202 4855 -10322 -10096 6058 3922 -13727 -10424
845 -10424 8661 4792 -14917 -11005 8181 4265 -13509 -8940 7072 1569 -12487 -5738 6832
858 6832 -820 -11858 -3470 6253 -2048 -9978 -1898 4131 -3399 -7097 76 1482 -5195 -4262 2173
873B173l007o018M855N759o328n296P429M710q025l986Q685K927r064j890R291
888B215Q48r412k46R230k19q796O75P594j218o438J984N191k695m138L535L241
904A351l621k200L497J085k888P61K825k438k677M404L182n497l340O196L546
919D186o295k502O642J575p049K01Q197p19r266J288J0140o11r781N57Q918n56
935D925p543J805O341l249n846M646O180n347o601M908O556l959n698K789M060
950C967k627j798K940K56m151M38M983l62n159n24M322P42k818j25R20j322M5
967b73L010L0m206q11M716J824l859j974K653J631j359P9J168j361j425K570K650
984E063k396l434J787L904k67k886n43J758J101K6l83r25l26J493J282r29j155
$$ plain form
873 2173 -834 -6852 -1997 3762 -2566 -7862 -433 4277 -3748 -7734 951 3878 -5186 -7076 2215
888 2215 3063 -6349 -6595 2635 2416 -6380 -5705 1889 671 -5767 -3783 1408 -1287 -5425 -1890 1351
904 1351 -2270 -4470 -973 112 -2776 -2015 810 -1628 -4305 99 3281 -2216 -5556 640 4186
919 4186 -2109 -4611 2031 3606 -3443 -3242 4955 4236 -5030 -3742 6398 5787 -3994 -3437 5481 4925
935 4925 -2618 -813 5528 2279 -3567 1079 7259 1912 -4689 219 6775 2816 -2882 -93 3967
950 3967 1340 -458 2482 2738 -1413 -975 4008 3646 -1513 -2037 2285 3027 209 84 1004 -318 -273
967 -273 2737 2767 -1439 -2250 2466 4290 431 -1543 1110 2741 1382 1461 2629 1268 -157 2413 5063
984 5063 2667 -767 1020 4924 4657 1771 1228 2986 4087 4113 3730 2805 2479 3972 5254 4325 3170
1001C170M69N37O5M99K76j733j179K477K339k494l423K005L871j474l673R28L050
1018E710j027k198J463J723k266j798L045J928l364k597L223K866k648k961J792
1033B891K488j024j613N87N25n52O98J130j168j946J348K751q38k674J42K133
1049D878N58j082k42q5p44O40K080l29l223q94L453K442k609l422R09L244O29
1066F203k153j456M21Q85O05L61p26j890q58K100K567j311m348q88M308K961l270
1083C511m583J052M172M19k828j076Q88p4L4J757J29l676j678L889L502l102m770
1100b434J203M406M93l008j401Q21O84P86O59j292k284M88K920N45k578j550J315
1117b27J275J53m11j060j423Q17K628L4l568j323L092K122k490k487J433J791
$$ plain form
1001 3170 3639 4176 4241 4740 5016 3283 2104 4581 6920 4426 1003 3008 6879 5405 1732 2660 5710
1018 5710 4683 2485 3948 5671 3405 1607 4652 6580 3216 619 3842 6708 4060 1099 2891
1033 2891 5379 4355 2742 3329 3854 3302 4000 5130 3962 2016 3364 6115 5277 2603 2745 4878
1049 4878 5436 4354 4112 4027 3283 3923 6003 5674 2451 1557 5010 7452 4843 1421 2330 5574 6203
1066 6203 4050 2594 3015 3900 4505 4866 4140 2250 1392 3492 6059 4748 400 -488 3820 6781 3511
1083 3511 -1072 -20 4152 4571 1743 667 1555 1481 1515 3272 3401 -275 -1953 1936 5438 2336 -2434
1100 -2434 -1231 3175 3668 660 -741 80 764 1550 2209 917 -1367 -879 2041 2586 8 -1542 -227
1117 -227 1048 1201 790 -270 -1693 -876 1752 1786 -1782 -3105 -13 2109 -381 -2868 -1435 356
1133C56j052j205Q52L45j409k38J737K20k239p38J953J080j680j509P33J368K3
1150a403j200p37O22J147l35j346p1J301K27j297j54J316k27j404N60J790q27
1167b038k331Q48K901o47l274K76L206J39k880l68K251Q5j594N98P88j488q24
1184d352K286R36l041j480L070J684k817j752K063R62j903J15J998j513k944K265
1200d423M109k585n382J987N818j136n419N11M204n84k835J560K075l030k117
1215g247M553L111m841m165M278M800k477m038J144K396k05N7R84j796k093K646
1231b893L836j964m234R07L735K63j778P7m10j277K108L560k394n360J509O404
1247B089j05n807o31M102M72k463J196J198l144j229N029K118n768l137N271L559
$$ plain form
1133 356 -696 -1901 -1049 -704 -2113 -2351 -614 -394 -2633 -3371 -1418 -338 -2018 -3527 -2794 -1426 -1403
1150 -1403 -2603 -3340 -2718 -1571 -1906 -3252 -3323 -2022 -1795 -3092 -3246 -1930 -2157 -3561 -3001 -1211 -2038
1167 -2038 -4369 -3521 -620 -1267 -4541 -4265 -1059 -920 -3800 -4168 -1917 -1832 -3426 -2828 -2040 -3528 -4352
1184 -4352 -2066 -1130 -4171 -5651 -2581 -897 -3714 -5466 -3403 -2441 -4344 -4229 -2231 -3744 -6688 -4423
1200 -4423 -314 -2899 -8281 -6294 -476 -1612 -7031 -6520 -2316 -2900 -5735 -4175 -2100 -5130 -7247
1215 -7247 -2694 417 -4424 -8589 -4311 489 -1988 -6026 -4882 -2486 -2691 -2634 -1650 -3446 -5539 -2893
1231 -2893 943 -1021 -5255 -4348 -613 -350 -2128 -2051 -2461 -3738 -1630 1930 -464 -5824 -4315 2089
1247 2089 1984 -3823 -4454 -352 120 -2343 -1147 51 -3093 -4322 707 2825 -2943 -6080 -809 2750
1263B750m081k867K856J107k151J354K455l296l575M745M927m813n515M468N572
1278C936l892m201L944K609m378o68N995m33p365J109Q942n88r381R3R232J98
1294E152p630L98O028j654m421M005L791n922m213P558M917p681n237O843M680
1309F614n614k626M555j92m905L137O177n164q209N713R478n070r701L976P845
1324F014l598n190M502K460o883p65R450O66j1510j708J1665K927j0034l014P417
1339B399J291m827J809L460n167l611P739M829q584n729P916N350o324l171N379
1354B759m04n447M091P131o742r451P681J1387p317j1736O313J0308o098p664
1368e189P021M914r492l201J2184K770j4414l622J4818M297j3710m388J1208K672
$$ plain form
1263 2750 -1331 -4198 -1342 -235 -2386 -1032 1423 -1873 -5448 -703 4224 -589 -6104 -1636 3936
1278 3936 44 -4157 -213 2396 -1982 -2650 3345 2912 -4453 -3344 5598 5010 -4371 -4278 4954 5152
1294 5152 -2478 -2080 3948 2294 -2127 1878 5669 -253 -4466 3092 8009 328 -4909 1934 6614
1309 6614 1000 -1626 2929 2737 -2168 969 7146 1982 -6227 -514 8964 3894 -5807 -1831 6014
1324 6014 2416 -2774 1728 4188 -2695 -3460 5990 6656 -4854 -6562 5103 8030 -2004 -5018 2399
1339 2399 3690 -1137 672 4132 -1035 -4646 3093 7922 -662 -6391 1525 6875 551 -2620 2759
1354 2759 2355 -3092 999 8130 1388 -8063 -382 11005 3688 -8048 -1735 8573 2475 -5189
1368 -5189 1832 6746 -2746 -5947 6237 9007 -5407 -9029 5789 10086 -3624 -8012 3196 5868
1382E868r196J64P727l592p871O148Q394p474r301P376Q605o616o750N942L666
1397C090o411l86P634k308r673L668J1202m179j1708M083J0839m409r113N510
1411b161O980p440n275R686M389j1660m300J2682M209j2658l757J1667K469j0644
1425e813m55R550k040r245M113R204n856r487O764Q952o932q113O853O240p184
1440c449m083P568J849q685J8R396j412r970K046R783k875q918L828P381n167
1455b690n861O948M448q903l497J0515K899j1463k132J1785J139j1333K69J0979
1469C103k202j0716M460J0672o214j0948P790J0903q375j0598Q828R683r230p945
1483a0789R551O265j0212m551J0848L180j1347j965J1265Q16j0705L52R952k057
$$ plain form
1382 5868 -3328 -3164 4563 971 -6900 -752 7642 168 -9133 -1757 6848 232 -6518 -576 3090
1397 3090 -3321 -3707 3927 1619 -8054 -4386 6816 2637 -9071 -4988 5851 1442 -7671 -2161
1411 -2161 4819 -2621 -7896 1790 6179 -5481 -9781 2901 7110 -5548 -9305 2362 4831 -5813
1425 -5813 -6268 3282 1242 -8003 -3890 5314 -542 -10029 -3265 5687 -1245 -9358 -2505 3735 -3449
1440 -3449 -7532 36 1885 -6800 -6782 2614 1202 -8768 -6722 3061 186 -8732 -4904 2477 -2690
1455 -2690 -8551 -1603 2845 -6058 -9555 960 3859 -7604 -9736 2049 3188 -8145 -7876 3103
1469 3103 901 -9815 -5355 5317 -897 -11845 -4055 6848 -1527 -12125 -3297 6386 -2844 -10789
1483 -10789 -1238 5027 -5185 -9736 1112 4292 -7055 -9020 2245 3061 -7644 -7292 2660 603
1497F03q855L641P796n194o884O507N971p544m857Q349L614q805k094R373P12
1512B333r662Q10R952j959r800L295R584m213q724N355Q193o194p138P221O535
1527E588p568n440Q033M459p775k771P957J254p670O25P799j914p619L300P430
1542E688m116o754N171N773n897m525O989L269q003k091Q955J220r619n56R988
1557E492l5r932R38R314j939q494L050P784m281p248N381O883o269o392O554N709
1573F515o284m641N985L248n684j412N913l45o101J823O865k631o973L076O597
1588E951k985n636L536M130m105k609N600J542o754j264P848J587p898j641P128
1603D430J536n840n06M718j184l978K854M190m288m759M407N128l945m709K776
$$ plain form
1497 603 -8252 -4611 3185 -2009 -8893 -2386 3585 -3959 -8816 -467 3147 -5658 -7752 1621 2333
1512 2333 -7329 -6519 3433 1474 -8326 -5031 4553 340 -8384 -3029 5164 -1030 -8168 -947 5588
1527 5588 -1980 -7420 613 5072 -2703 -5474 2483 3737 -3933 -3308 4491 2577 -5042 -1742 5688
1542 5688 1572 -5182 -11 5762 -135 -4660 2329 5598 -2405 -4496 4459 5679 -3940 -4496 5492
1557 5492 5457 -4475 -3537 5777 3838 -4656 -1606 6178 1897 -5351 30 6913 644 -5748 806 6515
1573 6515 231 -4410 1575 4823 -861 -2273 3640 3295 -2806 -983 5882 3251 -3722 -646 5951
1588 5951 2966 -2670 866 4996 891 -1718 3882 5424 -1330 -2594 5254 6841 -1057 -2698 4430
1603 4430 5966 126 -380 4338 3154 -824 2030 6220 1932 -2827 1580 6708 2763 -1946 830
1618H30L300k343j205K508r35l687K161N053k519o052J812N993j243m856R63L165
1634B945j924j722L411J000n189j317O147K149o102k869N116K811l606j678K564
1649A736L1k167J775K593k701l589L029M000k482l724J706K649j376j101J881
1664B260n06k903J343M160j452n146R09N455l85m948J13L859n98k923J413K298
1680B949k712k470L460K888l793l740L295L980k633l532J574K566j133j429J231
1695E01J91j669K93K333m34k712N0K415L31j625m84M68P7M51R18r57j944R20K621
1714A744l29k751k60K419M03j471kP00p73m55J739N76k497j287K634J719k055
1731E4j922J286J416o38n72M09n95p12J335J373j676j948J290K161q68j879N08
$$ plain form
1618 830 4130 1787 582 3090 2155 -1532 629 5682 3163 -2889 -1077 4916 3673 -1183 -220 2945
1634 2945 1021 -701 2710 3710 -1479 -2796 3351 5500 -602 -3471 1645 4456 850 -828 1736
1649 1736 1767 -400 1375 3968 1267 -2322 707 4707 2225 -1499 207 2856 1480 379 2260
1664 2260 1754 -1149 194 4354 2902 -2244 -1335 4120 3735 -1213 -1100 2759 2161 -762 651 2949
1680 2949 237 -2233 1227 4115 322 -3418 -123 3857 1224 -2308 -734 1832 699 -730 501
1695 501 692 -977 -684 1649 1215 -1497 -1447 968 1299 -326 -810 -342 -265 186 1104 147 -1797 -877 1744
1714 1744 1415 -1336 -1596 823 1226 -245 -247 453 -320 -775 964 1540 -957 -2244 390 2109 54
1731 54 -1868 -582 834 196 -376 33 -562 -1274 61 1434 -242 -2190 -900 1261 393 -1486 -978
1748i78J047n95k45J081k98j863L72K512rk726n12K627Q71j955p43J339L58q29
1766e46M04R05r01j086J220J593r71j739N82J655o1j002j75N76J25J55K61m39
1784E56o27N61R77l60r20L8P17R5l06L1p7l19K68O31k41q75p7R41J78p11l85L68
1806D63L58o2q2j94j86J59N30q4o36O2N36J9l37J53J23l00L3O55M9r80j26J231
1828A384L85j259n10J268N92r34n51R38M06q98p7R01j2r41J02J123j33j334K16
1847F66J157q1j116n6Q02o3m97J32K00l69k44N93J48q10k68O79K72p61l35N07
1867E56O9k76M5J26n79k14P80K50p67n85O61O89l80n18M8J01J56L99r3p92k35
1888e59J124M49r04o54Q43L81l75j00M85m46o95R06J101r65j598R04J655m87j586
$$ plain form
1748 -978 69 -526 -771 310 12 -1851 -1479 1033 1024 -1702 -2214 413 1284 -671 -1414 -75 283 -546
1766 -546 -142 763 -138 -1224 -4 1589 618 -1121 -539 1116 1055 53 -122 454 579 734 995 556
1784 556 -71 490 1467 1107 187 225 942 1037 731 762 685 366 634 1265 1024 149 72 1013 1191 480 95 463
1806 463 821 759 677 483 297 456 986 902 266 328 864 883 546 699 822 522 555 1210 1259 279 153 1384
1828 1384 1769 510 0 1268 1860 926 375 1313 1719 821 744 1645 1633 692 794 1917 1784 450 666
1847 666 1823 1742 626 570 1372 1309 812 944 1144 775 531 1124 1272 462 194 873 1145 384 49 556
1867 556 625 349 394 520 -59 -273 507 757 -10 -595 66 755 375 -143 -95 6 162 561 468 -324 -559
1888 -559 565 1014 110 -544 299 680 305 205 690 244 -451 455 1556 591 -1007 -103 1552 1065 -521
1907e21L96J022l72p43Q46L9j227j78J690J78j901n33J617N21j376m56Q51k72
1925d19o42P31O37j432j034J662J287j837j556J529J290j406j047J347M43j633
1941b080m6J901l26k228K62K405j71k325rK065j9j681K65J237o37r39R87Q32j347
1960a854o95J392O62j270o31J043K59p19K26M60p61o97J381P56j715r58J689R88
1978d44j695q85J439L40j474K06J469o00j890P26K222j026k267P99K113p50j860
1995c577Q42J250j153q52J668M55k008m73K260M54k121m62J975Q5j568M07J450
2012a368q59j496J613J455j776j554J958J634j853j402J921J041j836n13K066
2027i69M4k337M48K450n42k511O11K449o22k213R18J947j315j455J595J228j923
$$ plain form
1907 -521 -125 897 525 -218 628 667 -560 -738 952 1130 -771 -1304 313 834 -542 -998 -147 -419
1925 -419 -1061 -330 307 -1125 -2159 -497 790 -1047 -2603 -1074 216 -1190 -2237 -890 -447 -2080
1941 -2080 -2126 -225 -551 -2779 -2517 -112 -283 -2608 -2617 -552 -571 -2252 -1987 -750 -1387 -2326 -1339 -507 -1854
1960 -1854 -2549 -1157 -495 -1765 -2396 -1353 -1094 -1813 -1587 -1127 -1888 -2585 -1204 -448 -2163 -3121 -1432 -444
1978 -444 -2139 -3024 -1585 -1245 -2719 -2513 -1044 -1644 -3534 -2808 -586 -1612 -3879 -3080 -967 -1717 -3577
1995 -3577 -2735 -1485 -2638 -3490 -1822 -1367 -3375 -3848 -1588 -1134 -3255 -3717 -1742 -1657 -3225 -2818 -1368
2012 -1368 -2227 -3723 -2110 -655 -2431 -3985 -2027 -393 -2246 -3648 -1727 -686 -2522 -3035 -969
2027 -969 -925 -3262 -2814 -364 -906 -3417 -2806 -357 -979 -3192 -2274 -327 -1642 -3097 -1502 -274 -2197
2044b197j035K111Q79k103p22K054M82j947J27J744n21j575J013J610j326j542
2060b948J643J434j687j201J911R39j857n01K116J13k256M12K494o66k358R66
2076a446K402j045k155J382J994j555j660J919J399j979j156K291Q83k372o16
2091a714K514K96k467K20K405o25k294J066K224j432k181J714J976j937j669K112
2107B08J479k297j227K498R09k721m35K736L17k770n8K833k56k650O24K503q35
2124H58k220J162K194j428j761J569J440j397j163J807O67j586m31J898L6j713
2140f8L27J832o46j583J001J415j110j212J452J080j777q46J995O39k103m10K233
2157B219P3k203K08K079l81k172P20K022r54j961J136J740j302j542J415J209
$$ plain form
2044 -2197 -3232 -1121 -242 -2345 -3067 -1013 -531 -2478 -2351 -607 -1128 -2703 -1690 -80 -1406 -2948
2060 -2948 -1305 129 -1558 -2759 -848 91 -1766 -2267 -151 -38 -2294 -1882 612 -54 -2412 -1446
2076 -1446 956 -89 -2244 -862 1132 -423 -2083 -164 1235 -744 -1900 391 1274 -1098 -1714
2091 -1714 800 1096 -1371 -1151 1254 629 -1665 -599 1625 193 -1988 -274 1702 -235 -1904 208
2107 208 1687 -610 -1837 661 1570 -1151 -1586 1150 1467 -1303 -1361 1472 1216 -1434 -810 1693 858
2124 858 -1362 -200 1994 566 -1195 374 1814 417 -746 1061 1728 142 -289 1609 1645 -68
2140 -68 259 2091 1445 -138 863 2278 1168 -44 1408 2488 711 -135 1860 2499 396 -14 2219
2157 2219 2292 89 297 2376 1995 -177 543 2565 1611 -350 786 2526 1224 -318 1097 2306
2173B306j569q20J721N13j967j43J949k0k003L93J885n49j875J013J698j188j694
2190c50J671J508j787j307J923J150k007p90K172M97k211j66K324O3k402K43K314
2207B845m32k009N26J833q49j637J168J260j368j211J525R63j618q52J597N05
2223B246j590l36J530j75j676M65J552p53j618P78J575r19j522R29J162j237q38
2240d27J328N02j508m66J535M50j708l05J502J56j269K7J091l98q53N90R50j003
2258A94q75J083P71j117o41J077L83j115K1J023k88j099L96J289o11j394O94J278
2276A069p00j180Q11Q72r91q08J077O75j364o00J356L81j422m04J308K15j253
2293i58j00R92p1j034K99Q91n22q18O40P66p41r12Q54Q39q61o96P17N50o92l00
$$ plain form
2173 2306 737 -83 1638 2151 184 41 1990 1970 -33 360 2245 1696 -179 834 2532 1344 -350
2190 -350 1321 2829 1042 -265 1658 2808 801 11 2183 2680 469 303 2627 2690 288 531 2845
2207 2845 2413 404 930 2763 1914 277 1445 2705 1337 126 1651 2614 996 144 1741 2246
2223 2246 656 320 1850 1675 -1 464 2016 1263 -355 423 1998 1079 -443 486 1648 411 -427
2240 -427 901 1403 -105 -571 964 1414 -294 -599 903 1059 -210 -183 908 510 -343 247 1197 194
2258 194 -681 402 1173 56 -585 492 875 -240 -219 804 516 -583 -187 1102 491 -903 -209 1069
2276 1069 369 -811 0 872 -119 -927 150 825 -539 -1139 217 598 -824 -1228 80 295 -958
2293 -958 -1058 -66 -137 -1171 -872 19 -503 -1321 -681 85 -656 -1568 -714 125 -736 -1432 -715 -165 -857 -1157
2313a157O92O8p72J7R38r6r77J57R37J3p49PN32j00l53K34K42m45j95O11K10n46
2335g32m82N27L22k72j69R6j10p7M27O3o03l18P05L34n28m99M40J27j77n7L15
2356f68k87n46N03O85l98r06L03Q73j33o87J33L90j58k29M36K25n94j75P52K51
2376b30o89l58O22L77l19k55K80m9j37M17K41m04n15N12P24l73o67K20O10j00
2396i3m02J64J72k72m4M43M3m25k49N33L53n05l56K98M64j16k82nJ65L5q1J25
2418c5K6j20j9J36K32j85j18P4J21J36L8k56O4M14P4k31j33K19K02j1n8mJ19N5
2442G40o9O5O4o5R1J31k0j4j34O6J95mj39p3J92J94j93k16Q7K91j2k85p3K13J44
2467A176k60j62J93J36j89j03R0J33k02j76K00K95k43m50K20N32j13n71k8N99
$$ plain form
2313 -1157 -465 -397 -1169 -1152 -214 -310 -1287 -1130 -193 -180 -929 -922 -390 -490 -843 -609 -367 -812 -1007 -396 -186 -732
2335 -732 -1214 -687 -365 -637 -806 -710 -820 -897 -470 -407 -1010 -1328 -623 -289 -817 -1316 -876 -749 -926 -983 -668
2356 -668 -955 -1501 -998 -313 -711 -1617 -1314 -441 -574 -1261 -1128 -738 -896 -1125 -689 -464 -1058 -1233 -481 -230
2376 -230 -919 -1277 -655 -278 -597 -852 -572 -621 -758 -341 -100 -504 -1019 -507 217 -156 -823 -603 7 -93
2396 -93 -495 -331 -159 -431 -475 -32 11 -414 -663 -130 223 -282 -638 -340 124 8 -274 -279 -114 -79 -160 -35
2418 -35 -9 -129 -148 -12 220 35 -83 -9 112 248 286 30 94 508 582 351 218 437 639 628 570 566 685 740
2442 740 671 736 800 735 826 957 937 923 789 855 1050 1046 907 834 1026 1220 1027 811 898 1189 1177 892 819 1032 1176
2467 1176 916 754 947 1083 894 791 881 1014 812 636 836 1131 888 438 658 1190 1077 506 478 1077
2487A077J05l66j64K67J60k77K9K79q9l46J31M22O9m34k44N07L97l80l72Q2M20
2508A273L9k22j15PJ49RO1p0k33m2J60K09p6m41p3K97K32j41m61JK05L52k81l58
2532D81n3L08J16k45j83M5m4P3J25L9m34k57M07M51k01p20%O34K61n97l33L54
2554B27K77j35j49J02p0j26J19M09k84n14P9N90J37n60l13L73L86j65l03j60J29
2575D9K03op0j12j85J28J97N7l49l25P6M81J36o78l96L19N41j85o37j0L16rm7
2598e06pj73k69K08N16j30p47j80O65M22n75m25K04J67Q8J9j09l66l5M88L74n17
2620h88n69L91O02j43l53j06J19m2K23K70l93n98K93Q66j85q53j35P13L14m49
2640i23k88J77l1p1L72R1m93m14M98O10l85p35Q9N90O3k83k02p0P7K79J77l06
$$ plain form
2487 1077 1182 816 652 919 1079 802 831 1110 1021 675 806 1228 1297 863 619 1126 1523 1143 771 853 1273
2508 1273 1312 1090 975 982 1131 1140 1201 1131 898 856 1016 1225 1149 708 635 932 1164 1023 562 563 768 1120 839 481
2532 481 428 736 852 607 424 469 425 498 623 662 228 -29 378 829 628 -92 -92 542 803 206 -127 227
2554 227 504 369 220 322 252 126 245 654 370 -144 -65 525 662 102 -211 162 548 383 80 -80 49
2575 49 252 246 176 64 -121 7 204 261 -88 -413 -337 144 280 -398 -794 -475 66 -119 -756 -766 -450 -459 -506
2598 -506 -513 -686 -955 -747 -231 -361 -1108 -1288 -623 -201 -776 -1201 -997 -830 -742 -723 -832 -1198 -1233 -745 -371 -888
2620 -888 -1457 -1066 -464 -607 -960 -1066 -947 -989 -766 -496 -889 -1487 -1194 -328 -513 -1366 -1501 -788 -474 -923
2640 -923 -1211 -1034 -1065 -1136 -764 -673 -1166 -1580 -1082 -472 -857 -1592 -1503 -913 -850 -1133 -1335 -1405 -1328 -1049 -872 -1178
2662a178l80J69M14k7k95p9L9P9K91J04l79l61M54O03k61o49kO85Q6l59j01K39
2684i08j27P4K66N3n10m5N50L34n71l68M48K71q2k67J26j05l0K83K07m59l02L96
2706g66M61k91m69K22K90j96p6K57r3l80J39N49r8o36m1O90Q6n45j13M17P3l60
2728h80K13K28k84k92M38M40m19m25L44M86k06l57J03L52j66pK00p0k69J69L74
2749b8j33l39P2M20p1l47K08J78l17n9M15m5m84J10M88j02l92qM36j02l99J74
2771c25L68k81l86L87L63m74l25N00L26n21l31O00J24m96j1M30Nm95J99M92k47
2792i8m35K73N23l30m15L26M96m14k88N15J71m26j04O66j4p01K57O10j27o99K30
2813A6P03k44n97K66O38m08n26M94M98n81m12N59L54n61l58N74L27o39j82M89
$$ plain form
2662 -1178 -1558 -1389 -975 -1002 -1297 -1376 -1337 -1258 -967 -863 -1242 -1603 -1149 -546 -807 -1456 -1458 -773 -687 -1046 -1147 -908
2684 -908 -1035 -961 -695 -642 -1152 -1197 -647 -313 -884 -1252 -804 -533 -615 -882 -756 -861 -891 -608 -401 -860 -1162 -766
2706 -766 -305 -596 -1065 -843 -553 -749 -825 -568 -661 -1041 -902 -353 -451 -1087 -1128 -438 -352 -897 -1010 -593 -520 -880
2728 -880 -667 -439 -723 -1015 -577 -137 -556 -981 -637 -151 -357 -714 -611 -259 -425 -432 -232 -302 -571 -402 -28
2749 -28 -161 -500 -428 -8 -79 -426 -218 -40 -357 -416 -1 -46 -530 -420 68 -34 -426 -434 2 -100 -499 -325
2771 -325 43 -238 -624 -237 126 -348 -673 -173 153 -368 -699 -99 25 -471 -482 -52 -47 -542 -343 149 -98
2792 -98 -533 -260 263 -67 -482 -156 340 -74 -362 153 324 -102 -206 460 446 -255 2 612 485 -214 16
2813 16 719 475 -122 144 782 374 -152 342 840 259 -153 406 760 199 -159 415 742 103 -79 410
2833D10J15l84q9M02o4l50P8L43k31k93K69K73k62j62J70M6j81R7K71k61m53M91
2855B35M58l90n39M44M80l45m11L95K60m47p1N54J42p58j29P93K46p27k42O14
2875E62J90l94r7K32r3k26L33K55m14l31L36M15k30m39J99J23j30J65J09l02m34
2896a71N07N97m47p26L30O25j80n50K37K90l96n4M89J18p19k13R14L79q96m70
2916c36P05M80m54l35L99J41l71J47L94j19o01K44O18o9n57P3K50J22j06K8r3
2937E60j32K30L07k39n18K85M44j65l02J2K38j10j18L62k0m78n5O22N8o91j70
2958A20O32K27m34k68L62L4l03J79K71k55m11L31N42l60m35J08N25j76k92J46
2978E43J55j45m5L22j79l94J21N34j12m53KL60J0j50J6J76l84L0M46J7o28j15
$$ plain form
2833 410 525 141 52 454 390 40 118 461 230 -63 206 479 217 55 225 271 90 187 458 197 -256 235
2855 235 693 303 -236 208 688 343 -68 327 587 140 69 623 765 7 -122 671 917 190 -52 562
2875 562 752 358 261 493 400 174 507 762 348 17 353 768 538 99 298 421 291 456 565 263 -171
2896 -171 336 933 486 -240 90 715 535 -15 222 512 116 62 551 669 -50 -263 651 1030 134 -336
2916 -336 369 849 395 60 459 600 229 376 770 651 50 294 912 843 286 359 609 731 625 653 560
2937 560 428 658 965 726 208 493 937 772 470 482 720 610 492 854 834 356 301 923 981 290 120
2958 120 752 979 545 277 639 673 370 549 820 565 154 485 1027 667 232 340 865 689 397 543
2978 543 698 553 508 830 651 257 378 912 800 347 349 709 719 569 585 761 377 407 853 870 242 127
3000A27N70K02m98l46M53J43l34n1K92j77m11K36M93k88n12J77M36j61m54J05
3020BK29p4j84P3J24k51m4K62P2l11o0K34O5k43p5J55j07J8K03n0l27J25L29K1
3044A86m47L7K76R8k97k9K40j15k20J82L02l27k00K80L07l32l05K19K68j56k29
3065b62J75j1j85L4K09p2l77R7L65m0l29p0K18p3j24J15O8k71r7L93O4m22k12
3088h07M42J68l50k09K87R2j48n6J57q4k03K53J59n1l40J19K78l9k43O5J82p6
3110d04j35J75K9j89P5J62l0k21J22J14pj68J20R4j09j76J95R5k05m6J02J36k50
3133e21p2J59O0j19p7J21P3j18k0O9q8o8J14J10k24j30J65K08r8j56M8P5qJJ58
3158c38j27k51L00K46j13l01M9L36k0j49N7Q8j10lK60J9l98JM89J11l39j78K56
$$ plain form
3000 127 697 899 401 55 508 651 317 266 558 381 -30 206 699 411 -101 76 512 351 -103 2
3020 2 231 157 -27 46 170 -81 -125 137 209 -102 -162 72 137 -106 -181 -26 -133 -115 88 38 -289 -164 165 186
3044 186 -261 -224 52 150 -147 -176 64 -51 -271 -89 213 -114 -314 -34 273 -59 -364 -145 123 -33 -262
3065 -262 -87 -98 -283 -249 -40 -112 -489 -392 -27 -67 -396 -466 -248 -321 -445 -330 -262 -533 -630 -237 -173 -595 -807
3088 -807 -365 -197 -547 -756 -469 -377 -525 -581 -424 -508 -711 -458 -299 -350 -690 -571 -293 -332 -575 -510 -328 -404
3110 -404 -539 -364 -335 -524 -449 -287 -317 -538 -416 -302 -309 -477 -357 -263 -372 -548 -353 -258 -463 -509 -407 -271 -521
3133 -521 -593 -434 -374 -493 -570 -449 -376 -494 -514 -445 -533 -601 -487 -377 -601 -731 -566 -358 -456 -612 -564 -489 -497 -496 -338
3158 -338 -465 -716 -416 -170 -283 -584 -535 -199 -219 -368 -311 -223 -333 -336 -76 -57 -455 -454 35 146 -193 -371 -115
3181a15K32j56l1O2r6l8K83J33l01l00K02L90k0l67K7J08Q8q5P9m1k45J77K42
3204B28k1l29%K94J08j43o4j03R7R2R3J4l51O1K81J10j12k43J44K08p1P1m5p2
3228B47p0L09P3k04j68K25J94j46p1j2O6o9R9J44k09j07J64K41j76k89R1L07o
3251F33k51O8R0j24q1J45Q7l05j27L71O3l57n9K63J19j98j51J69jr1M6J45q6k60
3275A08J64K44j43k51J44J29k7j50R3KL1q6J91o4k14Q9K80m5k54N8R0J2m9m5J37
3300D44j64KJ71p6n6j24J72O8j52o5M3JmJ2L3j82p3J59J28j55k33J97J28j22j41
3325A1J53j10j05J70J54k79j72J48K62j51k71N4K24r1r5J80Nj82l8K71qk68k9
3348a67K69K1k46p8K60J2k19R1K02k35j11J66J48j71k14J43K12j89r6N7J43k56
$$ plain form
3181 -115 117 -39 -70 -8 -104 -142 141 274 -27 -327 -125 265 245 -122 -95 13 101 16 95 54 -191 -14 228
3204 228 207 -122 -122 172 280 137 73 -30 67 159 252 266 -85 -24 257 367 255 12 156 364 293 364 319 247
3228 247 177 486 559 355 187 412 606 460 389 377 443 374 473 617 408 301 465 706 530 241 332 639 633
3251 633 382 450 540 416 335 480 567 262 135 506 569 212 153 416 535 337 186 355 354 263 309 454 368 108
3275 108 272 516 373 122 266 395 368 218 311 313 344 258 449 385 171 260 540 495 241 299 389 401 352 307 444
3300 444 280 282 453 377 321 197 369 437 285 220 263 264 260 272 305 123 50 209 337 182 -51 146 274 152 11
3325 11 164 54 -51 119 273 -6 -178 -30 232 81 -190 -136 88 -3 -98 82 87 -95 -133 138 130 -138 -167
3348 -167 102 123 -123 -201 59 71 -148 -57 145 -90 -201 -35 113 -58 -272 -129 83 -106 -202 -145 -2 -258
3370b58RJ96r6k01J8K45r6k41p3K58nk29j2K37j58j06N9M7j41j22K38L8j88p3
3394f54J29J06k29P6J03k4k52K02J05j83j16J71J55j27p5J06R5k42j4K69j5k29
3416f43nK85j5l12R6K48j56j30Q3J78j15k20J81J92k65j13K16R3j97p7K54n5k26
3439g03N5K80j03k58R5K33j41j86J00K42j78k19K79J16k33j34K84O7j93r6K64
3460d29R3l26R1K26l4j46J6K75r4j91Q8K72j35j25J59J21j18q1K26l8j16r3K46
3483a13J8j31mJ74j4j62R3J07m2k33K03J09j48r3J43J05j58j01J95K6k08L5K65
3506F6n0k92O7K09n8j79J65J39j70j50J84K07k63j50L12J36l37p2K69Q9k69M5
3528a02L22j5m27K18K43p3k96J50K50j15k33K19K22k36j40L14J12l13j50M21R
$$ plain form
3370 -258 -249 -53 -149 -350 -332 -87 -183 -424 -497 -239 -244 -473 -485 -248 -406 -512 -453 -406 -547 -669 -431 -393 -581 -654
3394 -654 -525 -419 -648 -572 -469 -493 -745 -543 -438 -621 -737 -566 -411 -538 -613 -507 -412 -654 -668 -399 -414 -643
3416 -643 -648 -363 -378 -690 -594 -346 -502 -632 -549 -371 -486 -706 -525 -333 -598 -711 -495 -402 -599 -676 -422 -477 -703
3439 -703 -648 -368 -471 -729 -634 -401 -542 -728 -628 -386 -564 -783 -504 -388 -621 -755 -471 -404 -597 -693 -429
3460 -429 -336 -662 -571 -345 -379 -525 -509 -234 -328 -519 -431 -159 -294 -419 -260 -139 -257 -338 -112 -150 -266 -359 -113
3483 -113 -95 -226 -230 -56 -70 -232 -139 -32 -74 -307 -104 5 -143 -236 -93 12 -146 -247 -52 -26 -234 -199 66
3506 66 16 -276 -209 0 -58 -237 -72 67 -103 -253 -69 138 -125 -275 37 173 -164 -236 33 122 -147 -102
3528 -102 220 205 -222 -4 239 166 -130 20 270 155 -78 141 363 127 -13 301 413 100 -50 371 380
3549C80k22k8K18K6k91J04K25m5l36J64K80j75k28K21J71j94k01K24R8j99m6K57
3571D03O8k98MK72rk39Q8K05o8k37J53K37k30r9J85K37k65j29K24R9j71r5K53
3594E88L2k18QK60q6k87J46K52j31j82J82K05j39j86K09R4j63k55K50Q3k18J7
3616D61K21K9l34P0K64j29j84K0K41r4l50K27J78j62j73J78J76k13k16K61J68
3637F39k39j29K39Q6l10O6J55L8l21N0K63r6j73J06J90j59k08K15J23r9j87J88
3659D37J14k96m9L22o9k15pK18j1k85M3K27lk56P5J22q9j55N2K03k18j06J17J34
3683C05j09k71K61l8j08n9K28j11k05J14J90j16j78J03J84j95j65J92J33j64q2
3704i1R6J33k40p2L33k3k72MK64j8k75P0K79j01k03J51J56j66j84J73J68j76j46
$$ plain form
3549 380 158 130 348 374 83 187 412 367 31 195 475 300 72 293 464 270 69 293 391 192 146 403
3571 403 471 173 177 449 440 201 289 494 426 189 342 579 349 250 435 672 407 278 502 601 430 335 588
3594 588 620 402 410 670 584 297 443 695 564 382 564 769 630 444 653 747 584 329 579 662 444 461
3616 461 682 711 377 447 711 582 398 418 659 565 215 442 620 458 285 463 639 426 210 471 639
3637 639 400 271 510 596 286 352 507 545 224 274 537 441 268 374 564 405 197 412 535 436 249 437
3659 437 551 255 206 528 459 244 237 455 444 159 202 429 426 170 245 367 278 123 175 378 160 54 171 305
3683 305 196 -75 186 148 40 -19 209 98 -107 7 197 81 -97 6 190 -5 -170 22 155 -9 -91
3704 -91 5 138 -102 -174 159 136 -136 -132 132 114 -161 -91 188 87 -116 35 191 25 -159 14 182 6 -140
3727a40K11J07j80j32K28J1k25r5L91j24k61M7K05m2j97J7J45k3j86J56P1j96
3749b12j34J70J35j98p2J63N2k22K2J44J1j21n0K31j08j94J15K24k48j31K04K05
3771a4j82j48O8K28k13j48K46R6k50k2J87n5j63N2K06n0j95JK57r5j09L1Q0j38
3795c30M4Q1O0k16l5J80L7j23j08J64Kj40P6J82j93j26J25J91k01j89K48J71j60
3818b60j82J92O1j26o3K00rj67m8K42N7k70J00K05l3j48N9J87j15q9J32J79k40
3841a36r4J57J39j48j07J61R5j26o0K02r2p8l3L10j13j64J1J66O3l40J22J79m0
3864G4r8L4O1p0j07J87mj34qJ26K1j40M2M6M1r9N2J13j44l5J54O6j20j15J36O2
3890A41r6K5J06N4k09J2K03l9k00Q8K23k1k09j9K37p4j42P8J18j44m2Q4J47k42
$$ plain form
3727 -140 71 178 -2 -134 94 105 -120 -215 176 52 -209 -162 43 1 -196 -179 -34 -57 -243 -87 -16 -212
3749 -212 -346 -176 -41 -239 -311 -148 -96 -318 -296 -152 -141 -262 -312 -81 -189 -383 -268 -44 -292 -423 -219 -14
3771 -14 -196 -344 -276 -48 -261 -409 -163 -67 -317 -339 -152 -207 -370 -318 -112 -162 -357 -356 -99 -194 -303 -272 -192 -330
3795 -330 -286 -205 -145 -361 -396 -216 -179 -302 -410 -246 -244 -384 -308 -126 -319 -445 -320 -129 -330 -519 -271 -100 -260
3818 -260 -442 -250 -189 -315 -378 -178 -187 -354 -402 -160 -103 -373 -273 -68 -101 -249 -190 -3 -118 -207 -75 104 -136
3841 -136 -230 -73 66 -82 -189 -28 67 -59 -119 83 -9 -87 -120 190 77 -87 -76 90 153 -187 -65 114 74
3864 74 -24 10 71 1 -106 81 77 -57 -65 61 82 -58 -16 30 71 -28 24 137 -7 -42 112 178 58 -57 79 141
3890 141 45 70 176 230 21 33 236 197 -3 85 308 287 78 59 296 222 80 158 276 132 90 174 321 79
3914G9j02J59J81k31p1J63K6j31MQ0rk03J22K47j79k38J40J72j15j23R9J10k06
3937b6RQ3Q0j61p6K28P9k80n2K42O9j24k3Q1j2j71J43J49k17n9J31J39j72j26
3961f6J79P4o5n4L7K3j11Q5R6n5j28J18J17n9j69M2J02q4rJ4Kl5j44K22q4j23
3987g5n4K03n4j8n1N6o6lJ02J7j43q0J95L2j65j19J61R6j52j3R3j9r6O1J37p8
4013c3j32J15J22p9j31K9J44n4j41Q4J35k20L1J53P7k87nJ87j7j23q3J73L4j60
4037a81JJ35n4k03R8J73l9j89J8K03j30r1L6M3q1J3K9J5j26L0N6Rj33J23N6m4
4063b33o7O5Q6j33p4J80J0j14m9J23J07j22r3J87J05k09J5J27p2q1J7K11r2q8
4087a94rJ85n8j04N1J29n2q6R6N7j07l4J02n3l0L1R5r1n5J45P8j67j23J84P7j35
$$ plain form
3914 79 -23 136 317 86 15 178 204 73 77 157 148 -55 67 314 135 -103 37 209 94 -29 70 180 -26
3937 -26 -17 66 146 -15 -91 137 216 -64 -116 126 195 71 48 129 117 -54 89 238 21 -38 93 232 60 -66
3961 -66 113 187 122 68 105 128 17 102 198 143 15 133 250 191 22 64 166 82 73 87 89 54 -90 132 48 -75
3987 -75 -129 74 20 2 -49 7 -59 -62 40 57 -86 -166 29 61 -104 -223 -62 34 -118 -131 -38 -57 -153 -92 45 -33
4013 -33 -165 -50 72 -7 -138 -109 35 -19 -160 -76 59 -161 -130 23 100 -187 -192 -5 -22 -145 -228 -55 -21 -181
4037 -181 -180 -45 -99 -302 -204 -31 -70 -259 -241 -38 -168 -259 -223 -180 -261 -248 -219 -204 -330 -300 -244 -235 -368 -245 -189 -233
4063 -233 -300 -235 -149 -282 -356 -176 -166 -280 -329 -206 -99 -221 -314 -127 -22 -231 -216 -89 -161 -242 -225 -14 -106 -194
4087 -194 -203 -18 -76 -180 -129 0 -52 -138 -42 15 -92 -126 -24 -77 -107 -76 19 -72 -127 18 96 -71 -194 -10 67 -68
4113f8p3J49M5j23o2J89oj78k7J78N6j73K0J57m0j68P6J76n7j48O6J61n3j27R5
4138F5O7r7k2R7J12j41j1N2R9q1q7J34o7j02J19J02j29j36J83Q3j46N2j5N0q7
4163I4m8J03N2k59P2J64m0j66L6J82o1j18M6P4o7n8J25kj12j03K42j0q0n0K8L9
4189H3q1Q8J7q2J0OJ79j70r1J35J02j40o7J36L9q2o0K15q6j51l3J99M8j91l7J77
4215A63K3k03N7Q7Rj15R7M1k9j56J60M0j05n8P6J5p6K3P9l5j37J9K03k5j75O3
4241D1J83j18j84J33Q7o9m5P3P8j40k7J86j8j63qJ16J28j85o3J41K8j05M9QJ8
4266A44n2O8jj45M3Q9N0p9m2O6j1j08rJ28l5j37K0J09l4j48R2Q5j02j17J53N0
4292G7j89m0J73O9k77N1J23J06k04l7J37qj52O8J16m1j85J45J27j95k8M7J93j69
$$ plain form
4113 -68 -141 8 53 -70 -132 57 51 -127 -154 24 80 -93 -73 84 44 -124 -48 128 71 -77 -11 150 97 -30 65
4138 65 132 35 13 110 222 81 70 122 221 140 53 187 120 18 137 239 110 -26 157 240 94 146 131 181 94
4163 94 46 149 201 -58 14 178 138 -28 8 190 129 11 57 131 64 6 131 129 17 -86 156 146 66 16 44 83
4189 83 2 90 107 25 35 41 220 50 -41 94 196 56 -11 125 164 82 22 237 151 0 -33 166 214 23 -14 163
4215 163 186 -17 40 127 136 21 118 159 130 -26 134 174 69 11 87 102 26 49 128 93 -44 -25 178 153 -22 41
4241 41 224 106 -78 55 142 73 28 101 179 39 12 198 180 17 9 125 253 68 5 146 174 69 118 126 144
4266 144 92 160 159 14 57 146 196 117 75 141 130 22 13 141 106 -31 -11 98 64 -84 8 93 -9 -126 27 77
4292 77 -112 -152 21 90 -187 -136 -13 93 -111 -148 -11 -19 -171 -103 13 -28 -213 -68 59 -136 -164 -117 76 -93
4316i3k7M1M9q6m9R4K8j21L9J65J9k02P6J03m8j18M6R2l4j04J53l9o3n2J58l4
4342gn4r1J77l7j02N0P5j9j32N0N1N3j38K7J55q2n5P8L0o6k5RJ3q5Q3N4l4l2M8
4371fN0%o4P8L0p1l3J04L2j17j0J17M8j83M6J42M7j74QJ67%j76K5J33Lj71OK15
4399B46j20j30R5O1%q0NQ6o1K2N7p4r4O3O5J9j28K3J03r5p6O9O3p6j09K46pj16
4427E7n3J37n8o2j8M1R2n8n8Q8L0r9L7mP2n9k0N9J1j09L3P9p3q3J88m7l4L7l6
4456I0Mj30J68N2o3p7K7Q7L9k34J27K2n3r2J34N6j36j03J38O4q2o9N4N7j30L4
4482a6R5n0n4K6Q5n2p2Q4P3j7r1K5M9n0N3L1q7p6J0K34o3j81N3J41k0j67Q3J49
4510A95r4j01P0J50j33j14Q2J04j04n2L2O3m8q8Q7J9k1m4M2q5N2O6j15k0L6N6
$$ plain form
4316 -93 -120 -79 -30 -116 -165 -71 -43 -164 -125 40 59 -143 -67 36 -12 -130 -84 8 -26 -130 23 -16 -79 -131 27 -7
4342 -7 -61 -152 25 -12 -114 -64 11 -8 -140 -90 -39 14 -124 -97 58 -24 -79 -1 29 -37 -62 -53 -40 -125 -42 12 -22 -54 -6
4371 -6 44 44 -20 58 88 17 -16 88 120 3 -7 110 158 -25 21 163 210 36 44 211 211 35 60 193 196 25 31 246
4399 246 126 -4 91 152 152 72 77 163 102 124 181 107 13 76 141 160 32 55 158 63 -13 56 119 43 -66 180 173 57
4427 57 4 141 83 21 3 44 136 78 20 108 138 39 76 72 144 85 65 124 135 26 59 138 65 -18 170 123 89 126 90
4456 90 94 -36 132 184 121 44 71 158 197 -37 90 112 59 -33 101 157 21 -82 56 120 38 -31 23 80 -50 -16
4482 -16 79 29 -25 1 86 34 -38 46 119 102 11 36 85 35 88 119 32 -44 -34 200 137 -44 9 150 130 -37 46 195
4510 195 101 0 70 220 87 -27 55 159 55 3 35 98 50 -38 49 68 47 3 45 -40 12 78 -37 -57 -21 35
4536C5N3j33k4M6K6pq9J39r8k0NJ15k0j72KJ23n3rNO7k5j62J31J01q0m4JO5q3
4565a05pO0N1p2k5J24m3q0J1J01j27j6M3N9r8M7O3q1L5p2J04j2p7j11J07P4j36
4592a83j0O1R3j26qP5l4k2J2J09o5p8P0o9M0KK2K3l5j7L5Kl6O1K0j5o2K7R8K3
4622A3q7j8J17r1m2oQ6Ro5N9P6o1o1N2J4m8K2L5n7O3n9pO2p1J08j8r0PJ07q3R
4653b5k2q4J20k1j10J39K5j06j8N7n1l1R9J3k1j24O2Q0no2K8O7q0j8M4k0m9l0
4681a43J10J0l3k4M0l8Ppj3J10j22K7J39j03m5N5k9l1J5R4j8k1k4NK3q0K3O4m0
4710d9n1J0j8N4j03O3O3K8j18J8J19r1o6J23q3QK8p7Q0k9k9L5N1m3k9O6k6m0R6
4739a0L2Oj03P4j0K9m2m3J06p9M9lN6q3L7J18r4Qn5O9m8K1J4K7m6J6L0q2Q6l2
$$ plain form
4536 35 88 -45 -69 -23 3 -4 -93 46 -52 -72 -67 48 28 -144 -142 -19 -72 -81 -76 -9 -34 -196 -65 36 -44 -88 -87 -22 -105
4565 -105 -112 -52 -1 -73 -98 26 -17 -97 -86 15 -112 -128 -85 -26 -124 -77 -14 -95 -60 -132 -28 -40 -117 -228 -121 -47 -183
4592 -183 -193 -132 -39 -165 -173 -98 -132 -154 -142 -33 -98 -176 -106 -175 -135 -133 -111 -88 -123 -140 -105 -103 -139 -78 -58 -73 -135 -108 -10 13
4622 13 -74 -92 25 -66 -108 -114 -28 -19 -84 -25 51 -10 -71 -19 -5 -53 -31 4 -53 10 -49 -56 6 -65 43 25 -65 -58 49 -34 -25
4653 -25 -47 -131 -11 -32 -142 -3 22 -84 -102 -45 -96 -127 -28 -15 -36 -160 -98 -18 -23 -85 -57 10 -70 -88 -44 -64 -113 -143
4681 -143 -33 -23 -56 -80 -40 -78 -71 -78 -91 19 -103 -76 63 -40 -85 -30 -59 -90 -75 19 1 -20 -44 -39 -16 -96 -73 -9 -49
4710 -49 -100 -90 -108 -54 -157 -94 -31 -3 -121 -103 16 -75 -141 -18 -101 -93 -65 -142 -62 -91 -120 -85 -34 -77 -106 -40 -66 -106 -10
4739 -10 22 28 -75 -1 -11 18 -24 -67 39 -40 9 6 62 -21 16 134 40 48 -7 62 14 35 49 76 30 46 76 -6 80 48
4769D8N3n9l4J0Q3o9p7P3Q3n8k2l0J03n8l0nO6m6m9Q0j4j0ol2J00n6m7J08l4p6
4799eN8OJ8p4J9m7J28kr6Q5m4M2Nq3L0L5J3K5q7P2Pn0J3j%o5%PO0q2J2RJ32j79
4833c9N7n8J0J1M7N3l1m0p4J14j3m4l0L9O5j1p2j8M6%j6K3O0j9nJ0n0k5J03r7
4863dJ9k1M0K7n8P6N7j21N0M8J5o2M7k7M8Ql7J1J6p2l9J12J4m3l7J0Q4o5m6M4
4893I4M2L8j46J10Km5jM3Po0J4m2omlP3jJ2qln2K6qJ5M8k7o2L8k9kk8OJ09j6r6
4928C8J14l4n9J15q6j5O3rj41R3NM2l1LqNL0j05O2k2j9k6O1j2r2M8LOk2L0j8o8
4960d9l3P6N6j21J7O7j9j4o2J03l2n6R7%o1MK7k3l8k8M3M8j2j8mlnlK7j4o8Q2
4992a6L1n6JK7N5k8r1K7O0j9r1J06L3q2k6J70n7q5K0N1%j01kR1k2q1NP7q9K2L7
$$ plain form
4769 48 101 42 8 18 101 32 -45 28 111 53 31 1 104 46 16 11 77 31 -18 62 48 38 32 0 100 44 -3 105 71 -5
4799 -5 53 59 77 3 22 -25 103 101 5 90 46 88 93 10 40 75 88 113 26 98 105 55 68 67 67 2 2 9 69 -13 -1 8 140 -39
4833 -39 18 -40 -30 -19 28 81 50 10 -64 50 37 -7 -37 2 67 56 -16 -34 12 12 -4 19 79 60 55 65 15 -10 93 -4
4863 -4 15 -6 34 61 3 79 136 15 65 113 128 66 113 86 134 142 105 116 132 60 21 133 147 104 67 77 161 96 50 94
4893 94 136 174 28 138 140 95 94 137 144 84 98 56 50 46 43 116 115 127 119 116 64 90 82 97 145 118 56 94 65 63 35 41 150 134 38
4928 38 152 118 59 174 88 73 136 127 -14 79 84 126 95 98 90 95 125 20 82 60 41 15 76 64 -28 20 23 29 7 37 19 -49
4960 -49 -82 -6 50 -71 -54 13 -6 -20 -82 21 -11 -67 30 30 -31 -27 0 -23 -61 -89 -46 2 -10 -28 -32 -35 -40 -43 -16 -30 -98 -16
4992 -16 15 -41 -40 -13 42 14 -77 -50 10 -9 -100 6 39 -43 -69 101 44 -41 -21 30 30 -71 -73 18 -4 -85 -80 -3 -92 -70 -33
5023c3mqm2Q9l8j5n2oO7kjJ1J1l6L6JJl9L0J8Kn8J25j9r3j4J06%j05N6PP3j38
5056g0j1R7j0p1N6M0p7PK6K1l6m7N6J9rm7K3Km5m5N4K2nl8J7ml5QJ0Nnj1Q8j34
5090a49J6J10l4l3j9P7j4n0LJ5K9J2m5M2m5L3l3J0O2n7N5Mk4p0MN1J4p4PO2o8
5121a09L3pmM8m5ORJ2l0Q7r2M5nJ7j4l2J03jp5m5O9rl3j0J07o0n2m7J30K2n2l7
5153g1O2rp3J6P0J3o4M6N8p0p8J25j4m3J3L0M0qK2n4Q9r2M6lJ4q4J6R6n9j6L1
5184D9j1K4j03P3Lr9Q6N9rm2m9J00Qp3MP4k1p5P0L0J4r6M9L4p7o0N0L9l9L5k2
5215B5J7K8o1J8O4r7M1Pom5O8J8l2R3n9Lj22J13M6J5j03J04Mj7n9rN9m7ok1J23
5246A62l3n2m1Q3m6L3r5J30q3n2Q2M5r0j6O3l0K4J0j9J0j6K5o2N0l9N1J2nNJ0
$$ plain form
5023 -33 -37 -45 -87 2 -36 -51 -103 -109 -42 -44 -45 -34 -23 -59 -23 -22 -21 -60 -30 -12 -10 -68 57 38 -55 -69 37 37 -68 -12 -5 68 -70
5056 -70 -81 16 6 -65 -9 31 -46 -39 -13 8 -28 -75 -19 0 -9 -56 -33 -31 -76 -121 -67 -45 -50 -88 -71 -75 -110 -102 -92 -87 -92 -103 -15 -149
5090 -149 -133 -23 -57 -90 -109 -32 -46 -96 -93 -78 -49 -37 -82 -40 -85 -52 -85 -75 -13 -70 -15 -11 -35 -105 -101 -50 -36 -110 -103 -41 -109
5121 -109 -76 -83 -87 -39 -84 -78 -69 -57 -87 0 -92 -47 -52 -35 -49 -81 22 21 -54 -99 -30 -39 -72 -82 25 -35 -87 -134 -4 18 -34 -71
5153 -71 -9 -18 -91 -75 -5 8 -56 -10 48 -22 -100 25 11 -32 -19 11 51 43 65 11 100 8 54 51 65 -19 -3 93 34 18 49
5184 49 38 62 -41 32 35 -64 22 81 72 30 -19 81 89 16 20 94 73 -2 68 98 112 16 65 99 22 -38 12 51 12 47 25
5215 25 42 70 9 27 91 -6 35 42 36 -9 59 77 45 138 79 82 -40 73 119 134 31 135 139 122 63 54 113 66 60 39 162
5246 162 129 77 36 119 73 106 11 141 58 6 88 133 43 27 90 60 84 94 75 85 69 94 32 82 43 94 106 101 106 116
5276A16M7j13m1J09Q1j55PM9K4K9l9n4P1k9qk6J33j40j2P5p5L2K7O1rj21R3K9
5304A61k1j48J18k7J2pJ9J5r1k2P6L2j51N8k2L6o3M2J6l3j4O6l0qn9L9M7j02J4
5333d7N2l2l8JP3J3r0%O2qm6K1J4J3n2N6K2r1N3L2J6j59N8O0J5o4Q8j2k1r3J13
5364Ij9q5O2Q1J5j18o7J29m7j03O3O3l0p8j4J16l4j32R1R8m1j36R1O6m4l6j3P6
5392c7l0n6M8%k5l9P8n1n4R4Q6j08qM3L4n7PK3M2j24O6K7m6k3K7L5q8j6K5J17
5422a0p7l6P3Rj3j01O4O0r5o6J17L0j08M3J9J0m1n0J33k9j54Q3j0K6m2L5O8n5
5450a17q7O3M2n4l4L3M2L1r8P6Jr5K6N2L0r8J02m9j9mN7j8nl4N3k2MN1k5k5k2
5481a43n3J30oj03J3J55j20j7R9l3qm7oJ50n6r1J02K5o1o1J20J4p3K0K0n9j8Q6
$$ plain form
5276 116 163 50 9 118 199 44 51 100 124 153 114 60 131 102 94 68 201 61 49 124 49 81 108 169 160 39 132 161
5304 161 140 -8 110 83 95 88 107 122 31 9 85 117 -34 24 2 38 -25 17 33 0 -14 52 22 14 -45 -6 41 -61 -47
5333 -47 5 -27 -65 -64 9 22 -68 -68 -6 -14 -60 -39 -25 -12 -64 -8 14 -77 -24 8 24 -135 -77 -17 -2 -66 22 10 -11 -104 9
5364 9 -10 -95 -33 48 63 -55 -122 7 -40 -143 -80 -17 -47 -125 -139 -23 -57 -189 -98 0 -41 -177 -86 -20 -64 -100 -113 -37
5392 -37 -67 -123 -75 -75 -100 -139 -61 -112 -166 -72 14 -94 -102 -59 -25 -82 -75 -52 -10 -134 -68 -41 -87 -110 -83 -48 -136 -152 -127 -10
5422 -10 -87 -123 -50 -41 -54 -155 -91 -31 -126 -192 -75 -45 -153 -110 -91 -81 -122 -172 -39 -68 -222 -139 -149 -123 -165 -130 -62 -117
5450 -117 -204 -141 -99 -153 -187 -154 -112 -81 -179 -103 -102 -197 -171 -119 -89 -187 -85 -134 -153 -157 -100 -118 -123 -157 -104 -126 -122 -71 -96 -121 -143
5481 -143 -196 -66 -72 -175 -162 -7 -127 -144 -45 -78 -86 -133 -139 11 -45 -136 -34 -9 -70 -131 -11 3 -70 -50 -30 -89 -107 -21
5509b1l1J0l9k8P7k2NN7L0p9k3R7k3l9L8J3K0q9J17%J8j40Q5J04n5o0R0P6j39
5538D9n8J17P3p9p4J06O8j46mP2P2o4p6J33o7l6KL7L4n1J07k7n3l0L1O2j06j0
5566H2L4J08j15J9J16n0k6p9N0M9r8K9N9l6m9KJ14r0q3J23L2o1k2N1pq7J10j1
5594A64L2j20Q3jn9J4M6O1m9n1M2N5j02l5J33n0p7k9J56Mj31l7J64j3r3K5Lk2
5622A13o5J04K2l1j04R1j7j5o0L9J8o3rJ56l2q2M3O9m9j13J07L5p3o4J41j1j37
5649A3K2J47k3j54MJ09O1j48J0R6j5r9L0M8kq3M5O3jo3K4J6J3j2m9N7o3k1J21
5678A46j25l4R7rj6m4N8L1q7m5J06m8k5n1R3m4m9kR7K7j71L3Q6k9j13Q7J36p5
5706C0j29O0Q1o1m8k8J52j23J2PN4k0r2Q1J5p5lJ02j9n2l3O7o7m9N3Q1j12mMO7
$$ plain form
5509 -21 -52 -42 -81 -109 -32 -54 -49 8 38 -41 -64 33 10 -29 9 22 42 -47 70 70 88 -52 33 137 82 22 112 188 49
5538 49 -9 108 181 102 28 134 202 56 52 124 196 132 56 189 122 86 88 125 159 108 215 188 135 105 136 198 92 82
5566 82 116 224 109 128 244 194 168 89 139 188 90 119 178 142 93 95 209 119 36 159 191 130 108 159 152 65 175 164
5594 164 196 76 159 158 99 113 159 220 171 120 162 217 115 80 213 163 86 57 213 217 86 49 213 200 107 132 135 113
5622 113 48 152 174 143 39 130 113 98 38 77 95 32 23 179 147 65 108 177 128 15 122 157 84 20 161 150 13
5649 13 35 182 159 5 9 118 179 31 41 137 122 23 53 101 99 16 61 124 123 60 84 100 113 101 52 109 46 25 146
5678 146 21 -13 84 75 59 15 73 104 17 -28 78 30 5 -46 47 3 -46 -48 49 76 -95 -62 24 -5 -118 -31 105 30
5706 30 -99 -39 42 -19 -67 -95 57 -66 -54 -47 7 -13 -105 -24 -9 -84 -87 15 -4 -56 -89 -22 -89 -138 -85 -4 -116 -120 -116 -49
5736d9p5j5Q7Or8m0J41o7j10rJ57m1r7lJ53l1j49J17k6l2q1J06M9m0m4J11j8j40
5764b38J07J8J5l8k2R3o7m8P1N5j21JM1N9m1j4PL4l2m3P1Qq1N0N6Mj41M0R9Lq6
5795a40K8L5l2l9J12m6m9Q0M6m9p5J3Q5m8m5O0M9l3k7o0P5j8o4J40lo2o9K2J76
5824F2r9q8J09l5j9P4L0l8q5l5J20K7j09R4lKm1O5Rq0O9p4N5ro7Q7J6k0k5O0o
5855D6j16J04O8j36J5L7M1k3l3m7J36p2q0O7Q1r2K8N1n0M2j17M8R5j08K5J30p8
5882F2q3J6J03m4q4Q3J8Jn8N9J4l7Lj7Q6o0l0M8O2r0M0N3m6q2K6N1Qk2o8J44q5
5913G1m7R0M2o7NK3rq0L2Q4K2r9K9L6k1o1N6M9m4J2k9M6o1L7L1m9o0K3M1N4j08
5944D8L5J3Pj22K7J40qq6M3j6J5q5R0M4m3l7k3Q6p6rK4Q6j15p7J36Q9j42q7Q3
$$ plain form
5736 -49 -124 -139 -52 -46 -144 -184 -43 -110 -220 -229 -72 -113 -210 -213 -60 -91 -240 -123 -149 -181 -262 -156 -107 -147 -191 -80 -98 -238
5764 -238 -131 -113 -98 -136 -158 -65 -132 -180 -109 -54 -175 -174 -133 -74 -115 -129 -122 -88 -120 -163 -92 -84 -165 -115 -59 -55 -196 -156 -57 -54 -140
5795 -140 -112 -77 -109 -148 -36 -82 -131 -51 -5 -54 -129 -116 -31 -79 -124 -64 -15 -48 -75 -135 -60 -78 -142 -2 -5 -67 -136 -114 62
5824 62 -37 -125 -16 -51 -70 4 34 -4 -89 -124 -4 23 -86 8 5 7 -34 31 40 -40 29 -45 10 1 -66 21 37 17 -8 52 46
5855 46 -70 34 102 -34 -19 18 59 36 3 -44 92 20 -60 7 88 -4 24 75 25 67 -50 -2 93 -15 10 140 62
5882 62 -21 -5 98 54 -30 53 71 72 14 73 87 50 53 36 122 62 32 80 142 52 92 145 99 17 43 94 102 80 12 156 71
5913 71 24 114 156 89 94 117 108 28 60 144 166 67 96 132 111 50 106 155 111 123 94 140 79 116 147 98 38 61 102 156 48
5944 48 83 96 103 -19 8 148 140 54 97 81 96 11 101 145 102 65 42 128 52 43 67 153 38 -39 97 186 44 -43 40
5973D0M7r8K7R7qn4m4M9J2o1L7J6q4P0K3n5l0qQ0m5n2Q1M8o9o9L4Q6p0m4N0N8
6004F4m6p4O2R0j37nP8k6l5P5l3J04j15m0K1LJ4k1M8Kj7kQ6j37k2J16q6O8r7J36
6034G4k2j08K3P3K4r7M3l6M7oo0qN0r5J34j6p7m4M7R3q7j2L9M2K5j03k1Q6r0N6
6064b6P1p4o6P3jL5k8J2L2r6l2J28q2J9k2J6L2k8k1J05j22k7M3N0O7j79R2M1K
6093A4o4K4l6l1L9k1N1k5k4M8M8j02m2O4j0n7P8K2m0p5P1J0k6n5K9M4o1K4K8l2
6123a07m3L8K7N0j76O5J50j20lP7O3r9pRN2k5j4M3j1j3j0J9K9n9L6lJ5l3J7j5
6153d8M6p1R0L6j04O3L1j16QJ1L9qj13P6L1%l0N3N0j12J0M2nk1j5P2M2q2m3J01
6183C3k6m8J1M3j7j9j0J06p8m8O5P9j13K4K7K4p1N7jk7K9M8ok6j9k3R1m1l6MR8
$$ plain form
5973 40 87 -11 16 113 105 51 7 56 68 7 44 60 -24 46 69 14 -16 -24 56 11 -41 40 88 19 -50 -16 70 0 -44 6 64
6004 64 18 -56 6 96 -41 -46 32 6 -29 46 13 117 2 -38 -17 -14 0 -21 27 29 12 10 96 -41 -63 53 -33 35 -62 74
6034 74 52 -56 -33 40 64 -33 10 -26 21 15 -45 -53 -3 -98 36 20 -57 -101 -54 39 -48 -60 -21 21 46 -57 -78 8 -82 -26
6064 -26 45 -29 -95 -22 -23 12 -16 -4 28 -68 -100 28 -54 -35 -57 -41 -9 -37 -58 47 -75 -102 -59 -9 58 -121 -29 12 14
6093 14 -50 -26 -62 -93 -54 -75 -24 -49 -73 -25 23 -79 -121 -57 -67 -124 -46 -24 -64 -139 -68 -58 -84 -139 -110 -66 -127 -103 -75 -107
6123 -107 -150 -112 -85 -35 -211 -146 4 -116 -119 -42 21 -78 -85 -76 -24 -49 -63 -20 -31 -44 -54 -35 -6 -65 -29 -32 -17 -50 -33 -48
6153 -48 -2 -73 17 53 -51 12 43 -73 -65 -54 -15 -23 -136 -60 -29 -29 -59 -6 44 -68 -58 -16 -21 -42 -57 15 57 -25 -68 33
6183 33 7 -41 -30 13 -4 -23 -33 73 -5 -53 12 91 -22 2 29 53 -18 39 38 11 40 88 82 56 37 14 105 64 28 32 130
6214A30j10l1R7nq8J5N9m0K5L3n6o2P7O1m5l3k1K5N5j11J6L3J6r2L4J15j00K4
6242B1O3r8mL0KLo1L1L8N5j11P6o8P4j02O0O8n7k1lQR6m8q6J12r7P0L2m3l2L6
6273D4j4J8q0J2P9Loj4J1o2K8Mj4O2l7K7J2l6O5n8K5l5J4KK0k4k5j0mN7l5j2P8
6306I5k9J1%l6p1N6P5k6m5Q3k5m1l4P7J2l2jMRl8J0N6m4j3K0K9jj16R6O9r8l5
6338A7K6Q8j9p8R9r8L2k8J9l6n6Q5J7k7J1l6L7l0oM9k8j3o8R5o0N1k4K0j1m5L1
6369A4R1n8r8J19k3m1Rj6kJ6j09J30L9j69J2J16L1r1NN9j7n7m3R2k5k2O6ml1k3
6399c0j9M5J3Pk7%M8J8k3n0km0P5p4N8nLj12P2qM6j13Q7Qn6oL5PJ8p1K4L3J8l
6433b4m5O5m8l3Q6%n7l2O2L8n7j1N4l2omO9m4pn6N9K0o3Q4L1r0k8M3L0lj07L8
$$ plain form
6214 130 20 -11 86 81 -7 8 67 27 52 85 29 -33 44 105 60 27 6 31 86 -25 -9 24 40 -52 -18 97 -3 21
6242 21 84 -14 -18 12 14 17 -44 -13 25 80 -31 45 -23 51 -51 9 77 20 -1 -4 4 100 52 -34 78 -19 51 83 40 8 44
6273 44 30 48 -32 -20 59 62 56 42 53 -9 19 23 9 71 34 61 73 37 102 44 69 34 48 50 70 46 21 11 7 64 29 17 95
6306 95 66 77 77 41 -30 26 101 75 30 113 88 47 13 90 102 70 69 73 82 44 54 110 66 53 73 102 101 -15 81 150 52 17
6338 17 43 131 112 34 133 35 67 39 58 22 -34 51 68 41 52 16 53 23 17 66 38 25 -43 52 -8 43 19 39 28 -17 14
6369 14 105 47 -51 68 45 4 13 -3 -5 11 -98 32 71 -98 -86 30 61 -30 -25 34 17 -40 -83 9 -16 -38 28 24 -7 -30
6399 -30 -49 -4 9 16 -11 -11 37 55 32 -18 -20 -60 15 -59 -1 -6 -3 -115 -43 -51 -5 -118 -31 -23 -79 -85 -50 -43 -25 -96 -72 -39 -21 -24
6433 -24 -69 -4 -52 -85 1 1 -56 -88 -26 12 -45 -56 -2 -34 -40 -44 25 -19 -26 -82 -23 -3 -66 18 49 -41 -69 -26 4 1 -106 -68
6465f8M8j3J1j7K2l8L2PLl1pm3Q3q8R8N5j65J03rql8L2%Lq9M3kQ6q6NJ2M2n2K9
6499d0J8p2L3K7j8M9nk7R5l9n9QJ5l6RjL4l6M6mMm0M6J7o3l3P0j9N7l9rj9P6j01
6533e6RL8l3k5P1k3j20J06M6j3l7p8J25M8r9JL5K5j73J24N8k4j5M3K4j00RJJ30
6562I7r4l9N6qp6L7Q2J7p7M2N2n3l6Q2l0%r6R3O1j34j3O1M5q6l9J20L2j05j6Q1
6592E6n1m7j3L6R1m3m6L5p3M4PK5l9J6J4mJO0l4l7l0OJ8J9q9J25Oo7n7M3O3n7
6624b2N5L3k4n3J5J3Lk6MO0L5j31N9N9o2L0p2Q3lj08O0rn7L5mJ12j58N9K9L3r
6655C9mk8Oj3K0K1np7L8L9m9qR1n9o3N4J9K9n6Q1n2Prk0M6l6L2%N0k7q6K6N1%
6689E7m9K3MN3j14J19k9o0M2mJ7l4L8m0N2J2n3N4r1K6L4k3O4j73Q3O0J6o9MN2
$$ plain form
6465 -68 -20 -33 -22 -39 -17 -55 -23 -16 -13 -44 -51 -94 -11 -99 -1 54 -111 -8 -17 -25 -63 -31 -31 -28 -117 -74 -76 10 -76 -71 -59 -17 -69 -40
6499 -40 -22 -94 -61 -34 -52 -3 -8 -35 60 21 -38 -30 -15 -51 -42 -43 -9 -45 1 -3 1 -39 7 24 -39 -72 -2 -21 36 -3 -12 -31 45 -56
6533 -56 -47 -9 -42 -67 4 -19 -139 -33 13 0 -37 -115 10 58 -41 -40 -5 20 -153 -29 29 5 -10 33 57 -43 -34 -33 97
6562 97 3 -36 20 12 -64 -27 55 72 -5 37 89 36 0 82 52 52 -44 49 110 -24 -37 24 69 -17 -56 64 96 -9 -25 56
6592 56 5 -42 -55 -19 72 29 -17 18 -55 -11 -4 21 -18 -2 12 8 9 69 35 -2 -32 -26 -8 11 -78 47 53 -14 -71 -28 35 -22
6624 -22 33 66 42 -11 4 17 20 -6 -2 58 93 -38 21 80 18 48 -24 59 56 -52 8 -1 -58 -23 -27 85 -73 -14 15 48 39
6655 39 35 7 13 0 20 41 36 -41 -3 36 -13 -21 70 11 -52 2 21 50 -6 75 23 30 21 1 47 11 43 43 93 66 -20 6 57 57
6689 57 8 31 35 88 -26 93 64 4 46 42 59 25 63 23 75 87 34 88 -3 23 57 34 98 -75 8 68 84 15 19 71
6719G1k4n3K8n3L8K5qn6Q1n2P2j02J1M7M0n4l2j5P4l6n3Q6LJj09M9N7l9k5N4n9
6750c3moJ5P5k8j4Jol0o5Q4J8k3ON3l1q5R3m8m3Q0J9r7L7M5q2J10j30M8k2k4O6
6782b1M5p5K0j1jJ4n8M7K4k9lj6J9J4O5k6K0r7O3k9P1n1J9N3j00M5MQp6J3O5l1
6814a5J5k7O4l0o4P5k9PK2j6j5k7L4P2j05N7p6P6o3J3N6jk7l3l6P9L9p7qJ01p5
6845a4Plk1M3J4jj13K7P6N3n8rj4KkrJ4m7O2l6Rq1j0J04Q8j11n9O7N5l6QM5p3
6878b3j1k1N8L2j15L8J8M3j00L4KQlj9P8m6J1J07j67RQ0j4m8m6P4Lk4p4jR4pl1
6910f1L3M1n1lLK8j8lk4O3j5n0K8L3o5J6O8r0N4Pl1M9n6R1nn6m6J01l0m3J6P1
6942E5l3m1N4K1o4j00J08N2l0l9Q9k4k8q7O6M9j9o9J15k4q5K2P9m4OJ8J6j1n6
$$ plain form
6719 71 47 -6 22 -31 7 32 24 -32 49 -3 69 -33 -22 25 65 11 -21 -36 38 2 -51 35 38 39 -70 -21 36 -3 -28 26 -33
6750 -33 -37 -43 -28 47 19 5 6 0 -30 -95 -11 7 -16 -10 43 12 -73 20 -28 -71 9 28 -69 -32 13 -69 41 -89 -41 -63 -87 -21
6782 -21 24 -51 -31 -42 -43 -29 -87 -40 -16 -45 -48 -64 -45 -31 34 8 28 -69 -6 -35 36 -15 4 57 -43 2 6 14 -62 -49 16 -15
6814 -15 0 -27 37 7 -57 18 -11 -4 18 2 -13 -40 -6 66 -39 18 -58 18 -45 -32 24 23 -4 -37 -73 6 45 -32 -40 61 -14
6845 -14 -7 -10 -31 12 26 25 -88 -61 15 68 10 1 -13 -11 -13 -22 -8 -55 7 -29 -20 -101 -111 -7 81 -30 -89 -22 33 -3 5 50 -23
6878 -23 -34 -55 3 35 -80 -42 -24 19 -81 -47 -45 -37 -40 -59 19 -27 -16 91 -76 -67 13 -1 -49 -95 -21 -18 -42 -116 -117 -23 -30 -61
6910 -61 -28 13 -38 -41 -38 -10 -28 -31 -55 8 -7 -57 -29 4 -61 -45 23 -67 -13 -6 -37 12 -44 47 42 -14 -60 41 11 -32 -16 55
6942 55 22 -19 35 56 -8 -108 0 52 22 -17 72 48 20 -67 -1 48 29 -40 75 51 -34 -12 67 23 29 47 63 52 -4
6971dl2J17m9kL5mj09R6m7L1m5Q8o7J24r6o2Q9j3o1L1K6K5j1j3pL6n9Q9J3j24
7001eN0L3k1Po2R1L2j02NK5Mn5k7J14n8m1P6Nj6q1N0J2k3LK1J5n2j8J03r5k8J6
7033b2O5J7p5L5J0m8MJ1K5j4n1N3Kn3J5O5Ll5j9O8L0j12j4J49n0r1O2%j2p6L3
7064b5J27j30m6N4J21q9j11K01m3p7k8O8Mp9M4M4k4o0M5N1j6j44R3J3k3n1P0R5
7092H4j18l0J53m6p8%L5K5j13Q8M6p0m6M5rK2N%O9p0r2J40rj00j3R9Lp5M0P9k2
7123D2p6kJ1q0Q0QJ04j35m0N2Q6q2q4R7O2j13Q2k7j4J2J8j1Qp6NO6m4k4O4j3k9
7154e3j4L6mm5m7R1K8j02K9Q2m0p1O0M0J1j02Q0N9j7j25M8O3m8j6rJ3J8l8O1J0
7184br2J5L1pj0JQ7j7n2K9nN0n1%N2j6q4O9k7J2J2o7M7l1MjO7m0jJ7k3j9M3L9
$$ plain form
6971 -4 -36 81 32 30 65 61 -48 48 1 32 -13 75 8 132 36 -26 63 50 -11 20 46 71 60 47 40 76 17 106 119 -5
7001 -5 45 78 57 64 2 93 125 23 28 53 57 2 -25 89 31 -10 66 71 55 -26 24 36 13 16 37 52 0 -18 85 -10 -38 -22
7033 -22 43 60 -15 20 30 -18 -14 -3 22 8 -43 10 12 -41 -26 39 42 7 -12 56 86 -26 -40 109 59 -32 30 30 18 -58 -25
7064 -25 102 -28 -74 -20 101 12 -99 102 59 -18 -46 22 26 -53 -9 35 11 -49 -4 47 31 -113 -20 -7 -30 -81 -11 84
7092 84 -34 -64 89 43 -35 -35 0 25 -88 0 46 -24 -70 -25 -34 -12 -7 -7 62 -8 -100 40 31 -69 -82 17 20 -55 -15 64 42
7123 42 -34 -36 -25 -105 -25 -17 87 -48 -88 -36 50 -32 -116 -19 43 -70 12 -15 -29 -17 1 -10 -2 -78 -73 -7 -51 -75 -11 -24 -53
7154 -53 -67 -31 -35 -80 -127 -36 -8 -110 -81 1 -39 -110 -50 -10 1 -101 -21 38 21 -104 -56 7 -41 -57 -66 -53 -35 -73 -12 -2
7184 -2 -94 -79 -48 -55 -65 -64 23 6 -46 -17 -22 28 -23 -23 29 13 -71 -2 -29 -17 -5 -72 -25 -56 -52 -53 14 -26 -27 -10 -33 -52 -9 30
7218C0j8j09k6J18m8RN8m8L9p6N7k1qq4J59J7j03K7N4M3j51K4J67p0o6lO3J8k0
7247C2k4O8m3m7lQ1o7j4K9P0l7p0R2pl4MJ1L7p9l4R2m9r5J17on9K0pR5o7m9QP6
7280D1o7J2M4M0j40J01Mmo0RM4o8N4N3J9p2l9J49r3k4j9RJ31j52K4O1Rq9K4L6
7310C7lj9mN3N8j51O9M1n7k9L0J9jL1l3mn2OL7O1o9K0K0J3j15M1J9K0m6P0k8Q
7342D2m4jP9o9o2P8P1q6m6Q4j7m4K5K5K2q8L7L1M3j08M2J3kl9P5kk0n9J4L7l2
7373aj9O5o2j2L9O4k9j03N4K9%o2K2Jj8J2Q6n7r7RR3K0r0k0J31j18K3kJ05n9n8
7404e4J4J8n1j2N2Kmn7J44n3r3m7J62k3n3q3J50m5l4PP9k1r5P8N2m9q1R3N6o8
7434a6k3M6K1o4N1J0K8j25j4R2Qr1K1Q6p6l0K6Q6p5Rk2O9n1k0N5m9PP1j8rn4R0
$$ plain form
7218 30 12 -97 -123 -5 -53 -44 14 -34 5 -71 -14 -35 -43 -127 32 49 -54 -27 27 70 -81 -57 110 40 -26 -29 34 52 32
7247 32 8 76 33 -14 -17 64 -3 -17 12 82 45 -25 67 60 26 30 41 78 -1 -35 57 8 -87 30 24 -35 -15 -22 73 6 -43 -35 41
7280 41 -26 -14 30 70 -70 31 35 31 -29 -20 24 -44 10 63 82 10 -29 120 27 3 -16 -7 124 -28 -4 57 66 -23 1 37
7310 37 34 15 11 64 122 -29 40 81 24 -5 25 44 43 74 41 37 -15 -9 28 89 20 40 60 73 -42 -1 18 38 -8 62 34 42
7342 42 -2 -3 76 7 -55 23 94 8 -38 46 29 -15 10 35 57 -31 6 37 80 -28 14 27 25 -14 61 59 39 -20 -6 31 -1
7373 -1 -20 45 -17 -29 10 74 45 -58 -4 25 25 -37 -15 -14 -32 -20 66 9 -88 -79 14 34 -56 -76 55 -63 -40 -42 63 4 -54
7404 -54 -40 -22 -73 -85 -33 -31 -35 -92 52 -1 -94 -141 21 -2 -55 -138 12 -33 -67 -60 19 -2 -97 -19 33 -16 -97 -4 52 -16
7434 -16 -39 7 28 -36 15 25 53 -72 -86 6 14 -77 -56 30 -46 -76 -50 36 -39 -30 -52 17 -34 -54 1 -48 -41 30 12 3 -51 39
7466C9o4l6L4N1O9j21%j7O9q9K9K5j5K6kJ5j7l7O5L4k9j03K1J08j3q8N7L2r8J16
7496F1l4J5j02N5%K2o7LN3j8m0oR8n8j8N3J8m4r6J36j7q1L7j9O2m4P1L0j07jk1
7527e9P4j7m4j9J30r0KkQ1j60N4N3njl1K8L6j00M7L3k6j7N5N7n7r8J00l0K6m7
7557b7M6k9PM5n0O7m4LOJ8l0j2P8n4p1L2N4o8j3K7P0o0K4l6j3J6M9lm4l0M6J8
7589B2LN2o1L2l5pL3J7J5p1Q8m1Ln0R1k1p5M6N2Om3L1pl1m8Q2j9k7o5O8K3Jm2
7622B2J6k7LP6lm3nl6L5K3k8K3M7n4K5j8l1j0M7j8l8NrR2j2r6L4N3k7m4Q6n5l6
7655ck5nR0m3n3R2k6l1k8J20n8o3P4m9Pl3Q7or1J8Q9ol6j6K5m1mM1M4n9k8J8L0
7688C1m3K6L7Lr5J7J3J3n6J2L0L5n1J9M2k2p1L3R7p5k0J4Ojj17R6M5j3j4l0N7
$$ plain form
7466 39 -25 -61 -27 24 93 -28 -28 -45 24 -65 -36 -11 -26 0 -2 13 -4 -41 24 58 29 -74 -53 55 42 -46 11 43 -55 61
7496 61 27 42 -60 -5 -5 17 -50 -47 6 -12 -52 -58 40 -18 -36 17 35 -9 -105 31 14 -67 -30 -49 13 -31 40 70 -37 -38 -59
7527 -59 15 -2 -46 -65 65 -25 -23 -25 56 -104 -50 3 -2 -3 -34 -6 30 -70 -23 10 -16 -33 22 79 22 -76 24 -6 20 -27
7557 -27 19 -10 -3 42 -8 59 15 18 24 42 12 0 78 24 -47 -15 39 -29 -42 -15 55 -5 19 -17 -30 -14 35 32 -12 -42 4 22
7589 22 25 77 16 48 13 6 39 56 71 0 88 47 50 0 91 70 -5 41 93 99 56 87 80 49 1 83 64 37 -28 40 63 64 22
7622 22 38 11 14 90 87 44 39 3 38 61 33 56 103 49 74 56 25 15 62 44 6 11 2 94 82 -14 20 73 46 2 88 33 -3
7655 -3 -28 -33 57 14 -39 53 27 -4 -32 88 30 -33 41 -8 -1 -34 53 47 -44 -26 63 57 21 5 30 -11 -15 26 70 11 -17 1 31
7688 31 -12 14 51 54 -41 -24 -11 2 -54 -42 -12 23 -28 -9 33 11 -60 -27 70 -5 -25 -11 -5 -6 -123 -27 18 5 -9 -39 18
7719A8p2N5M5o6k7k4P8J6m6j0L3N2Oj0Oj12K7M3M2p9l6J50j28QP8Kn0qm3R4m7
7750eq4J36q1pK7j2K5L6j35N7K7nj0nQ2j30M6O6l0o6P0J7l4o6JR1l1k1nQ1qq8
7782f1j0PM8L8L4p7k6J8Mj6l6L1j1N2kJk3kjJ02o9j8j0M3kj02l2R1j7k3O1k7k4
7815e9j7N6lRn8l6J37n6l8N9L4m4Lpkl8l6l5P8m7O1k5P5o4j8R3l3l9N0l7J9n0
7847f8N6K4o6j0R4o3K6l0J4N7o7N2k5L2j01Q4O7m7r2O3j1j0J8qJ27j00Lm9O4p5
7877d1J2KRl0mL2K5j2j6k6N3j7k6J07p7j2J8Mkm6K6OJ3j1O3r6P2l2L0Rl2j7k5
7910d1R8m4K0n4pN2K5m5JK6%J5j1n8R3p7L3o2O1J6p7K0mK2m6J05mj5Lk8L4j5l2
7943DK4j8J8l6O7k3mn9O8N2j31L3L7M3Kj01M7Ml4j2R4o1K2l0R6lm9J2K8n4L1O
$$ plain form
7719 18 -54 1 46 -20 -47 -71 7 23 -23 -33 0 52 58 48 54 -58 -31 12 54 -25 -61 89 -39 -31 47 49 -1 -9 -52 42 -5
7750 -5 -89 47 -34 -41 -14 -26 -1 35 -100 -43 -16 -21 -31 -36 46 -84 -38 28 -2 -68 2 19 -15 -81 -80 11 -20 -41 -46 35 27 -61
7782 -61 -71 -64 -16 22 56 -21 -47 -29 -25 -41 -77 -46 -57 -5 -7 -6 -29 -31 -32 70 1 -17 -27 16 14 -88 -120 -29 -46 -69 -8 -35 -59
7815 -59 -76 -20 -23 -14 -72 -108 29 -27 -65 -6 28 -16 -13 -20 -22 -60 -96 -131 -53 -100 -39 -64 11 -53 -71 22 -11 -50 0 -37 -18 -68
7847 -68 -12 12 -54 -64 30 -33 -7 -37 -23 34 -33 19 -6 26 -75 9 76 29 -63 0 -11 -21 -3 -11 116 16 19 -30 34 -41
7877 -41 -29 -27 -18 -48 -52 -20 5 -7 -23 -49 4 -13 -39 68 -9 -21 -3 1 -1 -47 -21 -15 -2 -13 50 -46 26 -6 24 33 1 -16 -41
7910 -41 57 13 33 -21 -28 24 49 4 5 31 31 46 35 -23 70 -7 26 -36 25 41 -36 -16 -20 2 -44 61 57 42 45 17 51 36 4
7943 4 28 10 28 -8 59 36 32 -27 41 93 -38 -5 32 75 77 -24 23 27 -7 -19 75 14 36 6 102 99 50 62 90 36 67 73
7975G3K0n2l7M6L4r6L4P1m4Ll5O5np8l2R6k9nM0n7K5m6L4P1n6o0L2P5n0l8J24
8006A23p9k4QlK0o2L6N0o5j6lO6l0p8R2N1j46L0M9M8p5L8L0j9o8J18m2m8j6K6
8036A1R7r0jJ3l3Q9r1O6jo9k9K7P1j4j15J9J02j29O9k5mn0M6R2q8m2N8j4kKN3
8067A8J9m4m9J04o0j43P6L1K7l2j3M5M7j09N1L9k8j3N3l2l6J8j5P0p0L5jJ0k3
8096b5M4%o0J7J1M0Qr6R2k0m6J9K1j07O5L7n7L1m3O9o2%%j9J06ln2j6L9j2M4P
8128C2l3k0n0M9k0K8p7R6j9o5K4RN2o0K6O5l7k6M1o7m3O4NJ00j21R6j15R5On8
8158b3Lk1K5J4J8j08P2l8N0J0j0l6N5J6p5%PNl7O2j5l9N6j00J09J3p7M2J6j9m6
8189g1M9j4
$$ plain form
7975 73 93 41 4 50 84 -12 22 93 49 52 17 82 77 -1 -33 63 34 29 69 12 37 -9 25 96 40 -20 12 87 37 -1 123
8006 123 44 20 28 25 45 -17 19 69 4 -12 -15 51 21 -57 35 86 -60 -30 19 67 -8 30 60 41 -27 91 49 1 -15 11
8036 11 108 18 17 30 -3 86 -5 61 60 -9 -38 -11 60 46 -69 -50 52 -77 -8 -33 -37 -87 -41 51 -37 -79 -21 -35 -37 -35 18
8067 18 37 -7 -56 48 -12 -155 -79 -48 -21 -53 -66 -21 26 -83 -32 7 -21 -34 19 -13 -49 -31 -46 24 -46 -11 -12 -2 -25
8096 -25 19 19 -41 -24 -13 27 35 -61 31 11 -35 -16 5 -102 -37 0 -57 -26 -69 0 -62 -62 -62 -81 25 22 -30 -46 -7 -19 25 32
8128 32 -1 -21 -71 -22 -42 -14 -91 5 -14 -79 -55 -46 6 -54 -28 37 0 -26 15 -52 -95 -31 -26 74 -47 49 -66 29 35 -23
8158 -23 -20 -41 -16 -2 16 -92 -20 -58 -8 2 -8 -44 11 27 -48 -48 -41 -36 -73 -11 -26 -65 -9 -109 0 13 -64 -22 -6 -25 -71
8189 -71 -22 -36
8191c6
$$ Imaginary data points
##PAGE= N=2
##DATA TABLE= (X++(I..I)), XYDATA
0@%%%%%%%%%%%oJ1nOj4J6j6J6k1K6k6K9l6M0m2M8n3N9o6P2q0Q9j01J12j20J31
37F9j48J65j79J95k16K40k66K95l31L73m18M77n51O39p50R00j109J408j861K607
57A539l983O976j5822Q4493L50836l49314m47592K74894L88304k11946l02771
68b24386K01275K14982k33663j74237K69140J76723k73929k08286K21983K22323
78A91925j29616j95144K6671J17874M6735j8242p4607o9976O4961J18576m7333
89C1824j25289N0253J07920q7782r6765J48661J10104k10063j50602K46324J99134
100B23719k50236k35188K27823K42240j99741k22268J81135J86877j79240j53130
110a78009J87063J29257j94496j16571J90081J05983j73592r1806J47484O8249
$$ plain form
0 0 0 0 0 0 0 0 0 0 0 0 0 -6 5 0 6 -8 8 -8 8 -13 13 -13 16 -20 20 -22 26 -27 32 -34 38 -42 47 -54 58 -62 69
37 69 -79 86 -93 102 -114 126 -140 155 -176 197 -221 256 -295 344 -406 494 -615 793 -1068 1539
57 1539 -2444 4532 -11290 73203 424039 74725 -372867 -97973 290331 78385 -224386
68 -224386 -23111 191871 -41792 -216029 53111 229834 -44095 -252381 -30398 191925
78 191925 62309 -132835 -106164 11710 58445 40203 -34404 -104380 -39419 79157 31824
89 31824 -93465 -43212 64708 -23074 -119839 28822 138926 -71137 -221739 24585 223719
100 223719 -26517 -261705 -33882 208358 8617 -213651 -32516 154361 -24879 -178009
110 -178009 9054 138311 -56185 -172756 17325 123308 -50284 -142090 5394 73643
120G3643j20652m0567R3913R805o9825J8938M4913m8542k1328P7881M15j08134
132h9540J2841J32055j9669j45685K4082J45829l4293j37072N4831J28235q3962
143a2348j28338J13161J39949j29275j55010J27577J62556j09289j50047Q8348
153e2716J17701p7144p2902Q5849L3650j08113j0909J32102Q828j40382j6331
164a00367J27281J8749r5132j529O1040l4533l9427Q0452M0105j17154n6799J33407
176A6093P6557j24901q1757J03665O5799q4799l2332Q2132l950r6599K8218J20116
188F8242l1568j36254J8797J34127r90j10195n823P5304l443m0457K8686K0466
200A6892n5634j5020P4733K1127p5727k3739O3529J6759m3862N551L0651l4617
$$ plain form
120 73643 -47009 -87576 6337 16142 -53683 -34745 10168 -38374 -59702 18179 18594 -89540
132 -89540 -76699 55356 35687 -109998 -85916 59913 25620 -111452 -56621 71614 -12348
143 -12348 -140686 -27525 112424 -16851 -171861 -44284 118272 8983 -141064 -52716
153 -52716 64985 -12159 -85061 788 34438 -73675 -84584 47518 56346 -84036 -100367
164 -100367 26914 45663 -49469 -50998 10042 -24491 -63918 16534 56639 -60515 -117314 16093
176 16093 92650 -32251 -114008 -10343 55456 -29343 -61675 20457 16507 -80092 -51874 68242
188 68242 36674 -99580 -80783 53344 52354 -57841 -63664 11640 8197 -32260 -3574 16892
200 16892 -38742 -53762 20971 42098 -33629 -57368 6161 22920 -20942 -15391 15260 -19357
212a9357k7249O3621L6150q0689m6670Q6310N3420q0340m7970P3988L3732p0432
224b5486j2953P6101m146q5438J5407R5413j7920r8630J6959R4068j5851q1856
236d4332J9813O7315k8522n4061M0578M5315n1138m0339N8230L7503n9424l3116
248d2178N6650K6077n1497j5620M7501L828m4514P880M3605j7236m2924K3908
260d520M1735k7699l8248L0219L3344l1275k6382L3245J9412l4744j1748L7262
272B0601O105l8393p95L9644k008l8523M549L6152o304l1376Q719K5964j1636
285A2699k0356J5259J5610j8626j2510K0421J0175k0389q038J8208M766j5033
297B186m39J1641n265r733J0382Q672j4371q681J6058P449j6746n582J5947J545
$$ plain form
212 -19357 -46606 17015 53165 -27524 -74194 12116 65536 -14804 -62774 11214 44946 -25486
224 -25486 -38439 37662 33516 -51922 -36515 58898 40978 -57652 -40693 53375 37524 -44332
236 -44332 -24519 42796 14274 -39787 791 46106 -5032 -45371 12859 50362 -9062 -42178
248 -42178 14472 40549 -10948 -26568 20933 24761 -19753 -11873 31732 14496 -28428 -4520
260 -4520 37215 9516 -28732 1487 34831 3556 -22826 10419 29831 -4913 -16661 20601
272 20601 26706 -11687 -12482 27162 25154 -13369 -8820 27332 21028 -10348 -1629 24335 12699
285 12699 -7657 7602 23212 4586 -7924 12497 22672 2283 -5755 12453 17219 2186
297 2186 1747 13388 8123 -1610 8772 17444 3073 -5608 10450 17899 1153 -4429 11518 13063
311A3063j6233K425J7011o386j8803Q673J9971r999k0149J0487J9181j1138j7010
324h907J2544J5292j4106j3772J5651J3076j6172j2107J6205J1236j5490r407
336e957J5021P440j4918n740J4758M935j4494m495J3095L659j1275k632R032K26
350H655q176J847P798l857r001L699R072l252r163J244O723j165m913J444K111
365C066m239k315N354K700p015n248N436O129l959o819J242M987o46l522N91K236
381b022j936k715K865M050k908n904J518O868K24o528j667N638K010m694j330
396f531M657L62n460J35O731N41p457j318P801K022p128j952O787J371o732n40
412f711P536M23q503j079Q563J884q035k582O538J812n484o40M854j122n966J595
$$ plain form
311 13063 -3170 -745 16266 9880 -8923 -250 19721 9722 -10427 60 19241 8103 -8907
324 -8907 3637 18929 4823 -8949 6702 19778 3606 -8501 7704 18940 3450 -5957
336 -5957 9064 16504 1586 -4154 10604 15539 1045 -3450 9645 13304 2029 -603 8429 8655
350 8655 479 2326 10124 6267 -2734 965 10037 6785 -2378 -1134 5589 4424 -489 955 3066
365 3066 -1173 -3488 1866 4566 -2449 -7697 -2261 3868 -91 -6910 -5668 -681 -1327 -4849 -4258 -2022
381 -2022 -3958 -6673 -3808 242 -2666 -8570 -7052 -184 40 -6488 -8155 -2517 -507 -5201 -6531
396 -6531 -1874 -1512 -6972 -6837 -106 435 -7022 -8340 -539 1483 -5645 -7597 -810 561 -6171 -6711
412 -6711 825 1248 -7255 -8334 229 2113 -5922 -8504 -1966 -154 -5638 -6278 -1424 -2546 -8512 -6917
428f917P051j214p873n58P293J989n365k596K790J711r48L56O40k092j578K803
444d508L408j741m249j23L952K283j722k836k22K371K101k54j875r40O86J886
460a783J988m74l153j310M076L839k947m730J821M975m88l620Q60K423k139j465
476b127M228J773o150k936P332M472p547n277O856N332o425m408O378K888p121
491b732j390Q692M52j0339m48J1505Q38j1886j013J1522P84j0682L15J0105j737
506C986r939L587J0337m638j0511N615J0918n655j0334O020R736o011q356O770
520A525P517p015o015P367N067p182l553P410K021p130j88P557r81p767J776P676
536H085j937o731K308M948k789k806M111J190o091k89P462M09p641r83O547O25
$$ plain form
428 -6917 134 -1080 -8953 -9511 -2218 -229 -5594 -8190 -5400 -3689 -4637 -4281 -3641 -5733 -7311 -4508
444 -4508 -1100 -2841 -7090 -7213 -3261 -978 -2700 -5536 -5758 -3387 -1286 -1540 -3415 -4355 -3669 -1783
460 -1783 205 -269 -3422 -4732 -656 3183 236 -4494 -2673 2302 1814 -1806 -946 1477 -662 -2127
476 -2127 2101 3874 -2276 -5212 2120 6592 -955 -6232 624 5956 -469 -4877 1501 4389 -2732
491 -2732 -4122 4570 5022 -5317 -5765 5740 6578 -5308 -6321 5201 5985 -4697 -4382 5723 3986
506 3986 -5953 -2366 7971 3333 -7178 -1563 9355 3700 -6634 -614 9122 3111 -5245 1525
520 1525 9042 2027 -3988 3379 8446 1264 -2289 5121 7142 12 -176 7381 6400 -1367 409 8085
536 8085 6148 -583 1725 6673 3884 1078 5189 6379 288 -1 7461 7870 229 -754 5793 6418
552F418m104R91J687l918m07P325N22r633j360J0137K037q870q44P031k231n822
568a041O884P072j1033r567J3502J2986j3356j4568J1607J3989r564j0675R619
581E855O304j1775k882J5762J687j9293k955K0602N238j8931o448J4693M753j0270
595B340o89P208n123o873R624Q308j1983j0195J1015R772r155p014P285J516p886
610a850L932J0465q224j4660R402J7784q561j8667O810J6869o288j3082P722R476
624A1128j0789p312J4224P401j6195q161J5858Q803j3296p454J0019M258p206
637A278M82O284m766o326P888P106r150o743R330N209r337k160J0259j244j2158
652d048L915J4223n822j5920O384J6118p123j5701P656J4085r471j2819J0456
$$ plain form
552 6418 2314 3305 4992 1074 667 7992 8514 -1119 -2479 7658 9695 825 -19 7012 4781 -1041
568 -1041 5843 12915 1882 -7685 5817 18803 5447 -9121 2486 16475 6911 -3764 5855
581 5855 12159 384 -2498 13264 14951 -4342 -7297 13305 18543 -388 -6836 7857 12610 2340
595 2340 1651 8859 3736 -3137 6487 14795 2812 -7383 3632 13404 4249 -2765 4520 6036 -1850
610 -1850 2082 12547 4323 -10337 -935 16849 8288 -10379 -3569 13300 7012 -6070 1652 11128
624 11128 339 -6973 7251 14652 -1543 -9704 6154 14957 1661 -5793 4226 8484 1278
637 1278 1760 8044 3278 -3048 4840 11946 2796 -3947 5383 10592 1255 -905 9354 8110 -4048
652 -4048 -133 14090 8268 -7652 -1268 14850 7727 -7974 -318 13767 4296 -8523 1933
665A933J1148j1668r883J1605P256j1667m283J1183N9j2207L417J3271o744j4461
679a1041Q445J4099j0004j2757J1938J0015j5417p500J9965O626k4538p222K7540
692A0149R083k7968j0133K6476R320k3842o261K2527K469k2871M76K4773r14k5642
706a2358r84K4479M153j9649n940J2791N223n864j711J201k466M65M890m29m159
721c58L71L31l386M218Q862p223j6274O988K2557m413k6029J008K5689K34k3354
736a0779J394K1375n716k1499J0017K3785j2683k7043J2460K8411j0131k7007
748a7416P842K2849p327j7686R369J3494j2261j1214J4735J1054j4750j0352J2729
761A066Q395r379m132P055j255o326O146P204r179q023J0147P328j0187m733J0646
$$ plain form
665 1933 13081 1413 -8470 3135 10391 -1276 -5559 5624 5683 -6524 -3107 10164 3420 -11041
679 -11041 -2596 11503 1499 -11258 680 10695 -4722 -12222 7743 14369 -10169 -17391 10149
692 10149 19232 -8736 -18869 7607 16927 -6915 -13176 9351 11820 -11051 -10575 14198 13284 -12358
706 -12358 -13342 11137 15290 -4359 -10299 2492 7715 1851 140 1341 -1125 -660 4230 3801 -358
721 -358 13 344 -3042 1176 10038 2815 -13459 -6471 16086 11673 -14356 -13348 12341 12575 -10779
736 -10779 -9385 11990 6274 -15225 -5208 18577 5894 -21149 -8689 19722 9591 -17416
748 -17416 -9574 13275 5948 -11738 -2369 11125 -1136 -12350 2385 13439 -1311 -11663 1066
761 1066 9461 82 -4050 3005 1750 -4576 1570 8774 -405 -8428 1719 9047 -1140 -5873 4773
776D773P85j2416K842J5115n247j7828N827J8900o096j8146O712J5815r174j4009
790a2147J2302J2569j5737j3139J7509J3495j7934j3153J6546J1034j5518p870
802a2043J5525M124j6719j654J8261Q91j8971j513J7590K106j4491j750J0590
815A946j29p149K962N059n288m107O337L607n686j992M160p66k373M595J774q592
831e642j975J1580K770j3435l073J4235K400j4824q65J5558j234j6921K805J8373
845I752l696j9549L891J9412l899j8674M133J6944n060j4981O090J3189p317j1809
859a1574P999J0362q479q878Q286P016p844m860P261K533o895j98O582j982o207
874f878M047N993n640n557O917N054p791m333Q363L447q818k407R120J344r471
$$ plain form
776 4773 5558 -6858 -4016 11099 5852 -11976 -6149 12751 6655 -11491 -4779 11036 1862 -12147
790 -12147 155 12724 -3013 -16152 1357 14852 -3082 -16235 311 11345 -4173 -12043
802 -12043 3482 7606 -9113 -10767 7494 8385 -10586 -12099 5491 7597 -6894 -8644 1946
815 1946 1817 -5332 -2370 2689 -2599 -6706 -369 3238 -2448 -4440 -280 -1046 -3419 1176 2950 -5642
831 -5642 -7617 3963 6733 -6702 -9775 4460 6860 -7964 -8829 6729 5495 -11426 -8621 9752
845 9752 6056 -13493 -9602 9810 5911 -12763 -8630 8314 3254 -11727 -5637 7552 235 -11574
859 -11574 -3575 6787 -1692 -10570 -2284 4732 -3112 -7972 -711 1822 -5073 -5271 1311 -671 -6878
874 -6878 -2831 3162 -2478 -8035 -1118 3936 -3855 -8188 175 3622 -5196 -7603 1517 2861 -6610
889f610n62R323n0r128M03Q245r93p130J501N661k445m700L014L664l640k865
905f312L494J507l332l20K757j780k808L414K867n117l401N949L377o263l178
920i146O388K027o596p26P634m02q727J059R833r51r989M76R647m29q162J217
936f847O841k371n927M070O016m963o268N360O818m436o200L520M897k518k782
951d790K725R57l472K30M605m57n264p5M732O58l562n56J808n57l89K064j18l782
969e243m03M623J348m449k138L269J908j993r57J066o16j169K002K045k635l041
985f383K169L895j020l447j67K511J036o61p05n25J37J494R33j157j200O89J175
1002a226N5Q8J35j151m81K271J891k455k883K529L887j661l770J227L549r87k620
$$ plain form
889 -6610 -7172 2151 2101 -7027 -6624 1621 628 -6502 -5001 660 -1785 -6485 -3471 193 -3447 -6312
905 -6312 -2818 -1311 -4643 -4963 -2206 -3986 -6794 -3380 -513 -5630 -9031 -3082 295 -5968 -9146
920 -9146 -2758 -731 -7327 -8053 -419 -821 -9548 -8489 1344 393 -9596 -9120 527 98 -8064 -6847
936 -6847 -6 -2377 -8304 -4234 1782 -3181 -9449 -4089 2729 -1707 -7907 -4387 510 -2008 -4790
951 -4790 -2065 -1108 -4580 -4350 255 -202 -5466 -5541 -809 -151 -3713 -4269 -2461 -3018 -3407 -1343 -1461 -5243
969 -5243 -5646 -1023 325 -4124 -6262 -2993 -1085 -3078 -4035 -2969 -3585 -4754 -2752 -707 -3342 -6383
985 -6383 -4214 -319 -1339 -4786 -4953 -2442 -1406 -2067 -2772 -3297 -3160 -1666 -733 -1890 -3090 -2401 -1226
1002 -1226 -1171 -1083 -948 -2099 -2580 -309 1582 -873 -3756 -1227 2660 999 -2771 -1544 2005 1018 -1602
1019a602J350K075j977j693K764J849l290k253L249K808k937l025K283K912j399
1034A114k201Q39J149m89M4Q81q97j555J494K322j059k777M10K720L13j622m43
1051B43N60%N36J584m67k736j19L658J877k976k962J936L651O6k662j131J402
1068B460J423L59k54p16j087J57K277J725j858l525M35M601K067l934l797K273
1084B606M501j50l611q07J774O18k15R10j64k734p92L822K652l669m273K235M738
1101G441k84l699j064J829J160R5k7j104j584J090K796M2k883j102J964J581n78
1118E673q95n83m52J029K137m59l178p07L402J894k869k378J869K249j128j591
1134D013Q15O69j149k29J510Q0k102m02K051Q10j872j419J046J362l92j467m42
$$ plain form
1019 -1602 -252 1823 -154 -1847 917 2766 -524 -2777 472 3280 343 -2682 -399 2513 1114
1034 1114 -1087 -248 901 412 456 1337 440 -1115 379 2701 1642 -1135 -725 1995 2308 686 243
1051 243 803 803 1339 2923 2456 -280 -399 3259 5136 2160 -802 1134 4785 4851 2189 1058 2460
1068 2460 3883 4242 3988 3272 2185 2342 4619 6344 4486 961 1396 5997 8064 4130 333 2606
1084 2606 7107 6957 3346 2539 4313 4931 4716 5626 5462 2728 1936 5758 8410 4741 468 2703 7441
1101 7441 7157 3458 2394 4223 5383 5478 5451 4347 2763 3853 6649 6691 3808 2706 4670 6251 5673
1118 5673 4778 4195 3743 4772 6909 6450 3272 2565 5967 7861 4992 2614 4483 6732 5604 4013
1134 4013 4828 5497 4348 4119 5629 5709 3607 3205 5256 6066 4194 2775 3821 5183 4791 3324 2882
1151B882R40P63o25j257n1J197Q3j385k26J254j66j367K26J527p93k058P89K557
1169D290p44l102M10L217j05l149k80K513L13j897J99J142j021q17J883Q64k861
1186H55j243L113J588k980j848K488J366k065o05J905j016k456J948L436k713
1201A773m827K244N542j681n843N77M846m91l721R05K315k474k137L794K468m964
1217a674l736M653M535l550m723J718L318n17j359M15j015j459K326L079k467
1232d56m238J485M191j97k841k61O45m59J427K403k421m451K054O135q98o098
1248c980m23N070P77l212J80J695k144j200M226J600n648k631N624L473m819l470
1264d882L361K009k495J04K210k499k895L876M229m924n413M784N562m235m996
$$ plain form
1151 2882 3822 4585 3960 2703 2652 3849 3932 2547 2321 3575 3409 2042 2268 3795 3002 944 1733 4290
1169 4290 3546 444 854 4071 3966 817 537 3050 3363 1466 1665 2807 1786 969 2852 3716 855
1186 855 -388 2725 4313 1333 -515 1973 3339 1274 669 2574 1558 -898 1050 4486 1773
1201 1773 -3054 -810 4732 3051 -2792 -2215 2631 2140 -1581 -676 1639 -835 -2972 822 3290 -1674
1217 -1674 -5410 -757 3778 228 -4495 -2777 541 24 -1335 -920 -1935 -3394 -1068 2011 -456
1232 -456 -4694 -3209 982 785 -2056 -2317 -1672 -2131 -704 1699 -722 -5173 -3119 3016 2118 -3980
1248 -3980 -4403 667 1444 -1768 -1588 107 -2037 -3237 989 2589 -3059 -5690 -66 3407 -1412 -4882
1264 -4882 -1521 488 -2007 -1903 307 -2192 -5087 -1211 3018 -1906 -7319 -2535 3027 -1208 -6204
1279f204L751L448m063j703N143j0o716R94Q283r33r273M09R445J86q409m9O858
1296A157p73n041K861M147m962l783O951M504p563n187P489N264o138l742N005
1311A89J385m481J809N476m326p150N732R019n521r667M488Q901l544o596L875
1326d11L770n594j307Q097N64j0650j240J1936K381j1135l119Q821K393o029J58
1341a365M015l613l383O654M289q381n320Q439N860o971m489N669J571n130K397
1356B42O245n544q116P545J0621p612j1684O925J1336o035q972O581O242q085
1370c11l780J0981K871j3420l045J4888M096j4433m423J2553L703j0129j406Q421
1384F566j856p707N022Q124o997r004P529R074p020p891O166N173n982k098O842
$$ plain form
1279 -6204 -2453 995 -3068 -4771 372 362 -6354 -5360 2923 1990 -7283 -6874 2571 2757 -5652 -5701 1157
1296 1157 384 -4657 -1796 2351 -2611 -6394 557 5061 -2502 -7689 -200 5064 -1074 -4816 189
1311 189 1574 -2907 -1098 4378 52 -7098 -1366 7653 2132 -7535 -3047 5854 2310 -4286 -411
1326 -411 3359 -2235 -3542 4555 5119 -5531 -6771 5165 7546 -3589 -6708 2113 4506 -1523 -1365
1341 -1365 2650 -963 -4346 2308 6597 -1784 -7104 1335 7195 224 -4265 1404 2975 -2155 242
1356 242 6487 943 -7173 372 10993 3381 -8303 -1378 9958 3923 -5049 1532 7774 -311
1370 -311 -4091 6890 9761 -3659 -6704 8184 12280 -2153 -6576 5977 9680 -449 -1855 6566
1384 6566 4710 -2997 2025 10149 3152 -5852 1677 10751 3731 -4160 2006 7179 1197 -901 5941
1399E941j092q740L172J0443m121j1633M131J1409m159j0080M788P927o315o139
1413d468Q561M758j0814m335J2389M193j2783m160J2229L262j1123j624J0044
1426F129p49r380L215R111n086r413O351R272o897q574O829P125o955n277P285
1441B986K861q141r58Q958p09r953J804R842k641r456L319Q073m633o624O044
1456G72M975q009l987R696L014j1152k521J1591J742j1679o95J1277j312j0775
1470g063L245J0581n377j0842P091J0952q154j0892Q777J0130r003q867R360P184
1484G122r920n439J0562L800j1106k542J1300J437j1106k54J0332j243r403K750
1498c710Q300m442p441N802O434p209n511P896M304q714k918R041J217r593L9
$$ plain form
1399 5941 4849 -3891 -719 9724 5603 -6030 -1899 9510 5351 -4729 59 7986 1671 -4468
1413 -4468 4093 8851 -1963 -6298 6091 10284 -2499 -6659 5570 8832 -2291 -3915 6129
1426 6129 5380 -4000 -785 8326 3240 -6173 178 9450 2553 -6021 808 7933 978 -4299 2986
1441 2986 5847 -2294 -3252 5706 4997 -4956 -3152 6690 4049 -5407 -2088 5985 1352 -5272 772
1456 772 5747 -2262 -6249 3447 6461 -4691 -7212 4379 6121 -5558 -6253 5024 3712 -7063
1470 -7063 -3818 6763 1386 -9456 -2365 8587 433 -10459 -1682 8448 -555 -9422 -62 7122
1484 7122 -2798 -8237 2325 6125 -4981 -7523 3777 5214 -5892 -6146 4186 2943 -6460 -3710
1498 -3710 4590 148 -7293 -1491 4943 -2266 -7777 119 4423 -4291 -7209 1832 3049 -6544 -6505
1513f505R794j510r986K504R709l771r213M610Q467n818p778O811O821p491o050
1528i406P865M918p955l538P859K103p776l37P790j213p697K636P625l695p089
1543g910M636O387n392n094O433L927p391k643Q536J739r384p82R970J90r923
1558f701M14R668j390q938K391Q242l736p575M989O936n894o662O344O201o478
1573b189n311O111M073n937k224N673M45o026J225O471k380o871K886O884l073
1588b43o144L255M901l685l285M920K083o085j241P511J356p906j604P781J851
1603C465o539r88N322k07m226K170M100l574m372M553N095m093m955L413M151
1618C315k431k182K343K08l094J805M432k472n703K247O210j515n645J059M098
$$ plain form
1513 -6505 3289 1779 -8207 -5703 4006 235 -8978 -4368 4099 -1719 -9497 -2686 4135 -3356 -9406
1528 -9406 -1541 3377 -4578 -8116 -257 1846 -5930 -6267 1523 310 -7387 -4751 2874 -821 -7910
1543 -7910 -3274 3113 -2279 -7373 -940 2987 -4404 -7047 1489 3228 -6156 -6938 3032 3222 -6701
1558 -6701 -6287 3381 1991 -6947 -4556 3686 -50 -7625 -2636 4300 -1594 -8256 -1912 4289 -2189
1573 -2189 -7500 -1389 2684 -3253 -5477 196 641 -5385 -4160 2311 -69 -6940 -4054 2830 -243
1588 -243 -6387 -3132 1769 -1916 -5201 -281 1802 -4283 -5524 1987 3343 -4563 -6167 1614 3465
1603 3465 -3074 -4062 1260 1053 -3173 -1003 3097 -477 -4849 -296 4799 706 -4249 -836 3315
1618 3315 884 -1298 1045 1253 -1841 -36 4396 1924 -3779 -1532 4678 3163 -2482 -1423 2675
1633B675j359k448K563J304m363j067N731J698o200k569N639L004m352k419L013
1648H50R06k324Q40K481k399l079K997L814k749m060K160L312j477j819J581L13
1664A347k197J000L611j430m771J308N395n37n282K37M422k18l432R50K666k146
1680I23k359L241K687l703l410L657L927l064l774K052L131j339k057J121O50
1695A683j468J16J911m14k655K22K584K27k213m95J044K85K2L70q43j388J011
1712aK356o51k783j3K607L64j888l31J071l81n13J419L80k148r12K593J532k373
1730C28j882J781J760q93j070N07l0m87Q88J079j604j590J445K059j074k132O05
1747c10J442n53o92Q48o1j560L77K183j66k819k19K611P25k251r02J483O64j151
$$ plain form
1633 2675 1316 -1132 1431 2735 -1628 -2695 3036 4734 -1466 -4035 1604 4608 256 -2163 850
1648 850 1756 -568 272 2753 354 -2725 272 4086 1337 -2723 -563 2749 1272 -547 1034 1347
1664 1347 -850 150 3761 2331 -2440 -1132 4263 3726 -1556 -1319 3103 2885 -547 403 3069 923
1680 923 -1436 1805 4492 789 -2621 1036 4963 1899 -1875 177 3308 1969 -88 1033 1683
1695 1683 215 331 2242 1828 -827 -605 1979 2206 -7 -502 542 827 849 1219 376 -1012 -1
1712 -1 2355 1704 -1079 -1092 1515 1879 -9 -340 731 350 -163 1256 1636 -512 -1424 1169 2701 328
1730 328 -1554 227 1987 1094 24 531 501 14 902 1981 377 -1213 232 2291 1217 -915 -310
1747 -310 1132 579 -113 735 674 -886 -509 1674 1508 -1311 -1530 1081 1806 -445 -1347 136 800 -351
1765c51n7Q34o21j061J107J303j108j634P92J724k68j448r9Q36K27r9P3k90l97
1784e37N42Q17m43r20J94Q34R4n64oJ97k25K10N11k16p46KR94J66q92l89O06L65
1806E94k27k74o1n1J04L81k10o06Q0N84q0m52m0K16j40n2N00j09p70q4J059K87
1828F49j271l89J348N62j141n32R79N46r05j83Q69J94q61N8J172j45j136K53J192
1847A259k0j022J13R29O1n71J81M40k40j12N24K57p93r4Q14K92p22l49N84K52
1867A783l70oK67l38j45N51L04p71m84O93O68n09o28K51K53Q3J27j61o85RR53
1888A845L22r93n95Q49N74n61k38M75j67m95O73J010j023j264J014J638o64j568
1906H32N06J402l44p77O13L43r49n9J527J12j740l31J865N53j483m92J040J53
$$ plain form
1765 -351 -408 426 -195 -1256 -149 1154 46 -1588 -796 928 660 -788 -887 -51 176 77 150 -140 -537
1784 -537 5 822 379 -541 -347 487 581 17 11 208 -17 193 704 488 -258 -256 738 904 12 -377 229 594
1806 594 367 93 32 -19 85 466 256 -350 -270 314 234 -218 -258 -42 -182 -234 266 157 -613 -697 362 649
1828 649 -622 -1011 337 899 -242 -774 205 751 -154 -337 532 726 -135 -77 1095 950 -186 67 1259
1847 1259 1239 217 330 1259 1320 749 930 1370 1130 1018 1542 1799 1006 912 1726 2018 1296 947 1531 1783
1867 1783 1413 1407 1674 1336 1191 1742 2046 1275 791 1484 2152 1643 1015 1266 1519 1602 1729 1568 883 892 1845
1888 1845 2167 1174 579 1428 2002 1441 1203 1678 1511 1016 1689 2699 1676 412 1426 3064 2400 832
1906 832 1338 2740 2396 1619 2232 2575 1626 1567 3094 3206 1466 1135 3000 3553 2070 1578 2618 2771
1924B771p47N01N81j168q10J622J129j890j381J723J297j556j196J306O63j444
1940A401l35J626j11k063J35K309k47k423k0K244n1j915P0J389l99j146P87Q42
1958B093j171p89J310P96j285q43J144M78q36m0O05n34n63J175O13j571p81J611
1976A412J090j700r62J438P34j437k19J439l62j702O71K047q90k400Q40K317q94
1993A422j967O33J582j069j057J343N70j898n11K087M61k346n09K069K91j908
2009h07N5J583p45j463J177J525j826j579J868J702j967j639J921J200j798q69
2025a662K018J55k154J90K448m67k588N65K536o21k435Q06K013j013j738J387
2041e60J281j784j103J970R21k145p91K005N60k074j62J709l41j699P47J599j239
$$ plain form
1924 2771 2024 2525 3106 1938 1128 2750 3879 1989 608 2331 3628 2072 876 2182 2845 1401
1940 1401 1066 2692 2581 518 653 2962 2715 292 272 2516 2465 550 620 2009 1610 464 1251 2093
1958 2093 922 133 1443 2239 954 111 1255 1733 897 857 1462 928 365 1540 2153 582 -199 1412
1976 1412 2502 802 -160 1278 2012 575 356 1795 1433 -269 402 2449 1559 -841 -1 2316 1422
1993 1422 -545 88 1670 601 -456 887 1457 -441 -952 1135 1596 -750 -1259 810 1101 -807
2009 -807 -752 831 86 -1377 -200 1325 -501 -2080 -212 1490 -477 -2116 -195 1005 -793 -1662
2025 -1662 356 511 -1643 -1453 995 528 -2060 -1495 1041 420 -2015 -1209 804 -209 -1947 -560
2041 -560 721 -1063 -2166 -196 725 -1420 -2211 -206 354 -1720 -1882 -173 -514 -2213 -1466 133 -1106
2058a106j646J515J398j712j431J740J008j905o40K004J24k162K19K214n13k478
2074c371Q45K354j025k268J187K098j392j883J780J453j958j225K327R07k325
2089b496p01K409M00k394k3K406k87k387Q01K290j163k138J514K001j734j848
2105c350J960J637k233j259K371R84k590o48K669L83k860q2K887k88k656L45K543
2122a87n95k495J082K128j236j900J411J664j434j428J698R42j758m39J844J22
2138e81j743K22J849m84j607P99J522r52j308J441J158j614q42J898Q31k024m69
2155a904K235K88k130J1K249k73k090N63K138q30j919J091J815j173j677J380
2171b26J288j481j001J745O84j900l46J981L4k035K14J987m49j983Q03J784j126
$$ plain form
2058 -1106 -2752 -1237 161 -1551 -2982 -1242 -234 -2139 -2779 -775 -651 -2813 -2594 -380 -893 -3371
2074 -3371 -2526 -172 -1197 -3465 -2278 -180 -1572 -3455 -1675 -222 -2180 -3405 -1078 -171 -2496
2089 -2496 -3197 -788 -388 -2782 -2805 -399 -686 -3073 -2272 18 -1145 -3283 -1769 232 -1502 -3350
2105 -3350 -1390 247 -1986 -3245 -874 110 -2480 -3128 -459 -76 -2936 -3018 -131 -419 -3075 -2730 -187
2122 -187 -782 -3277 -2195 -67 -1303 -3203 -1792 -128 -1562 -2990 -1292 -350 -2108 -2547 -703 -581
2138 -581 -2324 -2102 -253 -737 -2344 -1545 -23 -975 -2283 -842 316 -1298 -2140 -242 589 -1435 -1904
2155 -1904 331 619 -1511 -1500 749 476 -1614 -1051 1087 257 -1662 -571 1244 71 -1606 -226
2171 -226 1062 -419 -1420 325 1009 -891 -1237 744 778 -1257 -1043 944 495 -1488 -685 1099 -27
2188b7j672J477J555j705j440J901J291k026r50K081P40k146m01K294J74k282
2204a136J36K314j66k180N03K104p23j706J022J527j218j231J530J127j655p80
2220e32J572Q16j580l94J623R8j592L72J592o55j555P55J650q25j586Q94J318
2237A971r90j061J230O79j413m50J545L98j689l31J552K92j373j40J168k06j024
2254A58N99P63p46q20J039P82j106p17J145N11r26k55J002o4j051L66J257m76
2272A461j319O93J326p07j174P36J079q98q37J060P01j272m50J328M28j366m42
2289C47J360L69j409j17J100J73j201R0R67l50r69M97Q98p68r19P69Q14r39p14
2308bP73N85p94m54P05K00q09k4Q47j11j040J46R61q1r83O2O57o7m75J51L35m08
$$ plain form
2188 -27 -1699 -222 1333 -372 -1812 89 1380 -646 -1596 485 1225 -921 -1322 972 1146 -1136
2204 -1136 -1000 1314 1148 -1032 -529 1575 852 -854 168 1695 477 -754 776 1903 248 -532
2220 -532 1040 1856 276 -118 1505 1603 11 383 1975 1320 -235 520 2170 1345 -241 653 1971
2237 1971 981 -80 1150 1829 416 -34 1511 1909 220 -111 1441 1733 360 220 1388 1182 158
2254 158 757 1520 774 -46 993 1775 669 -48 1097 1608 682 427 1429 1365 314 680 1937 1461
2272 1461 142 835 2161 1454 280 1016 2095 1197 360 1420 2121 849 399 1727 2155 789 347
2289 347 1707 2076 667 550 1650 1823 622 712 1679 1329 360 857 1755 987 68 837 1651 712 -2
2308 -2 771 1356 562 108 813 1013 204 180 1027 916 -124 22 983 902 -81 -19 638 571 96 247 582 174
2330A74k42M79L55p23l02N92L73l34l81K28m1M7J83P7n39k39N66M04o54m27L92
2351a2L05k93k28K82j79l95M20N59n19r06M20Q75j73j000J14O52k57l67K40J74
2371b88n64j59O68K37o88m78P20L93m66m09L16J09j83K00K46l73l43M78N30m53
2391e07o41K67O94j88n94K70K61j50j75K77K53n27j25N13K85n52l10M02L59j88
2411c76l61Q9K00m9j38mm6q0MJ07J46l08o6Q8J66M9j79k04N7K61Ok42p8J58J34
2436f66q3j45P0J09N9j35Q2J8M4l9J00R5p8r3J25K03n6j11j9J77J64n2k43R4L08
2461g2K1l15P7K65J43k99p4J56J56j28j14J81J18j70j78K82J64k16l84K71M73
2482C57k04m40%N04J17m91j53L41J92k43p9J86L6l10R2M40m1m50q6N69K91l94
$$ plain form
2330 174 -68 411 766 43 -259 333 706 372 -9 219 178 225 408 485 -54 -293 273 677 23 -404 -12
2351 -12 293 0 -228 54 -125 -520 -100 459 -60 -966 -546 329 156 -844 -730 -78 -335 -702 -462 -288
2371 -288 -852 -1011 -343 -106 -794 -1272 -552 -159 -625 -1034 -718 -609 -792 -592 -346 -719 -1062 -584 -54 -507
2391 -507 -1148 -881 -187 -375 -969 -699 -438 -588 -763 -486 -233 -760 -885 -372 -87 -639 -949 -547 -188 -376
2411 -376 -737 -648 -448 -497 -635 -639 -685 -765 -761 -654 -508 -816 -882 -794 -628 -579 -758 -962 -905 -644 -638 -880 -958 -800 -666
2436 -666 -749 -894 -824 -715 -656 -791 -709 -691 -647 -686 -586 -491 -569 -662 -537 -334 -390 -501 -520 -343 -179 -231 -474 -380 -72
2461 -72 -51 -366 -289 -24 119 -180 -254 -98 58 -70 -184 -3 115 -55 -233 49 213 -3 -387 -116 357
2482 357 153 -287 -287 217 334 -157 -310 31 223 -20 -99 87 123 -187 -95 345 304 -146 -232 337 628 234
2504B34l12K49L98P9k32j64K05J35P9N6k5j65K3K57J83p9k57R1L85J57k27k75
2526G95Q1M62J98l15k69Q9M30O5k25j82R6J33q9K02p1k04k09K99N27m31n69J89
2548A002O52L7n04l48M60L38k75j78O7K2j38J57K52k31m89K16N39O9o02j49M24
2569A321L50k53k80P2J47J98j28q3n5pJ95J05K4k80j82J91L65k2n40k91O19L98
2591A864l59n21L6M62qj85j15Rk21K41L84k05p24r5P08K27o45m09K91L33p4k01
2613G93l1k55OM62K32o42m54M81N64k47n28m3L05j4L9J47l31m40L73Q16k69r94
2635c0k0R54K24o41k72K43K01m3J57Jm20l19O66M94m69p12K25N34Q9m61k32J33
2657C02J15J80J0l01l37K64L66r6l96j38J79Q4R7l3l29k53L22M92l62o49J01P05
$$ plain form
2504 234 -78 171 569 648 416 252 457 592 671 727 702 537 560 817 1000 921 664 755 1140 1297 1070 795
2526 795 876 1338 1536 1221 952 1041 1471 1536 1311 1129 1225 1358 1269 1471 1400 1196 987 1286 1813 1382 813 1002
2548 1002 1654 1691 1187 839 1299 1637 1362 1184 1251 1273 1135 1292 1544 1313 824 1040 1579 1648 1046 897 1321
2569 1321 1671 1418 1138 1210 1357 1555 1427 1344 1289 1282 1477 1582 1606 1326 1144 1335 1700 1678 1138 847 1466 1864
2591 1864 1505 984 1020 1482 1474 1289 1174 1183 962 1203 1587 1382 658 563 1271 1498 853 444 735 1068 994 793
2613 793 762 507 513 975 1207 565 111 592 1156 909 381 338 643 629 668 815 484 44 417 1233 964 -30
2635 -30 -50 904 1128 487 215 458 659 616 773 774 354 35 701 1195 726 14 239 773 862 401 169 302
2657 302 417 597 607 306 -31 233 599 503 107 -31 148 232 329 296 -33 -286 36 528 166 -483 -382 323
2679C23n2m57j49K23Kl7K20n2l99l3M66K85o44l37L80M33k17l30M8P6J2J29J32
2702B2l69k46M15L37l18m53K16L62j94j26J61j9m05J04M85j63o50N1O46N0o60
2723g54j76M49J06m22J15K46k64l92M47L99n27m89M54M34k98n38K88K82j93n0
2743h83J44Lk89K12K84j29l94J07M20j56k33Q7K65j68n1K76O2m01N1M73n8m15
2765g93J2M91m4m74J62M32k60l20L69L15m45l81N35L98o38k18M53K44m90k09N53
2786c08j6m56N1M57k09m05K33M50l54m64M00L95l80l52M03L03m70k03N85J11o11
2807h40J06N59q9o55K22O84k50o02L24O44m12n13N15M16m36m27N69M32n54m02
2827g09O00L52o20j70M92J92m97r6M81l4m59J93L13j70l72K06L26k94k36K06O3
$$ plain form
2679 323 271 -186 -335 -112 -110 -147 73 21 -378 -411 55 340 -304 -641 -261 172 -45 -375 -327 -251 -239 -110 22
2702 22 -347 -593 -178 159 -159 -612 -396 -34 -228 -354 -193 -212 -617 -513 -28 -191 -841 -790 -144 -94 -754
2723 -754 -930 -481 -375 -797 -682 -436 -700 -1092 -645 -246 -773 -1262 -808 -374 -672 -1210 -922 -640 -833 -883
2743 -883 -739 -736 -1025 -813 -529 -658 -1052 -945 -525 -681 -914 -827 -562 -730 -781 -505 -443 -844 -793 -320 -378 -793
2765 -793 -781 -290 -334 -808 -646 -214 -474 -794 -425 -110 -555 -936 -401 -3 -641 -859 -406 -162 -652 -861 -308
2786 -308 -324 -780 -729 -272 -481 -886 -653 -203 -557 -1021 -621 -226 -606 -958 -555 -252 -722 -925 -340 -229 -840
2807 -840 -734 -175 -264 -919 -697 -13 -263 -865 -541 103 -309 -822 -307 109 -327 -754 -185 247 -307 -709
2827 -709 -109 243 -377 -547 -55 137 -360 -456 25 -9 -468 -275 38 -132 -504 -298 28 -266 -502 -296 -233
2848b33k31J33J79k27l01L58L30m11n36L70O37m26n13L77L11l96j80M92J33o91
2868h25p1Q11J47q24j18O15K26m26j84K60J26k39K41K98m37l20M36M23k69m51
2888e81K53L28j16n2J36k31k30M21M92n61o24M37O96k87n76K34L80k27k53M15
2908E4J43o96j52Q63K85q42m45O93N09n01m68M72J14l63J04L67j94m53K79N47
2928C16j46n59K5N03K5j81p0L6n4J67K94k57l94K76M67j03m47J39L18j05n9K02
2950C93M0m16K4N38M2o37j64P03K19n96j37M21N6l27L9K98j63m09L17M54l61n20
2972a86L47M56j67l99J06K42j76q5K80q7l98J74M68j3n60O4M01O4l35J29J38j44
2994C19mL35N8n34j16N52L71o76k12M83K55k92j88L75l5l99K53M26k19m82J82
$$ plain form
2848 -233 -464 -331 -152 -379 -680 -322 8 -403 -939 -569 68 -358 -871 -494 -183 -579 -759 -267 -134 -825
2868 -825 -896 -85 62 -762 -880 -265 -39 -465 -649 -389 -263 -502 -261 37 -400 -720 -284 139 -130 -581
2888 -581 -328 0 -116 -168 -32 -263 -493 -72 420 -141 -765 -328 368 81 -495 -261 119 -108 -361 54
2908 54 197 -499 -651 212 497 -345 -790 -97 412 -89 -557 -85 29 -334 -230 137 -57 -510 -231 316
2928 316 170 -389 -364 139 164 -17 -87 -51 -105 62 356 99 -295 -19 448 345 -102 37 355 250 191 393
2950 393 433 17 41 579 621 -16 -180 523 742 146 9 430 486 159 198 496 333 -76 241 695 334 -186
2972 -186 161 617 450 51 157 399 223 138 418 331 -67 107 575 562 2 66 467 531 196 325 463 319
2994 319 315 650 708 174 58 610 981 305 93 576 831 539 351 726 691 292 545 971 752 270 452
3015D52N57j48n83J37M24j14k40N8J66j70k8J98J2j96j70L10J14l21K0J23l4L
3037E70Q6j29j76J0L99r5l39q6M18J08l01p5K99n9k35J85K63k70k39K67K86k67
3059F20k98K79L04j35l13J57K04j31o3J92j04k54J03L87j23l63P6L08j05j93J51
3080F99L0k01j32K78O1m00j13M00J67l65k49K69J13k54m3J09o2k57J64K47k18
3101B43l22J93K51j54k25M3J54m6j28P8O0j77M8J72n0k88N5K00j4j79L9J22m9
3124B6r5L0J09q5r0J81O7k90k8K14P2j53j37P8J12l3j37N4l2m4J39l5j73j26J96
$$ plain form
3015 452 1009 861 278 415 839 725 485 543 709 539 511 709 721 525 355 665 779 458 478 601 567 570
3037 570 656 527 351 361 760 665 326 240 658 766 465 390 689 630 395 580 843 573 334 601 887 620
3059 620 322 601 905 770 457 614 818 687 624 816 712 458 561 948 825 462 538 846 741 548 699
3080 699 729 528 396 674 735 335 222 622 789 424 175 444 557 303 260 369 307 50 214 461 243
3101 243 -79 114 365 211 -14 29 183 137 9 87 147 -30 18 190 140 -148 -93 107 93 -86 -47 75 26
3124 26 -69 -39 70 -15 -105 76 143 -147 -175 39 111 -42 -179 -101 11 -22 -159 -105 -137 -181 -42 -77 -250 -376 -180
$$ [...]
8191a
##END NTUPLES=NMR FID
##END=
