##TITLE=1H_DEApr26_160
 200.13Hz, DMSO-d6+CDCl3.
 8 sc
 
1.1.2026
##JCAMPDX= 6.0         $$ Bruker NMR JCAMP-DX V2.0
##DATA TYPE= NMR FID
##DATA CLASS= NTUPLES
##ORIGIN= UXNMR, Bruker Analytische Messtechnik GmbH
##OWNER= pz
$$ XWIN-NMR		Version 3.5
$$ Wed Apr  1 13:31:19 2026 Russian Standard Time (UT+4h)  she@DPX200
##.OBSERVE FREQUENCY= 200.1313
##.OBSERVE NUCLEUS= ^1H
##.DELAY= (6, 6)
##.ACQUISITION MODE= SIMULTANEOUS
##.ACQUISITION SCHEME= undefined
##.AVERAGES= 8
##.DIGITISER RES= 18
##SPECTROMETER/DATA SYSTEM= spect
##.PULSE SEQUENCE= zg30
##.SOLVENT NAME= CDCl3
##.SHIFT REFERENCE= (INTERNAL, CDCl3, 0, 14.3821)
##AUDIT TRAIL= $$ (NUMBER, WHEN, WHO, WHERE, WHAT)
$$ ##TITLE= Audit trail, XWIN-NMR		Version 3.5
$$ ##JCAMPDX= 5.01
$$ ##ORIGIN= Bruker BioSpin GmbH
$$ ##OWNER= she
$$ F:/spectra/data/she/nmr/H-C/1/audita.txt
$$ ##AUDIT TRAIL=  $$ (NUMBER, WHEN, WHO, WHERE, WHAT)
(   1,<2026-04-01 13:30:02.31 +0400>,<she>,<DPX200>,
      <created by zg, POWCHK disabled, PULCHK disabled
       configuration hash MD5:
       00 E9 B6 7A A2 85 ED C7 34 08 36 98 17 FE 4E 26
       data hash MD5: 16K
       40 86 6F 6B CD CF BA 2A 88 C7 2B 45 3E BB 98 EE>)
$$ ##END=
$$ 
$$ hash MD5
$$ 1F EF FD 7B 3B 43 D5 56 86 FB ED C6 03 98 13 3D
##$RELAX= 
##$RELAX= 
##$RELAX= 
##$RELAX= 
##$RELAX= 
##$RELAX= 
$$ Bruker specific parameters
$$ --------------------------
##$DU= <F:/spectra>
##$EXPNO= 1
##$NAME= <H-C>
##$PROCNO= 1
##$TYPE= <nmr>
##$USER= <she>
##$AMP= (0..31)
100 100 100 100 100 100 100 100 100 100 100 100 100 100 100 100 100 100 
100 100 100 100 100 100 100 100 100 100 100 100 100 100 
##$AQSEQ= 0
##$AQ_mod= 1
##$AUNM= <au_zg>
##$AUTOPOS= <>
##$BF1= 200.13
##$BF2= 200.13
##$BF3= 200.13
##$BF4= 200.13
##$BF5= 200.13
##$BF6= 200.13
##$BF7= 200.13
##$BF8= 200.13
##$BYTORDA= 1
##$CFDGTYP= 0
##$CFRGTYP= 5
##$CHEMSTR= <none>
##$CNST= (0..31)
1 1 145 1 1 1 1 1 1 1 1 1 1 1 1 1 1 1 1 1 1 1 1 1 1 1 1 1 1 1 1 1 
##$CPDPRG= <>
##$CPDPRG1= <>
##$CPDPRG2= <>
##$CPDPRG3= <>
##$CPDPRG4= <mlev>
##$CPDPRG5= <mlev>
##$CPDPRG6= <mlev>
##$CPDPRG7= <mlev>
##$CPDPRG8= <mlev>
##$CPDPRGB= <>
##$CPDPRGT= <>
##$D= (0..31)
0 0.7 0 0 0 0 0 0 0 0 0 0.03 0 0 0 0 0 0 0 0 0 0 0 0 0 0 0 0 0 0 0 0 
##$DATE= 1775035801
##$DBL= (0..7)
120 120 120 120 120 120 120 120 
##$DBP= (0..7)
150 150 150 150 150 150 150 150 
##$DBP07= 0
##$DBPNAM0= <>
##$DBPNAM1= <>
##$DBPNAM2= <>
##$DBPNAM3= <>
##$DBPNAM4= <>
##$DBPNAM5= <>
##$DBPNAM6= <>
##$DBPNAM7= <>
##$DBPOAL= (0..7)
0.5 0.5 0.5 0.5 0.5 0.5 0.5 0.5 
##$DBPOFFS= (0..7)
0 0 0 0 0 0 0 0 
##$DE= 6
##$DECBNUC= <off>
##$DECIM= 32
##$DECNUC= <off>
##$DECSTAT= 4
##$DIGMOD= 1
##$DIGTYP= 9
##$DL= (0..7)
0 120 120 120 120 120 120 120 
##$DP= (0..7)
150 150 150 150 150 150 150 150 
##$DP07= 0
##$DPNAME0= <>
##$DPNAME1= <>
##$DPNAME2= <>
##$DPNAME3= <>
##$DPNAME4= <>
##$DPNAME5= <>
##$DPNAME6= <>
##$DPNAME7= <>
##$DPOAL= (0..7)
0.5 0.5 0.5 0.5 0.5 0.5 0.5 0.5 
##$DPOFFS= (0..7)
0 0 0 0 0 0 0 0 
##$DQDMODE= 0
##$DR= 18
##$DS= 0
##$DSLIST= <SSSSSSSSSSSSSSS>
$$ [...]
##$SUBNAM0= <"">
##$SUBNAM1= <"">
##$SUBNAM2= <"">
##$SUBNAM3= <"">
##$SUBNAM4= <"">
##$SUBNAM5= <"">
##$SUBNAM6= <"">
##$SUBNAM7= <"">
##$SUBNAM8= <"">
##$SUBNAM9= <"">
##$SW= 18.0517328524113
##$SWIBOX= (0..15)
0 0 2 0 0 0 0 0 0 0 0 0 0 0 0 0 
##$SW_h= 3612.71676300578
##$TD= 16384
##$TD0= 1
##$TE= 0
##$TE2= 300
##$TE3= 300
##$TEG= 300
##$TL= (0..7)
0 120 120 120 120 120 120 120 
##$TP= (0..7)
150 150 150 150 150 150 150 150 
##$TP07= 0
##$TPNAME0= <>
##$TPNAME1= <>
##$TPNAME2= <>
##$TPNAME3= <>
##$TPNAME4= <>
##$TPNAME5= <>
##$TPNAME6= <>
##$TPNAME7= <>
##$TPOAL= (0..7)
0.5 0.5 0.5 0.5 0.5 0.5 0.5 0.5 
##$TPOFFS= (0..7)
0 0 0 0 0 0 0 0 
##$TUNHIN= 0
##$TUNHOUT= 0
##$TUNXOUT= 0
##$USERA1= <user>
##$USERA2= <user>
##$USERA3= <user>
##$USERA4= <user>
##$USERA5= <user>
##$V9= 5
##$VALIST= <valist>
##$VCLIST= <CCCCCCCCCCCCCCC>
##$VD= 0
##$VDLIST= <DDDDDDDDDDDDDDD>
##$VPLIST= <PPPPPPPPPPPPPPP>
##$VTLIST= <TTTTTTTTTTTTTTT>
##$WBST= 1024
##$WBSW= 4
##$XGAIN= (0..3)
0 0 0 0 
##$XL= 0
##$YL= 0
##$YMAX_a= 193387
##$YMIN_a= -240625
##$ZGOPTNS= <>
##$ZL1= 120
##$ZL2= 120
##$ZL3= 120
##$ZL4= 120
##$ABSF1= 10
##$ABSF2= 0
##$ABSG= 5
##$ABSL= 3
##$ALPHA= 0
##$AQORDER= 0
##$ASSFAC= 0
##$ASSFACI= 0
##$ASSFACX= 0
##$ASSWID= 0
##$AUNMP= <proc_1d>
##$AZFE= 0.1
##$AZFW= 0.1
##$BCFW= 1
##$BC_mod= 2
##$BYTORDP= 1
##$COROFFS= 0
##$CY= -3
##$DATMOD= 1
##$DC= 2
##$DFILT= <>
##$DTYPP= 0
##$F1P= 0
##$F2P= 0
##$FCOR= 0.5
##$FTSIZE= 0
##$FT_mod= 4
##$GAMMA= 1
##$GB= 0.15
##$INTBC= 1
##$INTSCL= 1
##$ISEN= 128
##$LB= 0.25
##$LEV0= 0
##$LPBIN= 0
##$MAXI= 10000
##$MC2= 0
##$MEAN= 0
##$ME_mod= 0
##$MI= 1.114404
##$NCOEF= 0
##$NC_proc= 0
##$NLEV= 6
##$NOISF1= 3.799351
##$NOISF2= 2.8
##$NSP= 1
##$NTH_PI= 0
##$NZP= 0
##$OFFSET= 14.38212
##$PC= 1
##$PHC0= -3711.447
##$PHC1= 15.59231
##$PH_mod= 1
##$PKNL= yes
##$PPARMOD= 0
##$PSCAL= 0
##$PSIGN= 0
##$REVERSE= no
##$SF= 200.129724274929
##$SI= 16384
##$SIGF1= 3
##$SIGF2= 2
##$SINO= 400
##$SIOLD= 16384
##$SREGLST= <1H.CDCl3>
##$SSB= 0
##$STSI= 0
##$STSR= 0
##$SW_p= 3205.1282051282
##$SYMM= 0
##$S_DEV= 0
##$TDeff= 0
##$TDoff= 0
##$TI= <>
##$TILT= no
##$TM1= 0
##$TM2= 0
##$TOPLEV= 0
##$USERP1= <user>
##$USERP2= <user>
##$USERP3= <user>
##$USERP4= <user>
##$USERP5= <user>
##$WDW= 1
##$XDIM= 8192
##$YMAX_p= 0
##$YMIN_p= 0
$$ End of Bruker specific parameters
$$ ---------------------------------
##NTUPLES= NMR FID
##VAR_NAME=  TIME,          FID/REAL,        FID/IMAG
##SYMBOL=    X,             R,               I
##VAR_TYPE=  INDEPENDENT,   DEPENDENT,       DEPENDENT
##VAR_FORM=  AFFN,          ASDF,            ASDF
##VAR_DIM=   8192,          8192,            8192
##UNITS=     SECONDS,       ARBITRARY UNITS, ARBITRARY UNITS
##FACTOR=    0.0002768,     1,               1
##FIRST=     0,             0,               0
##LAST=      2.2672688,     0,               0
##MIN=       0,             -240625,         0
##MAX=       2.2672688,     193387,          0
$$ Real data points
##PAGE= N=1
##DATA TABLE= (X++(R..R)), XYDATA
$$ [...]
$$ plain form
2070 953 -28 586 1340 143 72 919 -461 -1562 -169 -360 -1435 -567 458 -181 -315 999 1 -280
2088 -280 794 302 -894 -419 692 -25 -308 789 424 -94 648 -223 -825 -256 -241 -878 -946 92 91 -389
2108 -389 526 784 377 487 1006 108 -58 740 -201 -799 78 23 -448 -343 -139 -250 186 -133 -408 -549
2128 -549 -406 9 -174 -226 381 334 351 847 565 218 553 232 -372 -400 -392 -502 -526 -431 -25 23 350 6 95
2151 95 277 161 -135 -449 -449 -66 550 291 221 960 415 -62 -15 -445 -667 -664 -297 -992 -453 171 244 -10 473
2174 473 891 -73 170 111 -268 -526 97 -130 -210 585 606 -136 363 135 -354 -635 -83 -628 -871 -197 319
2195 319 -526 394 955 92 -138 182 118 -896 254 208 -826 -24 897 -329 -511 1074 -61 -681 185
2214 185 354 -827 -172 661 -489 -251 886 369 -550 583 747 -241 -65 590 -384 -842 494 -17
$$ packed form
2070I53r81O14P54j197p1Q47j380j101J393j91j075Q68J025o39j34J314r98k81
2088b80J074m92j196M75J111p17k83J097l65n18P42q71o02N69J5o37o8J038jm80
2108c89R15K58m07J10N19q98j66P98r41n98Q77n5m71J05K04j11M36l19k75j41
2128e49J43M15j83n2O07m7J7M96k82l47L35l21o04k8Qj10k4R5M06M8L27l44Q9
2151I5J82j16k96l14%L83O16k59p0P39n45m77M7m30k22LL67o95N39O24P3k54M83
2174D73M18r64K43n9l79k58O23k27q0P95K1p42M99k28m89k81N52n45k43O74N16
2195C19q45R20N61q63k30L20o4j014J150m6j034Q02R21j226j82J585j135o20Q66
2214A85J69j181O55Q33j150K38J137n17r19J133J64r88J76O55r74m58J336n11
$$ plain form
2232 -17 -1019 768 948 -640 93 826 -116 -769 697 191 -911 153 427 -792 -117 1047 178 -572
2250 -572 1096 420 -1240 3 363 -1117 -353 898 -348 -815 1181 851 -734 701 943 -1205 -361
2267 -361 557 -802 -733 1141 470 -775 832 1401 -796 -391 1053 -383 -1241 641 286 -1295 434
2284 434 1234 -1005 -207 1260 -520 -1117 567 -148 -1687 368 1030 -923 70 1717 286 -694 1342
2301 1342 572 -1500 215 834 -1025 -516 1008 -547 -1451 1052 380 -1362 -92 1170 -1103 -540
2317 -540 1329 -320 -1016 1562 762 -1011 343 1436 -958 -729 1122 -591 -1565 618 228 -1560
2333 -1560 506 1366 -937 -459 1590 70 -1022 1320 989 -1603 428 1039 -1014 -478 1355 -191
2349 -191 -1197 1156 471 -1693 261 1080 -1433 -908 1054 18 -779 1623 1158 -1224 207 1533
$$ packed form
2232a7j002J787J80j588P33P33r42o53J466n06j102J064K74j219O75J164q69p50
2250e72J668o76j660J243L60j480P64J251j246m67J996l30j585J435K42k148Q44
2267c61R18j359O9J874o71j245J607N69k197M05J444j436q58J882l55j581J729
2284D34Q00k239P98J467j780n97J684p15j539K055O62j953R93J647j431r80K036
2301A342p70k072J715O19j859N09J524j555r04K503o72j742J270J262k273N63
2317e40J869j649o96K578q00j773J354J093k394K29J851j713r74K183l90j788
2333a560K066Q60k303M78K049j520j092K342l31k592K031O11k053N36J833j546
2349a91j006K353o85k164J954Q19k513N25J962j036p97K402m65k382J431J326
$$ plain form
2365 1533 -780 -700 919 -664 -1766 573 412 -1475 136 1291 -1279 -707 1545 -418 -1642 839
2381 839 688 -1530 540 1841 -571 -450 1857 -277 -1661 417 164 -1807 116 927 -1239 -970
2397 -970 1482 364 -1279 1250 1041 -1475 162 1240 -900 -652 1833 45 -1407 1099 777 -1441
2413 -1441 194 1003 -1459 -1254 880 -191 -1525 883 1253 -1000 237 1621 -801 -655 1366 131
2429 131 -1608 819 700 -1435 86 1312 -1295 -1190 1157 -43 -1313 661 882 -1651 -234 1240
2445 1240 -568 -839 1859 486 -1295 834 990 -1499 -113 1563 -1153 -1359 986 -115 -1389 953
2461 953 971 -1206 38 1395 -300 -762 1594 359 -1379 710 800 -853 312 1691 -551 -1030 982
2478 982 -24 -1445 465 745 -1535 -395 1418 -515 -91 1492 549 -1112 652 773 -1078 -424
$$ packed form
2365A533k313Q0J619j583j102K339j61j887J611J155k570N72K252j963j224K481
2381H39j51k218K070J301k412J21K307k134j384K078k53j971J923Q11k166K69
2397i70K452j118j643K529k09k516J637J078k140K48K485j788j452K506l22k218
2413a441J635Q09k462K05K134j071j334K408L70k253J237J384k422J46K021j235
2429A31j739K427j19k135J521J226k607J05K347j200j270J974K21k533J417J474
2445A240j808k71K698j373j781K129J56k489J386J676k716k06K345j101j274K342
2461I53J8k177J244J357j695m62K356j235j738K089R0j653J165J379k242m79K012
2478I82j006j421J910K80k280J140J813j933M24J583r43j661J764J21j851O54
$$ plain form
2494 -424 1276 -901 -821 1078 19 -1154 663 956 -1420 -627 908 -871 -912 1487 388 -873 731
2511 731 1137 -876 29 1172 -633 -1116 806 -191 -1507 463 897 -1091 -234 945 -445 -682 1207
2528 1207 210 -977 503 879 -839 -169 1197 -275 -783 743 228 -1036 476 616 -1195 -547 1029
2545 1029 -486 -883 1070 539 -985 483 820 -793 -315 1070 -167 -950 645 222 -1035 338
2561 338 868 -869 -178 911 -371 -1062 557 259 -1174 368 905 -593 -263 1075 29 -581 823
2578 823 272 -971 165 517 -967 -473 817 -131 -449 1001 704 -551 386 668 -878 -495 883
2595 883 -207 -622 856 227 -849 194 705 -832 -240 340 -249 -515 351 548 -561 201 979 -408
2613 -408 -186 1185 -36 -774 403 131 -918 302 528 -348 -201 868 -74 -989 476 367 -562 138
$$ packed form
2494d24J700k177Q0J899j059j173J817K93k376P93J535j779m1K399j099j261J604
2511G31M06k013R05J143j805m83J922r97j316J970M34j988Q57J179j390k37J889
2528A207r97j187J480L76j718O70J366j472n08J526n15j264J512J40j811O48J576
2545A029j515l97J953n31j524J468L37j613M78J385j237p83J595m23j257J373
2561C38N30j737O91J089j282o91J619k98j433J542N37j498L30J338j046o10J404
2578H23n51j243J136L52j484M94J290r48l18J450k97j255R37K82j546L83J378
2595H83j090m15J478o29j076J043N11j537N92N80n89k66Q66J97j109P62P78j387
2613d08K22J371j221p38J177k72j049J220K26q76J47J069r42r15J465j09r29P00
$$ plain form
2631 138 524 -560 -177 807 24 -644 375 458 -730 -192 255 -690 -411 256 -325 -187 486 228 -406
2650 -406 296 623 -239 -308 590 91 -303 186 128 -468 -1 326 -483 -160 131 -39 -290 199 148 -374 -66
2671 -66 462 -108 229 319 48 -489 579 269 -597 -117 40 -498 -332 237 258 -238 110 158 -229 82 273
2692 273 -77 171 518 111 27 453 55 -114 215 261 30 -339 92 -249 -375 -512 69 -72 -110 225 354
2713 354 226 298 36 40 216 -15 78 -89 101 -147 -87 0 95 -228 -207 -60 -46 -231 -195 289 128 132 346 242
2737 242 361 -19 -62 108 77 -165 -148 -67 -318 21 -174 -114 107 39 -214 19 21 -98 158 42 236 -132 212
2760 212 114 -28 -77 125 -86 74 -53 -91 -242 16 -128 -294 91 41 -81 -14 404 107 -65 369 222 -325
2782 -325 -147 249 -336 -29 396 -226 10 107 -103 -347 78 -268 -526 -173 183 -236 -60 332 334 -47 697
$$ packed form
2631A38L86j084L83R84p83o68J019Q3j188N38M47r45K79O67n81J38O73k58o34
2650d06P02L27q62o9Q98m99l94M89n8n96M67L27q09L23K91j70k51M89n1n22L08
2671f6N28n70L37R0k71n37J068l10q66M80J57n38J66N69K1m96L48M8l87L11J91
2692B73l50K48L47m07q4M26l98j69L29M6k31l69M31l41j26j37N81j41l8L35J29
2713C54j28P2k62MJ76k31R3j67J90k48O0Q7R5l23K1J47J4j85L6M84j61MK14j04
2737B42J19l80m3J70l1k42J7Q1k51L39j95O0K21o8k53K33Kj19K56j16J94l68L44
2760B12r8j42m9K02k11J60j27l8j51K58j44j66L85n0j22O7M18k97j72M34j47n47
2782c25J78L96n85L07M25o22K36R7k10k44M25l46k58L53L56m19J76L92Kl81P44
$$ plain form
2803 697 237 -447 -21 448 -326 -523 290 -158 -286 26 320 -204 74 432 -187 -607 521 126 -428 443
2823 443 513 -220 137 292 -300 -295 444 -76 -507 183 391 -503 19 426 -2 -331 509 181 -438 187 540
2844 540 -357 -182 387 -278 -278 -10 65 -664 -117 76 -751 -388 581 -130 -293 485 87 -341 225 459 -303
2865 -303 -41 763 -328 -547 730 240 -881 105 461 -685 -82 686 -329 -808 567 232 -460 229
2883 229 822 -438 -76 1068 -304 -782 575 18 -408 133 620 -829 -509 532 -280 -539 267 199
2901 199 -567 364 987 -479 -137 1021 -382 -491 640 256 -715 119 418 -430 -322 510 -462 -866 421
2920 421 -32 -924 217 682 -361 142 1012 -141 -567 703 381 -732 187 397 -588 -523 745 -101
2938 -101 -786 697 204 -980 -196 853 -797 -431 596 -46 -827 420 532 -637 354 769 -505
$$ packed form
2803F97m60o84M26M69p74j97Q13m48j28L12K94n24K78L58o19m20J128l95n54Q71
2823D43P0p33L57J55n92NP39n20m31O90K08q94N22M07m28l29Q40l28o19O25L53
2844E40q97J75N69o65%K68P5p29N47J93q27L63R69p11j63P78l98m28N66K34p62
2865c03K62Q04j091k19J277m90j121R86L56j146O03P68j015m79J375l35o92O89
2883B29N93j260L62J144j372m78J357n57m26N41M87j449L20J041q12k59Q06o8
2901A99p66R31O23j466L42J158j403j09J131l84r71Q34K99q48J08Q32r72m04J287
2920D21m53q92J141M65j043N03Q70j153m26J270l22j113R19K10r85O5J268q46
2938a01o85J483m93j184P84J049j650L66J027o42p81J247J12j169R91M15j274
$$ plain form
2955 -505 -150 551 -249 -640 565 141 -1053 20 853 -556 -153 713 -174 -770 641 47 -713 247
2973 247 569 -321 -270 861 -294 -803 421 73 -970 86 686 -689 -325 586 -233 -742 657 509
2991 509 -321 289 839 -726 -312 895 -154 -489 385 439 -857 176 1115 -508 -347 747 -201 -832
3009 -832 458 282 -473 222 872 -479 -525 988 -4 -518 374 333 -991 -69 733 -606 -228 831 -49
3028 -49 -879 371 441 -654 136 611 -478 -288 983 -152 -754 829 75 -787 -66 647 -514 -618
3046 -618 931 42 -1095 205 697 -635 166 709 -420 -432 796 -272 -605 445 321 -947 -226
3063 -226 818 -350 -434 663 -158 -741 9 516 -631 -3 853 -456 -618 643 343 -525 381 355 -687
3082 -687 -399 809 -392 -153 676 -2 -1078 265 580 -780 -25 716 -259 -692 372 -100 -663 556
$$ packed form
2955e05L55P01q00l91J205m24j194J073Q33j409M03Q66q87n96J411n94p60R60
2973B47L22q90N1J131j155n09J224l48j043J056O00j375L64R11q19n09J399j48
2991E09q30O10N50j565M14J207j049l35Q74N4j296J033R39j623J61J094r48o31
3009h32J290j76p55O95O50j351m6J513r92n14Q92m1j324R22Q02j339L78J059q80
3028d9q30J250P0j095P90M75j089J90J271j135o02J583p54q62P21P13j161j04
3046f18J549q89j137J300M92j332Q01N43j129j2J228j068l33J050j24j268P21
3063b26J044j168q4J097q21n83P50N07j147O28Q56j309j62J261l00q68R06k6j042
3082f87K88J208j201K39Q29o78j076J343L15j360P55P41r75m33J064m72n63J219
$$ plain form
3100 556 372 -403 -196 699 -251 -178 671 56 -592 -103 235 -663 -12 606 -188 -410 483 19 -712 231
3120 231 226 -795 190 585 -165 -533 482 213 -617 249 307 -391 -88 314 -290 -655 645 29 -266 366
3140 366 330 -385 -220 682 -107 -425 720 24 -535 284 260 -431 -224 486 -295 -251 289 453 -925 406
3160 406 686 -511 -165 489 -165 -418 391 -114 -584 489 525 -483 -186 447 -331 -178 291 -55 -539
3179 -539 152 348 -577 -231 425 -41 -331 243 264 -307 275 341 -486 60 199 176 -465 -199 111 -349 -35
3200 -35 508 -510 -111 435 111 -237 444 -44 -524 139 427 -524 -412 312 -166 -140 397 168 -316 -186
3220 -186 -110 -368 -82 288 -36 -138 139 67 -352 -34 406 -331 -84 480 -211 -288 253 118 -157 364 169
3241 169 128 32 89 -34 -470 -15 -276 -99 111 368 149 -62 -75 -197 -332 -194 -90 -339 147 185 11 -41
$$ packed form
3100E56j84p75K07Q95r50P3Q49o15o48M89L38q98O51O18p94k22Q93m64p31R43
3120B31nj021R85L95p50l68J015k69q30Q66N8o98L03M02o04l65J300o16k95O32
3140C66l6p15J65R02p89l18J145o96n59Q19k4o91K07P10p81M4N40J64j378J331
3160D06K80j197L46O54o54k53Q09n05m70J073L6j008K97O33p78J53M69l46m84
3179e39O91J96r25L46O56m66k90N74K1n71N82O6q27N46J39k3o41K66L10m60L14
3200c5N43j018L99N46l24l48O81m88m80O63K88r51J12P24m78K6N37k29m84J30
3220a86P6k58K86L70l24j02K77p2m19L18M40p37K47N64o91p7N41j35k75N21j95
3241A69m1r6N7j23m36M55k61J77K10K57k19k11j3j22j35J38J04k49M86L8j74n2
$$ plain form
3263 -41 119 -334 -327 231 167 6 -176 7 -344 -95 45 252 9 29 80 70 250 267 -81 -106 264 -28 -56
3286 -56 -238 -52 -220 16 173 85 -53 230 18 142 57 75 122 62 20 322 69 296 -14 -196 199 175 -138
3309 -138 108 83 35 -80 -266 87 78 -26 383 94 50 -131 -148 -30 -3 58 -55 131 -136 -135 321 -217 136
3332 136 -100 -56 36 -50 111 0 66 72 32 -146 -116 -8 103 -239 -298 -122 155 150 -64 -125 125 -320 49 -105
3356 -105 -237 -198 -52 71 -184 -203 154 -70 95 217 -2 68 183 -135 -123 -140 -133 53 -250 106 86 -153 140
3379 140 147 -26 -34 401 42 -147 143 34 -107 278 -79 -66 24 3 19 -60 33 -251 -151 -96 -87 -147 142 271 -292
3404 -292 8 199 -8 163 78 85 -473 -45 332 -556 6 152 -168 234 256 -46 -370 -149 196 -218 -161 364
3426 364 6 -310 386 -20 -133 152 175 -264 -128 285 -191 -501 -34 59 -390 226 252 -246 -227 202 -75
$$ packed form
3263d1J60m53PN58o4j61j82J83l51K49J40K07k43K0N1j0J80J7l48k5L70k92k8
3286e6j82J86j68K36J57q8j38K83k12J24q5J8M7o0m2L02k53K27l10j82L95k4l13
3309a38K46k5m8j15j86L53rj04M09k89m4j81j7J18K7O1j13J86k67JM56n38L53
3332A36k36M4R2q6J61j11O6Om0j78L0J08J11l42n9J76K77nk14o1K50m45L69j54
3356a05j32L9J46J23k55j9L57k24J65J22k19P0J15l18J2j7PJ86l03L56k0k39K93
3379A40Pj73qM35l59j89K90j09j41L85l57J3R0k1J6p9R3k84J00N5Ro0K89J29n63
3404b92L00J91k07J71q5Pn58M28L77q88N62J46l20M02K2l02l24K21L45m14N7N25
3426C64l58l16O96m06j13K85K3m39J36M13m76l10M67R3m49O16K6m98J9M29k77
$$ plain form
3447 -75 -97 223 201 -265 203 300 -157 -188 283 -218 -105 259 -139 -437 353 459 -219 -112 448 -147 -194 117
3469 117 -107 -356 -12 219 -369 -29 609 -73 -124 422 -43 -405 33 226 -283 -27 379 -77 -376 136
3489 136 139 -551 197 69 -598 49 354 -414 -130 65 -16 -211 206 294 -243 -186 348 -169 -420 334 38 -611
3511 -611 15 484 -331 -90 358 -231 -386 398 -114 -254 -112 116 -185 -205 479 -125 -196 406 246 -338 157
3532 157 335 -247 190 511 -212 -419 214 390 -422 341 255 -297 -274 494 -436 -363 85 105 -136 -101 542 -241
3554 -241 -176 493 -83 -256 425 81 -667 -32 428 -659 -374 372 71 -332 345 292 -449 97 -20 -212
3574 -212 -415 386 -347 -321 306 121 -233 184 467 -102 -108 277 -248 -391 361 313 -138 169 182 -303 -94 567
3596 567 -181 -414 406 -109 -388 -174 232 -274 -275 366 -425 -210 456 434 -444 31 289 -95 22 421 90
$$ packed form
3447g5k2L20k2m66M68R7m57l1M71n01J13L64l98k98P90J06o78J07N60n95m7L11
3469A17k24k49L44K31n88L40O38o82n1N46m65l62M38J93n09K56M06m56k99N12
3489A36Lo90P48j28o67O47L05p68K84J95q1j95M17Q8n37N7N34n17k51P54k96o49
3511f11O26M69q15K41M48n89j55P84n12j40J42K28l01k0O84o04p1O02j60n84M95
3532A57J78n82M37L21p23k07O33J76q12P63q6n52K3P68r30P3M48K0k41L5O43p83
3554b41O5O69n76j73O81l44p48O35M60j087K85P46l01m03O77n3p41N46j17j92
3574b12k03Q01p33K6O27j85l54M17K83n69oL85n25j43P52m8m51L07J3m85K09O61
3596E67p48k33Q20n15k79K14M06n06jO41p91K15O66k2q78M75K58l84J17L99l31
$$ plain form
3617 90 -353 4 200 -430 -352 74 -441 -442 272 33 -132 380 121 -396 18 78 -122 21 460 65 -278 315
3639 315 161 -563 196 406 -524 -376 200 -32 -395 233 -64 -486 -317 337 -302 -150 593 111 -500 334
3659 334 218 -467 49 361 49 157 287 -233 -573 189 -35 -326 20 272 -251 -236 289 -33 -254 371
3679 371 -45 -306 -42 271 -133 -347 57 -4 -320 148 370 -308 125 248 -367 -362 270 -74 75 429 359
3700 359 -163 247 307 -262 -323 285 -98 -531 55 121 -411 393 195 -81 -94 276 54 -139 78 105 -42 -63
3722 -63 359 63 -196 288 47 -356 199 81 -241 -177 277 30 -61 312 -331 -200 73 213 -88 236 179
3743 179 -233 -31 344 -186 -161 320 -223 -268 -182 -12 -29 -232 42 156 -137 118 223 -222 -9 401 -91
3764 -91 -42 229 56 -181 132 88 -99 149 75 -329 -282 232 -313 -196 275 39 -199 -34 21 -285 -183 243
$$ packed form
3617I0m43L57J96o30P8M26n15jP14k39j65N12k59n17M14O0k00J43M39l95l43N93
3639C15j54p24P59K10r30J48N76k32l63O28k97m22J69O54o39J52P43m82o11Q34
3659C34j16o85N16L12l12J08J30n20l40P62k24k91L46K52n23J5N25l22k21O25
3679C71m16k61K64L13m04k14M04o1l16M68K22o78M33J23o15NO32l44J49L54p0
3700C59n22M10O0n69o1O08l83m33N86O6n32Q04j98k76j3L70k22j93K17K7j47k1
3722f3M22k96k59M84k41m03N55j18l22O4M54k47r1L73o43J31K73J40l01L24n7
3743A79m12K02L75n30K5M81n43m5Q6J70j7k03K74J14k93K55J05m45K13M10m92
3764i1M9K71j73k37L13m4j87K48p4m04M7N14n45J17M71k36k38J65N5l06J02M26
$$ plain form
3786 243 147 12 246 107 -59 -84 -24 -320 -165 310 -150 -85 -141 159 -117 -193 92 -76 54 19 3 -128 -45
3809 -45 217 -59 160 166 206 -280 170 190 -275 -32 165 -114 86 237 -244 -479 -34 133 -140 232 203 -137
3831 -137 16 163 -9 18 -83 23 -237 118 245 -125 -183 7 -144 -1 212 43 65 334 25 -123 -124 233
3853 233 -15 61 419 -59 -159 232 -211 -235 -39 129 -117 -315 -13 -55 16 174 69 99 22 307 148 -224
3875 -224 50 -25 -70 111 127 -105 -142 70 -94 -173 85 -14 -96 51 73 135 46 203 -148 70 180 -146 136
3898 136 -62 230 197 -97 -39 -50 -179 229 -173 -257 -156 156 -180 -28 149 50 -346 -20 222 -169 -273 344
3920 344 -283 10 4 196 29 -34 41 185 -75 -148 105 -164 148 46 131 -186 184 -98 107 -8 78 163 -92
3943 -92 151 -150 -208 136 33 31 -418 -280 -343 14 4 -176 161 194 -189 316 -1 102 167 40 141 -230 87
$$ packed form
3786B43r6j35K34j39j66k5O0k96J55M75m60O5n6L00k76p6K85j68J30l5j6j31Q3
3809d5K62k76K19OM0m86M50K0m65K43J97k79K00J51m81k35M45J67k73L72k9l40
3831a37J53J47j72K7j01J06k60L55J27l70n8J90j51J43K13j69K2K69l09j48jL57
3853B33k48P6L58m78j00L91m43k4J96J68k46j98L02m2P1J58j05L0p7K85j59l72
3875b24K74p5m5J81J6k32l7K12j64p9K58r9q2J47K2O2q9J57l51K18J10l26K82
3898A36j98K92l3k94N8j1j29M08m02q4J01L12l36J52J77r9l96L26K42l91j04O17
3920C44o27K93oJ92j67o3P5J44k60p3K53k69L12j02Q5l17L70k82K05j15Q6Q5k55
3943i2K43l01n8L44j03km49J38o3L57j0j80L37L3l83N05l17J03O5j27J01l71L17
$$ plain form
3966 87 227 144 -24 75 10 94 -154 45 -19 -51 38 154 42 115 -70 64 -91 -104 132 -176 -147 27 116 -254
3990 -254 -308 -151 -76 89 -1 -201 38 -106 -83 8 299 345 -172 -216 174 2 -245 -108 -155 -28 42 175 -348
4013 -348 -185 348 -108 106 -4 107 -190 -130 169 -354 178 209 -150 326 263 -279 -58 -195 -30 -86 -160 -175
4035 -175 -20 -97 308 -164 -290 -18 -49 -235 -215 65 -24 60 367 -26 12 235 179 -118 -17 21 -102 -159 112
4058 112 104 -330 172 185 -142 -41 233 -58 13 27 55 -178 366 -179 -45 145 436 -313 179 152 -449 -199
4080 -199 36 193 -16 194 187 -2 -335 214 16 -457 113 163 -11 -127 158 -164 -139 252 -117 -269 166
4101 166 -19 -17 11 202 105 244 280 -22 -114 252 79 12 91 94 -75 6 160 -241 -29 28 62 -160 293 55
4125 55 -251 -70 -3 -54 -67 242 10 -317 -35 135 23 39 214 289 36 72 248 -214 23 86 -143 -29 -139
$$ packed form
3966H7J40q3j68R9o5Q4k48J99o4l2Q9J16j12P3j85J34j55j3K36l08K9J74Q9l70
3990b54n4J57P5J65r0k00K39j44K3R1K91M6n17m4L90j72k47J37m7J27P0J33n23
4013c48J63N33m56K14j10J11k97O0K99n23N32L1l59M76o3n42K21j37J65n6p4j5
4035a75J55p7M05m72j26K72l1j86K0K80q9Q4L07l93L8K23n6k97J01L8j23n7K71
4058A12qm34N02J3l27J01K74k91P1J4K8k33N44n45J34J90K91p49M92k7o01K50
4080a99K35J57k09K10pj89l33N49j98m73N70N0j74j16K85l22K5L91l69j52M35
4101A66j85KK8J91r7J39L6l02r2L66j73o7P9Lj69Q1J54m01K12N7L4k22M53k38
4125E5l06J81O7n1j3L09k32l27K82J70j12J6J75P5k53L6J76m62K37O3k29J14j10
$$ plain form
4148 -139 -110 -24 352 384 -232 46 145 -245 -488 237 -162 -564 142 -119 -236 34 -62 -90 -47 85 -149 -144 99
4171 99 -16 -219 202 157 -17 -101 36 -30 79 181 210 -280 -32 41 -312 -335 176 -277 -384 122 307 -25
4193 -25 2 -57 -131 209 193 83 -138 -97 108 151 -191 110 -269 138 -162 -99 -6 306 -40 -128 137 -169 -42
4216 -42 -9 556 253 -103 98 -143 -116 216 34 -347 -471 38 160 -305 20 -49 38 192 520 -250 134 -77
4238 -77 -50 -113 3 -343 -278 -97 90 -81 16 -106 -48 104 -18 196 -97 -87 444 -183 -38 23 -222 -135 30
4261 30 178 -160 -128 293 -105 -211 267 -153 -127 -170 72 -115 21 -11 -60 -65 99 66 -59 193 0 111 -65
4284 -65 70 47 -261 147 283 -59 36 139 -105 -129 -93 63 -191 265 -175 131 128 120 -98 107 69 -153 -78 224
4308 224 127 -4 140 113 -13 105 265 -71 -58 185 -131 -236 -176 261 74 -8 240 -73 24 305 -151 -105
$$ packed form
4148a39K9Q6L76L2o16K78R9l90k43P25l99m02P06k61j17K70r6k8M3J32k34NK43
4171I9j15k03M21m5j74q4J37o6J09J02K9m90K48P3l53k3N11m53j07N06J85l32
4193b5K7n9p4L40j6j10k21M1K05M3l42L01l79M07l00O3R3L12l46q8K65l06J27
4216d2L3N65l03l56K01k41K7L32j82l81j24N09J22m65L25o9Q7J54L28p70L84k11
4238g7K7o3J16l46O5J81J87j71R7j22N8J52j22K14k93J0N31o27J45O1k45Q7J65
4261C0J48l38L2M21l98j06M78m20K6m3K42j87J36l2m9nJ64l3j25K52j93J11j76
4284f5J35k3l08M08J36l42R5J03k44k4L6J56k54M56m40L06lqk18K05l8k22P5L02
4308B24r7j31J44k7j26J18J60l36J3K43l16j05O0M37j87q2K48l13R7K81m56M6
$$ plain form
4330 -105 64 160 -204 256 117 67 112 -116 221 -151 -81 167 -38 112 224 -211 -185 230 -197 -55 109 26
4352 26 -210 -309 -21 108 213 76 -4 41 302 183 -246 44 113 -82 132 90 76 -54 196 42 -18 -44 73
4375 73 81 -70 195 -32 -111 -108 160 -98 -26 202 -144 71 362 -197 -169 -187 100 -172 79 215 -99 -33 -153
4398 -153 -264 -236 -48 212 182 -105 -79 35 24 122 -37 -102 134 -38 -106 102 -230 18 -67 198 204 156 140 -70
4422 -70 -201 53 -118 60 -99 24 -109 116 254 197 98 -152 41 -28 -470 203 -36 2 162 385 -85 143
4444 143 53 34 62 31 11 22 -5 -52 18 104 -46 102 5 -22 177 -48 -45 212 175 -5 95 58 -192 197 -168
4469 -168 -125 212 -120 93 -131 169 -75 -518 -51 1 3 169 3 24 128 26 -94 -95 -246 -171 83 80 -57
4492 -57 16 8 47 -108 26 210 -180 -15 208 240 -44 -246 105 58 15 -131 -21 100 -67 -170 148 -88 116
$$ packed form
4330a05J69R6l64M60j39n0M5k28L37l72P0K48k05J50J12m35K6M15m27J42J64q3
4352B6k36r9K88J29J05j37q0M5K61j19m29K90O9j95K14m2j4j30K50j54o0k6J17
4375G3Qj51K65k27p9LK68k58P2K28l46K15K91n59K8j8K87k72K51J36l14O6j20
4398a53j11K8J88K60l0k87K6J14j1R8j59o5K36j72o8K08l32K48q5K65Om8j6k10
4422g0j31K54j71J78j59J23j33K25J38n7r9k50J93o9m42O73k39L8J60K23m70K28
4444A43r0j9K8l1k0J1k7m7P0Q6j50J48r7k7J99k25LK57l7j80J00l7k50L89l65
4469a68M3L37l32K13k24L00k44m43M67N2KJ66j66K1J04j02j20jj51P5K54lj37
4492e7P3qL9j55J34J84l90J65K23L2k84k02L51m7m3j46J10J21j67j03L18k36K04
$$ plain form
4515 116 79 6 -255 76 56 -104 392 31 127 280 36 148 -131 -186 71 -213 142 -122 18 303 165 252
4537 252 150 80 191 -19 -229 -54 40 -368 51 -208 -280 -96 -138 -61 123 -26 -83 -19 -76 43 83 16 120
4560 120 48 -63 87 98 -145 95 11 122 -156 85 114 4 37 329 -100 103 -32 6 157 150 -37 36 -111
4583 -111 125 -46 10 116 -352 -100 86 -169 -103 -9 260 -18 111 -164 5 165 140 -83 -15 275 140 -96
4605 -96 0 -169 132 -184 339 -231 32 118 162 -131 -130 129 -284 -80 -46 205 64 152 120 85 7 126 -90 -120
4629 -120 -39 -302 -12 14 264 146 65 396 -99 -87 23 -60 -116 162 19 176 -3 29 -205 107 140 -3 64
4652 64 -398 -81 -5 94 70 -145 8 -75 147 17 197 33 -39 297 125 -94 -34 251 -144 -59 -63 -204 -270 51
4676 51 101 -39 15 -20 -24 -29 -75 48 -173 -81 -45 -41 67 130 40 -115 9 -199 -335 -61 96 -101 -255 176 -174
$$ packed form
4515A16l7p3k61L31k0j60M96l61R6J53k44J12k79n5K57k84L55k64J40K85j38Q7
4537B52j02p0J11k10k10J75R4m08M19k59p2J84m2P7J84j49n7O4n7J19M0o7J04
4560A20p2j11J50J1k43K40q4J11k78K41K9j10L3K92m29K03j35L8J51pj87P3j47
4583a11K36j71N6J06m68K52J86k55O6R4K69k78J29k75J69J60k5k23O8K90j35k36
4605i6R6j69L01l16N23n70K63Q6M4k93JK59m13K04L4K51j41Q8l2l5p8J19k16l0
4629a20Q1k63K90K6K50j18q1L31m95J2J10q3n6K78j43J57j79L2k34L12L3j43O7
4652F4m62L17P6R9k4k15J53q3K22j30J80j64p2L36j72k19O0K85l95Q5mj41o6L21
4676E1N0j40N4l5mnm6J23k21R2L6MJ08O3r0j55J24k08j36K74J57j97j54M31l50
$$ plain form
4701 -174 -8 111 12 -133 122 230 177 -121 -55 27 -147 245 344 -160 202 128 -35 -19 -14 -199 -88 463 -230
4724 -230 -60 -32 -98 -152 -98 -96 -133 60 -40 162 -117 103 -100 50 -380 -7 -172 -1 -126 -72 -45 -5 70 -49
4748 -49 -8 112 15 -176 219 -35 -221 -53 -57 -194 -304 -117 -266 46 15 -286 -144 126 238 -123 -23 100
4770 100 -275 41 -174 23 -254 -176 -4 -4 277 -104 -76 -224 142 172 93 -300 110 -170 -25 163 228 157 -291
4793 -291 -22 -76 135 113 -46 -375 45 172 45 -77 171 119 -106 63 -46 -58 164 -32 -159 -7 -167
4814 -167 -207 -124 -70 -206 -63 129 -255 -122 -255 34 -160 -95 24 138 109 268 -10 -150 -21 -51 -143 -48 169
4837 169 -161 204 68 -227 69 164 53 49 121 235 148 84 121 -106 62 -193 132 -38 261 -89 -17 -96 -54
4860 -54 -57 -104 146 121 -125 205 -60 13 -22 -165 -64 -159 173 -31 -139 52 218 46 215 129 12 -295 183
$$ packed form
4701a74J66J19r9j45K55J08n3k98O6Q2j74L92R9n04L62p4j63J6Nj85J11N51o93
4724b30J70K8o6n4N4Kl7J93j00K02k79K20k03J50m30L73j65J71j25N4K7M0P5j19
4748d9M1J20r7j91L95k54j86J68mj37j10J87j49L12l1l01J42K70J12l61J00J23
4770A00l75L16k15J97k77P8J72%K81l81K8j48L66L0p9l93M10k80J45J88O5p1m48
4793b91K69n4K11k2j59l29M20J27j27j22K48n2k25J69j09j2K22j96j27J52j60
4814a67m0Q3N4j36J43J92l84J33j33K89j94O5J19J14k9J59k78j40J29l0r2R5K17
4837A69l30L65j36k95K96R5j11mP2J14q7o4L7k27J68k55L25j70K99l50P2p9M2
4860e4lm7K50k5k46L30k65P3l5j43J01r5L32k04j08J91J66j72J69q6j17l07M78
$$ plain form
4883 183 153 -60 392 257 15 121 -73 -216 -202 149 163 -296 -108 -69 68 91 161 140 -9 12 -17 -144 6
4906 6 311 -142 225 -59 25 -189 69 20 59 60 23 -184 -279 116 -243 32 100 88 -167 135 36 41 -35 67 -424
4931 -424 -84 191 -13 -104 23 -130 30 -128 -172 -1 189 -96 -99 92 -138 157 -149 268 -102 -124 115 -102
4953 -102 -41 -137 1 149 -325 -218 178 -95 -85 70 -157 -82 34 157 -83 -69 126 -60 -161 170 108 65
4975 65 -1 -3 -33 -223 -30 -190 -203 30 65 141 71 181 -7 -11 35 -245 -239 105 -65 -177 -80 18 322 112 -515
5000 -515 -172 -21 -33 81 17 -47 -176 -13 35 150 -88 -36 78 162 66 24 -105 -59 -286 19 -20 39 -64 159
5024 159 -25 27 78 188 2 -65 167 -293 117 16 -212 -174 234 -19 -145 9 251 121 134 53 -242 59
5046 59 8 264 -318 -31 41 -15 136 129 -10 -8 137 11 61 57 -98 125 13 -147 306 -81 -235 347 -144 -58
$$ packed form
4883A83l0k13M52j35k42J06j94j43J4L51J4m59J88L9J37K3P0k1j49K1k9j27J50
4906FL05m53L67k84Q4k14K58m9L9Jl7k07r5L95l59K75O8j2k55L02r9Np6J02m91
4931d24L40K75k04r1J27j53J60j58m4J71J90k85lJ91k30K95l06M17l70k2K39k17
4953a02O1r6J38J48m74J07L96k73J0J55k27P5J16J23k40J4J95j86j01L31o2m3
4975F5o6kl0j90J93j60j3K33L5P6p0J10j88mM6k80OL44j70j12R7R8L04k10o27
5000e15L43J51j2J14o4o4j29J63M8J15k38N2J14Q4r6m2j29M6k27L05l9N9j03K23
5024A59j84N2N1J10j86o7K32m60M10j01k28L8M08k53j26J54K42j30J3q1k95L01
5046E9n1K56n82K87P2n6J51pj39KJ45j26N0mj55K23j12j60M53l87j54N82m91Q6
$$ plain form
5070 -58 -231 117 113 10 7 299 -213 3 -75 -93 -23 198 1 194 171 -32 -83 -74 326 56 343 130 341 -68
5094 -68 -66 -186 -66 148 50 343 -263 -106 -9 -201 -264 -68 -207 17 -57 12 84 -165 -117 76 53 -28 218 109
5118 109 101 52 -79 157 -142 -6 80 51 -99 -27 -482 -140 108 -196 -92 -109 50 134 -66 3 -244 -51 222
5141 222 -58 361 104 222 -117 -86 -53 88 -152 -44 130 -170 98 142 206 -43 -10 -63 62 -75 413 67
5163 67 -19 57 131 45 118 28 -244 -100 292 -243 59 -95 124 -39 49 91 -93 -35 66 -15 -83 32 -286 337
5187 337 130 53 -92 55 52 31 129 86 -34 35 44 -8 27 219 219 83 -139 64 -173 33 -112 -138 -124 -145 183
5212 183 -151 -136 -108 105 61 259 -87 -91 -298 19 -268 211 207 -81 267 -32 144 -42 -196 132 8 -205
5234 -205 -15 -251 -128 -14 -227 -90 213 396 -112 37 -51 171 181 -175 247 -117 45 -132 -22 114 -148
$$ packed form
5070e8j73L48mj03lK92n12K16p8j8P0K21j97J93k3k03n1RM00k70K87k13K11m09
5094f8Kj20J20K14r8K93o06J57R7j92o3J96j39K24p4O9P2k49M8J93k3q1K46j09
5118A09qm9j31K36k99J36Q6k9j50P2m55L42K48l04J04j7J59Q4k00O9k47J93K73
5141B22k80M19k57J18l39L1L3J41k40J08J74l00K68M4O4k49L3n3J25j37M88l46
5163F7q6P6P4q6P3r0k72J44L92n35L02j54K19j63Q8M2j84N8J01q1o8J15l18O23
5187C37k07p7j45J47lk1R8m3j20O9Rn2L5J92%j36k22K03k37K06j45k6J4k1L28
5212A83l34J5K8K13m4J98l46mk07L17k87M79mk88L48k99J76j86j54L28j24k13
5234b05J90k36J23J14k13J37L03J83n08J49q8K22J0l56M22l64J62j77J10J36k62
$$ plain form
5255 -148 -228 -12 73 3 -185 -195 -231 132 79 -142 18 96 186 -114 -280 43 50 20 58 195 30 -44 112 318
5279 318 -96 -260 162 3 -59 -30 164 111 -69 187 -199 -220 111 -95 39 230 118 -26 -103 162 147 38
5301 38 49 264 9 240 110 109 298 41 173 -140 -61 275 20 89 41 95 212 241 25 -106 270 15 -242
5324 -242 -310 30 80 476 -36 -4 -43 24 -41 -174 55 -167 -79 1 281 -45 -85 -112 325 -95 79 60 -118 92
5348 92 -46 -135 11 280 277 108 120 -48 -237 -76 210 271 250 36 88 26 160 122 -95 168 24 77 -72 20
5372 20 200 -173 -95 -101 -176 200 302 57 162 15 -70 304 166 41 -219 -125 -98 -143 -12 405 82 -183 -144
5395 -144 69 -90 -218 -17 -42 -126 -68 -66 135 221 -219 -173 -250 159 -121 -314 -16 -99 151 176 61 9 51 142
5419 142 -72 40 191 -23 -162 117 21 9 -63 -47 -32 -18 127 203 -163 -319 109 -237 -81 55 -59 -35 -88
$$ packed form
5255a48q0K16Q5p0j88j0l6L63n3k21J60P8R0l00j66L23Pl0L8J37j65p4J56K06
5279C18m14j64M22j59o2K9J94n3j80K56l86k1L31k06J34J91j12j44p7K65j5j09
5301C8J1K15k55K31j30jJ89k57J32l13P9L36k55O9m8N4J17K9k16j31L76k55k57
5324b42o8L40N0L96n12L2l9O7o5j33K29k22Q8Q0K80l26m0k7M37m20J74j9j78K10
5348I2j38q9J46K69lj69J2j68j89J61K86O1k1k14N2o2J34l8k17K63j44N3j49R2
5372B0J80l73P8op5L76J02k45J05j47q5L74j38j25k60R4K7m5J31M17l23k65L9
5395a44K13j59j28K01k5q4N8KK01Q6m40M6p7M09k80j93K98q3K50K5j15n2M2R1
5419A42k14J12J51k14j39K79r6j2p2J6J5J4J45P6l66j56M28l46J56J36j14K4n3
$$ plain form
5442 -88 -181 -252 271 -224 188 218 169 -381 16 -42 -72 -2 -232 94 -118 244 -107 184 -17 33 -25 -179 -221 35
5466 35 47 -89 241 -431 -140 228 -1 -81 -98 27 -99 -7 99 -163 -79 186 -6 -100 92 79 39 34 30 251
5490 251 -92 220 -37 25 66 117 -96 93 216 -99 -288 -229 193 63 136 -165 33 121 119 -43 99 22 13 117
5514 117 -14 108 31 -48 119 -35 -118 -79 367 127 319 310 -361 133 -5 365 -40 74 -143 12 11 -131 -171
5537 -171 -97 331 -47 -285 42 7 -54 130 -159 -159 192 2 31 122 -57 3 -184 143 80 -151 -158 360 72 77
5561 77 31 -176 44 67 102 -80 -298 -76 -116 142 205 -25 -199 178 122 -27 -136 -23 -98 95 22 162 86
5584 86 105 -15 90 67 28 36 67 164 -102 136 1 277 178 26 291 -42 204 -100 -160 89 -266 195 -144
5607 -144 81 97 214 125 104 12 -219 -198 -130 -77 -51 137 333 -342 -132 53 28 37 -54 106 -124 125 265 -15
$$ packed form
5442h8r3p1N23m95M12L0m9n50L97n8l0P0k30L26k12L62l51K91k01N0n8j54m2K56
5466C5J2j36L30o72K91L68k29q0j7J25j26R2J06k62Q4K65j92r4J92j3m0nmK21
5490B51l43L12k57O2M1N1k13J89J23l15j89N9M22j30P3l01J98Q8kj62J42p7rJ04
5514A17j31J22p7p9J67j54q3L9M46k40J92ro71M94j38L70m05J14k17J55jj42m0
5537a71P4M28l78k38L27l5o1J84k89%L51j90K9R1j79O0j87L27o3k31pN18k88N
5561G7m6k07K20K3L5j82k18K22m0K58O3k30j74L77n6j49j09J13p5J93p3J40p6
5584H6J9j20J05k3l9QL1R7k66K38j35K76r9j52K65l33K46l04o0K49l55M61l39
5607a44K25J6J17q9k1r2k31K1O8N3K6J88J96o75K10J85k5Rr1J60k30K49J40k80
$$ plain form
5631 -15 95 -113 -187 30 9 -98 -219 120 164 -72 -178 -50 -177 77 -175 138 18 60 50 -112 380 94
5653 94 196 -52 28 196 -379 155 193 4 132 14 -233 102 -120 15 -12 -91 -74 116 18 -147 43 146
5675 146 70 66 -60 -257 231 80 -23 -254 349 -75 25 -92 -25 -33 7 77 -52 186 -57 -184 -19 -61 -1
5698 -1 -27 -94 -73 138 -85 73 -181 80 -63 51 8 -12 113 -110 40 62 311 -24 -8 -138 3 135 -146
5721 -146 -428 -26 35 102 -171 -92 82 140 -108 72 -34 73 -120 -82 -136 -137 93 -25 36 124 41 -96 201 20
5745 20 164 394 -105 112 -152 179 -38 173 -43 -138 -113 84 -23 -24 3 0 234 17 18 -137 104 -216 -352
5768 -352 -159 245 -19 -43 141 -209 -32 -82 232 26 -127 -127 -9 109 -258 -139 -163 -129 105 135 112 185 -64
5791 -64 198 -161 59 -112 -49 48 47 -122 -237 95 -108 -224 123 26 -150 -49 -108 -409 -100 -41 -278 -43 262
$$ packed form
5631a5J10k08p4K17k1j07j21L39M4k36j06J28j27K54k52L13j20M2j0j62M92k86
5653I4J02k48Q0J68n75N34L8j89J28j18k47L35k22J35k7p9J7J90r8j65J90J03
5675A46p6mj26j97M88j51j03k31O03m24J00j17O7qM0P0j29K38k43j27J65m2O0
5698ak6o7K1K11k23J58k54K61j43J14m3k0J25k23J50K2K49l35J6j30J41J32k81
5721a46k82M02O1O7k73P9J74N8k48J80j06J07j93L8n4jK30j18O1Q8q3j37K97j81
5745B0J44K30m99K17k64L31k17K11k16r5K5J97j07jK7lK34k17Jj55K41l20j36
5768c52J93M04k64k4J84l50J77n0L14k06j53%J18J18l67J19k4L4K34L0k3P3k49
5791f4K62l59K20j71O3R7jj69j15L32k03j16L47r7j76J01n9l01L09N9k37K35L05
$$ plain form
5814 262 -173 28 -336 -3 -152 -106 13 -82 77 -141 -75 -227 42 337 11 46 127 -365 94 -59 79 -116
5836 -116 92 102 -32 2 143 119 255 -235 49 -162 70 98 96 -168 114 -31 -109 -144 -284 -215 -121 58 -148
5859 -148 -366 46 -9 -221 174 334 -94 -12 -147 165 408 244 -33 -180 -65 -43 -9 267 -9 190 -81
5880 -81 64 -113 -101 14 -147 -36 -55 10 39 -77 99 34 -8 -95 -37 -126 14 -40 -155 33 -21 -152 -167 20
5904 20 -111 -218 -93 68 28 -62 -215 -73 43 -37 305 -84 -10 300 261 -68 112 -42 9 43 76 -105 151
5927 151 -214 -79 85 6 16 -36 199 42 -166 -17 121 28 142 -47 -27 -130 434 60 77 -40 176 -24
5949 -24 -183 276 4 -88 6 57 51 54 51 -57 -100 -49 -163 -65 256 55 53 -157 -81 -212 -82 -35 151 -78 -19 152
5975 152 -135 -61 -115 170 -255 -229 79 78 29 81 -69 -99 -205 -60 79 -85 261 -249 266 52 -79 -103 -12
$$ packed form
5814B62m35K01l64L33j49M6J19r5J59k18O6j52K69K95l26L5Q1m92M59j53J38j95
5836a16K08J0j34L4J41k4J36m90K84k11K32K8kk64K82j45p8l5j40O9R4J79k06
5859a48k18M12n5k12L95J60m28Q2j35L12K43j64k77j47J15K2L4K76k76J99k71
5880h1J45j77J2J15j61J11j9O5K9j16J76o5m2q7N8q9J40n4j15J88n4j31j5J87
5904B0j31j07J25J61m0r0j53J42J16q0L42l89P4L10l9l29J80j54N1L4L3j81K56
5927A51l65J35J64p9J0n2K35j57k08J49J38r3J14j89K0j03N64l74J7j17K16k00
5949b4j59M59k72r2R4N1oLlj08m3N1j14R8L21k01kk10P6j31J30M7J86k29N9J71
5975A52k87P4n4K85m25K6L08jm9N2j50l0j06J45J39j64L46n10N15k14j31k4R1
$$ plain form
5998 -12 -118 -270 208 67 -111 134 95 -108 -87 144 -175 -177 -69 -24 222 188 12 -91 61 55 -234 -390 -18
6021 -18 -79 135 -42 -179 -29 105 194 49 69 43 58 -152 -160 -134 -134 238 113 -1 -85 57 -277 -195 199 -63
6045 -63 100 42 28 52 -198 -57 45 25 83 106 6 -31 -162 -190 70 16 75 30 -44 29 -75 180 -11 -109 -216
6070 -216 -95 62 -262 48 30 74 147 -10 -252 -80 102 87 -54 -264 15 -80 38 -44 159 69 -95 -15 -250
6093 -250 -274 126 -75 -65 -95 8 92 175 -227 9 186 -19 158 -47 165 -125 42 -111 137 -159 -82 283
6115 283 -58 -174 -1 -97 44 57 3 -204 -203 -47 53 2 -9 37 -206 144 -26 109 63 212 303 -206 270
6138 270 -20 -37 51 35 11 -133 197 37 84 39 25 -91 173 -137 -60 40 86 10 227 233 -107 -15 6 105 80
6163 80 28 -9 75 81 -23 -48 -288 32 48 59 146 4 -126 -30 161 197 240 -278 -129 -7 -11 54 115 -258 21 -52
$$ packed form
5998a2j06j52M78j41j78K45l9k03K1K31l19kJ08M5K46l4j76j03J52ok89j56L72
6021a8o1K14j77j37J50J34Q9j45K0k6J5k10qK6%L72j25j14q4J42l34Q2L94k62
6045f3J63n8j4K4k50J41J02k0N8K3j00l7j31k8K60n4N9m5p4P3j04K55j91r8j07
6070b16J21J57l24L10j8M4P3j57k42J72J82j5j41k10K79r5J18q2K03r0j64Q0k35
6093b50k4M00k01J0l0J03Q4Q3m02K36J77k05J77k05K12k90J67j53K48k96P7L65
6115B83l41j16J73r6J41J3n4k07JJ56J00n1j1M6k43L50j70J35m6J49R1n09M76
6138B70k90j7Q8j6k4j44L30j60M7m5j4j16K64l10P7J00M6p6K17Ol40R2K1R9k5
6163H0n2l7Q4Oj04k5k40L20J6J1Q7j42j30R6J91L6M3n18J49J22mO5O1l73K79p3
$$ plain form
6189 -52 102 355 88 -84 118 -88 -212 -127 -42 -33 14 24 -90 151 15 268 363 24 25 -78 45 -237 285
6212 285 132 182 35 18 -118 -159 -48 31 -94 31 53 -22 -79 151 -150 126 -166 -3 -103 0 152 -94
6234 -94 -76 58 258 84 -60 237 320 69 279 -90 -13 -273 -113 -8 -182 -29 -62 -24 418 -270 -39 155
6256 155 5 57 95 -81 -52 100 25 -25 -15 52 -79 -346 -229 -131 -74 22 148 31 -88 124 0 -102 41
6279 41 -97 -37 -81 -2 -104 -164 122 179 -84 110 128 -48 -77 104 -157 31 22 -424 -73 -215 -2 27 -20 126
6303 126 28 -309 35 266 93 368 181 -230 60 -43 185 -2 192 52 248 -182 -109 -154 -197 114 -54
6324 -54 194 13 -3 -233 -112 -62 -96 -128 97 -42 149 -19 213 221 27 199 -318 76 -130 -68 20 392 -39
6347 -39 238 222 -147 -146 196 -88 -62 106 -86 113 -48 -29 -175 -242 -212 27 93 -79 -27 233 62 109 241 107
$$ packed form
6189e2J54K53k67j72K02k06j24Q5Q5RM7J0j14K41j36K53R5l39Jj03J23k82N22
6212B85j53N0j47j7j36m1J11P9j25J25K2p5n7K30l01K76k92J63j00J03J52k46
6234i4J8J34K00j74j44K97Q3k51K10l69P7k60J60J05j74J53l3L8M42o88K31J94
6256A55j50N2L8j76K9J52p5n0J0O7j31k67J17R8N7R6J26j17j19K12j24j02J43
6279D1j38O0m4P9j02o0K86N7k63J94J8j76k9J81k61J88rm46L51j42K13K9m7J46
6303A26r8l37L44K31j73K75j87m11K90j03K28j87J94j40J96m30P3m5m3L11j68
6324e4K48j81j6k30J21N0l4l2K25j39J91j68K32Qj94J72n17L94k06O2Q8L72m31
6347c9K77j6l69JL42k84K6J68j92J99j61J9j46o7L0K39O6j72N2K60j71M7J32j34
$$ plain form
6371 107 41 231 -41 -51 22 91 56 -71 -78 124 67 -12 20 314 226 9 3 169 -52 42 -86 -135 35 32 -226 -47
6397 -47 -4 -18 -85 60 -52 -205 201 -58 -84 -220 -18 68 -14 18 -11 -21 56 29 -390 -192 -190 -38 -94 158 52
6422 52 24 195 -325 -265 56 1 -136 158 109 174 108 106 -140 -54 8 -193 -22 -73 -28 77 43 -143 -214 -37 5
6447 5 -186 -10 -113 158 -154 122 156 -58 69 110 148 227 -57 186 -244 -94 8 -128 29 150 156 -89 -148
6470 -148 -113 150 251 301 141 204 -65 -32 14 146 -189 -5 -130 35 179 86 -135 6 70 -87 -138 28 -54
6493 -54 -148 10 219 -125 -30 33 193 -89 -12 36 150 -76 135 -25 -289 -259 -35 153 46 118 171 81 -111
6516 -111 -71 3 141 42 32 165 264 -22 80 -147 29 -66 294 57 -101 -42 195 -82 -288 237 224 8 89
6539 89 3 25 46 2 46 20 136 -9 -126 -5 131 69 -358 -158 -224 -202 62 251 90 -3 -63 64 30 -371
$$ packed form
6371A07o6J90k72j0P3O9l5j27pK02n7p9L2K94q8k17oJ66k21R4j28m9J70lk58J79
6397d7M3j4o7J45j12j53M06k59k6j36K02Q6q2L2k9j0P7k7m19J98KJ52n6K52j06
6422E2k8J71n20O0L21n5j37K94m9O5o6kk46Q6O2k01J71n1M5J05l4j86p1J77M2
6447Ej91J76j03K71l12K76L4k14J27M1L8P9k84K43m30J50J02j36J57J21Ok45n9
6470a48L5K63J01N0j60O3k69L3M6J32l35J84j25J65J44r3k21J41O4j57n1J66q2
6493e4r4J58K09l44R5O3J60k82P7M8J14k26K11j60k64L0K24J88j07P2N3r0j92
6516a11M0P4J38r9j0J33R9k86J02k27J76r5L60k37j58N9K37k77k06N25j3k16Q1
6539H9q6K2K1m4M4k6J16j45j17J21J36o2m27K00o6K2K64J89j61r3o0J27l4m01
$$ plain form
6563 -371 241 107 -3 -86 27 63 5 -8 -171 -52 209 -42 -155 -43 -35 71 106 -149 41 11 128 -152 -22
6586 -22 337 55 15 -146 79 -167 -295 -37 -161 -89 66 -1 -215 231 -66 -101 -70 13 -100 -23 -55 -248 -119
6609 -119 2 -47 -34 409 215 24 24 105 -123 -108 196 145 24 -189 -212 -56 61 56 -37 -52 302 -6 59 241
6633 241 61 -74 24 -10 56 171 108 -79 -37 44 64 -99 -12 204 95 -128 205 93 105 -29 -35 -34 -282 -135
6657 -135 36 -75 88 51 -95 257 93 34 23 141 -232 -55 -71 226 -171 150 -129 10 -129 265 -16
6678 -16 15 -133 -22 143 -114 14 104 -73 -217 178 102 367 -164 -87 46 -116 -100 129 317 62 -44 -47 83
6701 83 -32 250 22 -28 -126 -16 51 114 98 3 -31 38 -5 -71 219 143 -88 22 -275 165 -64 208 -199 -77
6725 -77 -254 -57 182 -107 -110 -46 36 -69 407 10 45 -131 148 82 156 -70 14 38 -63 145 -255 35 175
$$ packed form
6563c71O12j34j10q3J13L6n8j3j63J19K61k51j13J12QJ06L5k55J90l0J17k80J30
6586b2L59k82m0j61K25k46j28K58j24P2J55o7k14M46k97l5L1Q3j13P7l2j93J29
6609a19J21m9J3M43j94j91%Q1k28J5L04n1j21k13k3J56J17nr3j5L54l08O5J82
6633B41j80j35R8l4O6J15o3j87M2Q1K0j63Q7K16j09k23L33j12J2j34oJk48J47
6657a35J71j11J63l7j46L52j64n9j1J18l73J77j6K97l97L21k79J39j39L94k81
6678a6L1j48J11J65k57J28R0j77j44L95p6K65n31P7J33j62J6K29J88k55j06lJ30
6701H3j15K82k28n0r8J10O7O3j6r5l4O9m3o6K90p6k31J10k97M40k29K72m07J22
6725g7j77J97K39k89lO4Q2j05M76l97L5j76K79o6P4k26Q4K4j01K08m00K90J40
$$ plain form
6748 175 -263 -189 -152 -110 71 -165 2 -234 -140 98 81 -153 39 -4 -113 -148 177 161 80 79 -136 33 -167 -437
6772 -437 -19 129 2 -84 221 39 -147 -169 113 -136 -182 69 -111 -222 48 20 111 -97 -178 -204 -190 -311 125
6795 125 -62 65 86 88 78 134 -83 61 60 53 63 -84 74 261 101 -149 72 105 201 35 -22 -174 -1 108
6819 108 -97 63 -11 109 -17 223 -147 -89 -75 45 -83 327 18 -125 200 22 85 -17 -68 -21 365 172
6841 172 -151 -14 320 -132 -177 -85 15 -34 -57 -8 -139 -131 127 99 -156 -176 107 75 -14 71 -191 -121 -213 23 -222
6866 -222 -145 -178 53 259 159 143 -130 -8 75 -27 314 -31 165 -62 113 -72 -172 -42 -183 333 144
6887 144 -112 -170 -72 -113 16 41 80 -137 124 -18 -19 109 -27 -172 57 -151 -79 -77 -119 -110 98 82 213 167 -128
6912 -128 131 -5 128 77 -193 31 151 -105 33 54 -251 -75 -86 73 -76 -8 27 -103 -2 -20 15 -42 -71
$$ packed form
6748A75m38P4L7M2J81k36J67k36R4K38j7k34J92m3j09l5L25j6q1jk15J69k00k70
6772d37M18J48j27q6L05j82j86k2K82k49m6K51j80j11K70k8R1k08q1k6J4j21M36
6795A25j87J27K1Kj0N6k17J44jpJ0j47J58J87j60k50K21L3R6j66n7j52J73J09
6819A08k05J60p4J20j26K40l70N8J4J20j28M10l09j43L25j78O3j02n1M7L86j93
6841A72l23J37L34m52m5R2J00m9k3M9j31QK58k8k55k0K83l2q9Q5k62P0r2K36k45
6866b22P7l3K31K06j00j6k73J22Q3j02L41l45J96k27J75j85j00J30j41N16j89
6887A44k56n8R8m1J29K5L9k17K61j42jJ28j36j45K29k08P2Km2RK08j6J31m6k95
6912a28K59j36J33n1k70K24J20k56J38K1l05J76j1J59j49O8L5j30J01j8L5n7k9
$$ plain form
6935 -71 -156 -11 202 -105 175 18 -45 150 -241 155 319 -112 381 42 -182 -41 0 -31 -370 92 6 113
6957 113 171 236 -290 15 78 34 -152 -86 5 -246 -125 -144 29 176 200 114 168 117 -94 -93 -73 -48 -114 110 66 49
6983 49 93 138 -145 -12 -177 -6 -72 -45 -21 110 -136 -99 -48 -127 46 153 92 -170 -17 -5 -113 -138 68 -108
7007 -108 -107 -63 -270 27 177 -47 85 81 372 145 -19 27 10 -50 -43 -123 -43 -244 -12 -102 -35 16 -175 -54 419
7032 419 -111 -68 -329 -137 103 -40 -175 -121 -328 -188 50 -123 -66 87 -40 -18 113 -19 -245 -6 58 -70
7054 -70 162 52 156 144 -210 -194 -4 -276 272 41 -163 32 76 67 23 -103 -3 -96 24 -345 -109 -8 32
7077 32 15 -217 -81 -298 -270 22 28 14 -7 -85 -23 79 150 -143 -21 89 -27 77 284 117 144 -255 44 -47
7101 -47 -175 -106 -18 -87 161 51 315 -60 79 -189 131 -111 116 -200 -66 -53 -24 214 -155 5 2 94 -164
$$ packed form
6935g1q5J45K13l07K80j57o3J95l91L96J64m31M93l39k24J41M1l1l39M62q6J07
6957A13N8O5n26L05O3m4j86O6R1k51J21j9J73J47K4q6N4n1k11JK0K5o6K24m4j7
6983D9M4M5k83J33j65J71o6K7K4J31k46L7N1p9J73J07o1k62J53J2j08k5K06j76
7007a08JM4k07K97J50k24J32mK91k27j64M6j7o0Pq0Q0k01K32r0O7N1j91J21M73
7032D19n30M3k61J92K40j43j35N4k07J40K38j73N7J53j27K2J31j32k26K39O4j28
7054g0K32j10J04j2l54J6J90k72N48k31k04J95M4rm4j26J00r3J20l69K36J01M0
7077C2j7k32J36k17K8K92Oj4k1p8O2J02P1k93J22J10j16J04K07j67K7l99K99r1
7101d7j28O9Q8o9K48j10K64l75J39k68L20k42K27l16J34J3K9K38l69J60lR2k58
$$ plain form
7124 -164 -38 103 159 -215 -109 -73 21 200 86 -12 -86 48 -22 -42 -79 14 125 -5 354 -167 59 -28 -68 -22
7148 -22 21 182 -155 81 -300 5 -70 -19 -111 22 -29 110 275 200 298 -6 241 -42 39 127 -26 -45 120 266
7172 266 273 -129 -200 164 80 -121 101 15 222 -20 34 249 37 145 275 -164 48 -147 89 -36 138 83
7194 83 -71 122 8 178 58 -67 -248 26 76 -5 -54 55 175 107 -49 62 -84 75 108 81 -130 262
7216 262 4 -142 -65 90 110 -24 -113 13 69 -87 233 104 -13 39 -248 -105 279 -66 -8 113 98 -59
7238 -59 -194 -91 -48 189 14 -69 152 86 -121 -78 81 -230 -74 -153 143 -230 -114 -226 62 -141 401 137
7260 137 -88 62 -101 67 -123 136 -199 -274 136 91 -180 -3 -56 21 -18 -33 42 -276 35 215 -86 -123 37
7283 37 56 -98 30 -81 10 162 -132 117 41 61 0 -209 9 180 -236 -97 174 -174 231 223 35 -5 -9 -65
$$ packed form
7124a64J26J41N6l74J06L6R4J79j14r8p4J34p0k0l7R3J11j30L59n21K26q7m0M6
7148b2M3J61l37K36l81L05p5N1r2J33n1J39J65p5R8l04K47k83Q1Q8j53j9J65J46
7172B66Pm02p1L64q4k01K22q6K07k42N4K15k12J08J30m39K12j95K36j25J74n5
7194H3j54J93j14J70j20j25j81K74N0q1m9J09J20o8j56J11j46J59L3k7k11L92
7216B62k58j46P7J55K0j34q9J26N6j56L20j29j17N2k87J43L84l45N8J21j5j57
7238e9j35J03M3K37j75q3K21o6k07M3J59l11J56p9K96l73J16j12K88k03N42k64
7260A37k25J50j63J68j90K59l35p5M10m5k71J77n3P7l9j5P5l18L11J80l01l7J60
7283C7J9j54J28j11R1J52k94K49p6K0o1k09K18J71m16J39K71l48M05qj88m0mn6
$$ plain form
7307 -65 -244 36 -36 171 -346 -119 28 265 -118 -89 10 35 104 -42 127 228 -94 -79 -222 74 9 3 199
7330 199 -158 141 79 65 97 230 -105 -61 -44 14 65 -76 59 65 -101 268 138 -203 -5 63 -179 -145 25 -52
7354 -52 167 -157 189 -12 107 42 -390 -157 33 63 8 -84 297 98 -178 15 -23 -136 243 253 -122 -69 129
7377 129 -33 -73 243 55 138 48 -151 261 213 38 -179 121 119 133 -127 -73 -65 101 -168 -45 36 212 171 56
7401 56 251 37 158 103 -1 15 127 -95 68 -89 -391 96 14 -113 230 -44 205 -65 216 67 45 173
7423 173 9 -75 29 -212 -147 -115 -104 -298 57 216 -325 154 -27 -10 -330 140 -130 162 -97 -143 -6 -79
7445 -79 -23 -71 -244 -117 114 -73 105 184 -154 108 204 69 -39 -80 -61 -110 19 19 197 57 -46 49 35 -42
7469 -42 -168 -148 34 -48 133 122 88 24 6 -285 76 378 72 75 170 171 -104 92 -84 115 -6 -64 -159 -30 59
$$ packed form
7307f5j79K80p2K07n17K27J47K37l83K9R9K5O9j46J69J01l22J5j43K96o5oJ96
7330A99l57K99o2j4L2J33l35M4J7N8N1j41J35Oj66L69j30l41J98O8k42L4J70p7
7354e2K19l24L46k01J19o5m32K33J90L0n5r2L81j99k76J93l8j13L79J0l75N3J98
7377A29j62m0L16j88Q3r0j99M12m8j75k17L00kJ4k60N4QJ66k69J23Q1J76m1j15
7401E6J95k14J21n5j04J6J12k22J63j57l02M87q2j27L43k74K49k70K81j49k2J28
7423A73j64q4J04k41O5L2J1j94L55J59n41M79j81J7l20M70k70K92k59m6J37p3
7445g9N6m8j73J27K31j87J78P9l38K62R6j35j08m1J9m9J29%J78j40j03R5j4p7
7469d2j26K0J82q2J81j1l4o4j8k91L61L02l06LR5Jk75J96j76J99j21n8r5J29Q9
$$ plain form
7494 59 27 33 -16 -78 -177 -256 -233 -62 133 86 42 57 39 189 -10 243 17 126 -111 227 294 180 -93 54 317
7519 317 -191 -4 108 256 -210 -176 -240 133 284 227 -106 123 -86 23 -135 -103 23 -97 -30 -61 226 -167
7541 -167 148 -40 77 -26 164 17 62 -56 -42 16 86 -116 -67 8 -69 84 -69 181 -57 317 -190 179
7563 179 47 -4 12 -49 84 147 114 112 65 1 115 -134 36 -65 258 43 -80 47 83 -144 -72 144 193 -242
7587 -242 321 -97 -178 26 80 130 -79 26 -190 -234 -24 -29 37 2 188 -239 -51 -18 114 -78 -49 161 2
7610 2 82 70 24 156 -139 3 18 71 177 -11 195 25 39 195 62 -113 106 235 -8 103 116 95 154 195
7634 195 -123 -191 -5 110 185 -43 44 -123 44 -45 -262 -150 307 186 262 33 -184 130 83 -10 200 -112
7656 -112 -252 -18 167 17 39 171 143 12 243 -116 -372 -142 8 -282 153 90 123 123 0 244 -124 24
$$ packed form
7494E9l2Om9o2r9p9K3J71J95m7m4J5j8J50j99K53k26J09k37L38O7j14k73J47K63
7519C17n08J87J12J48m66L4o4L73J51n7l33K29k09J09j58L2J26j20O7l1K87l93
7541a67L15j88J17j03J90j47M5j18J4N8P0k02M9P5p7J53j53K50k38L74n07L69
7563A79j32n1J6o1J33O3l3km7o4J14k49J70j01L23k15j23J27L6k27P2K16M9m35
7587b42N63m18q1K04N4N0k09J05k16m4K10nO6l5J86m27J88L3J32j92K9K10j59
7610BQ0j2m6J32k95J42J5N3J06j88K06j70J4J56j33j75K19J29k43J11J3k1N9M1
7634A95l18o8J86J15P5k28Q7j67J67q9k17J12M57j21P6k29k17L14m7r3K10l12
7656a12j40K34J85j50K2J32k8j31K31l59k56K30J50k90M35o3L3%j23K44l68J48
$$ plain form
7678 24 -19 -14 39 -127 -171 184 91 -265 41 -29 72 -181 76 -76 -102 72 190 -11 -145 -259 -150 -219 46
7701 46 103 97 -191 306 283 -129 124 162 77 -129 141 145 74 153 74 -127 53 80 -279 -32 175 -57 -81 -118 -41
7726 -41 98 309 34 -125 -211 249 102 27 412 -52 -336 105 -249 11 255 -81 197 -24 34 -15 87 -25
7748 -25 -4 -142 92 -61 -166 -32 60 91 20 158 -51 -33 151 3 -20 143 330 158 59 45 -3 -94 119 82
7772 82 -24 -18 166 92 94 285 186 -82 -39 -128 -226 28 -49 -42 -111 -274 -92 7 13 407 -124 204 97 34 -44 -16 -96
7799 -96 -7 14 148 -244 1 -106 -72 18 -158 249 -99 -50 -113 -144 -145 55 -58 -323 -145 -190 -171 -117 105 82 38
7824 38 193 194 -101 55 324 -157 -307 -238 -133 202 177 324 0 48 -35 -24 -75 204 -7 -25 131 176 -13 -96
7848 -96 135 -73 177 187 -32 -170 -79 100 -154 55 9 -156 -74 -80 102 -22 -12 75 128 -224 101 -121 120
$$ packed form
7678B4m3NN3j66m4L55r3l56L06p0J01k53K57j52k6J74J18k01j34j14J09o9K65
7701D6N7ok88M97k3m12K53L8q5k06K70Mp1P9p9k01J80K7l59K47K07k32k4l7P7
7726d1J39K11k75j59q6M60j47p5L85m64k84M41l54K60K44l36K78k21N8m9J02j12
7748b5K1j38K34j53j05J34R2L1p1J38k09J8J84j48k3J63J87j72r9j4m8r1K13l7
7772H2j06OJ84p4KJ91r9k68M3q9r8K54p7Po9j63J82R9OL94n31L28j07o3p8K8q0
7799i6Q9K1J34l92K45j07L4R0j76M07l48M9o3l1jK00j13k65J78m5J9N4K22k3m4
7824C8J55Jk95J56K69m81j50O9J05L35k5J47l24M8q3J1n1K79k11j8J56M5j89q3
7848i6K31k08K50J0k19j38R1J79k54K09m6j65Q2oJ82j24J0Q7N3l52L25k22K41
$$ plain form
7871 120 -57 71 166 -17 -45 -49 94 -30 -35 82 217 92 49 8 204 -42 37 198 30 302 -47 296 -100
7894 -100 108 114 30 -136 95 -98 -102 -3 54 -84 97 -12 -276 234 -144 -10 -70 90 139 115 -83 29 -58 -64
7918 -64 48 -229 -237 -54 254 141 197 -171 141 55 76 77 -89 108 -48 82 -94 87 -66 83 -126 -49 -40 153
7942 153 218 6 7 328 -58 -26 54 1 -47 -248 146 50 11 4 -50 70 -69 -108 -142 8 -191 -124 128 300 41
7967 41 50 -30 -93 42 -8 -105 -159 139 -193 -215 -128 23 -166 -173 135 320 44 79 125 94 -7 9 -352 -3 77 309
7993 309 125 -80 89 -85 56 409 50 -86 51 -243 362 -3 -23 31 25 49 11 150 91 153 -126 92 61
8016 61 7 -129 -31 -95 -32 -375 59 -41 -18 96 7 243 -142 120 281 -85 -85 -106 -182 -57 -392 237 -125 165
8040 165 -50 39 42 -28 -162 -130 51 -21 232 -114 260 139 -239 127 18 18 66 33 188 18 178 38 -8 121
$$ packed form
7871A20j77J28R5j83k8mJ43j24nJ17J35j25m3m1J96k46P9J61j68K72l49L43l96
7894a00K08Oq4j66K31j93mR9N7j38J81j09k64N10l78J34o0J60M9k4j98J12q7o
7918f4J12k77qJ83L08j13N6l68L12q6K1Jj66J97j56J30j76J81j53J49k09P7RJ93
7942A53O5k12JL21l86L2Q0n3m8k01L94r6l9pn4J20j39l9l4J50j99O7K52J72k59
7967D1Rq0o3J35n0r7n4K98l32k2Q7J51j89pL08J85k76L5M6l1j01J6l61L49Q0K32
7993C09j84k05J69j74J41L53l59j36J37k94O05l65k0N4oK4l8J39n9O2k79K18l1
8016F1n4j36R8o4O3l43M34j00K3J14q9K36l85K62J61l66%k1p6J25l35O29l62K90
8040A65k15Q9Lp0j34L2J81p2K53l46L74j21l78L66j09%M8l3J55j70J60j40m6J29
$$ plain form
8064 121 -253 171 146 74 22 -130 84 -30 -93 223 -117 -154 -258 -6 -112 193 -94 -120 152 114 175 -77 301
8087 301 -212 -55 -58 238 -5 -52 51 -36 341 4 66 40 189 38 -219 147 -288 255 257 -144 47 -91 -6
8110 -6 -79 92 -54 -92 89 -69 -1 -13 191 43 35 -124 8 -153 215 189 118 238 50 -31 373 94 37 41 12
8135 12 19 -160 -21 -30 -190 93 126 -268 162 -62 -319 24 -377 24 -6 -28 133 -34 -143 -98 149 -15 -108
8158 -108 140 196 -39 -161 -139 249 -142 -149 28 71 39 -241 -73 150 50 56 -41 18 59 -48 -11 11 89 66 -253
8183 -253 -33 -85 171 304 11 50 47 149
$$ packed form
8064A21l74M24k5p2n2j52K14j14o3L16l40l7j04K52j06L05k87k6K72l8O1k52L78
8087C01n13J57lK96k43m7J03q7L77l37O2k6J49j51k57L66m35N43Km01J91j38Q5
8110fp3J71j46l8J81j58O8j2K04j48qj59J32j61L68k6p1J20j88q1M04k79n7Mk9
8135A2Pj79J39rj60K83L3l94M30k24k57L43m01M01l0k2J61j67j09M5K47j64r3
8158a08K48N6k35j22K2L88l91pJ77M3l2k80J68K23j00Or7N9M1j07L7K2P8k3l19
8183b53K20n2K56J33k93L9lJ02
8191A49
$$ Imaginary data points
##PAGE= N=2
##DATA TABLE= (X++(I..I)), XYDATA
$$ plain form
0 0 0 0 0 0 0 0 0 0 0 0 0 -8 8 -8 8 -16 16 -17 24 -31 32 -40 48 -56 65 -79 89 -105 121 -137 158 -179 206
33 206 -231 262 -295 329 -370 414 -462 514 -571 633 -701 775 -856 946 -1042 1149 -1265 1394
51 1394 -1536 1694 -1868 2066 -2286 2539 -2829 3164 -3563 4039 -4626 5365 -6333 7660 -9595
66 -9595 12707 -18536 33344 -158971 -240625 -20224 -36075 -11788 -14847 -16486 44551 183588
78 183588 153193 52202 35877 67335 63087 112081 102130 -29234 -106712 -31847 10260 -10578
90 -10578 -39073 -113926 -194893 -129853 -27087 -40312 -68802 -7613 53760 115643 193387 168022
102 168022 43621 1323 34717 33085 31685 34066 -45098 -112135 -55090 2436 -29932 -58645
114 -58645 -69694 -95540 -56914 18960 -8377 -76571 -42699 28400 71520 138279 172956 111356
$$ packed form
0@%%%%%%%%%%%qJ6j6J6k4L2l3M1n5O3p2Q8j04J21j44J68j94K26k58K95l37L85
33B06m37M93n57O24o99P84q76R76j085J204j334J476j631J802j988K191k414K659
51A394k930L230l562L934m352M825n368N993o727P602q665R991j1698J3993j7255
66i595K2302l1243N1880j92315q1654K20401j5851K4287l059j639O1037J39037
78A83588l0395j00991j6325L1458m248M8994r951j31364p7478P4865M2107k0838
90a0578k8495p4853q0967O5040J02766j3225k8490O1189O1373O1883P7744k5365
102A68022j24401m2298L3394j632j400K381p9164o7037N7045N7526l2368k8713
114e8645j1049k5846L8626P5874k7337o8194L3872P1099M3120O6759L4677o1600
$$ plain form
126 111356 66611 82436 45958 -27360 -56896 -99302 -149710 -102030 -28553 -53203 -87238 -53063
138 -53063 -21169 15030 85995 89187 19573 17038 62723 51926 39544 57954 29944 -2329
150 -2329 36720 49433 -17572 -64577 -87064 -131246 -116818 -38408 -23636 -48911 -5908 49801
162 49801 58270 79810 91498 42816 22608 61066 45354 -11789 -20839 -27968 -58111 -27936 25904
175 25904 6732 -26777 -19641 -35472 -58381 -32377 -27352 -65364 -38814 38605 65599 69780 87621
188 87621 66212 33149 51166 50687 -6757 -36337 -37820 -70117 -80281 -40083 -32029 -49807 -19045
201 -19045 17321 16160 24816 30735 -8345 -21484 25095 44773 29576 42537 52145 29940 28167
214 28167 30032 -16503 -56081 -50836 -58700 -73991 -46611 -25825 -40790 -20541 32129 50496 54751
$$ packed form
126A11356m4745J5825l6478p3318k9536m2406n0408M7680P3477k4650l4035L4175
138e3063L1894L6199P0965L192o9614k535M5685j0797j2382J8410k8010l2273
150b329L9049J2713o7005m7005k2487m4182J4428P8410J4772k5275M3003N5709
162D9801Q469K1540J1688m8682k0208L8458j5712n7143r050p129l0143L0175N3840
175B5904j9172l3509P136j5831k2909K6004N025l8012K6550P7419K6994M181J7841
188H7621k1409l3063J8017m79n7444k9580j483l2297j0164M0198Q054j7778L0762
201a9045L6366j161Q656N919l9080j3139M6579J9678j5197J2961R608k2205j773
214B8167J865m6535l9578N245p864j5291K7380K0786j4965K0249N2670J8367M255
$$ plain form
227 54751 66980 45599 14061 22978 21358 -19262 -29542 -8143 -8655 -6648 15980 5349 -25790
240 -25790 -22489 -18005 -39467 -35235 -15010 -26095 -25510 17996 41986 36767 48833 55606 37967
253 37967 36183 34603 -8343 -45012 -38330 -38357 -48404 -28153 -7176 -13632 -5942 16041 8594 -3536
267 -3536 4709 -2747 -15770 6173 29443 20487 19447 35657 33702 25622 26358 3413 -32294 -38468
281 -38468 -37904 -55843 -54465 -29906 -18658 -6861 24900 42613 36685 36618 30946 9979 4595 10072
295 10072 -4406 -18071 -5080 5699 2891 6656 5202 -10873 -16765 -14086 -27364 -38651 -28591
308 -28591 -19352 -14217 8313 32980 38980 41349 43892 32801 19901 11095 -9083 -32157 -32283 -22863
322 -22863 -23098 -18546 -6782 -2382 515 7523 4552 -5784 -6462 -5785 -9057 -3075 12192 19065 21696
$$ packed form
227E4751J2229k1381l1538Q917j620m0620j0280K1399n12K007K2628j0631l1139
240b5790L301M484k1462M232K0225j1085N85M3506K3990n219J2066O773j7639
253C7967j784j580m2946l6669O682k7j0047K0251K0977o456P690K1983p447j2130
267c536Q245p456j3023K1943K3270q956j040J6210j955q080P36k2945l5707o174
281c8468N64j7939J378K4559J1248J1797L1761J7713n928o7n672k0967n384N477
295A0072j4478j3665J2991J0779k808L765j454j6075n892K679j3278j1287J0060
308b8591R239N135K2530K4667O000K369K543j1091j2900q806k0178k3074j26R420
322b2863k35M552J1764M400K897P008k971j0336o78O77l272N982J5267O873K631
$$ plain form
337 21696 29313 31605 26262 17636 1366 -20868 -31260 -32260 -36708 -38199 -26877 -11337 1441
350 1441 14343 23877 25049 22777 18435 9480 1942 259 -1846 -4992 -1236 7102 12406 10954 4871
365 4871 -3201 -10884 -17323 -25661 -31721 -30984 -21196 -7162 5312 17913 30606 36964 32912 26354
379 26354 18871 6528 -8022 -17336 -21458 -20592 -13208 -6837 -5741 -722 6298 3667 -4360 -7736 -11982
394 -11982 -16048 -11340 -2772 2292 13071 27799 30425 26804 27827 20115 -122 -13435 -20272 -29911
408 -29911 -32361 -24563 -21134 -14483 4016 13900 10548 13292 17244 6802 -1249 1553 -2021 -5815
422 -5815 4944 12083 9743 16072 21475 8158 -5080 -6310 -16650 -30288 -28058 -23956 -24220 -9856
436 -9856 8391 10231 15280 29868 27197 14458 13888 9564 -7848 -11066 -5781 -11334 -9438 5479
$$ packed form
337B1696P617K292n343q626j6270k2234j0392j000m448j491J1322J5540J2778
350A441J2902R534J172k272m342q955p538j683k105l146L756Q338N304j452o083
365D871q072p683o439q338o060P37R788J4034J2474J2601J2693O358m052o558
379B6354p483j2343j4550r314m122Q66P384O371J096N019P020k631q027l376m246
394a1982m066M708Q568N064J0779J4728K626l621J023p712k0237j3313o837r639
408b9911k450P798L429O651J8499R884l352K744L952j0442q051K802l574l794
422e815J0759P139k340O329N403j3317j3238j230j0340j3638K230M102k64J4364
436i856J8247J840N049J4588k671j2739n70m324j7412l218N285n553J896J4917
$$ plain form
450 5479 5502 -2083 5215 5093 -12624 -17382 -13136 -21333 -19550 -2047 2916 3010 22205 32028 20978
465 20978 21391 25666 7056 -8247 -6372 -16234 -29308 -18786 -10833 -16393 -3093 13826 4717 -1941
479 -1941 7679 750 -13600 -4112 2562 -5824 5097 23534 16698 12517 25277 16963 -4440 -3532
493 -3532 -6195 -27137 -29305 -17966 -25021 -21603 4463 11279 5690 21765 28590 7419 2109 8493
507 8493 -6561 -14115 3821 5181 -3654 11457 18987 427 -1950 6274 -11150 -24860 -13466
520 -13466 -17080 -28555 -11133 3884 -3362 9166 32535 24406 14435 25413 15291 -9773 -6829
533 -6829 -2978 -19029 -12784 6652 -2015 -9031 6507 1789 -17719 -8557 -856 -17215 -13341 5258
547 5258 -1399 -2533 22148 25155 11789 23509 29001 4777 -4209 160 -20194 -33996 -17541
$$ packed form
450E479K3p585P298j22j7717m758M246q197J783J7503M963R4J9195R823j1050
465B0978M13M275j8610j5303J875r862j3074J0522P953n560J3300J6919r109o658
479a941R620o929j4350R488O674q386J0921J8437o836m181J2760q314k1403R08
493c532k663k0942k168J1339p055L418K6066O816n589J6075O825k1171n310O384
507H493j5054p554J7936J360q835J5111P530j8560k377Q224j7424j3710J1394
520a3466l614j1475J7422J5017p246J2528K3369q129r971J0978j0122k5064K944
533f829L851j6051O245J9436q667p016J5538m718j9508R162P701j6359L874J8599
547E258o657j134K4681L007j3366J1720N492k4224q986M369k0354j3802J6455
$$ plain form
560 -17541 -14740 -21816 -425 14750 -545 1114 15877 2353 -8689 8259 7256 -8023 4962
573 4962 15609 230 4468 23211 10744 -2244 8941 -779 -25675 -19757 -13574 -30401 -23245
586 -23245 2784 650 11 25327 25901 4620 10325 15276 -5256 -5507 12369 872 -10090 7478
600 7478 5791 -11397 761 10301 -11629 -16732 -4276 -19527 -29246 -6691 1144 -7079 13868
613 13868 32840 19394 18545 31817 12030 -10000 -1695 -7241 -25814 -12501 1406 -14299 -13052
626 -13052 6409 -2744 -11837 8137 8892 -10751 -2944 6285 -10242 -5562 18986 15357 7494 25121
640 25121 22024 -2117 234 2897 -21497 -26564 -9963 -17893 -22594 2292 8798 -5971 5466
653 5466 17013 92 193 18128 6851 -7429 6320 6241 -9304 4340 19574 4006 -165
$$ packed form
560a7541K801p076K1391J5175j5295J659J4763j3524j1042J6948j003j5279J2985
573D962J0647j5379M238J8743j2467j2988J1185r720k4896N918O183j6827P156
586b3245K6029k134o39K5316N74k1281N705M951k0532k51J7876j1497j0962J7568
600G478j687j7188J2158R540k1930n103J2456j5251r719K2555P835q223K0947
613A3868J8972j3446q49J3272j9787k2030Q305n546j8573J3313J3907j5705J247
626a3052J9461r153r093J9974P55j9643P807R229j6527M680K4548l629p863J7627
640B5121l097k4141K351K663k4394n067J6601p930m701K4886O506j4769J1437
653E466J1547j6921J01J7935j1277j4280J3749p9j5545J3644J5234j5568m171
$$ plain form
666 -165 10096 -7138 -25153 -12361 -12346 -27684 -13495 5076 -3579 2840 26469 19929 7162 19341
680 19341 16877 -4300 357 8536 -11459 -16222 -1009 -8739 -16863 3918 9449 -7642 -2286 4894
694 4894 -14650 -17198 3390 554 -5396 15617 22005 6565 14208 23700 3369 -5778 3313 -9923
708 -9923 -24532 -9943 -5863 -19970 -8715 7133 -2628 -1119 18091 10293 -4453 5383 4603 -12647
722 -12647 -3207 13195 4175 3947 19450 9820 -6021 2399 242 -19420 -16270 -6536 -18779 -18322
736 -18322 2825 3092 -2571 14598 20521 6172 10597 18743 1254 -7425 2442 -5285 -15402 -343
750 -343 6336 -5946 -389 7423 -8208 -14288 -1142 -6320 -15615 -425 6848 -3227 6335 20404
764 20404 11027 7657 18238 9053 -6815 -620 -2492 -19280 -16002 -4505 -12439 -11042 6875 6103
$$ packed form
666a65J0261j7234j8015J2792J5j5338J4189J8571q655O419K3629o540j2767J2179
680A9341k464k1177M657Q179j9995m763J5213p730q124K0781N531j7091N356P180
694D894j9544k548K0588k836n950K1013O388j5440P643R492k0331r147R091j3236
708i923j4609J4589M080j4107J1255J5848r761J509J9210p798j4746R836p80j7250
722a2647R440J6402r020k28J5503r630j5841Q420k157j9662L150R734j2243M57
736a8322K1147K67n663J7169N923j4349M425Q146j7489q679R867p727j0117J5059
750c43O679j2282N557P812j5631o080J3146n178r295J5190P273j0075R562J4069
764B0404r377l370J0581r185j5868O195j872j6788L278J1497p934J397J7917p72
$$ plain form
778 6103 -2825 7640 9117 -6056 -2578 7707 -1504 -3506 10768 8801 -316 9181 11785 -2268
792 -2268 -2393 2582 -11813 -18553 -8299 -11324 -17744 -3500 6369 629 8167 19752 10467 4161
806 4161 11428 4559 -8079 -1189 2480 -7219 -3519 5975 -2206 -5935 2968 -1614 -12323 -6000 -3189
821 -3189 -13014 -8305 4471 2271 3140 16991 17375 8751 13089 11980 -3042 -6776 -3420 -12247 -15875
836 -15875 -5612 -4730 -8602 632 5477 -2199 -705 5768 -812 -5109 3345 3220 -1369 6130 11944
851 11944 6068 7538 11438 2946 -4949 -2801 -8236 -17466 -12740 -8361 -11664 -5952 5217 4218 3898
866 3898 11990 10399 3150 5614 6400 -1250 -1219 3853 -13 -2203 3903 2471 -3793 -1727 -2133 -10212
882 -10212 -11112 -6779 -9670 -9057 120 4231 3964 11100 15503 10296 8996 9867 3131 -3800 -2842 -5408
$$ packed form
778F103q928J0465J477j5173L478J0285r211k002J4274j967r117R497K604j4053
792b268j25M975j4395o740J0254l025o420J4244R869n740P538J1585r285o306
806D161P267o869j2638O890L669r699L700R494q181l729Q903m582j0709O323K811
821c189r825M709J2776k200Q69J3851L84q624M338j109j5022l734L356q827l628
836a5875J0263Q82l872R234M845p676J494O473o580m297Q454j25m589P499N814
851A1944n876J470L900q492p895K148n435r230M726M379l303N712J1169r99l20
866C898Q092j591p249K464P86p650L1N072l866k190O106j432o264K066m06q079
882a0212r00M333k891O13R177M111k67P136M403n207j300Q71o736o931R58k566
$$ plain form
898 -5408 -9867 -6516 -3327 -5528 -3140 1456 -1026 -3396 -787 -1419 -5405 -2001 1934 1644 4855 10823
914 10823 10513 8990 9842 6939 -112 -3617 -6316 -11596 -12112 -9434 -8846 -6581 -523 2837 2811 4709
930 4709 6436 3493 1795 2373 921 521 2381 3902 4086 5529 5231 1920 -963 -3135 -7263 -10393
946 -10393 -10495 -9884 -8296 -4062 602 4031 6851 9698 9574 7917 5203 2805 442 -1694 -2810 -2552
962 -2552 -1786 -810 -307 -11 -1011 -2356 -3420 -5438 -6689 -5360 -4320 -2493 1134 4801 6703 8616
978 8616 10312 8221 5297 3813 326 -4295 -5938 -5812 -7416 -6367 -2944 -1676 -913 1343 1449 -935
994 -935 307 488 -2013 -1581 2192 2407 2891 6856 7514 4836 4813 4060 -2023 -5201 -4714 -8223 -10750 -6632
1012 -6632 -3945 -3841 949 5345 3577 4416 6985 3289 -615 1747 897 -2761 -299 3416 914 1223
$$ packed form
898e408m459L351L189k201K388M596k482k370K609o32l986L404L935k90L211N968
914A0823l10j523Q52k903p051l505k699n280n16K678N88K265O058L360k6J898
930D709J727k943j698N78j452m00J860J521J84J443k98l311k883k172m128l130
946a0393j02O11J588M234M664L429K820K847j24j657k714k398k363k136j116K58
962b552P66R76N03K96j000j345j064k018j251J329J040J827L627L667J902J913
978H616J696k091k924j484l487m621j643J26j604J049L423J268P63K256J06k384
994i35J242J81k501M32L773K15M84L965O58k678k3p53o083l178M87l509k527M118
1012f632K687J04M790M396j768Q39K569l696l904K362q50l658K462L715k502L09
$$ plain form
1028 1223 4703 1270 -3377 -1120 -3327 -9065 -7387 -3542 -5994 -3379 4347 4385 3878 9144 9301 2490
1044 2490 2673 3782 -3710 -5972 -930 -2594 -4838 1066 2755 -2196 336 3071 -3803 -5562 -1001
1059 -1001 -3341 -6339 1102 4072 539 5062 10236 4871 3002 6940 1324 -6331 -3283 -2876 -9221
1074 -9221 -5728 394 -2755 -2167 5102 2935 -2580 2741 3200 -4316 -1773 3959 -1072 -1286 6664 4541
1090 4541 -247 5192 5445 -3315 -2616 396 -7092 -9522 -2222 -3550 -6592 2069 5924 184 3810
1105 3810 9243 1133 -2431 4410 402 -6240 265 3118 -3921 -180 6218 -336 -3428 3617 -195
1120 -195 -7766 -2058 -649 -8265 -4218 4363 55 793 10201 7667 -20 4571 5192 -5134 -4628 1257
1136 1257 -4845 -7434 1692 1110 -4277 3004 5562 -4101 -2151 4110 -3295 -6165 2824 1199 -4653
$$ packed form
1028A223L480l433m647K257k207n738J678L845k452K615P726L8n07N266J57o811
1044B490J83J109p492k262N042j664k244N904J689m951K532K735o874j759M561
1059a001k340k998P441K970l533M523N174n365j869L938n616p655L048M07o345
1074i221L493O122l149N88P269k167n515N321M59p516K543N732n031k14P950k123
1090D541m788N439K53q760O99L012p488k430P300j328l042Q661L855n740L626
1105C810N433q110l564O841m008o642O505K853p039L741O398o554l092P045l812
1120a95p571N708J409p616M047Q581m308P38R408k534p687M591O21j0326N06N885
1136A257o102k589R126n82n387P281K558r663J950O261p405k870Q989j625n852
$$ plain form
1151 -4653 3776 8463 926 3001 9003 -23 -6259 -72 -3381 -11019 -3045 1685 -5299 -1573 7379
1166 7379 1043 -1722 7059 3918 -5495 516 3591 -5337 -2335 5887 -116 -3244 6112 4156 -4157
1181 -4157 1289 3368 -7608 -7316 351 -4760 -5997 5307 4825 -2159 4599 8450 -1212 -169 6503
1196 6503 -1679 -7013 1164 180 -7000 373 5279 -3397 -1838 5816 -594 -5099 3238 833 -8220
1211 -8220 -1402 3951 -2695 465 10325 3649 -2006 5363 2475 -6678 -1412 2698 -7428 -6440 2136
1226 2136 -2521 -4634 6077 5849 -2988 2765 6233 -3736 -3030 4674 -2187 -6653 3004 3430 -3451
1241 -3451 3706 8119 -2452 -4207 2269 -4254 -8685 1026 987 -6491 151 6490 -419 1130 9699
1256 9699 3137 -3964 2823 798 -7947 -2344 3157 -4368 -3600 5529 1033 -3438 4737 3526 -6290
$$ packed form
1151d653Q429M687p537K075O002r026o236O187l309p638P974M730o984L726Q952
1166G379o336k765Q781l141r413O011L075q928L002Q222o003l128R356j956q313
1181d157N446K079j0976K92P667n111j237J1304m82o984O758L851r662J043O672
1196F503q182n334Q177r84p180P373M906q676J559P654o410m505Q337k405r053
1211h220O818N353o646L160R860o676n655P369k888r153N266M110j0126R88Q576
1226B136m657k113J0711k28q837N753L468r969P06P704o861m466R657M26o881
1241c451P157M413j0571j755O476o523m431R711l9p478O642O339o909J549Q569
1256I699o562p101O787k025q745N603N501p525P68R129m496m471Q175j211r816
$$ plain form
1271 -6290 -2246 1964 -5704 -3467 6353 2307 -2420 5964 5676 -3039 1694 5521 -4324 -6194 764
1286 764 -4182 -8256 1955 3634 -3182 1887 6826 -988 -1343 5906 -17 -5940 1807 1949 -5153
1301 -5153 843 6727 -924 -2241 4475 -494 -5940 827 975 -7201 -2565 2459 -3785 -1792 7405
1316 7405 3921 -1046 5816 4773 -4096 -881 3343 -4683 -5409 2196 -1085 -5217 3014 3741 -3532
1331 -3532 -203 3873 -3319 -3724 3776 -296 -4936 2492 4339 -1823 2936 7991 466 -1806 3302
1346 3302 -2238 -7856 -1760 -660 -6560 -2306 3892 -982 -1116 6397 2988 -2374 2807 3206 -3947
1361 -3947 -1128 3969 -1670 -2401 4502 2039 -3130 2467 2574 -5054 -3581 66 -5512 -5627 2158 1212
1377 1212 -1686 4851 6376 264 2239 5800 -884 -3008 1961 -976 -5565 -104 1795 -3618 -907
$$ packed form
1271f290M044M210p668K237R820m046m727Q384k88q715M733L827r845j870O958
1286G64m946m074J0211J679o816N069M939p814l55P249n923n923P747J42p102
1301e153N996N884p651j317O716m969n446O767J48q176M636N024o244J993R197
1316G405l484m967O862j043q869L215M224q026p26P605l281m132Q231P27p273
1331c532L329M076p192m05P500m072m640P428J847o162M759N055p525k272N108
1346C302n540n618O096J100n900M254O198m874j34P513l409n362N181L99p153
1361c947K819N097n639p31O903k463n169N597J07p628J473L647n578j15P785r46
1377A212k898O537J525o112J975L561o684k124M969k937m589N461J899n413K711
$$ plain form
1392 -907 3386 -1521 -3147 2137 -835 -4864 342 1991 -2460 1078 6086 2009 1171 5705 2757
1407 2757 -2717 545 220 -5489 -3947 -138 -3844 -4074 1840 833 -2155 2543 3494 -1359 43 3413
1423 3413 -1111 -2038 2927 1574 -1430 2802 3859 -839 -628 1567 -2796 -4802 -1141 -2604 -5164
1438 -5164 -919 1565 -863 1518 5131 2342 1021 4550 2099 -2328 492 1001 -3030 -1602 1774
1453 1774 -634 -1746 1658 425 -3021 -730 -374 -4158 -2678 689 -658 -225 3714 3615 1689 3670
1469 3670 3909 -356 -721 618 -2424 -4142 -1317 -1532 -2639 -10 1483 -659 191 1817 -788 -1718
1485 -1718 443 249 -1317 1282 2860 1347 2096 3429 1330 -447 279 -1213 -3530 -2918 -1985 -2931
1501 -2931 -1675 644 301 475 2660 2042 478 1320 1447 -752 -607 763 -255 -250 1176 873 -140
$$ packed form
1392i07M293m907j626N284k972m029N206J649m451L538N008m077q38M534k948
1407B757n474L262l25n709J542L809l706k30N914j007k988M698R51m853J402L370
1423C413m524r27M965j353l004M232J057m698K11K195m363k006L661j463k560
1438e164M245K484k428K381L613k789j321L529k451m427K820N09m031J428L376
1453A774k408j112L404j233l446K291L56l784J480L367j347M33L939r9j926J981
1469C670K39m265l65J339l042j718K825k15j107K629J493k142Q50J626k605r30
1485a718K161j94j566K599J578j513P49J333k099j777P26j492k317O12R33r46
1501b931J256K319l43J74K185o18j564Q42J27k199J45J370j018NJ426l03j013
$$ plain form
1518 -140 422 278 -1369 -2157 -1325 -2192 -2359 -756 -188 263 1716 2377 1988 2278 2046 914 -298 -322 -1021
1537 -1021 -1600 -1551 -964 -540 59 376 186 -9 4 -368 -976 -1053 -878 -135 292 687 1504 2187 2052 1677 1201
1558 1201 -68 -875 -1406 -2136 -2575 -1699 -623 -519 110 1515 1450 1309 1056 565 -471 -460 -143 -1082 -319
1577 -319 1022 958 635 1796 1314 -443 -364 -996 -2414 -2441 -887 -1315 -1516 1209 1807 1061 1815 2349 314
1596 314 14 394 -1114 -1854 -199 -67 -1525 48 1528 -142 -449 970 -514 -1952 -55 -450 -2245
1613 -2245 -246 1402 312 896 2666 1745 49 1263 632 -2182 -1087 85 -2164 -2121 1254 241
1629 241 -1215 1609 1835 -1001 216 1460 -1179 -1383 1103 -492 -1457 1626 2017 -627 847 2317
1645 2317 -584 -1385 892 -1380 -3477 -328 240 -2104 -19 2776 569 201 2859 920 -1405 675
$$ packed form
1518a40N62j44j647p88Q32q67j67J603N68M51J453O61l89K90k32j132j212k4o99
1537a021n79M9N87M24N99L17j90j95J3l72o08p7J75P43M27L95Q17O83j35l75m76
1558A201j269q07n31p30m39Q76J076J04O29J405o5j41k53m91j036J1L17r39P63
1577c19J341o4l23J161m82j757P9o32j418k7J554m28k01K725N98p46P54N34k035
1596C14l00L80j508p40J655J32j458J573J480j670l07J419j484j438J897l95j795
1613b245J999J648j090N84J770r21j696J214o31k814J095J172k249M3L375j013
1629B41j456K824K26k836J217J244k639k04K486j595r65L083L91k644J474J470
1645B317k901q01K277k272k097L149N68k344K085K795k207l68K658j939k325K080
$$ plain form
1661 675 662 -2603 -843 1830 -1367 -1140 2659 1079 -1338 1291 1039 -2618 -1241 863 -2206 -2388
1677 -2388 2254 1078 -725 2537 2807 -746 303 1924 -2043 -2333 736 -1062 -3185 870 1808 -1755
1693 -1755 626 3190 -698 -1688 1587 -411 -3090 776 1478 -1813 819 3875 468 -311 2531 345
1709 345 -3057 113 535 -3363 -1161 2386 -1216 -1818 2924 1795 -1635 1674 2169 -2092 -927 2010
1725 2010 -1508 -2081 2411 857 -2172 1578 2695 -1856 -763 1999 -1946 -3035 1424 -23 -3086
1740 -3086 1338 2733 -1547 194 3495 259 -1792 2340 -42 -3306 402 1591 -3134 -626 3202
1755 3202 -546 -1834 2376 1068 -2706 685 1376 -3334 -1447 2469 -827 -1888 3304 1764 -2081
1770 -2081 1563 2540 -2024 -986 2194 -2118 -3600 1842 833 -2286 1875 3234 -1526 -951 2421
$$ packed form
1661F75j3l265J760K673l197K27L799j580k417K629k52l657J377K104l069j82
1677b388M642j176j803L262K70l553J049J621l967k90L069j798k123M055R38l563
1693a755K381K564l888r90L275j998k679L866P02l291K632L056l407p79K842k186
1709C45l402L170M22l898K202L547l602o02M742j129l430L309M95m261J165K937
1725B010l518n73M492j554l029L750J117m551J093K762l945j089M459j447l063
1740c086M424J395m280J741L301l236k051M132k382l264L708J189m725K508L828
1755C202l748j288M210j308l774L391O91m710J887L916l296j061N192j540l845
1770b081L644R77m564J038L180m312j482N442j009l119M161J359m760N75L372
$$ plain form
1785 2421 -1234 -2507 1626 180 -3780 1043 3077 -1210 189 3727 -338 -2498 1682 -77 -3716
1800 -3716 352 2068 -3193 -1443 3407 256 -1428 3099 1470 -3020 12 1572 -2944 -1139 2948
1815 2948 -815 -2521 2587 1908 -1938 1058 2549 -2655 -1982 1791 -1532 -2946 2379 1077 -2738
1830 -2738 948 3132 -1446 -490 2820 -890 -3342 1225 573 -3249 913 3178 -1726 -1274 3139 95
1846 95 -1880 1814 770 -3662 -206 1902 -2221 -1344 3404 44 -2272 2370 1594 -2219 753 2068
1862 2068 -2928 -1934 2452 -805 -2458 2536 1986 -2276 254 2216 -1925 -1168 2461 -1151 -3044 1532
1878 1532 1277 -2264 1220 3412 -625 -1035 1999 -445 -2848 1197 815 -3378 -359 2702 -1268 -431
1894 -431 3356 309 -2030 1051 679 -2967 172 2467 -2023 -1540 2985 519 -1553 2265 1800 -2302
$$ packed form
1785B421l655j273M133j446l960M823K034m287J399L538m065k160M180j759l639
1800c716M068J716n261J750M850l151j684M527j629m490L032J560m516J805M087
1815B948l763j706N108o79l846K996J491n204O73L773l323j414N325j302l815
1830b738L686K184m578R56L310l710k452M567o52l822M162K265m904M52M413l044
1846I5j975L694j044m432L456K108m123Q77M748l360k316M642p76l813K972J315
1862B068m996R94M386l257j653M994n50m262K530J962m141P57L629l612j893M576
1878A532k55l541L484K192m037m10L034k444k403M045l82m193L019L061l970Q37
1894d31L787l047k339L081l72l646L139K295m490M83M525k466k072L818m65m102
$$ plain form
1910 -2302 -479 1210 -2740 -1851 2172 -470 -2641 1825 1959 -1616 608 2533 -1485 -1683 1819 -1030
1926 -1030 -2502 1386 1777 -2021 318 2343 -829 -1199 1847 -279 -2744 726 527 -2705 1 2511
1942 2511 -906 -677 2776 651 -1740 1433 1117 -2557 -386 1829 -1868 -1243 2497 485 -1844 963
1958 963 1181 -2137 -59 1650 -1746 -1272 2025 49 -1822 1417 2404 -1008 431 2095 -973 -1176
1974 -1176 1615 -910 -2870 615 763 -2375 -315 2339 -577 -797 1649 139 -1352 1127 1270 -1920
1990 -1920 -84 2300 -265 -800 2051 690 -1184 662 149 -2405 -895 1086 -1531 -1417 1553 868
2006 868 -1201 1400 1764 -715 435 1420 -1337 -1400 1338 252 -1507 611 1696 -644 -374 958
2022 958 -1241 -1366 312 -623 -1735 461 1271 -533 467 2109 460 -216 1288 220 -1480 413
$$ packed form
1910b302J823J689l950Q89M023k642k171M466J34l575K224J925m018j98L502k849
1926a030j472L888L91l798K339K025l172l70L046k126k465L470j99l232K706K510
1942B511l417K29L453k125k391L173l16l674K171K215l697O25L740k012k329K807
1958I63K18l318K078J709l396M74L297j976j871L239R87l412J439J664l068k03
1974a176K791k525j960L485J48l138K060K654k916k20K446j510j491K479J43l190
1990a920J836K384k565n35K851j361j874J846n13k554J510J981k617J14K970o85
2006H68k069K601L64k479J150R85k757o3K738j086j759K118J085k340K70J332
2022I58k199j25J678r35j112K196Q10j804J000J642j649o76J504j068j700J893
$$ plain form
2038 413 248 -1716 -565 988 -558 -872 839 194 -1064 274 535 -1608 -39 1296 -222 -786
2054 -786 1731 1268 -365 630 915 -376 -320 448 -890 -1168 319 -494 -1719 280 849 -408 42 1161
2072 1161 -98 -238 990 139 -692 401 810 -321 -238 970 310 -289 318 -398 -1216 -123 181 -1188
2090 -1188 -596 419 223 -97 1067 1062 162 895 563 -403 -132 201 -522 -883 373 163 -340 -50 494
2109 494 -330 -297 82 -236 -701 255 25 -156 584 1228 548 566 819 93 -143 -286 -542 -935 -650 -148 -82
2130 -82 -18 184 158 325 266 178 -234 -129 9 -427 218 671 891 783 291 519 274 -214 -474 -724 -353 -1014
2152 -1014 -538 -502 -205 237 102 219 160 544 311 109 -339 -85 35 70 334 81 66 355 300 -475 -192
2173 -192 -49 -495 -552 -197 -445 -244 199 448 -78 980 1024 -122 36 568 -294 -763 -80 -297 -794 -80
$$ packed form
2038D13j65j964J151J553j546l14J711o45j258J338K61k143J569J335j518n64
2054g86K517m63j633R95K85j291N6P68j338k78J487q13j225J999N69j257M50J119
2072A161j259j40J228q51q31J093M09j131Q3J208o60n99O07p16q18J093L04j369
2090a188N92J015j96l20J164nr00P33l32r66K71L33p23l61J256k10n03K90N44
2109D94q24L3L79l18m65R56k30j81P40O44o80J8K53p26k36j43k56l93K85N02O6
2130h2O4K02k6J67n9q8m12J05J38m36O45M53K20j08m92K28k45m88k60k50L71o61
2152a014M76L6K97M42j35J17n9L84k33k02m48K54J20L5K64k53j5K89n5p75K83
2173a92J43m46n7L55k48K01M43K49n26J058M4j146J58N32q62m69O83k17m97P14
$$ plain form
2193 -80 260 -421 -219 883 179 -579 16 292 -783 -164 471 -172 191 959 432 -120 999 638 -786
2212 -786 -60 169 -835 -681 317 -153 -468 892 662 -459 177 579 -690 -624 561 -350 -898 626
2230 626 739 -508 513 1091 -666 -645 560 -233 -1014 87 111 -762 316 1153 -459 -31 1125 -332
2248 -332 -1123 277 155 -1292 -96 991 -182 -357 1274 324 -795 797 730 -1250 -20 741 -438
2265 -438 -841 943 -102 -759 1177 609 -1001 -85 837 -829 -933 1139 -29 -1046 476 800 -851
2282 -851 69 1537 -463 -472 1268 66 -1369 552 514 -1278 -202 1084 -906 -657 1249 94 -1032
2299 -1032 800 751 -1472 49 922 -546 -479 1432 259 -1232 932 1035 -1328 -310 757 -1567
2315 -1567 -1244 1021 -226 -1125 684 1135 -1063 56 1485 -607 -970 1326 78 -1515 445 1102
$$ packed form
2193h0L40o81K02J102p04p58N95K76j075O19O35o43L63P68n27n52J119l61j424
2212g86P26K29j004J54R98m70l15J360k30j121O36M02j269O6J185r11n48J524
2230F26J13j247J021N78j757K1J205p93p81J101K4q73J078Q37j612M28J156j457
2248c32p91J400j22j447J196J087j173j75J631r50j119J592o7j980J230P61j179
2265d38m03J784j045o57J936n68j610R16R22j666j04K072j168j017J522L24j651
2282h51R20J468k000rJ740j202j435J921l8j792J076J286j990K49J906j155j126
2299a032J832m9k223J521Q73j468O7J911j173j491K164J03k363J018J067k324
2315a567L23K265j247q99J809M51k198J119J429k092l63K296j248j593J960O57
$$ plain form
2331 1102 -937 228 1628 -648 -1152 1156 108 -1763 244 508 -1329 -192 1706 -280 -279 1684
2347 1684 377 -1340 722 907 -1543 -491 1313 -860 -1205 1315 222 -1471 798 823 -1613 -556
2363 -556 1574 -589 -1140 1273 624 -1086 1037 1572 -1146 -33 1359 -1039 -1589 970 145 -1759
2379 -1759 379 1188 -1650 -63 1658 -391 -969 1343 256 -1483 501 1434 -961 -86 1400 -728
2395 -728 -1302 1121 306 -1718 390 813 -1566 -901 1460 -471 -949 1619 678 -1421 1070 1906 -955
2412 -955 -357 1427 -743 -1345 978 330 -1619 377 986 -1540 -593 1510 -488 -1290 1179 407 -1403
2429 -1403 308 1479 -968 154 2137 -144 -1246 993 345 -1623 123 612 -1945 -719 1299
2444 1299 -357 -1046 1337 926 -1409 241 1420 -964 -286 1637 -406 -1078 1253 858 -1092 675
$$ packed form
2331A102k039J165J400k276n04K308j048j871K007K64j837J137J898j986JJ963
2347A684j307j717K062J85k450J052J804k173l45K520j093j693K269K5k436J057
2363e56K130k163n51K413o49j710K123N35k718J113J392k398n50K559q25j904
2379a759K138Q09k838J587J721k049n78K312j087j739J984R33k395Q75J486k128
2395g28n74K423q15k024K108M23k379O65K361j931m78K568r41k099K491Q36k861
2412i55N98J784k170o02K323o48j949J996O09k526R47K103j998q02K469p72j810
2429a403J711J171k447J122J983k281j102K239o48j968J746M89k557J226K018
2444A299j656o89K383m11k335J650J179k384O78J923k043o72K331l95j950J767
$$ plain form
2460 675 1344 -1548 -1255 1158 -451 -1347 1048 470 -1382 420 1711 -651 -154 1476 -250 -1268
2476 -1268 706 679 -901 161 841 -1351 -730 1093 -414 -1246 1091 264 -1540 -12 1172 -920
2492 -920 -171 1509 -95 -1114 1212 985 -1155 267 1063 -869 -883 1063 -381 -1373 777 477 -1530
2509 -1530 98 1216 -783 -561 1009 240 -1250 1092 590 -1182 515 1448 -841 -903 1370 -266
2525 -266 -1163 615 326 -1442 -109 1012 -759 -550 1540 164 -865 984 862 -956 -135 674 -473
2542 -473 -626 1073 -131 -904 675 703 -918 -48 872 -918 -893 918 -37 -874 757 856 -350 339
2560 339 1109 -316 -762 854 -324 -1058 443 530 -1059 66 1067 -609 -433 1211 267 -1102 478
2577 478 368 -937 114 777 -426 -293 658 -97 -983 91 487 -923 -111 787 -600 -578 978 -2
$$ packed form
2460F75O69k892K93K413j609q96K395n78j852J802J291k362M97J630j726j018
2476a268J974k7j580J062O80k192O21J823j507q32K337q27j804J528J184k092
2492i20P49J680j604j019K326k27k140J422P96j932j4J946j444r92K150l00k007
2509a530J628J118j999K22J570p69j490K342n02j772J697R33k289o2K273j636
2525b66q97J778k89j768J333J121j771K09K090j376j029J849j22j818Q21Q09j147
2542d73j53J699j204p73J579K8j621Q70R20j790K5J811r55q37J631R9j206O89
2560C39P70j425m46J616j178p34J501Q7j589J125J001j676J76J644r44j369J580
2577D78j10j305J051O63j203J33R51p55q86J074L96j410Q12Q98j387K2J556r80
$$ plain form
2595 -2 -324 811 622 -808 103 821 -340 -610 491 -444 -844 525 635 -754 77 837 -399 -489 297
2614 297 97 -656 255 413 -569 -196 587 -285 -370 596 22 -803 212 168 -907 -41 531 -411 -405 613
2634 613 191 -361 515 509 -571 -207 298 -144 -618 428 238 -490 350 556 -492 -186 398 -519 -657 551
2654 551 -46 -487 110 712 -66 141 577 -337 -505 114 -2 -472 -156 -51 -382 10 247 -52 -417 374
2674 374 131 -182 -66 603 -277 -88 295 -209 -186 291 112 -262 231 -145 -311 50 96 -169 41 331 77
2695 77 -90 599 234 -155 79 231 -91 -53 279 140 -163 -36 22 92 -140 -131 -52 -410 62 76 -412 20 283
2718 283 -38 281 118 264 158 394 74 -150 222 -34 -115 -116 -455 58 -140 -143 27 403 -101 29 156 117
2740 117 59 -154 -181 13 144 124 74 52 185 145 -347 -79 47 -461 -133 31 75 -44 360 -177 78 177 358
$$ packed form
2595bl22J135j89j430R11P18j161k70J101r35m00J369J10j389Q31P60j236r0P86
2614B97k00p53R11J58r82L73P83q72q5R66n74q25J015m4j075Q66N72r42OJ018
2634F13m22n52Q76oj080L64N05m42m74J046j90p28Q40K06j048L06N84r17j38J208
2654E51n97m41N97O02p78K07M36r14j68O19j16m70L16J05l31L92K37k99l65P91
2674C74k43l13J16O69q80J89L83n04K3M77j79l74M93l76j66L61M6k65K10K90k54
2695G7j67O89l65l89K34J52l22L8L32j39l03J27N8P0k32RP9l58M72J4m88M32K63
2718B83l21L19j63J46j06K36l20k24L72k56q1jl39N13j98lJ70L76n04J30J27l9
2740A17n8k13k7J94J31k0n0k2J33m0m92K68J26n08L28J64M4j19M04n37K55R9J81
$$ plain form
2763 358 -277 -223 150 -110 -141 -17 18 -136 233 -132 -150 -21 -167 -265 -253 -33 107 -207 211 484 73 292
2785 292 516 55 -244 161 33 -313 -127 264 -368 -45 172 -104 -247 210 406 -199 -76 255 43 -8
2805 -8 397 -32 -223 533 -66 -373 181 623 -266 -278 75 -208 -585 197 319 -517 138 461 -190 -99 619
2826 619 106 -432 88 182 -533 -97 497 -548 -236 453 -28 -312 344 -84 -690 34 354 -404 -279 585
2846 585 137 -241 783 204 -422 210 319 -310 -282 589 -90 -740 300 395 -903 144 552 -247 -259 487
2866 487 -212 -709 477 554 -806 118 971 -516 -320 618 -53 -798 295 156 -738 -198 531 -445 -155
2885 -155 809 114 -384 546 269 -675 -27 697 -228 -263 943 268 -550 416 294 -817 55 493 -571
2904 -571 -578 456 -81 -744 484 522 -723 -16 654 -312 -469 785 55 -706 94 583 -633 -120 622
$$ packed form
2763C58o35N4L73k60l1J24L5j54L69l65j8J29j46r8J2K20J40l14M18K73m11K19
2785B92K24m61k99M05j28l46J86L91o32L23K17k76j43M57J96o05J23L31k12n1
2805hM05m29j91P56n99l07N54M42q89j2L53k83l77P82J22q36O55L23o51R1P18
2826F19n13n38N20R4p15M36N94j045L12O89m81k84O56m28o06P24L20p58J25Q64
2846E85m48l78J024n79o26O32J09o29K8Q71o79o50J040R5j298J047M08p99j2P46
2866D87o99m97J186P7j360R24Q53j487J96R38o71p45J093j39q94N40P29r76K90
2885a55R64o95m98R30k77r44O48P24r25l5J206o75q18R66j22j111Q72M38j064
2904e71pJ034n37o63J228L8j245P07O70r66j57J254p30p61Q00M89j216N13P42
$$ plain form
2923 622 -453 -499 519 91 -989 528 494 -544 208 551 -444 -202 1035 191 -903 566 357 -781
2941 -781 -46 561 -539 -703 318 -42 -760 403 586 -866 173 899 -188 -579 767 40 -562 584
2959 584 441 -605 -139 719 -435 -517 335 -60 -650 122 663 -537 -18 575 -244 -441 797 185 -631
2978 -631 174 365 -719 -203 1024 -281 -394 805 -71 -991 162 414 -955 -187 468 -222 -513 1130
2996 1130 332 -314 264 560 -568 -300 807 -410 -548 573 61 -1109 517 728 -662 -274 729
3013 729 -297 -677 562 282 -709 486 827 -763 -38 912 -159 -559 635 12 -620 464 495 -574
3031 -574 -274 793 -379 -901 605 17 -787 396 463 -641 -206 987 -34 -229 485 216 -728 534
3049 534 552 -820 -218 857 -419 -679 674 -3 -553 205 364 -719 -181 842 -42 -530 569 13
$$ packed form
2923F22j075m6J018m28j080J517l4j038P52L43r95K42J237q44j094J469k09j138
2941g81P35O07j100j64J021l60p18J163J83j452J039P26j087l91J346p27o02J146
2959E84j43j046M66Q58j154q2Q52l95n90P72N41j200N19N93q19j97J238o12q16
2978f31Q05J91j084N16J227j305j13J199q76r20J153K52j369P68O55o90k91J643
2996A130p98o46N78K96j128K68J107j217j38J121n12j170J626K11j390L88J003
3013G29j026l80J239k80r91J195L41j590P25R50j071m00J194o23o32J084L1j069
3031e74L00J067j172n22J506n88q04J183O7j104M35J193j021j95P14k69r44J262
3049E34J8j372O02J075j276k60J353o77n50P58J59j083N38J023q84m88J099n56
$$ plain form
3067 13 -979 -65 501 -424 -454 504 -531 -898 772 288 -471 176 371 -853 -267 1101 -166 -484 635
3086 635 83 -717 122 390 -274 -105 469 -248 -610 759 287 -599 244 401 -565 -383 664 -70 -581
3105 -581 801 214 -658 153 760 -397 -82 856 -154 -727 446 277 -751 -172 418 -376 -318 564 -134
3124 -134 -630 404 393 -482 204 514 -262 -58 541 -35 -732 405 373 -688 50 314 -319 -105 520 -275
3144 -275 -537 210 281 -609 250 468 -242 -245 791 51 -414 316 149 -552 27 560 -698 -295 503 -165
3164 -165 -626 138 313 -705 41 248 -533 -172 470 203 -492 394 568 -645 -151 373 -328 -244 528 29
3184 29 -492 455 315 -648 -23 287 53 -436 505 -116 -323 261 629 -391 263 404 -360 -70 -200 -381
3204 -381 -328 241 73 -400 104 453 -202 -62 456 48 -308 205 176 -438 81 451 -28 -357 463 208 -309
$$ packed form
3067A3r92R14N66r25l0R58j035l67J670m84p59O47J95j224N86J368j267l18J119
3086F35n52q00Q39K68o64J69N74p17l62J369m72q86Q43J57r66J82J047p34n11
3105e81J382n87q72Q11O07j157L15R38j010n73J173j69j028N79N90p94N8Q82o98
3124a34m96J034j1q75O86L10p76K04N99n76o97J137l2j061P38K64o33K14O25p95
3144b75k62P47P1q90Q59K18p10lJ036p40m65P30j67p01N79N33j258M03P98o68
3164a65m61P64J75j018P46K07p81L61O42k67o95Q86J74j213M94N24p01Q4P72m99
3184B9n21R47j40r63O25L10k34m89R41o21k07N84L68j020O54J41p64K90j30j81
3204c81N3N69j68m73N04L49o55J40N18m08l56N13k9o14N19L70m79l29Q20k55n17
$$ plain form
3225 -309 569 -12 -415 -242 493 -152 -59 322 -88 -45 281 212 -455 18 250 19 -21 103 -101 -237 -110
3246 -110 -43 -197 215 185 -134 -9 300 -11 -171 -42 -157 -95 401 355 -603 -270 337 77 -206 203 254 -85
3268 -85 14 -57 -42 -286 357 180 -229 274 302 -220 18 129 -183 41 114 196 -80 92 42 -89 -122 187 -77
3291 -77 -277 50 -135 -190 156 120 -13 278 36 -151 -3 -72 31 10 77 120 -127 -190 39 -24 70 -31 75
3314 75 31 149 -160 -158 -370 -139 94 134 61 -238 23 106 75 60 85 -98 127 -128 18 58 -126 187 16 -8
3338 -8 -44 -293 1 321 23 -107 191 64 -60 106 68 -3 214 126 -59 -55 302 -101 -107 -74 -13 -418 -126 272
3362 272 -105 -24 232 -39 17 20 141 22 -6 241 -41 -79 193 77 -153 270 20 -242 -77 -167 -70 -12 47
3385 47 20 32 119 -151 -227 46 212 -111 149 129 -131 -220 250 210 -290 -29 224 -69 34 141 -99 -296 165
$$ packed form
3225c09Q78n81m03J73P35o45R3L81m10M3L26o9o67M73K32k31m0J24k04j36J27
3246a10O7j54M12l0l19J25L09l11j60J29j15O2M96m6r58L33O07k60k83M09N1l39
3268h5R9p1J5k44O43j77m09N03K8n22K38J11l12K24P3Q2k76J72n0j31l3L09k64
3291g7k00L27j85n5L46l6j33K91k42j87J48o9J03k1O7M3k47o3K29o3R4j01J06
3314G5m4J18l09Kk12K31K33M0p3k99K61Q3l1j5K5j83K25k55J46M0j84L13j71k4
3338hl6k49K94L20k98j30K98j27j24J66l8p1K17q8j85ML57m03oL3O1m05K92L98
3362B72l77Q1K56k71N6LJ21j19k8K47k82l8K72j16k30M23k50k62J65r0R7N8N9
3385D7k7J2Q7k70p6K73J66l23K60k0k60q9M70m0n00K61K53k93J03J07k40j97M61
$$ plain form
3408 165 217 12 246 226 -151 75 115 83 -186 -9 -81 -208 109 90 -126 251 427 -109 -136 286 149 -153
3430 -153 231 175 -154 -93 653 -123 -183 -177 268 -596 -106 366 -382 -35 342 -84 -388 519 292 -118 24 447
3452 447 -189 -131 324 -46 -248 344 103 -435 94 415 -81 -149 220 -50 -136 -24 204 -75 0 148 -152
3473 -152 -283 288 -7 -320 32 209 -236 -110 166 -422 -241 321 58 -65 133 128 -281 10 525 -352 -152
3494 -152 475 -117 -487 366 -66 -403 -102 271 -185 -195 198 -184 -142 110 100 -340 201 424 42 -360 387
3515 387 -33 -299 26 273 -393 -211 161 -253 -206 71 181 -312 265 220 -553 5 496 -236 -157 488 45
3536 45 -512 309 368 -530 -17 345 -243 -242 148 -21 -287 340 277 -491 -106 435 -248 -319 642 -127 -379 250
3558 250 276 -325 -197 463 -466 -93 435 115 -328 33 19 -304 77 394 -279 -137 269 -195 -115 149 233
$$ packed form
3408A65N2k05K34k0l77K26M0l2k69J77p2j27L17j9k16L77J76n36k7M22j37l02
3430a53L84n6l29O1P46p76o0OM45q64M90M72p48L47L77m26l04R07k27m10J42M23
3452D47o36N8M55l70k02N92k41n38N29L21m96o8L69k70q6J12K28k79P5J48l00
3473a52j31N71k95l13L52J77m45J26K76n88J81N62k63j23J98nm09K91N15q77K00
3494a52O27n92l70Q53m32l37L01L73m56j0L93l82M2K52j0m40N41K23l82m02P47
3515C87m20k66L25K47o66J82L72m14M7K77J10m93N77m5p73N58M91p32P9O45m43
3536D5n57Q21N9q98N13L62n88JL90j69k66O27o3p68L85N41o83p1R61p69k52O29
3558B50K6o01J28O60r29L73N28l20m43L61j4l23L81L17o73J42M06m64Q0K64Q4
$$ plain form
3579 233 -462 126 371 -130 -255 277 36 -279 -168 195 -394 -182 329 38 -218 478 -64 -587 231 114
3599 114 -84 246 456 -81 -308 355 -17 -250 139 -83 -375 -190 189 120 -242 485 150 -273 287 -96
3619 -96 -461 -191 313 -123 36 362 254 -57 42 215 -437 -145 432 -236 -354 306 31 -444 247 479 1
3640 1 -242 514 -63 -269 251 43 -178 268 445 -246 -87 177 -400 -251 165 -49 -501 10 290 -80 121
3661 121 333 -86 -385 429 -62 -404 340 95 -368 -133 46 -361 -323 419 -62 -479 114 392 -162 -154 331
3682 331 62 -206 81 -85 -297 -40 421 -459 -78 335 -165 -259 231 131 -286 44 104 -594 51 108 -59
3703 -59 -408 -91 137 -215 -38 25 -287 -133 103 -162 -200 284 12 -361 52 160 -143 -11 260 -271 -103
3724 -103 297 190 -241 270 216 -381 135 27 -123 -238 304 63 -80 243 250 -130 140 208 23 -291 135
$$ packed form
3579B33o95N88K45n01j25N32k41l15J11L63n89K12N11k91k56O96n42n23Q18j17
3599A14j98L30K10n37k27O63l72k33L89k22k92J85L79o9l62P27l35m23N60l83
3619i6l65K70N04m36J59L26j08l11R9J73o52K92N77o68j18O60k75m75O91K32m78
3640Ak43P56n77k06N20k08k21M46J77o91J59K64n77J49M16k14m52N11K80l70K01
3661A21K12m19k99Q14m91l42P44k45m63K35J79m07L8P42m81m17N93K78n54QM85
3682C31k69k68K87j66k12K57M61q80L81M13n00r4M90j00m17L30O0o98O45N7j67
3703e9l49L17K28l52J77O3l12J54K36k65l8M84k72l73M13J08l03J32K71n31J68
3724a03M00j07m31N11n4n97N16j08j50j15N42k41j43L23Pl80K70O8j85l14M26
$$ plain form
3745 135 -165 -34 14 356 -238 -137 381 -144 -12 -128 1 -2 45 73 -220 46 152 169 95 -6 -59 -434 107
3768 107 379 -37 72 235 -270 -100 -3 337 -258 11 520 -133 185 76 -40 1 86 -270 -206 -177 51 -195
3790 -195 -56 243 -11 -63 -13 -3 -109 -29 223 -245 -35 428 -169 -6 272 104 136 93 179 -141 7 135
3812 135 185 231 18 40 -166 57 218 258 -178 258 -123 -312 214 26 -402 146 -20 -149 -23 150 105 58
3834 58 180 -128 366 -176 63 -90 -106 173 -119 42 44 98 -159 5 204 165 120 -176 -23 -428 292 -18
3856 -18 -13 246 262 -65 11 88 21 -296 -7 201 -156 52 156 -371 -120 -100 -161 -2 90 -40 -226 -9 68 115
3880 115 -16 115 -36 -7 67 -4 -17 86 -26 69 29 -104 -31 -169 65 -106 12 -119 198 25 -277 278
3902 278 162 -170 -230 107 -44 19 -308 -114 -81 270 95 -16 345 198 28 -2 205 150 15 -59 -57 -103 301
$$ packed form
3745A35l00J31M8L42n94J01N18n25J32j16J29lM7K8k93K66J06J7p4j01n3l75N41
3768A07K72m16J09J63n05J70R7L40n95K69N09o53L18j09j16M1Q5l56O4K9K28k46
3790a95J39K99k54n2N0J0j06Q0K52m68K10M63n97J63K78j68L2m3Q6l20J48J28
3812A35N0M6k13K2k06K23J61M0m36M36l81j89N26j88m28N48j66j29J26J73m5m7
3834E8J22l08M94n42K39j53j6K79k92J61KN4k57J64J99l9m5k96J53m05P20l10
3856a8NK59J6l27P6P7o7l17K89K08l57K08J04n27K51K0o1J59R2j30j86K17P7M7
3880A15j31J31j51K9P4p1j3J03j12R5m0j33P3j38K34j71J18j31L17j73l02N55
3902B78j16l32o0L37j51O3l27J94L3L51j75j11L61j47j70l0K07n5j35p4Km6M04
$$ plain form
3925 301 130 -123 -62 -231 68 31 153 -8 -112 -68 -173 -80 117 -136 162 276 129 -7 120 -118 -38 13
3947 13 -113 -76 -2 54 140 -144 -259 -21 -81 274 -257 -185 124 -124 -70 -101 -131 44 32 -60 100 28 -55 -41 -260
3972 -260 -83 24 84 153 95 -11 205 -270 11 -187 281 303 -139 -26 374 -340 85 102 -113 16 27 158
3994 158 27 128 -180 -47 -113 -51 139 -192 194 323 -84 -247 91 -67 -109 157 177 -169 150 -280 -80
4015 -80 -99 95 -11 46 288 39 61 -55 -98 -106 121 41 95 58 73 39 -111 -71 468 -8 63 101 105 -150 -140 61
4041 61 77 99 209 -177 -168 114 -155 -329 160 -14 -289 64 218 -159 125 33 -386 5 -12 175 -124 -300
4063 -300 93 -128 -134 38 274 -222 170 22 6 -24 143 -64 -77 388 -242 -71 125 286 -293 91 326 79
4085 79 -223 178 -46 -68 -241 240 -228 280 279 -444 -132 66 333 -332 51 -51 -116 -67 -12 -75 -65 134 -3
$$ packed form
3925C01j71k53O1j69K99l7J22j61j04M4j05R3J97k53K98J14j47j36J27k38Q0N1
3947A3j26L7P4N6Q6k84j15K38o0L55n31P2L09k48N4l1l0J75j2r2J60p2q3J4k19
3972b60J77J07O0O9n8j06K16m75K81j98M68K2m42J13M00p14M25J7k15J29J1J31
3994A58j31J01l08J33o6O2J90l31L86J29m07j63L38j58m2K66K0l46L19m30K00
4015h0j9J94j06N7K42k49K2j16m3qK27q0N4l7J5l4j50M0N39m76P1L8Mk55J0K01
4041F1J6K2J10l86RK82k69j74M89j74k75L53J54l77K84r2m19L91j7J87k99j76
4063c00L93k21oJ72K36m96L92j48j6l0J67k07j3M65o30J71J96J61n79L84K35k47
4085G9l02M01k24k2j73M81m68N08jp23L12J98K67o65L83j02o5M9N5o3J0J99j37
$$ plain form
4108 -3 18 -149 -8 -235 -53 119 -62 36 -116 8 -239 -5 343 -37 158 175 -257 -230 220 -7 -185 93
4130 93 -54 -329 -90 -102 -96 54 -76 -4 -386 33 -28 -63 165 173 -130 -160 134 21 -356 52 187 -212 149
4153 149 108 -111 -475 411 89 -46 439 138 -19 -91 295 -52 29 22 -278 98 208 89 -237 62 109 157
4175 157 30 73 29 -319 122 345 -229 180 -80 -240 -88 -29 -164 -83 184 205 -291 -135 252 -16 -183 294
4197 294 263 117 147 131 41 8 -4 -167 -238 -16 60 -194 40 -114 -173 -158 314 -70 -136 122 212 -272 121 -15
4221 -15 80 -173 -22 -34 -67 194 212 -231 99 291 -46 30 510 97 -297 -19 -85 263 -69 57 -54 -69 115
4244 115 -136 -5 -7 229 9 76 74 -179 -68 255 -36 -176 29 165 -133 31 255 -104 -167 64 25 -91
4266 -91 105 156 -403 103 136 -79 3 -117 -153 -138 -59 -6 -57 -26 75 -191 -18 340 -320 -59 -19 215 -488 229
$$ packed form
4108cK1j67J41k27J82J72j81R8j52J24k47K34L48l80J95J7m32K7M50k27j78K78
4130I3j47k75K39j2OJ50j30P2l82M19o1l5K28Ql03l0K94j13l77M08J35l99L61
4153A49m1k19l64Q86l22j35M85l01j57p2L86l47Q1pl00L76J10j19l26K99M7M8
4175A57j27M3m4l48M41K23n74M09k60j60J52N9j35Q1K67K1m96J56L87k68j67M77
4197B94l1j46L0j6r0l3j2j63p1K22P6k54K34j54n9J5M72l84o6K58R0m84L93j36
4221a5R5k53J51j2l3K61J8m43L30J92l37P6M80m13l94K78o6L48l32J26j11j5J84
4244A15k51J31kK36k20O7kk53J11L23k91j40K05J36k98J64K24l59o3K31l9j16
4266i1J96N1n59N06L3k15Q2j20l6J5P9N3n1L1J01k66J73L58o60K61M0K34p03P17
$$ plain form
4290 229 37 -417 106 250 -49 -107 76 -83 -365 -237 -5 104 43 -32 -77 -116 19 -104 -123 -7 196 -126
4312 -126 22 88 -280 39 70 160 -141 73 104 177 109 104 -180 -169 82 85 -95 41 73 27 111 -137 -112 -291 159
4337 159 44 -21 215 -130 126 28 259 -119 -163 66 -68 30 163 70 -369 240 165 -52 41 215 79 -73
4359 -73 124 119 23 68 250 196 -14 137 136 -225 262 -70 -192 207 276 52 46 199 -26 -137 309 90 -30 -109
4383 -109 208 -115 -155 -159 60 -171 330 -282 -1 89 -231 -162 -206 114 -29 61 146 -40 74 211 248 207 -113
4406 -113 0 -69 46 -151 214 -73 -93 108 77 61 56 -194 -34 31 -178 165 -153 73 223 120 176 -183 -127
4429 -127 3 146 198 178 27 74 157 -106 -21 33 157 -59 -96 -55 -97 -66 -85 284 51 -421 158 -125 -18 -63
4453 -63 217 116 242 40 -6 -205 -229 220 -249 226 2 69 -216 70 -97 80 29 218 286 90 211 182
$$ packed form
4290B29j92m54N23J44k99n8J83j59k82J28K32J09o1p5m5l9J35j23j9J16K03l22
4312a26J48O6l68L19L1R0l01K14L1P3o8nk84J1K51Lj80J36L2m6Q4k48K5j79M50
4337A59j15o5K36l45K56r8K31l78m4K29j34R8J33r3m39O09p5k17R3J74j36j52
4359g3J97nr6M5J82n4k10J51jl61M87l32j22L99O9k24oJ53k25j11M46k19j20p9
4383a09L17l23m0mK19k31N01o12K81R0l20O9m4L20j43R0Q5j86J14J37L7m1l20
4406a13J13o9J15j97L65k87k0K01l1j6nk50J60O5k09L43l18K26J50j03N6l59N6
4429a27J30J43N2k0j51M7Q3k63Q5N4J24k16l7M1m2L1j9L69k33m72N79k83J07m5
4453f3K80j01J26k02m6j99k4M49m69M75k24O7k85K86j67J77n1J89O8j96J21k9
$$ plain form
4475 182 -121 -123 182 -263 -87 -43 -35 -248 15 -227 -91 105 -150 -72 120 -72 -143 -37 67 -219 -5 6 166
4498 166 -118 -120 -44 -296 -13 -158 -96 263 -16 -76 -55 -190 66 -31 -10 223 77 47 151 -37 -107 103 43 -130
4522 -130 127 9 104 31 76 93 -5 64 120 31 -118 -67 -328 56 17 -180 -155 39 -88 -12 -14 -132 -21 -18 50 -329
4548 -329 241 393 -18 229 -121 -54 -7 -72 -206 29 7 107 -115 25 -47 -285 26 -98 -81 -106 46 -27 -150
4571 -150 162 294 -31 -89 145 -124 25 -79 -87 173 146 -24 -211 -2 344 -95 -13 96 257 -110 94 36
4593 36 190 -183 185 -36 55 -44 -205 -31 121 12 -88 73 118 -175 -30 153 31 26 43 201 34 66 27
4616 27 -44 154 33 -181 -143 10 -72 -227 -1 159 -33 -48 256 24 -236 1 223 -12 -131 140 -56 -33
4638 -33 -136 -208 -99 0 92 -26 -40 -4 -153 -157 46 -134 -381 -75 -197 -107 -95 -89 -186 48 325 -202 129 297
$$ packed form
4475A82l03kL05m45J76M4Qk13K63k42J36J96k55P8J92j92p1J06J04k86K14J1J60
4498A66k84kP6k52K83j45O2L59k79o0K1j35K56r7K1K33j46l0J04j88p0K10o0j73
4522a30K57j18R5p3M5J7r8O9N6q9j49N1k61L84l9j97K5J94j27P6kj18J11LO8l79
4548c29N70J52m11K47l50O7M7o5j34K35k2J00k22J40p2k38L11j24J7k5J52p3j23
4571a50L12J32l25n8K34k69J49j04qK60k7j70j87K09L46m39Q2J09J61l67K04n8
4593C6J54l73L68k21R1r9j61J74J52j09j00J61M5k93J45J83j22nJ7J58j67L2l9
4616B7p1J98j21k14L8J53q2j55K26J60j92j5L04k32k60K37K22k35j19K71j96K3
4638c3j03p2J09R9R2j18j4L6j49mK03j80k47L06j22R0J2Or7K34K77n27L31J68
$$ plain form
4662 297 73 25 69 -2 -61 31 -21 -284 -60 132 235 -341 -26 -52 -209 -113 -67 -40 -182 -20 -96 27 4 263
4686 263 -35 125 220 45 -19 -83 120 -88 -164 217 -110 125 194 83 65 -70 -65 -88 -94 304 -36 -247 117 80
4710 80 169 91 177 94 -103 -22 -88 -119 -111 -117 90 28 63 -65 -75 -172 21 12 -186 238 81 -367 60 66 -8 304 52
4737 52 -61 -255 -58 -208 -359 22 -33 -103 -83 67 3 17 23 70 -25 -307 94 -74 43 -258 -175 56 -124 -12
4761 -12 14 214 46 97 143 -18 294 66 5 -165 73 -223 -149 -26 125 -169 -112 58 261 -34 208 -6
4783 -6 -182 24 118 -93 -167 -202 -316 44 61 256 -110 -144 79 -46 -49 -132 84 86 -158 278 -62 6 94 -34 -110
4808 -110 -154 -116 -69 -31 161 -135 182 -80 44 -138 372 -18 -106 -151 41 -393 191 95 -369 -103 250 145
4830 145 193 148 -25 -96 -221 249 70 -229 -89 -179 9 16 69 46 -150 103 -56 -19 22 -186 3 78 74 215
$$ packed form
4662B97k24m8M4p1n9R2n2k63K24J92J03n76L15k6j57R6M6K7j42J62p6J23k3K59
4686B63k98J60R5j75o4o4K03k08p6L81l27K35O9j11j8j35Nk3oL98l40k11L64l7
4710H0Q9p8Q6q3j97Q1o6l1QoK07o2L5j28j0r7J93rj98M24j57m48M27Op4L12k52
4737E2j13j94J97j50j51L81n5p0K0J50o4J4OM7r5k82M01j68J17l01Q3K31j80J12
4761a2K6K00j68N1M6j61L12k28o1j70K38k96P4J23J51k94N7J70K03k95K42k14
4783fj76K06R4k11p4l5j14L60J7J95l66l4K23j25lq3K16Kk44M36l40O8Q8j28p6
4808a10m4L8M7L8J92k96L17k62J24j82N10l90q8m5J92m34N84r6m64K66L53j05
4830A45M8m5j73p1j25M70j79k99J40r0J88PN3k3j96K53j59L7M1k08J89P5mJ41
$$ plain form
4854 215 5 44 -23 77 -61 -41 -44 -105 -119 -332 -249 236 157 -79 25 -128 -82 63 5 98 -19 -193 -37 2
4878 2 2 -13 -424 -7 48 -135 106 -50 47 97 179 -33 222 -22 41 -93 -69 451 -234 66 9 130 -99 -242
4902 -242 -162 -186 -303 6 -95 94 305 -145 -100 179 -52 -73 -266 14 -43 18 120 16 101 -194 33 43 -42
4925 -42 170 159 32 -7 172 -196 -76 -150 -228 -39 298 -106 -231 37 -11 -23 20 264 60 169 -70 234 -237
4948 -237 88 97 -15 -3 101 -22 95 -291 -69 57 101 208 -122 157 268 -67 41 47 83 -38 -46 -70 25 -250
4972 -250 160 -152 -39 33 -68 102 99 27 -175 104 18 -242 -45 69 -4 76 13 -63 298 -56 115 -115 188
4995 188 -73 -199 -18 30 -3 -154 -169 104 192 7 152 -288 -193 135 -4 32 -2 205 369 -132 -50 -91 256
5018 256 -38 111 -79 -219 -212 -52 -23 149 161 136 32 205 -177 -110 22 171 91 52 -49 -95 282 127 -177
$$ packed form
4854B15k10L9o7J00j38K0lo1j4k13Q3M85p9k36J04j53M6J45n8R3j17j74J56L9
4878B%j5m11M17N5j83K41j56R7N0Q2k12K55k44O3j34K4N20o85L00n7J21k29j43
4902b42Q0k4j17L09j01J89K11m50M5K79k31k1j93K80n7O1J02j04Q5k95K27J0q5
4925d2K12j1j27l9J79l68J20p4p8J89L37m04j25K68m8j2M3K44k04J09k39L04m71
4948b37L25Rj12J2J04j23J17l86K22J26M4J07l30K79J11l35J08OL6j21qk4R5k75
4972b50M10l12J13P2j01J70lp2k02K79q6k60J97J14p3Q0o3p6L61l54J71k30L03
4995A88k61j26J81M8l3j51j5K73Q8j85J45m40R5L28j39L6l4K07J64n01Q2m1L47
5018B56k94J49j90j40PJ60K9J72J2k5j04J73l82O7J32J49q0l9j01m6L77j55l04
$$ plain form
5041 -177 -197 191 -126 -97 245 -194 -11 -31 125 34 -146 108 86 -127 6 -173 61 226 58 164 126 276
5063 276 194 174 147 106 -82 -251 -103 -42 -92 167 49 -200 47 136 -94 66 37 -102 146 -208 15 -55 -125
5086 -125 -47 216 -102 -1 159 -99 -172 185 -63 134 -69 162 -49 171 -111 -275 -89 22 -281 216 -155
5107 -155 -11 -271 190 113 -40 -29 -72 22 101 -173 236 282 52 61 -185 70 -120 6 -96 -295 -109 589 -21
5130 -21 123 -43 148 -112 -75 -252 -127 -111 -290 -118 -15 -165 -339 -31 -44 295 -18 37 -124 31 -63 56
5152 56 384 182 139 -9 -84 -196 163 426 -23 -40 187 -203 -9 213 -137 94 -119 -238 32 28 -84 66
5174 66 -145 -70 13 -84 -38 104 75 40 260 -55 130 -14 48 -93 -29 38 -94 -87 -137 -24 -159 -112 196 154 -8
5199 -8 91 34 -89 -146 -206 217 81 62 291 -143 77 -65 186 -190 -261 12 328 -32 105 117 -1 68 25 -144
$$ packed form
5041a77k0L88l17K9L42m39J83k0J56r1j80K54k2k13J33j79K34J65j68J06l8J50
5063B76q2k0k7m1j88j69J48O1n0K59j18k49K47Q9k30J60k9j39K48l54K23p0p0
5086a25P8K63l18J01J60k58p3L57k48J97k03K31k11K20k82j64J86J11l03M97l71
5107a55J44k60M61p7j53J1m3R4P9k74M09M6k30Rk46K55j90J26j02j99J86O98o10
5130b1J44j66J91k60L7j77J25J6j79J72J03j50j74L08j3L39l13N5j61J55r4J19
5152E6L28k02m3j48p5j12L59K63m49j7K27l90J94K22l50K31k13j19K70mj12J50
5174F6k11P5Q3r7M6J42k9l5K20l15J85j44O2j41O4O7j32Pn0J13j35M7L08m2j62
5199hR9n7j23n7o0M23j36j9K29m34K20j42K51l76p1K73L16l60J37J2j18O9m3j69
$$ plain form
5223 -144 -114 120 -89 164 112 -188 66 -10 321 99 -272 -5 170 81 -95 -30 -122 180 -66 -74 125 220 -101
5246 -101 -159 15 161 -97 335 97 166 41 14 -146 -118 429 -348 181 -137 -125 -182 371 -255 -38 -28 11 85
5269 85 -195 -81 59 -248 168 215 -164 137 100 -192 81 -136 9 -151 84 102 -150 -175 -55 -165 -23 77
5291 77 122 4 -106 -96 0 247 15 50 78 21 93 97 83 -58 -335 -21 135 -75 -15 187 249 -165 64 40 -33
$$ packed form
5223a44L0K34k09K53n2l00K54p6L31k22l71K67J75q9j76O5r2L02k46qJ99R5l21
5246a01n8J74J46k58M32k38O9j25k7j60K8N47p77N29l18J2n7N53o26K17J0L9P4
5269H5k80J14J40l07M16M7l79L01l7k92K73k17J45j60K35J8k52k5J20j10J42J00
5291G7M5j18j10J0R6K47k32L5K8n7P2Mj4j41k77L14J56k10O0K02O2m14K29k4p3
$$ [...]
8191a07
##END NTUPLES=NMR FID
##END=
