##TITLE=1H_AmBC0404
 CDCl3,8 sc, 
 5.04.2021
##JCAMPDX= 6.0         $$ Bruker NMR JCAMP-DX V2.0
##DATA TYPE= NMR FID
##DATA CLASS= NTUPLES
##ORIGIN= UXNMR, Bruker Analytische Messtechnik GmbH
##OWNER= root
$$ XWIN-NMR		Version 3.5
$$ Mon Apr  5 11:27:50 2021 Russian Standard Time (UT+4h)  she@DPX200
##.OBSERVE FREQUENCY= 200.131506
##.OBSERVE NUCLEUS= ^1H
##.DELAY= (6, 6)
##.ACQUISITION MODE= SIMULTANEOUS
##.ACQUISITION SCHEME= undefined
##.AVERAGES= 8
##.DIGITISER RES= 18
##SPECTROMETER/DATA SYSTEM= spect
##.PULSE SEQUENCE= zg30
##.SOLVENT NAME= CDCl3
##.SHIFT REFERENCE= (INTERNAL, CDCl3, 0, 15.7039)
##AUDIT TRAIL= $$ (NUMBER, WHEN, WHO, WHERE, WHAT)
$$ ##TITLE= Audit trail, XWIN-NMR		Version 3.5
$$ ##JCAMPDX= 5.01
$$ ##ORIGIN= Bruker BioSpin GmbH
$$ ##OWNER= she
$$ F:/spectra/data/she/nmr/H-F/1/audita.txt
$$ ##AUDIT TRAIL=  $$ (NUMBER, WHEN, WHO, WHERE, WHAT)
(   1,<2021-04-05 11:26:19.65 +0400>,<she>,<DPX200>,
      <created by zg, POWCHK disabled, PULCHK disabled
       configuration hash MD5:
       00 E9 B6 7A A2 85 ED C7 34 08 36 98 17 FE 4E 26
       data hash MD5: 16K
       E8 A7 33 6F 94 15 58 93 DF 2A CC 7C 93 F8 8F 20>)
$$ ##END=
$$ 
$$ hash MD5
$$ 16 79 05 70 D0 20 3A 15 92 5D 73 37 3F 94 04 E5
##$RELAX= 
##$RELAX= 
##$RELAX= 
##$RELAX= 
##$RELAX= 
##$RELAX= 
$$ Bruker specific parameters
$$ --------------------------
##$DU= <F:/spectra>
##$EXPNO= 1
##$NAME= <H-F>
##$PROCNO= 1
##$TYPE= <nmr>
##$USER= <she>
##$AMP= (0..31)
100 100 100 100 100 100 100 100 100 100 100 100 100 100 100 100 100 100 
100 100 100 100 100 100 100 100 100 100 100 100 100 100 
##$AQSEQ= 0
##$AQ_mod= 1
##$AUNM= <au_zg>
##$AUTOPOS= <>
##$BF1= 200.13
##$BF2= 200.13
##$BF3= 200.13
##$BF4= 200.13
##$BF5= 200.13
##$BF6= 200.13
##$BF7= 200.13
##$BF8= 200.13
##$BYTORDA= 1
##$CFDGTYP= 0
##$CFRGTYP= 5
##$CHEMSTR= <none>
##$CNST= (0..31)
1 1 145 1 1 1 1 1 1 1 1 1 1 1 1 1 1 1 1 1 1 1 1 1 1 1 1 1 1 1 1 1 
##$CPDPRG= <>
##$CPDPRG1= <>
##$CPDPRG2= <>
##$CPDPRG3= <>
##$CPDPRG4= <mlev>
##$CPDPRG5= <mlev>
##$CPDPRG6= <mlev>
##$CPDPRG7= <mlev>
##$CPDPRG8= <mlev>
##$CPDPRGB= <>
##$CPDPRGT= <>
##$D= (0..31)
0 1.2 0 0 0 0 0 0 0 0.06 0 0.03 0 0 0 0 0.0002 0 0 0 0 0 0 0 0 0 0 0 0 
0 0 0 
##$DATE= 1617607579
##$DBL= (0..7)
120 120 120 120 120 120 120 120 
##$DBP= (0..7)
150 150 150 150 150 150 150 150 
##$DBP07= 0
##$DBPNAM0= <>
##$DBPNAM1= <>
##$DBPNAM2= <>
##$DBPNAM3= <>
##$DBPNAM4= <>
##$DBPNAM5= <>
##$DBPNAM6= <>
##$DBPNAM7= <>
##$DBPOAL= (0..7)
0.5 0.5 0.5 0.5 0.5 0.5 0.5 0.5 
##$DBPOFFS= (0..7)
0 0 0 0 0 0 0 0 
##$DE= 6
##$DECBNUC= <off>
##$DECIM= 32
##$DECNUC= <off>
##$DECSTAT= 4
##$DIGMOD= 1
##$DIGTYP= 9
##$DL= (0..7)
0 120 120 120 120 120 120 120 
##$DP= (0..7)
150 150 150 150 150 150 150 150 
##$DP07= 0
##$DPNAME0= <>
##$DPNAME1= <>
##$DPNAME2= <>
##$DPNAME3= <>
##$DPNAME4= <>
##$DPNAME5= <>
##$DPNAME6= <>
##$DPNAME7= <>
##$DPOAL= (0..7)
0.5 0.5 0.5 0.5 0.5 0.5 0.5 0.5 
##$DPOFFS= (0..7)
0 0 0 0 0 0 0 0 
##$DQDMODE= 0
##$DR= 18
##$DS= 0
##$DSLIST= <SSSSSSSSSSSSSSS>
$$ [...]
##$SUBNAM2= <"">
##$SUBNAM3= <"">
##$SUBNAM4= <"">
##$SUBNAM5= <"">
##$SUBNAM6= <"">
##$SUBNAM7= <"">
##$SUBNAM8= <"">
##$SUBNAM9= <"">
##$SW= 16.9725357007746
##$SWIBOX= (0..15)
0 0 2 0 0 0 0 0 0 0 0 0 0 0 0 0 
##$SW_h= 3396.73913043478
##$TD= 16384
##$TD0= 1
##$TE= 0
##$TE2= 300
##$TE3= 300
##$TEG= 300
##$TL= (0..7)
0 120 120 120 120 120 120 120 
##$TP= (0..7)
150 150 150 150 150 150 150 150 
##$TP07= 0
##$TPNAME0= <>
##$TPNAME1= <>
##$TPNAME2= <>
##$TPNAME3= <>
##$TPNAME4= <>
##$TPNAME5= <>
##$TPNAME6= <>
##$TPNAME7= <>
##$TPOAL= (0..7)
0.5 0.5 0.5 0.5 0.5 0.5 0.5 0.5 
##$TPOFFS= (0..7)
0 0 0 0 0 0 0 0 
##$TUNHIN= 0
##$TUNHOUT= 0
##$TUNXOUT= 0
##$USERA1= <user>
##$USERA2= <user>
##$USERA3= <user>
##$USERA4= <user>
##$USERA5= <user>
##$V9= 5
##$VALIST= <valist>
##$VCLIST= <CCCCCCCCCCCCCCC>
##$VD= 0
##$VDLIST= <DDDDDDDDDDDDDDD>
##$VPLIST= <PPPPPPPPPPPPPPP>
##$VTLIST= <TTTTTTTTTTTTTTT>
##$WBST= 1024
##$WBSW= 4
##$XGAIN= (0..3)
0 0 0 0 
##$XL= 0
##$YL= 0
##$YMAX_a= 704751
##$YMIN_a= -663407
##$ZGOPTNS= <>
##$ZL1= 120
##$ZL2= 120
##$ZL3= 120
##$ZL4= 120
##$ABSF1= 10
##$ABSF2= 0
##$ABSG= 5
##$ABSL= 3
##$ALPHA= 0
##$AQORDER= 0
##$ASSFAC= 0
##$ASSFACI= 0
##$ASSFACX= 0
##$ASSWID= 0
##$AUNMP= <proc_1d>
##$AZFE= 0.1
##$AZFW= 0.1
##$BCFW= 1
##$BC_mod= 2
##$BYTORDP= 1
##$COROFFS= 0
##$CY= 11.3945322036743
##$DATMOD= 1
##$DC= 2
##$DFILT= <>
##$DTYPP= 0
##$F1P= 15.9154993809931
##$F2P= -4.1035820241983
##$FCOR= 0.5
##$FTSIZE= 0
##$FT_mod= 4
##$GAMMA= 1
##$GB= 0.15
##$INTBC= 1
##$INTSCL= 1
##$ISEN= 128
##$LB= 0.24
##$LEV0= 0
##$LPBIN= 0
##$MAXI= 10000
##$MC2= 0
##$MEAN= 0
##$ME_mod= 0
##$MI= 1.114404
##$NCOEF= 0
##$NC_proc= 0
##$NLEV= 6
##$NOISF1= 3.799351
##$NOISF2= 2.8
##$NSP= 1
##$NTH_PI= 0
##$NZP= 0
##$OFFSET= 15.70392
##$PC= 1
##$PHC0= -11276.46
##$PHC1= 9.200919
##$PH_mod= 1
##$PKNL= yes
##$PPARMOD= 0
##$PSCAL= 0
##$PSIGN= 0
##$REVERSE= no
##$SF= 200.130013532006
##$SI= 16384
##$SIGF1= 3
##$SIGF2= 2
##$SINO= 400
##$SIOLD= 16384
##$SREGLST= <1H.CDCl3>
##$SSB= 0
##$STSI= 0
##$STSR= 0
##$SW_p= 3612.71676300578
##$SYMM= 0
##$S_DEV= 0
##$TDeff= 0
##$TDoff= 0
##$TI= <>
##$TILT= no
##$TM1= 0
##$TM2= 0
##$TOPLEV= 0
##$USERP1= <user>
##$USERP2= <user>
##$USERP3= <user>
##$USERP4= <user>
##$USERP5= <user>
##$WDW= 1
##$XDIM= 8192
##$YMAX_p= 0
##$YMIN_p= 0
$$ End of Bruker specific parameters
$$ ---------------------------------
##NTUPLES= NMR FID
##VAR_NAME=  TIME,          FID/REAL,        FID/IMAG
##SYMBOL=    X,             R,               I
##VAR_TYPE=  INDEPENDENT,   DEPENDENT,       DEPENDENT
##VAR_FORM=  AFFN,          ASDF,            ASDF
##VAR_DIM=   8192,          8192,            8192
##UNITS=     SECONDS,       ARBITRARY UNITS, ARBITRARY UNITS
##FACTOR=    0.0002944,     1,               1
##FIRST=     0,             0,               0
##LAST=      2.4114304,     0,               0
##MIN=       0,             -663407,         0
##MAX=       2.4114304,     704751,          0
$$ Real data points
##PAGE= N=1
##DATA TABLE= (X++(R..R)), XYDATA
0@%%%%%%Qj6J6j6J6j6K4m0N6o4P2q8J04j28J59j89K19k58K98l39L95m58N25o00
30c20O82p72Q68r75J097j230J372j528J701j884K086k311K555k818L104l417L759
47A969m132M545n000N497o049O667p356Q132r019J0038j1219J2608j4267J6284
61H698j8795K2008k6258L2129m0718N4365p9043J36038m63753k88078J012014
72C48607o43632M47223j72339n45739N71669K91238p87041O35533k5879k60800
82a41160Q45911j176247L78519O18355m08352L29063k05611m16562N81445n891
92C99470p31795Q65972m60359J15410K94925j065009N76198K48707l07264J77641
102A13896j42982m03496P43380m40898l65165Q32437n73474M66696j01385o64510
$$ plain form
0 0 0 0 0 0 0 0 8 -8 8 -8 8 -8 16 -24 32 -32 40 -48 56 -72 87 -102 117 -141 157 -182 213 -245 280 -320
30 -320 362 -410 458 -517 580 -650 722 -806 895 -989 1097 -1214 1341 -1477 1627 -1790 1969
47 1969 -2163 2382 -2618 2879 -3170 3497 -3859 4273 -4746 5292 -5927 6681 -7586 8698
61 8698 -10097 11911 -14347 17782 -22936 31429 -47614 88424 -375329 -663407 348607
72 348607 -295025 152198 -20141 -565880 5789 297027 -490014 145519 119640 -141160
82 -141160 704751 -471496 -92977 525378 117026 446089 240478 -176084 405361 399470
92 399470 -332325 533647 73288 188698 483623 -581386 -5188 243519 -63745 113896
102 113896 -29086 -432582 310798 -130100 -495265 337172 -236302 230394 129009 -535501
112e35501O05669J69321l67033K98384j71142k41110P66848q37387Q4914M84636
122B57599m85789M64110k92968m02688N31243J802m68033M78633l87331J17286
132a86136N24551q66699M12345J45628k57605L76870k35296k37963O23367k30910
142F8152l08457N00897n13053M90446J39273o46908M47553k8778j94789K85790
152B40126k64644j33618O61550n64001m7713K60438m55657N93900j61139l91363
162b62121M13116o7160k29125L28700l76324J28135N56231o81896K51919J603
172F3078k38148M93587k59843k37212M39478j74119j99612L18770n33772M18606
182I0813K28832n81023L45100j65270q5409L30138l07260j47273N28764l51355
$$ plain form
112 -535501 70168 239489 -127544 170840 -302 -241412 525436 -311951 -227037 257599
122 257599 -228190 235920 -57048 -459736 71507 73309 -394724 83909 -303422 -186136
132 -186136 338415 -528284 -115939 29689 -227916 148954 -86342 -324305 299062 68152
142 68152 -240305 260592 -252461 237985 377258 -269650 177903 149125 -45664 240126
152 240126 -24518 -158136 503414 -60587 -108300 152138 -303519 290381 129242 -262121
162 -262121 150995 83835 -145290 183410 -192914 -64779 491452 -190444 61475 63078
172 63078 -175070 318517 58674 -178538 260940 86821 -112791 205979 -327793 90813
182 90813 319645 -261378 83722 -81548 -166957 163181 -144079 -291352 237412 -113943
192a13943M682J70041m96966N98679p9073l41593L33234j28562k8739K75540l93574
203b00274L0549N10676m80106K42824p2048k94306N36783k66759j97203L13051
213A23187j24809k6491K38089n39588K79019K86988m46659L66479k35085n8280
223a37150L84307l24274j22468L75023k01538J03276J38553n53945M97509j8992
233A40301k78229L21268k47905O6159K63219l90808m4323L83323l28287K81058
243A65776q5532l80535N22963k34586j29919K22713j73037J07042K28112m84466
253b41469J43610K51533l34141L87304k76380r6349M08929k89346p9729J99258
263G3220j72126J77528J57792n30454L64980j294k09589L24434l35019J00958
$$ plain form
192 -113943 -109261 60780 -436186 162493 83420 -258173 75061 -53501 -82240 193300 -200274
203 -200274 -169725 340951 -139155 103669 31621 -262685 274098 7339 -189864 123187
213 123187 -1622 -28113 209976 -329612 -50593 236395 -210264 156215 -78870 -137150
223 -137150 247157 -77117 -199585 175438 -26100 77176 215729 -338216 159293 140301
233 140301 -137928 183340 -64565 1594 264813 -125995 -170318 213005 -115282 165776
243 165776 80244 -300291 222672 -11914 -141833 80880 -92157 14885 242997 -241469
253 -241469 -97859 153674 -180467 206837 -69543 -165892 243037 -46309 -126038 73220
263 73220 -98906 78622 236414 -294040 70940 69646 -139943 184491 -150528 -49570
273d9570K86691l06141n8320K16997k56286L20101k6178m09524M75364k12176
283a9042n1310J66659k72971J70806K42039l62342M6881J61169k95368M23374
293B09895k60267j52668M11418k58317K2266N6056j99785K00285K11243m27469
303a87343K37325q125j87504L74031l96352Q5473K74173k10766J418M4470k22623
314a95823K77806P1959l98362L89278j90797M275J92937l74310J92742J98778
324A68483j96106K9972N8957k53713L97940j63651k20677L94863k60097J42704
334I8675J2767k84457K00503J70369k61977J36402k6985j93446M08406l86919
344a26662j756K60727k02177J56698o9860k24425K24984J05096l05824K75170
$$ plain form
273 -49570 237121 -69020 -127340 89657 -166629 153472 127294 -282230 193134 -19042
283 -19042 -70352 96307 -176664 -5858 236181 -126161 -79280 81889 -213479 209895
293 209895 -50372 -203040 208378 -49939 -27673 28383 -171402 28883 240126 -187343
303 -187343 49982 41857 -145647 228384 -167968 -82495 191678 -19088 -17670 26800 -195823
314 -195823 81983 153942 -244420 144858 -45939 -41664 151273 -223037 -30295 168483
324 168483 -27623 2349 61306 -192407 205533 41882 -178795 216068 -44029 98675
334 98675 111442 -173015 27488 197857 -64120 72282 45297 -148149 260257 -126662
344 -126662 -128418 132309 -69868 86830 16970 -207455 17529 122625 -183199 91971
354I1971j55195P496K85008m37494J55367J39376j12426J14746n9670k07376L08820
365A30623p0514k47062L08853k47797J88476P4994l66182J83524Q1961j21524
375h4648J19856p3284j51821L81627k76344p5203K26583k10823K75877n5168k51667
386a75015K07973O3382j71276J90605j57364N861L35220l94729P9870Q6357j22781
397e1897K25564j17467j95963K56122m0555j87169K08255k52645J94900J64049
407B03194l63409J54978J4119o5480J67436j25065j25383L42304j84271p5364
417e6941J45522k43613L03346j2586k53551J65185m347r3168J50923k01266j4638
428a15134L28342l11932O2097P779j54289K79139j10504j70805K08038k6785r7715
$$ plain form
354 91971 -63224 -55728 229280 -208214 -52847 86529 -25897 88849 29179 -178197 130623
365 130623 60109 -186953 121900 -125897 62579 137573 -228609 -45085 36876 -84648
375 -84648 35208 -38076 -189897 191730 -84614 -159817 66766 -144057 131820 76652 -175015
386 -175015 32958 96340 -74936 115669 -41695 -35834 299386 -95343 -15473 70884 -51897
397 -51897 173667 56200 -139763 116359 75804 -111365 96890 -155755 39145 203194
407 203194 -160215 -5237 8882 -56598 110838 -14227 -139610 202694 18423 -56941
417 -56941 88581 -155032 148314 135728 -117823 47362 43015 -50153 100770 -100496 -115134
428 -115134 213208 -98724 -36627 -28848 -183137 96002 -14502 -185307 22731 -4054 -101769
439a01769J64887k82434J74010K13204k96137J60348o2854m3713K05493j42071
449a1036j21352K81060j17786l0455J06633l05942K93350K1206k10813J52280
459E7145p2456k2310J47604j95690n6444L05168k18930J03329j0396k08967L09641
470A37694r5883j14368J47857l6312j5685J53690k79926Q0398K19685k46743J89531
481A39938j30685p3677K25714j56239j00899J65087q0091J9460J10296l39232
491b20328K25897M3295j73891J83744j54567L2112J63365j75821o8159K09320
501F4967j46927J40988J4126k64320K96559r4794p4046J16376j12214N8986J42964
512A42665k35076O08J65141j95109K18439j30207j17187K51530j46262m0368P9092
$$ plain form
439 -101769 63118 -219316 -45306 167898 -128239 32109 -30745 -74458 131035 -11036
449 -11036 -132388 148672 30886 431 107064 -198878 94472 115678 -95135 57145
459 57145 -15311 -37621 109983 -85707 -142151 163017 -55913 47416 37020 -171947 137694
470 137694 41811 -72557 75300 38988 23303 176993 -102933 -22535 197150 -49593 139938
481 139938 9253 -64424 161290 5051 -95848 69239 -10852 8608 118904 -220328
491 -220328 5569 48864 -125027 58717 -95850 -63738 99627 -76194 -144353 64967
501 64967 -81960 59028 73154 -191166 105393 10599 -63447 52929 -59285 -299 142665
512 142665 -92411 -91803 73338 -121771 96668 -33539 -150726 100804 -45458 -85826 -6734
523f734q0009Q5646J40994k88267J45555N7702j39029K20721j95123L4069J87146
534A62671j40874m7537R4362j24068J51610N2882k81523K46393q8949m9754J20809
545I6022j95359R0073J47914j69199j9487R0584j69367K39459r4680j57056K59452
556A18356j42043K6038L2786j41531J13913J43618k16457Q0972K7462j36277K44406
567A51243k22646n535J83989j23509J8891k585j30005J34432Q7153k43109J90043
578C8362p6200k9554J60347k45198R3656J27860q7076J3010K3499j46730K09019
589H0995l1373j80041K36441j41833P8688M1683k03513J08871J06900j20030N1720
600B8508L458j37958K54774j86952n7928J82974j33261J16383l1230j52351J18267
$$ plain form
523 -6734 -86743 -1097 139897 -148370 -2815 54887 -84142 136579 -58544 -24475 162671
534 162671 21797 -25740 68622 -55446 96164 149046 -132477 113916 24967 -24787 96022
545 96022 -99337 -9264 138650 -30549 -50036 40548 -128819 110640 15960 -141096 118356
556 118356 -23687 2351 35137 -106394 7519 151137 -65320 15652 43114 -93163 151243
567 151243 -71403 -76938 107051 -16458 2433 -152 -130157 4275 91428 -151681 38362
578 38362 -37838 -67392 92955 -152243 -58587 69273 -17803 -4793 18706 -128024 80995
589 80995 49622 -130419 106022 -35811 42877 84560 -118953 -10082 96818 -23212 28508
600 28508 31966 -105992 148782 -38170 -96098 86876 -46385 69998 38768 -113583 4684
611D684Q2087j65557J37846o8409l8704K15676k63620N9997R5706p9470R9085
622G9321m0939j33426J58676L40j62994J79346j44949Q8559J01838k43689R8382
633a9535M0993n6642P8791m2325j12892K19573j17407q3273J44836j52020J70837
644G0936p26j75130J04886L1853q2780J02793q4260m0221K27371k10437J9230
655c6485N7952j02572J67495n0563j28249J30623j032j00480J25451j54646P7703
666a4803J53444k17512P8619m704n0632J29925p1003j01937J86237p1549n6550
677d0465R3573j77378J72331M6305j65802Q8109j3623m0068J08487j12281m8656
688h9468K13483j46179K5882J4340j30580J88663l1626j15532J00855j1044m5408
$$ plain form
611 4684 86771 -78786 59060 -9349 -48053 167623 -95997 -36000 59706 -19764 79321
622 79321 38382 -95044 63632 63972 -99022 80324 -64625 23934 125772 -117917 -19535
633 -19535 21458 -35184 43607 1282 -111610 107963 -9444 -92717 52119 -99901 70936
644 70936 70210 -104920 -34 31819 -50961 51832 -32428 -72649 154722 -55715 -36485
655 -36485 21467 -81105 86390 35827 -92422 38201 37169 -63311 62140 -92506 -14803
666 -14803 138641 -78871 -252 -4956 -55588 74337 3334 -98603 87634 16085 -40465
677 -40465 53108 -124270 48061 94366 -71436 16673 3050 -37018 71469 -40812 -89468
688 -89468 124015 -22164 3718 18058 -112522 76141 44515 -71017 29838 18794 -26614
699b6614J09565j79267N1071J63832j66937Q5896n4373n5766J50022o8984r8222
710h9777J43028m4005j1935Q2337k15266J54541O2907j25454Q8670o1009q476
721b4439J15899j07958p5599J80394j03381N8436L202j73545J90547k9744q1319
732d7507O6846l3664j160J09048j69739l494J56862j34219J19407p8284p5410
743i1314J62560o8221o8350P8322k7910K0333R9855k20675J03914O6315j05915
754e1086J18037j11865Q725J18218q9597p5924J11519p3871P7270L4642k04198
765a38130J78180l2569m9876O9803q2528M3832J08160j25146l5730J19655j12524
776e6873J43538o0641j07480J75516p8718k4049L0859n4202M7876J05039j78429
$$ plain form
699 -26614 82951 -96316 -45245 118587 -48350 37546 -16827 -72593 77429 8445 -89777
710 -89777 53251 9246 -2689 79648 -135618 18923 81830 -43624 45046 -15963 -24439
721 -24439 91460 -16498 -92097 88297 -15084 43352 46554 -126991 63556 33812 -47507
732 -47507 19339 -14325 -15485 93563 -76176 -79670 77192 -57027 62380 -15904 -91314
743 -91314 71246 3025 -65325 12997 -14913 5420 105275 -115400 -11486 54829 -51086
754 -51086 66951 -44914 -36189 82029 -7568 -83492 28027 -45844 31426 66068 -138130
765 -138130 40050 7481 -42395 27408 -55120 -11288 96872 -28274 -64004 55651 -56873
776 -56873 86665 26024 -81456 94060 15342 -8707 22152 -32050 15826 120865 -57564
787e7564M7045N6324j03528J47695j31918n522J27706p7083l4220L8453o5937
798e8549P9058O9724j90514J38390k8377l9943R4953j33242N3493R8663p8780
809D876l2115N8031j05177J34690k4760j34774J66252q7016J3983K2031j02473
820h6452N7200R5909j14206K0867L6003j04074J68279j20013l0598J31148p3586
831a9523L1293k452q0603O9840Q4500j46277J01971k9983m0841J30828j62790
842f4037M0029P8538m7498J2284O496r7669J07662J3970j33881J43491q8792M1917
854A2510N1576j40399N9029O2082n0114K4345J2455j00501J60515q4175o1678
865e4355J20885r2726Q7432j0688j04042N2216N9250r0422O5997l3911n5848J59152
$$ plain form
787 -57564 -10519 45805 -57723 89972 -41946 -47468 80238 3155 -31065 7388 -58549
798 -58549 20509 90233 -100281 38109 9732 -30211 64742 -68500 -15007 83656 4876
809 4876 -27239 30792 -74385 60305 35545 -99229 67023 -19993 -6010 16021 -86452
820 -86452 -29252 66657 -47549 -26682 9321 -94753 73526 -46487 -77085 54063 -19523
831 -19523 11770 9318 -71285 -1445 83055 -63222 38749 8766 -32075 98753 -64037
842 -64037 -24008 54530 7032 19316 25812 -71857 35805 49775 -84106 59385 -29407 12510
854 12510 64086 -76313 -17284 44798 -5316 19029 31484 -69017 91498 7323 -54355
865 -54355 66530 -26196 61236 50548 -53494 -1278 57972 -32450 33547 -364 -56212 102940
877A02940j60521J3388N6605n5549P7448k5093q8204P7832L2832j07155J10513
888C5036q7637L8525J03056j58898N5115J9973k5013N5190j8484q4925J26851
899E8789m0073p4974R8551j13246J06364K3104j19869N3720J4253l7521N6426
910B5524m0446n4735J58107j11142m705M4812q2329J23106k0982q1112O3885J7229
922C7212n7642P7187r0925J8261J27949j38177M4215j0830m0253Q9941l9120p3452
934e5634R6503k0567m9548P1478j28019R2508N5894j09061N6876j9944k0239P0964
946D1211n4080n4821J34140p2125O511K7084j11095J23302n061p3273N2443r604
958D632k5280P3177j02248m346J21670j02225N6186l1639n7705J05874l4544o1599
$$ plain form
877 102940 -57581 -44193 12412 -43137 34311 9218 -78986 -1154 31678 -75477 35036
888 35036 -52601 -14076 88980 -69918 -14803 5170 -19843 35347 16863 -68062 58789
899 58789 18716 -56258 42293 -70953 35411 58515 -61354 -7634 6619 -30902 25524
910 25524 -14922 -69657 88450 -22692 -27397 17415 -64914 58192 37210 -43902 19983 37212
922 37212 -20430 56757 -34168 -15907 112042 -26135 18080 7250 -33003 56938 17818 -55634
934 -55634 40869 20302 -29246 42232 -85787 6721 62615 -46446 10430 -9514 -29753 41211
946 41211 -12869 -67690 66450 -5675 836 27920 -83175 40127 35066 -38207 14236 4632
958 4632 -20648 52529 -49719 -54065 67605 -34620 21566 -10073 -67778 38096 3552 -58047
970e8047P1469j5560j0991P0763j41959P2595O1331q1468O9480n1341j0951P9971
982E5292n1519n9068J00700n4728L3612K8596j36762J14704p815m5785M4945l6321
994a4149l25P7602q6728l2587J03100q3685Q5222l5394p8349J10705l5282l3994
1006b3864L3326k1073Q877Q4061j34984L2777N7863p4085R4752p9101j2080Q4390
1018E0859m2559m6691N1055m2369M3662N4678j48368R8320j0971l2708O1987p6891
1030c9996K2373P4280n7856m0600O5894p5661R6326j3163j03009J15668m8081
1041c825m59J7244n3171K9333Q2266r5491K283M3441p3287J16725q2615k8721
1053d6277R2441m1971p268N370m6511M4320P0223j25807O5823p628l2712Q3584
$$ plain form
970 -58047 13422 -2138 -13129 57634 -84325 -11730 49601 -31867 37613 -13728 -24679 55292
982 55292 3773 -55295 45405 -9323 24289 52885 -83877 30827 23012 -22773 22172 -14149
994 -14149 -14474 63128 -23600 -56187 46913 -36772 48450 13056 -65293 45412 10130 -23864
1006 -23864 9462 -11611 -2734 81327 -53657 -20880 36983 -37102 57650 -21451 -33531 50859
1018 50859 8300 -38391 12664 -29705 13957 68635 -79733 18587 7616 -25092 36895 -39996
1030 -39996 -17623 56657 -1199 -41799 24095 -51566 44760 31597 -71412 44256 -3825
1041 -3825 -4284 12960 -40211 -10878 71388 -24103 -21820 21621 -51666 65059 -17556 -46277
1053 -46277 46164 4193 -3075 2295 -44216 104 70327 -55480 10343 2715 -29997 53587
1065E3587j04750K1998O8921l3942j9888K2661o6724Q3463J6518j09109J04319
1076C7054m8310J5628L1752q7702L4788O8970n2881j654K2172p4688J18499o2083
1088A545n2196R2441m9915L3313o377o8695M0267O6545q8612M5882j1449l6626
1100c3877J07039j12165R016N9507k7464K1337n368o5711O6563K9994r6205Q5749
1112C8415n3758K2798N3951j08926L1414L8590k4974J3291O98p2136J01852l7754
1124C461o1129P9627o4798O3064M561p9817L2835M2415m6918L6526j5433m3162
1136d8768J17930r4430n374M4579m0813O1849j4915o2579M5582K9534p1009O5390
1148B6976n6248J2911Q3826j09681K9394J1637j9528M2990j1837o0460Q0482j1468
$$ plain form
1065 53587 -51163 -29165 39756 5814 -14074 8587 -58137 25326 41844 -67265 37054
1076 37054 -11256 4372 36124 -51578 -16790 52180 -701 -2355 19817 -54871 63628 1545
1088 1545 -50651 41790 -8125 25188 18811 -49884 -9617 56928 -31684 14198 2749 -33877
1100 -33877 73162 -39003 -29987 29520 2056 23393 18025 -47686 18877 48871 -47334 38415
1112 38415 -15343 7455 61406 -47520 -16106 22484 -2490 10801 11499 -60637 41215 3461
1124 3461 -57668 21959 -42839 20225 24786 -55031 -22196 20219 -26699 9827 -5606 -48768
1136 -48768 69162 -25268 -30642 13937 -26876 34973 20058 -42521 3061 32595 -38414 26976
1148 26976 -29272 -16361 67465 -42216 -12822 -1185 -20713 22277 10440 -50020 30462 18994
1160A8994n4036O9616p9804O9271L3125q1760L5277P628k0427M0199k3786m8701
1172c4404J06817o4768j1553L0652o9958Q1931q464n9842L3734R507l8010N0989
1184B6631o0453l217R5481q7410L0139o781l3591O8302j9092m9460N8471n080
1196A3940l0855N4660r1941N1925M8299p2974L8418k2008j6052N0353l2549m8829
1208e7613Q4101m1507L753K4905q8613Q2070N032m5104L3168p808j2380N6608
1220C6612n9206j7351Q9046o2818M4270j6341m9847P5209j7124l9388L6929q410
1232A1581j0968N6462r8209L0966M8206n8078N1990m1513j3336N6431k6733m4427
1244c7628N9212l0068K0884L5187j02591P3882J805k9686L5078l2888J411N4342
$$ plain form
1160 18994 -35042 34574 -45230 24041 57166 -24594 10683 18311 -2116 38083 14297 -34404
1172 -34404 72413 7645 -3908 26744 -43214 38717 30253 -29589 4145 13652 -24358 26631
1184 26631 -33822 -37039 58442 -28968 1171 -5610 -39201 29101 10009 -39451 19020 13940
1196 13940 -16915 37745 -54196 -2271 46028 -26946 11472 -10536 -26588 23765 -8784 -57613
1208 -57613 26488 -15019 -11266 13639 -74974 7096 12128 -32976 192 -7616 -19996 36612
1220 36612 -22594 -39945 49101 -13717 30553 14212 -35635 39574 22450 -16938 19991 11581
1232 11581 613 57075 -41134 -10168 38038 -20040 31950 -9563 -22899 33532 6799 -37628
1244 -37628 21584 -8484 12400 47587 -55004 18878 20683 -9003 26075 -6813 -5402 48940
1256D8940m8243l5173O7320n8236N7732j4814o9416P6362k6079j7810J6332j9550
1268b2635K612O2329q2058O968M4670n5952P5269n1838j5787O0055k3254k3263
1280b2884K5034k4436K2044N3611j00824N6997j219k7258N2949o0324J2535M7280
1292C3505k7064l1141L8569n0418N6752J0328q1864P9072l3174L345J8595m3189
1304b6684J7855N4085m6784q168L3765n8719Q3759m2363l3952O6037l4239Q750
1316A3342M82l5676J9529N4665p5269L2085n88l5984P3398p4014O050M3242k0282
1329I80k429P059m5246M3096K9827p7738O5659l3185P029L7778o8933K0914L7612
1342B2423k0778j872J2695n5643P3940k1702m8647O3167m2599L2245L679n3552
$$ plain form
1256 48940 697 -34476 32844 -25392 32340 17526 -51890 24472 -1607 -19417 -3085 -22635
1268 -22635 -20023 42306 -39752 -32784 11886 -44066 31203 -20635 -36422 23633 379 -22884
1280 -22884 2150 -22286 -242 53369 -47455 9542 8323 -18935 34014 -26310 -13775 33505
1292 33505 6441 -24700 13869 -36549 20203 30531 -51333 27739 -5435 -2090 16505 -26684
1304 -26684 -8829 45256 -1528 -9696 24069 -34650 49109 6746 -27206 38831 4592 13342
1316 13342 13824 -21852 -2323 52342 -22927 9158 8570 -27414 45984 -28030 -21980 21262 980
1329 980 -1449 5610 -39636 3460 33287 -44451 21208 -11977 -4948 32830 -36103 -15189 22423
1342 22423 1645 -227 12468 -43175 30765 9063 -39584 23583 -19016 13229 16908 -36644
1354c6644K0528M1139m1508K1613m443l7975Q3764o4955p231L9519k5479L2137
1366B0465o327m7362L3069L1224n7756M8365l4235M505N8296p7418J5615K0791
1378I232j2219J9877m667m9653O0268n857m7248N1596m9688M3122J8965o2464
1390b8736J9531K0352j9107K2616j2428l8065Q0340m8263j4379K9093l8332N3138
1402B5760n180m6912K4058K0982l4951L7032l7173k692P0578o7892J2474M955
1414A039j7315M0929j1531m3578M4693L065l5713M0749n7983L8144L6204o0618
1426b1915K0740j322r632L0393j8464l7180O8435k9082j2085K3599n4286N9068
1438A8269L792m2557K1996L746j5947L3436l9318j2766O8682n1703J6288m978
$$ plain form
1354 -36644 -16116 25023 -16485 5128 685 -37290 46474 -18481 -25712 13807 -11672 20465
1366 20465 14138 -33224 -155 31069 -26687 21678 -12557 -8052 50244 -27174 -11559 9232
1378 9232 -2987 16890 12223 -37430 22838 16981 -30267 21329 -28359 14763 33728 -28736
1390 -28736 -9205 11147 -7960 14656 2228 -35837 44503 -3760 -18139 10954 -27378 25760
1402 25760 20580 -26332 -2274 18708 -16243 20789 -16384 -19076 51502 -16390 -3916 1039
1414 1039 -16276 24653 13122 -30456 14237 17302 -18411 22338 -35645 2499 38703 -21915
1426 -21915 -1175 -2497 -12129 18264 -200 -37380 31055 1973 -10112 13487 -40799 18269
1438 18269 22061 -20496 1500 5246 -10701 22735 -16583 -29349 39333 -12370 3918 -1060
1450a060l1776N2513j2620l5198L1390K26j6121L5833o1985K5497M3063m7845
1462a8083K7876j6825r419M0259k0134l2369N0588j7649J515K1053o3773N1169
1474A4208R065l3111K2279j2158n601L5545l7215k0419N5330l8218K6078o063
1486I720m2900N2625r733k4592K1709p024l288M0375n9138J0295L7579l8541L8473
1499B5560k6898j5136M1421j6950k8102L0547j9035J0978K8292p0935M0727M218
1511D687k3344K7792k8257M92L6955k6865k3534M0235l4993L8155L73n0195N2774
1524A4275j5265p159J4102j7805M664M1826m5356j723K8490l9035N1736l0947
1536b197j9192M0757j7275r351J0183j9371J1894L9777o1438K9367K396k0364
$$ plain form
1450 -1060 -32836 19677 7057 -28141 3249 3475 -12646 23187 -38798 -13301 29762 -18083
1462 -18083 9793 -7032 -16451 23808 3674 -28695 21893 4244 5759 26812 -36961 14208
1474 14208 23273 -9838 12441 283 -5318 30227 -6988 -27407 27923 -10295 15783 9720
1486 9720 -33180 19445 9712 -14880 6829 -195 -3483 36892 -22246 -11951 25628 -12913 25560
1499 25560 -1338 -16474 24947 7997 -20105 10442 -8593 2385 30677 -40258 469 4687
1511 4687 -18657 9135 -19122 -18630 18325 -8540 -32074 8161 -26832 11323 11696 -38499 14275
1524 14275 -990 -8149 5953 -11852 -7188 34638 -10718 -12441 16049 -22986 28750 -2197
1536 -2197 -21389 19368 2093 -7258 2925 -16446 -4552 35225 -26213 3154 5550 -14814
1548a4814M3244m1767N338L2434j2748j4970J9625l2001L3761J6094n7457M8584
1560B5323k1836J228J7218l7082R221L1909k4718r193J8448m2191N3384k1274
1572D37l0941M4596k5340J2306J299k7709J2138L6952m0673J6846K248k7048N5790
1585C0901m6436j321K9172j4503P260k91l0402K2910K3961m9450L7466k1676Q83
1598a1526L3192m9943J2334K0867r439L288N850l4848M5085m307l4549M2421k8752
1611a0327K4306R003l7443J3402K3223k0076J1926k092k8596N4473l7469j0381
1623a0051K4893k2389K5505m422l1935J6526J9606l3204K8264k1298l075M4613
1635C3033m8439Q958J0783r658J9478l030l2151L3445J806l0049L2949l6065K3904
$$ plain form
1548 -14814 28430 -13337 -7999 24435 11687 -3283 16342 -15659 18102 34196 -23261 25323
1560 25323 3487 4715 21933 -15149 -5928 25981 1263 -7930 10518 -31673 21711 437
1572 437 -30504 14092 -11248 1058 2357 -25352 -13214 23738 -16935 -89 2159 -24889 30901
1585 30901 -15535 -16856 12316 -2187 5073 4782 -25620 -2710 21251 -28199 9267 -12409 -11526
1598 -11526 21666 -28277 -15943 4924 -4515 -1227 4623 -30225 14860 10553 -23996 18425 -10327
1611 -10327 13979 22982 -14461 -1059 22164 2088 14014 11922 -16674 37799 330 -10051
1623 -10051 14842 -7547 17958 13536 -18399 -1873 17733 -15471 12793 -8505 -11580 33033
1635 33033 -15406 -6448 4335 -5323 14155 11125 -21026 12419 14225 -15824 17125 -18940 4964
1648D964J9586m2077J1437O354j0676J6273q034k9077M8730k4544j0860J9607
1660A683l1352L6593J583k9215J3555J0836j6765K4846k1951q049M8740l8879
1672h375R348J291j6247L0937n233k7139K2218L505j9342K7850m0788J8430K8571
1685B5026l5918J4765p223o077K3702q940k6860L9034j3039m724J7520m1968L7303
1698A2601P122k4789J1935k511o790K3452k3233j6277M3693k9481J2392m143k7223
1711b3252L6215o188k0622J3600M5p923K6272m0849Q648L0891k9292K1648j6309
1724g116q238K8566j0000k2160K5370q733K942J8554m7810L0289Q707j8731J5191
1737F831j4719p01K5263j9501j9230L3641k1921J9980j659l4694L7191n836j1760
$$ plain form
1648 4964 24550 -17527 -6090 264 -10412 5861 -2173 -31250 17480 -7064 -17924 1683
1660 1683 -29669 6924 8507 -20708 -7153 3683 -13082 11764 -10187 -18236 30504 -8375
1672 -8375 973 2264 -13983 16954 11721 -15418 6800 10305 -9037 18813 -21975 -3545 25026
1685 25026 -10892 3873 -3350 -9427 14275 5335 -21525 17509 4470 -254 17266 -24702 12601
1698 12601 19723 -5066 6869 4358 -2432 21020 -2213 -18490 25203 -4278 8114 3971 -23252
1711 -23252 12963 6775 -13847 -247 -202 -8125 18147 -22702 -14054 16837 -12455 9193 -7116
1724 -7116 -15354 13212 3212 -18948 6422 -2311 631 19185 -28625 1664 10371 -8360 6831
1737 6831 -7888 -8589 16674 -2827 -22057 11584 -10337 9643 7984 -26710 10481 4645 -7115
1750g115R360o738R44K7859l5307o78K6480k4859K8841j9812j2468K9719r884
1763F342j4384J2568r622O946K3646m6409K2006O200j5267K2411k4182J787K3858
1776A5900j2511j7035K0719k0205K2745N785l9111L4365r928k950Q493j6640M909
1789e464K5842k3780p085J9578k6101L5083j7914j7429K9983j2760j013K476j2420
1802a1004O721K6945l6955J4069M199j7125L2208l0623K296J9976p935o302P254
1815C724j8651J7557J5488l8677L0420j3353Q35J5983k7888Q327J7757r571o178
1828d227J1380k5878L2452p938k3930L0733j8948J1727P30j9267O805K0775k0796
1841f382O595L673k1292L7963k8812k851J8856j1757J0360k016j7366J1175J8024
$$ plain form
1750 -7115 2245 -4493 -3549 24310 -10997 -11675 14805 -10054 18787 -1025 -13493 16226 6342
1763 6342 -8042 4526 -5096 1850 25496 -20913 1093 7293 -7974 14437 -9745 -7958 15900
1776 15900 3389 -13646 7073 -13132 9613 15398 -23713 10652 724 -2226 6267 -10373 -5464
1789 -5464 20378 -3402 -10487 9091 -17010 18073 159 -17270 12713 -47 -1060 1416 -11004
1802 -11004 -4283 22662 -14293 -224 3975 -13150 19058 -11565 -9269 10707 2772 -3530 3724
1815 3724 -14927 2630 18118 -20559 9861 -3492 -2657 13326 -14562 -6235 11522 1951 -4227
1828 -4227 7153 -18725 13727 5789 -18141 12592 -6356 5371 6101 -13166 -6361 14414 -6382
1841 -6382 213 3886 -17406 20557 -8255 -11106 7750 -4007 6353 4337 -13029 -1854 16170
1854A6170k9396K2844j2329k605K7179l3969Q830R491n068M675J356k2152K3810
1867H836J399k4847K6708k2500J5493Q745k6508Q646R571q170O722k51k0425L4675
1881A8094j9070q128J6991j8610K1395k022j9040Q498J0970j6776J5830j2520
1893d388o772L1784l0500N440L875q667J5947l613j9068J6916M158j7885K0860
1906H087k4051J3838J7164k6371R532P87l979J2386m364j8590K9262j1693o848
1919d840J3481k4289K4223K229j8307P625L239q455J5052j3828r195L1070k2945
1932d940O993n13j3479K2249l311j5093J1461K897r871J8538k6012Q892K0295
1945A8106k2202J1329p819l760J5121n490j7324K0533o890l144J2027k9795K2132
$$ plain form
1854 16170 -13226 9618 -2711 -5316 21863 -12106 -3276 6215 1147 5822 7178 -14974 8836
1867 8836 10235 -14612 12096 -10404 5089 13834 -12674 -4028 5543 -2627 4095 3844 -16581 18094
1881 18094 -976 -9104 7887 -10723 10672 8650 -10390 -1892 9078 -7698 8132 -4388
1893 -4388 -11160 20624 -9876 -4436 -561 -9228 6719 3106 -15962 954 5112 -12773 8087
1906 8087 -15964 -2126 15038 -11333 -1801 -1014 -4993 7393 3029 -15561 13701 2008 -4840
1919 -4840 8641 -15648 8575 10804 -7503 122 3361 -5094 9958 -3870 -13065 18005 -4940
1932 -4940 2053 1540 -11939 10310 6999 -8094 3367 6264 -3607 14931 -11081 -2189 18106
1945 18106 -4096 7233 -586 -4346 10775 5285 -12039 8494 1604 -1540 10487 -19308 2824
1958B824M253j4238P774m706k751J4719j1696j2826K7020j7258J0355o28j9919
1971a7077K3863l526r354O553q15m426J8472k4168J154J9843j9164J7046j2566
1984d165o862J7857n331j2078J1824m666J328J5661l1119J7793N391j0710J3146
1997H069j2405J239J4895q289j2206J8594j3650J3182K443k4832K3055o063l628
2010D04M667p483M05J6651j7893m301J5178j7515K1542j2285j0175J8151o250
2023A096l999L984o204L231J8268k7230J0964L511r816J8177j8481J072J3171
2036G744n121r022Q879j2989J2639P741k6928K0840p961L35P153j4213L740J4648
2050G485r402n618J0980j7142K3949q481j3424J9446r386N037k53r405L470J7670
$$ plain form
1958 2824 7077 -7161 613 -4093 -6844 7875 -3821 -16647 10373 -6885 3470 2842 -17077
1971 -17077 6786 3260 -6094 459 -356 -4782 13690 -10478 -9324 10519 -8645 8401 -4165
1984 -4165 -11027 6830 1499 -10579 1245 -3421 -2093 13568 -17551 242 5633 -5077 8069
1997 8069 -4336 -3097 11798 3509 -8697 9897 -3753 9429 11872 -12960 10095 4032 404
2010 404 5071 -2412 -2007 14644 -3249 -7550 7628 -9887 11655 -630 -10805 7346 1096
2023 1096 -2903 1081 -5123 -1892 16376 -10854 110 3621 -6195 11982 -6499 -5427 7744
2036 7744 2623 -6399 2480 -10509 2130 9871 -17057 3783 -4178 -3843 3310 -10903 -7163 7485
2050 7485 -1917 -7535 3445 -13697 10252 1771 -11653 7793 -1593 3444 3191 -6214 -2744 14926
2064A4926j9459N936K093j1971K4206k1256K38J1014m168L61M66j1308R387J2612
2078A3077k4014J7565r035J767J3100k0812O375Q710k565l113M692j5892J9764
2091I619k479j7343J9022j3714J0451Q5j4194M368J0851r289J754K000j4303K5365
2105A2193j7593l329J1463q717J0839l824j0297N826J1813j6623J2274p501k237
2118e713K0037k3219O032L970k338M961j471j2372J3419K767j6232J6591j5316
2131h884J1012P001j8184P267L309k513L830o37j2297K1671j0607n816J1170j3652
2145g330J5864k258j1248N455N437q346Q494p643m856K0942j9005M237J263o416
2159e410J2127l976j0111R046K845j0360J2527j5610P762J1715j7117P688k272
$$ plain form
2064 14926 -4533 1403 3496 -8475 15731 -5525 -5287 5727 1559 1920 2386 -8922 465 13077
2078 13077 -10937 6628 -2407 -640 12460 -8352 -1977 6733 4168 1055 5747 -10145 9619
2091 9619 7140 -10203 8819 -4895 5556 5641 -8553 -4185 6666 -2623 -869 1131 -13172 12193
2105 12193 -5400 -8729 2734 -5983 4856 1032 -9265 -3439 8374 -8249 4025 -3476 -5713
2118 -5713 14324 -8895 -2863 1107 -1231 3730 2259 -10113 3306 6073 -10159 6432 -8884
2131 -8884 2128 9129 -9055 -1788 1521 -992 2838 2201 -10096 11575 968 -4848 6322 -7330
2145 -7330 8534 6276 -4972 483 5920 -2426 6068 -1575 -6431 14511 -4494 -257 1006 -5410
2159 -5410 6717 2741 -7370 1676 4521 -5839 6688 -8922 -1160 10555 -6562 1126 -1146
2172a146j884Q027l688j0654J6338o229m036Q836j7014J5625J117j0882N699l13
2186b04l476Q879q225o429J8953j3769N422l23j0435J5226l184p788O120Q61m720
2201c092J1462j6124M155J2820j3719R181o489k675J0586l981r140J1190m081
2214I3n50Q632j9662J3781K553q274O769n508m11R315p101p834J5134j0631P771
2229D077k66j4240J6003l736m234L467k261r77J1448j4315j35J1822j2138J2659
2243G174q745m524J1816m148n415N364l302J325J0475j9723J0309K554o886R997
2257F271j0626J399Q912m771p065R517q753Q742K731j6878J5230m820q66L689
2271B712o860K145R955r603l061R091j1411J4891p762p438J2608n773l6R59m847
$$ plain form
2172 -1146 -3030 4997 1309 -9345 6993 764 -3272 5564 -11450 4175 5292 -5590 109 -204
2186 -204 -3680 5199 -3026 -9455 9498 -4271 1151 828 -9607 5619 2435 -5353 767 1628 -3092
2201 -3092 8370 -7754 -3599 9221 -4498 4683 -1806 -4481 6105 2124 -7016 4174 93
2214 93 -457 8175 -11487 2294 4847 -3427 3342 -2166 -2577 6738 -363 -8197 6937 -3694 4077
2229 4077 3811 -10429 5574 1838 -2396 1071 -1190 -2167 9281 -5034 -5169 6653 -5485 7174
2243 7174 -1571 -6095 5721 1573 -3842 1522 -1780 -455 10020 -9703 606 3160 -3726 6271
2257 6271 -4355 -2956 5956 1185 -5880 3637 -5116 3626 6357 -10521 4709 -111 -977 2712
2271 2712 -4148 -2003 7952 -1651 -4712 4379 -7032 7859 97 -7341 5267 -506 -542 417 -4430
2286d430K416J1096j6023O137K021p124J3746j3231J155Q354l392k794L633p628
2300f064P806O065j6603J3258n753Q37O469j1477L609P505m756k744N201j0921
2314g568J4551m514r710J2616p811M934M1p585L040R515j0130L402J349q389J6512
2329A0253j3190k24P367m234L159p76p326N094P743j4042J0351o449N5J0267j4461
2344f413M102L636j647M85J377j0103J1732k54j0666J2078j0228Q005K030j0029
2358e895L633N097l979J953N37r275J6303j0156k418P014p601R086k524o965L204
2373a986O457q837P372n558k213J4225j4480L855J539k150N849j564p813P689
2387B385K555q919J0085j1021O854O300j2012M739K1j041L772j883q448J3141
$$ plain form
2286 -4430 -2014 9082 -6941 -804 1217 -5907 7839 -5392 -4237 4117 725 -2069 1564 -6064
2300 -6064 1742 7807 -8796 4462 -1291 -454 6015 -5462 -1853 5652 896 -1848 3353 -7568
2314 -7568 6983 2469 -7241 5375 -2436 2498 2539 -5046 -2006 7509 -2621 781 2130 -6259 10253
2329 10253 -2937 -3161 4206 -28 3131 2355 -4971 123 7866 -6176 4175 -2274 -2219 8048 -6413
2344 -6413 -2311 1325 -322 163 1540 -8563 3169 2915 -7751 4327 -5901 2104 4134 -5895
2358 -5895 -2262 2835 -1144 809 1346 -7929 8374 -1782 -4200 2814 -4787 4299 1775 -5190 -1986
2373 -1986 4471 -4366 3006 -2552 -4765 9460 -5020 -1165 374 -1776 4073 2509 -5304 2385
2387 2385 4940 -3979 6106 -4915 1939 8239 -3773 966 987 -54 3718 1835 -6613 6528
2401F528n590l635O237j0512J1510r68p655L539J915l290N528n569l833J4059
2415H264j1244L142jn123R721l174o235N083J566m888P397j1045M449Q311j0745
2430d522N151l030q46O431l318o687R618l077j509N221j1849J0679J358o766L986
2445H40j327q00O078n788m282J2044q261L872q40p355J0682k567m921L578j98
2460G55j901P211j1016K679Q058q901O839n187j449P628l322n417O635k721N96
2475D87N585j3198R250J001m924M591m925P70N871m739m929R009p018N650n60
2490A921r446J0842l392j827K163k297L14O918q732qP164q041R117o149k678P872
2506C741l411k189K541k343R95P020j2434O744J028m742P512p822J570N160k854
$$ plain form
2401 6528 938 -2697 3540 -6972 4538 3570 -4085 -546 1369 -1921 3607 -1962 -5795 8264
2415 8264 -2980 162 161 -4962 4759 1585 -4650 433 1999 -2889 4508 -6537 -2088 6223 -4522
2430 -4522 629 -2401 -3247 3184 -134 -6821 2797 -280 -1789 3432 -8417 2262 3620 -3146 840
2445 840 -487 -1287 4791 -997 -5279 6765 -1496 2376 1536 -5819 4863 2296 -2625 953 755
2460 755 -1146 6065 -4951 -2272 5786 -3115 3724 -1463 -2912 4716 1394 -4023 2612 -109 487
2475 487 6072 -7126 2124 3125 -1799 2792 -2133 -1363 4508 -231 -5160 3849 -3169 2481 1921
2490 1921 -7525 3317 -75 -1902 261 -2036 -1722 5196 -3536 -3544 3620 -4421 4696 -1453 -4131 3741
2506 3741 330 -1859 682 -1661 -666 6354 -6080 664 1692 -3050 4462 -3360 -1790 3370 516
2521E16l545N297n867N575K566j1252J0518m366L09K941n688K147N531n067j732
2536b117N413q178J0262m814n108Q590n026J872J7l706J679O680r200L931R36
2551A231n399J0290r504J340M653k636J23Q77m770M365M427j0530Q759m782O85
2566h71N327q701L240L307j927j052K524p062R259k183o743Q639o495M869k8n648
2582c545K356M826m977J699N78n948J1322q617k28M667m047M349j603m444K971
2597f41M774q103O600m409k37Q007j0275L637J436j035J621k09n901O926L45o983
2613d447Q033p722N655K040p439L262J629j593J588k04o000J0487n975j715M812
2628B411o192P454j919m441K442K906m411M471l685j944R808r601L072K35k490
$$ plain form
2521 516 -3029 2268 -3599 1976 4542 -6710 3808 -558 -249 2692 -2996 -849 4682 -385 -2117
2536 -2117 3296 -4882 5380 566 -4542 4048 -978 894 911 -2795 -1116 5564 -3636 295 1231
2551 1231 -4168 6122 -3382 -2042 2611 -25 98 975 -3795 570 4997 -5533 3226 -1556 -871
2566 -871 4456 -4245 -1005 2302 375 -677 1847 -5215 4044 1861 -4882 3757 -2738 2131 2103 -3545
2582 -3545 -1189 3637 -1340 359 937 -5011 6311 -2306 -2534 2133 -1914 2435 832 -3612 -641
2597 -641 4133 -3970 2630 -1779 -2016 5991 -4284 -647 789 -246 1375 1166 -4735 2191 2536 -4447
2613 -4447 3586 -4136 1519 3559 -3880 -618 1011 -582 1006 802 -5198 5289 -686 -2401 2411
2628 2411 -3781 3673 1754 -2687 -245 2661 -1750 2721 -964 -2908 6900 -2701 371 606 -1884
2643a884N251k335m340M255J496n307O333p637M135M816q244M202j419o3L058
2658B317j745m859P820l291j803M416q255Q141m30m984K835k50j053L613l873
2673a401k967R020p235K706j15m495P628k731l375L055M28k165N029p378K493
2688a503N891p112M735k941q60N233k812l683N283j991l29L619q761P034P89m598
2704b006L465k685M69M249m177k849P084n054L567o21n789P752k135k362K125
2719A033j280m3M828p274J183N114n828N431m343j550N728k557k871L166k123
2734a386J153L832r155N932O63l051L953m699J092M368l063k799N113m490M496
2749A959q8o987P745k709m41J323k709R79M800n755k85M379n402P043m948k113
$$ plain form
2643 -1884 3367 1032 -3308 947 2443 -2864 3469 -4168 -33 4783 -3461 741 -678 -741 2317
2658 2317 572 -4287 3533 242 -1561 2855 -5400 2741 2311 -2673 162 -88 -1141 2472 -1401
2673 -1401 -4368 4652 -2583 123 8 -4487 3141 410 -2965 90 518 -1647 3382 -3996 -1503
2688 -1503 4388 -2724 2011 -930 -1790 3443 631 -3052 2231 240 -89 3530 -5231 1803 2592 -2006
2704 -2006 1459 -1226 -757 3492 -685 -3534 3550 -1504 2063 1442 -4347 3405 1270 -1092 1033
2719 1033 -247 -290 4538 -2736 -1553 3561 -2267 3164 -1179 -2729 2999 442 -2429 737 -1386
2734 -1386 -233 3599 -5556 376 1039 -2012 1941 -2758 -1666 2702 -361 -3160 1953 -2537 1959
2749 1959 1871 -5116 2629 -80 -521 802 -1907 -928 3872 -1883 -2168 2211 -3191 3852 -1096 -3209
2765c209N950k824m41Q95k031J622M780q585M599N12k853N844o589J604L579j996
2781H57j806K562l901M139J639q068P423l548Q47K028m983K233L339l167j151
2796a557L139n397P603l750l651O473m246K559o22k820J794M190o050K361O83
2811G09l698P700p572J280L284k336J024k10l024K950L048p410O291l522O47M321
2827C482o961L195J580j324j74J290m485O144j395m753O325n319M196o8m283K329
2843b21K292k894J187M37m215Q126o232m6L416l695L972j622k704K239K712n214
2859b462M488l064n64O198p637L245K72j055J920o14l618M452J59m604N735n996
2875c145M148J572n269K981p0p12J469n42m029P116m194o12L187n251N915j666
$$ plain form
2765 -3209 2741 -83 -524 371 -1660 -38 4742 -3843 756 1268 -1585 4259 -2330 -726 2853 857
2781 857 -949 1613 -2288 1851 3490 -4578 2845 -703 144 2172 -2811 -578 2761 -406 -1557
2796 -1557 1582 -3815 3788 38 -3613 2860 -1386 1173 551 -2269 -475 3715 -2335 26 709
2811 709 -2989 4711 -2861 -1581 1703 -633 391 181 -2843 107 3155 -4255 2036 -1486 -839 3482
2827 3482 -3479 -284 1296 -28 -202 1088 -3397 2747 1352 -3401 2924 -2395 1801 1733 -2550 -221
2843 -221 2071 -823 364 801 -3414 4712 -1520 -1566 1850 -1845 2127 505 -2199 40 2752 -2462
2859 -2462 2026 -1038 -1602 4596 -3041 204 476 -579 1341 727 -2891 1561 1720 -2884 2851 -3145
2875 -3145 1003 2575 -2694 287 217 -495 974 432 -3597 3519 -675 -1287 1900 -3351 2564 898
2891H98k775J816J228k417L204k975j573P003o832K918l45k022M196j965k468
2906b109K642O62l023M704o121L186L329n792L564k077K77K339j307l296N037
2921B015k215q70L302o521O179o90k999K271r43j66K570k578k269O423n093K621
2937A037n40l627N947k368j748J651rj129L708n488J583M056n176M178l081l18
2953a324L777k128k192L169j397N0L021o855N361J28k843K873k713P13K738k468
2969i0k296M749l863K921k02m932O003k188r87J143j238J35L487m786M71L687
2985B014m513M810l493j095M331k053j259J699j345N05L519o835M298J43k279
3000a553L728m271J078K725j639k065L361l601L507N27n631N934k631O07J004
$$ plain form
2891 898 -1877 -61 1167 -1250 1954 -1021 -2594 4409 -2423 495 150 -1872 2324 359 -2109
2906 -2109 533 1195 -1828 2876 -3245 -59 3270 -2522 1042 -1035 -758 1581 274 -3022 2015
2921 2015 -200 -1070 2232 -4289 1890 1200 -1799 472 -471 -637 1933 -645 -2914 3509 -1584 1037
2937 1037 497 -3130 2817 449 -1299 352 343 -786 2922 -2566 -983 3073 -2103 2075 -1006 -1324
2953 -1324 2453 325 -1867 1302 -95 -45 2976 -3879 1482 1610 -1233 1640 -1073 -360 2378 -90
2969 -90 -2386 2363 -1500 1421 1219 -3713 2290 102 -885 258 -980 -845 2642 -2144 -1673 2014
2985 2014 -2499 2311 -1182 -2277 2054 1 -1258 441 -904 -399 3120 -3715 583 726 -1553
3000 -1553 2175 -2096 -1018 1707 68 -1997 1364 -2237 1270 1797 -3834 2100 -531 76 1080
3015A080k562J082L062l128o12L254m486N790l542j825M479k730Q96k00j329M85
3031b86L761n795L014R3k596N292n685J442K041j091n06R96k530K417K140o338
3047c631N622l008R15K177m448K078J553j171j242K202m221N472j944l551N105
3062A908l961K977q13k219J200K755l351J226P26l391O582n613Q12K390k136K096
3078A188r49j836J569K755n141M135k549J62M128o015K822M51m93L62L34l242
3094b319M111j82m058M901m464L432L62l698K143R13j069L29L90l314O049m010
3110d84n82K670l419L835j603j861J236J834l135K590k076q66N199n721K214M5
3126a24q90J994j065k135K713Q28l586M210m488K844J919m534K633n48j7J036
$$ plain form
3015 1080 -1482 -400 2662 -466 -1078 2176 -2310 3480 -62 -1887 2592 -138 758 558 -771 -286
3031 -286 3475 -2320 694 787 -1809 3483 -2202 -760 1281 190 -316 680 -1850 567 2707 -3631
3047 -3631 1991 -1017 -102 2075 -2373 -295 1258 87 -1155 1047 -3174 2298 354 -3197 1908
3062 1908 -2053 924 111 -2108 -908 1847 -1504 -278 448 -2943 3639 -1974 -1162 1228 -908 1188
3078 1188 239 -1597 -28 2727 -2414 1721 -828 -666 3462 -2553 269 720 227 589 923 -2319
3094 -2319 1792 1610 -2448 2453 -2011 1421 1783 -1915 228 1141 72 401 791 -2523 3526 -484
3110 -484 -1066 1604 -1815 2020 417 -1444 -208 1626 -1509 1081 -995 -1861 3338 -2383 -169 -124
3126 -124 -1014 980 -85 -2220 493 1321 -2265 1945 -2543 301 2220 -2314 319 -229 -246 790
3142G90m83k858M795k287j204K806m369M482q04k417J687L31j121J909j764j483
3158a990N186m747K038jk003L619j574j581J531O52j978L228m151J488L003m402
3174a682K871j647m0J935j117k289L177j129q16K689m983M307j77k462K108j247
3190e02M4J852j694j820M268l485J904R6l168M326j733j029J088k83o29K548l471
3207a688N45L148m027L362j994p55K923j518j208J837r62j54K749m948L462K04
3223I76k036K531k442N22K034j442j673L107k764K078M35l992M293j595l25R17
3239F24j322K19K407k783k48K692l428L838k363j236L104j545k48O73r77J66K873
3256B446m685K541L55j889L249l361O78J776r53j146J756k044J856J167m450M079
$$ plain form
3142 790 307 -2551 2244 -43 -1247 1559 -2810 1672 868 -1549 138 469 -652 1257 -507 -1990
3158 -1990 3196 -1551 487 486 -1517 2102 528 -1053 478 1130 -848 2380 -1771 -283 2720 -1682
3174 -1682 1189 -458 -498 1437 320 -1969 1208 79 -737 1952 -3031 1276 1099 -1363 745 -502
3190 -502 -458 1394 -300 -2120 2148 -1337 567 663 -2505 1821 88 -941 147 -136 -765 1783 -1688
3207 -1688 -1143 2005 -2022 1340 -654 -1409 1514 -4 -1212 625 -337 -491 2258 -2690 772 976
3223 976 -1060 1471 -971 -449 1585 143 -1530 1577 -1187 891 1326 -2666 1627 32 -293 624
3239 624 -698 -479 1928 -855 -1103 1589 -1839 1999 -364 -1600 1504 -41 -289 384 -593 -427 2446
3256 2446 -2239 302 657 -1232 2017 -1344 -666 1110 157 -989 767 -1277 579 1746 -2704 1375
3272A375j811K90J233k370P97J829j497p34K141l358M185j974k066L509k239J223
3288E33l86j069L94K556l379J335O58k457M415m041P82J488j009J95L63j570J046
3305a46K210m411L545j840K36K336l710J694P31m69o93J367k731L272n62k862
3321b033L793l193K311j72j907R40J419j615M40Q69k943M691l469J0J837j917
3337i39K085r81r85N50J991l169K341j238o18L501m244J919j6l57P42k15j764
3354a397J937O62l000L424l221J918J123l118J936j70k63L46K36k550L881j929
3370a85r19K298l035L045r51j312Q01Q78j361J366r45j350M083l794J384K21j375
3387a151K304j021j267J190Q57k141K599k668J015K169l351K050q71J31R31l39
$$ plain form
3272 1375 -436 -146 1087 -1283 -486 1343 -154 -888 1253 -2105 2080 106 -1960 1549 -690 533
3288 533 147 -922 -528 2028 -1351 -16 642 -1815 2600 -1441 -659 829 -180 15 378 -1192 -146
3305 -146 2064 -2347 1198 -642 -406 1930 -1780 -86 645 176 -517 850 -1881 1391 829 -2033
3321 -2033 1760 -1433 878 706 -1201 -261 1158 -457 -17 852 -2091 2600 -869 -859 978 -939
3337 -939 1146 165 -820 -270 1721 -1448 893 -345 -963 2538 -1706 213 197 -160 582 367 -1397
3354 -1397 540 1202 -1798 1626 -1595 323 1446 -1672 264 94 -169 177 413 -2137 1744 -185
3370 -185 -1104 1194 -1841 1204 253 -1059 -258 620 -741 625 -320 -1670 2413 -1381 3 224 -1151
3387 -1151 1153 132 -1135 55 912 -1229 1370 -1298 -283 1886 -1465 585 -286 -155 776 437
3403D37j976K550p42j103K329l278K937j68j903J355l28l35J262j037j461L492
3419B031k748J042K36k204L128j199r93P38L93j046J958k489L39K558l120K056
3435F80j155l13J865r70j328J677m50o70K036l397K448M00j834J475j214K76J294
3452H20r61j412K652j929J000M57k488L030r20p66P56l78k81J832k049k22K494
3469A635k700K246j275q26K218j064p15Q60n73kJ859l037J648O95j789K051j909
3486f78K88J454q08j115J817j483R47P43k906K804j107k53Q76j116K17J513j522
3503c29n70J934k375K270r73j378K306j237J15L18p45M5J883k556J131P81j896
3520a276K569k132J42J355o53m88R32j212P69J324l133K591j020j19J347j846
$$ plain form
3403 437 -1539 1011 269 -834 1495 -1783 1154 986 -917 438 110 -225 1037 0 -1461 2031
3419 2031 -717 325 561 -1643 1485 286 -707 31 424 -622 1336 -1153 -814 1744 -1376 680
3435 680 -475 -788 1077 107 -1221 456 6 -664 1372 -2025 423 823 -1011 464 -750 -474 820
3452 820 -141 -1553 1099 -830 170 627 -1861 1169 249 -517 239 -139 -420 1412 -637 -859 1635
3469 1635 -1065 1181 -94 -920 1298 234 -481 379 -194 -196 1663 -1374 274 969 -820 1231 -678
3486 -678 -390 1064 256 -859 958 -525 422 1165 -1741 1063 -44 -297 579 -537 -320 1193 -329
3503 -329 -899 1035 -1340 930 -43 -1421 885 -352 -237 81 -664 -619 1264 -1292 -161 620 -1276
3520 -1276 1293 -839 -697 658 5 -483 449 -763 6 1330 -1803 788 -232 -351 996 -850
3536h50N98J022o76n69J394k171K304o11j729K430j670Q81J34r32J37J571j786
3553e23O19O00j992L139k350K1J252q74M25R7j093M52J580k692K075j003m38K194
3571A489k529Q29M58k97r6O63j768J674K56k143K492k182J357N34j582N43P35
3588D33q10K86O22k123K942j564o29J488j582J644n06q09J48J264j576J221n42
3605i3j090K935k594P76K41m94P74M7j300R87R79k150K185k108R71J195k093J051
3623B19j18j95L77K05j805K291p80q44J633k272J892j89j048O67K90o55Q16k86
3641A98j373K662k071M87M39j304J675n57q74N65O67j222J608j692K69J797k195
3658i21J313o25k51R08j50j321J429j85q19J765k483J680K37j147P75l84j47R54
$$ plain form
3536 -850 -252 770 94 -475 919 -1252 1052 441 -1288 1142 -528 353 487 -445 -308 1263 -523
3553 -523 96 696 -1296 1843 -507 -486 766 -108 317 414 -679 -227 1353 -1339 736 -267 -705 1489
3571 1489 -1040 -211 247 -50 -146 517 -1251 423 679 -1464 1028 -1154 203 737 -845 -302 433
3588 433 -377 -91 531 -1592 1350 -214 -843 645 -937 707 201 -608 -460 804 -772 449 -93
3605 -93 -1183 1752 -842 -66 175 -319 455 502 -798 189 1168 -982 1203 -905 66 1261 -832 219
3623 219 101 -94 283 488 -1317 974 194 -650 983 -1289 603 414 -634 33 323 -332 484 198
3641 198 -1175 1487 -584 -97 342 -962 713 156 -718 -153 514 -708 900 -792 -523 1274 -921
3658 -921 392 -233 -484 424 274 -1047 382 197 -622 1143 -1340 340 577 -570 205 -179 -326 628
3676F28m35j348K160j464M09N88j749J966n37o49M72J77o14J410j442j93J733
3693A112j883J398p18n92J242k87q16P72p1m69J427k363J331N29j160J262j106
3710c92J29P72k43j129J565j105N80N38j930J809m95k60K87k11k63J175q87o27
3728f87J684j865J654p24r27J567o31k96K63q3m52J570k024Q91N53j184J551j385
3746e25J04P07j01p59R29r02N70Q50k156J860p50j8O83j000J94P83m12o71J371
3765G57j704J493j87j443J685q78L70J49n42m2J109j290L92P67j533K024j473
3782c46j4Q71m57r9K40n78K50J301k116J417m89k35J142j332L36M19M2n01P02
3801E53j301J232Q9j543J740j202P18No25P8P73o40j97R09j628J939j191k00R09
$$ plain form
3676 628 193 -1155 1005 -459 -50 538 -1211 755 218 -431 41 218 -396 1014 -428 -621 1112
3693 1112 -771 627 -91 -683 559 272 -544 228 157 -312 1115 -1248 83 612 -548 714 -392
3710 -392 -263 509 266 -863 702 -403 177 715 -1215 594 99 -161 126 -85 -348 827 -60 -687
3728 -687 997 -868 786 62 -865 702 71 -225 38 -45 -497 1073 -951 -60 493 -691 860 -525
3746 -525 -421 286 185 -574 355 -547 23 873 -1283 577 -173 -191 492 -508 -314 469 57 -614 757
3765 757 -947 546 359 -1084 601 -277 93 242 -300 -342 767 -523 -131 636 -897 1127 -346
3782 -346 -360 511 54 -45 195 -383 -133 1168 -948 469 -20 -255 887 -445 -109 310 352 -149 553
3801 553 -748 484 573 -970 770 -432 286 291 -334 -256 517 -123 -320 589 -1039 900 -291 -491 418
3820D18p61N30m4n00mJ255j671R72j94o44J612j626N96P5o9M2K63r57O84P48j566
3841h41J662j437O21N26j108N85K51k76j05P25j410J632p53n90J275j383J136
3858E10k35m07k5P28p71M13J16j084J851j499K97K99m80P38k12m96R7P47j290
3877g03J407j063r2J282j468P35k01KJ78K33r00Q12K1r49J431j504Q71L30r49
3896e27N50j01j66K98J90j167J516q64N7N25j100J166j89n02J94L98p20Q89n36
3915h9m83J413j307P46k70m69Q79j44o80M58J24o54J264j430O51M88p82N50l46
3934h1RL28Q3j072J358p44K5P15j289R95l7m63K67j3l64P83m24n69J206j168Q30
3955C75k78o63Q28q7l98K27J7m42J153j261K58P05q48P70n17p7M02J10p64P25
$$ plain form
3820 418 -343 187 143 -357 -361 894 -777 195 1 -643 969 -657 -61 14 -55 -13 250 -707 -23 725 -841
3841 -841 821 -616 5 531 -577 8 259 -17 -122 603 -807 825 72 -518 757 -626 510
3858 510 275 -132 -157 571 -200 213 329 -755 1096 -403 -106 193 -287 451 239 -257 -160 587 -703
3877 -703 704 -359 -451 831 -637 98 -103 -101 77 310 -590 222 243 -706 725 -779 92 422 -527
3896 -527 23 -78 -244 54 244 -923 593 -271 -214 311 -789 377 188 -314 -120 278 -442 447 -89
3915 -89 -572 841 -466 280 10 -459 420 276 -404 54 178 -476 788 -642 9 497 -285 265 -81
3934 -81 -72 256 339 -733 625 -119 -94 621 -668 327 290 -173 94 81 -283 500 76 -493 713 -455 375
3955 375 97 -566 262 175 -223 4 21 -421 732 -529 -271 434 -414 356 -161 -238 164 274 -490 235
3975B35m51l4R39j454R10j74k14L67k17k37N96j70o42J065j089Q14Q7r10R37l88
3995c0l1M7J78n69J132j069P2O72r62J078o44q3L95K1n47M93k51k19J196j511
4015f32Q32j26k57O86p38O9L99P4o61Q74r93O46L29j209J049m45K60j06p3l89
4035d11R12n93j85P66j261J325n77l14M10j11P2J52k90m61J450j401P05j47n48
4054e07J111q91J88L6K28l44N35p90L79O92j287J057o55K36L35m05j70M90j4n22
4074b98Q25j276J144k92m59O22p81P33p1p1n18R11p18K52K78j006J347p44l1K33
4094H0p9N0J71l91k44J073j167J027o55j90R03q18K46j21J34j89P51j220P14L13
4114C88q62R41q32L97K22k64k45M92k73l0M18j241J338m88k82N37o38N80K0l32
$$ plain form
3975 235 -216 -250 689 -765 145 -29 -243 124 -93 -330 266 96 -546 519 -570 244 331 -579 358 -30
3995 -30 -61 -14 164 -405 727 -342 -270 402 -560 518 -126 -209 186 207 -340 153 -98 -317 879 -632
4015 -632 200 74 -183 503 -235 -166 233 307 -354 520 -473 173 502 -707 342 -103 157 51 -22 -411
4035 -411 501 -92 -277 489 -772 553 -24 -338 72 -39 33 185 -105 -566 884 -517 188 41 -507
4054 -507 604 -287 -99 -63 165 -179 356 -434 -55 637 -650 407 -248 -12 323 -82 -252 238 224 -298
4074 -298 527 -749 395 103 -356 266 -515 218 147 76 -442 469 -249 3 281 -725 622 -122 -153 80
4094 80 1 51 222 -169 -413 660 -507 520 -135 -325 578 -240 6 -115 19 -170 581 -639 75 388
4114 388 -474 467 -365 32 254 -10 -255 237 -36 -66 352 -889 449 -39 -321 216 -422 158 178 -154
4134a54l01Q18p23P24m35m64J094q09L34o9k62K20L12o12J50N15p87J098r23J6
4154b58P05o55K06M7q7J0M72j047R52k04m15Q55j035N41J82k56j33L75m50M50
4174B55J38r08R94o32K42R2n43M91R8k94n9L65o07R61o70l21O64n67M89j91k82
4195b85J97L87o87L47Q1m13Q42r22L68K57l71J66N6l21L33K25q14Q83n25K30K73
4216C07o98M02Q2j44j3N9m48R20n36j59N12o14N07j12l69K10M14n50L81l8m70
4237c57Q75q73M20J20k74K38m9k98K06L33p23O86n29J38N35o90L05j9Pj9R7n64
4259d35O54j49m57P03q09O31N4m65K26Q4p8J32k4n66R38o50J16K26n39P20l76
4280f4o3K3J95l22O02n42pO37p96M38k14L1K63j8n00L44J97l79O13j056Q13J18
$$ plain form
4134 -154 -455 363 -360 364 -71 -535 559 -250 84 15 -247 -27 285 -327 -177 338 -449 649 -274 -258
4154 -258 447 -208 -2 45 -42 -32 440 -607 345 141 -274 581 -454 87 269 13 -120 255 -195 255
4174 255 393 -515 479 -153 89 181 -362 129 227 -67 -126 239 -368 593 -77 -398 266 -301 188 -3 -285
4195 -285 -88 299 -388 -41 40 -373 469 -453 -85 172 -199 -33 23 -298 35 260 -554 329 -196 34 307
4216 307 -391 11 93 -51 -64 -5 -453 467 -69 -228 284 -330 177 65 -304 -94 320 -230 151 113 -357
4237 -357 518 -355 65 185 -89 149 100 -198 8 341 -382 304 -225 -87 448 -242 63 44 51 32 129 -435
4259 -435 219 70 -387 316 -493 138 192 -273 -47 37 -41 91 67 -499 439 -211 -95 131 -408 312 -64
4280 -64 -127 -104 91 -231 371 -171 -178 459 -337 101 -113 -82 181 163 -337 7 204 -175 438 -618 195 313
4302C13n43L32j60l1K48N2p50R21m11pK27o62P66k00j61j7K37k00K77k10m23J035
4324F33r37O17l64l10O71l36j21R6K93m90O64q44L68M18p53N73m35K20K55q3m48
4345c13N44j88k75O08r19Q11p8m03L19k98J74J69o6n85Q40o26M03j6o39R10l67
4366En8lN4j38N24o27ON43o26P61o88j9N18j43j88Q4k1j27O26r57N57J02l51N03
4390C37o02J50L39k6l60M29n73L83L00r84R34m57J62Jj77M6L06k26l56Q21q25
4411c78P51l88l19N88k78J08K1j62j03N37p27L70K18o01P42p17J35M28j57j68
4431a00P0k08K49M09q64N82q3k23M44n92K14L70j80l15M30o13O06n1o59Q27n01
4452a88K50N0l79J41M99n98K09R4l99Q75p44m6M21k94K27J31m95J40N21q23O81
$$ plain form
4302 313 -230 102 -58 -89 159 211 -539 382 -29 -36 191 -471 295 95 -66 -83 154 -46 231 21 -402 633
4324 633 -304 313 -51 -361 310 -26 -147 -51 242 -248 416 -428 -60 358 -395 178 -257 -37 218 135 -313
4345 -313 231 43 -232 376 -543 268 190 -213 106 -192 -18 151 85 -500 340 -286 117 101 -538 372 5
4366 5 -53 -56 -2 -140 384 -243 -237 306 -320 441 -247 -266 252 109 -79 5 -16 -143 483 -474 83 185 -166 337
4390 337 -265 -115 224 198 -162 267 -306 77 377 -607 327 -130 32 33 -144 -98 208 -18 -374 447 -378
4411 -378 373 -15 -334 254 -24 84 105 -57 -160 377 -350 20 238 -363 379 -338 -203 225 68 -100
4431 -100 -30 -238 11 420 -444 138 55 -168 276 -316 -102 268 88 -227 203 -410 196 145 -514 313 -188
4452 -188 62 112 -267 -126 373 -225 -16 78 -321 554 -190 -236 185 -109 118 249 -246 -106 415 -408 273
4473B73k63k41P57q10J04M02j33l5R6n80O57Q2o70N14l00L16J04n59J47M40l84
4494h3R3J34n70R92o31k01M00l05L14j4l87Q1N83o92M61l50j00O86p02J50J10
4515c1m3R3L4n53M90K08n82Q69q53K61M96n85R1J60o7P4J57o87Q64l09k69N24
4537C42p10N78N9l25q0L67l73M08j16n68J064q16K07Q5l85M48J10n38J38M47o59
4558c17P97p54RQ06p20K72k10p8L65J31p86O95n6n45Q10j044O81K39m90J21J1
4579f3l6J91N1o20P94n01J9L14o81O63K0l35K2J83k22N37n50j19Q54q77N00r5
4601D9k97M77l9m62L74J9l42Q33r58K70M26n59M49l37j5L97o7o02O26k81J34M32
4623E27j003P88j52k55L31j85j38M15k15n59R07p40N57j12o72O87j93o9J15ml19
$$ plain form
4473 273 10 -231 526 -284 -180 222 89 54 150 -430 227 309 -361 153 -147 169 273 -286 -139 301 -83
4494 -83 10 144 -426 566 -65 -266 134 -171 143 129 -258 -177 406 -286 175 -175 -275 411 -291 -141 -31
4515 -31 -74 19 53 -500 -10 198 -384 485 -368 -107 389 -196 -105 55 -12 62 219 -468 396 87 -182 342
4537 342 -368 210 269 -56 -136 231 -142 266 150 -418 646 -170 37 122 -263 185 295 -243 -105 342 -317
4558 -317 480 -274 -265 541 -179 93 -117 -195 170 301 -485 210 154 -391 419 -625 56 295 -195 -74 -63
4579 -63 -99 92 143 -477 317 -184 -165 149 -532 131 151 -184 -162 21 -201 336 -214 -333 521 -356 144 49
4601 49 -248 229 190 -272 102 121 -221 612 -346 -76 350 -209 240 -97 -112 285 218 -384 242 -39 95 527
4623 527 -476 312 160 -95 236 51 -87 328 113 -446 461 -279 278 166 -506 181 -12 -81 34 30 -289
4644b89O63p52K3O08p40O58l85j86N66p0l96L67k02J7O49j045M98J16k36M33n79
4665b82j8N09j70m34P16o67N32K06r23P10j49r8K02k18j78O84n06j06M74n80O69
4686C73l52l62O92l17%N9l24J33N85q36L03K19m08O93o37m6M58j39j79L57p08
4707d36N36L10r09P15l73P9L98n24l4N55l89q0L79o56Q02l09n90P88m02J36J50
4728A46n08J57O79q07L63k1n09J074p05j07L65k31J95J28n80K25O01q48O90m14
4748a07J8O27p54k8M35j52J5J38p55Q21N5n44N92n40L00K88o72M9N22n19M57r6
4770A50p00J005m19j79K40k68K52K22o00J93M97p98Q31o44j09Q43p60J08K31k50
4790a55J61L79q81O59J74o71O49q26N30L17n37J20J52j75K53J17r37J124n12q1
$$ plain form
4644 -289 374 -378 -355 253 -487 171 -214 -400 166 96 -300 67 -135 -118 531 -514 -16 100 -136 297 -282
4665 -282 -300 209 39 -395 321 -346 186 392 -531 179 30 -68 134 -84 -262 422 -84 -190 284 -296 373
4686 373 21 -341 351 34 34 93 -231 -98 487 -349 -46 173 -235 458 -179 -225 233 94 -85 272 -436
4707 -436 100 410 -499 216 -157 -78 320 -204 -238 317 -72 -152 227 -429 373 64 -526 262 -140 -4 146
4728 146 -362 -205 474 -333 30 9 -500 574 -131 -238 127 -104 91 219 -361 -136 465 -383 307 -107
4748 -107 -89 538 -216 -244 191 39 54 192 -563 258 313 -231 361 -179 121 409 -263 -214 308 -211 246 150
4770 150 -550 455 36 -143 97 -171 81 303 -297 -104 393 -405 426 -218 -327 516 -244 -136 95 -155
4790 -155 6 385 -496 163 337 -334 315 -511 19 336 -201 -81 71 -104 149 266 -671 453 -59 -140
4810a40L22n59N97j1l77rL87m99N64l33m62J105q36L41n6k87L33K16p08L58L12
4831B58n96R05j079L51N99o42L08j63r7K71J60p98P85j73l34O69j032Q28j6l51
4851a47j1J43j57N35k66o70J045p12L76P6o76O85j21k36J15J57l15Q37q33m0Q05
4872E90r59O08m02k29O77Lp04N53j58k30P39j126O29J94l88L35l26k30P96j42
4892B30p16P88p01M99K74q91P73k88p9K12k73k40R36n86l52P89p93Q19l46n31
4912d76P38m1l26K17q9l28J031j117M43K22n15O54n19j26N00j10l85M59m73L87
4932A46M80j125P14j15j35L50n11j24Q18m26k83N19p98Q43k01p04P71k58O9P3
4952A03l98l2R22q90K04K00o89J150p33l14O29j83k4J09n29K65P34j078N76k36
$$ plain form
4810 -140 182 -377 220 209 -168 -177 210 -289 275 -58 -520 585 -251 90 34 -253 80 296 -412 -54 258
4831 258 -338 567 -512 -161 438 -204 104 -59 -156 115 275 -523 262 89 -245 424 -608 220 204 -147
4851 -147 -158 -15 -172 363 97 -573 472 -240 136 212 -464 221 100 -136 -21 136 -179 658 -175 -215 590
4872 590 -369 239 -163 -392 285 288 -416 137 -21 -251 488 -638 -9 185 -203 132 -194 -424 372 230
4892 230 -486 302 -399 100 374 -517 256 -32 -111 101 -172 -412 524 -62 -414 375 -418 401 55 -476
4912 -476 262 221 -105 112 23 -305 726 -391 52 274 -241 413 -106 -232 268 158 -227 232 -241 146
4932 146 626 -499 215 100 -35 315 -196 -320 498 72 -211 308 -490 353 152 -552 219 -39 30 103
4952 103 -295 -327 595 -295 -91 109 -580 570 -163 -477 152 -31 -55 54 -475 -210 524 -554 22 -214
4972b14m1O55o44j34O11j30k03L40p26O68J17q09Q76n00J90L26o16J3P34n51O9
4993C1K09p52J153n73l05M55k71J69K02n84K37O77q55N38m69j72R20q20n2M81
5013B19k41J84J26q46P44K19q66P88n84K51M32p81K1N41l60K16J37r61J197m90
5033e4l58N57n54M09K59o17mO18o61O50k98n28J207q07L4J55k51K99J39o51L74
5054h2M06o87Q54r02K64P04p63K24L2n7K29J49r44R62k99j91O26j000P22J59l89
5075A7r7L39m39O14k59q10J293q64J20K84n46M81J19m97R9L52n50Q58p49k06R52
5096E11q08M90l33p1K99J65q44N41J95l89Q23j264O78K74n10K18k8j15M06L7r24
5117f49J028n50J10L33q89Q08K9l75R1Q0l01P01l47m82R91q67N94k61m46O59P6
$$ plain form
4972 -214 -255 400 -244 -378 233 103 -100 240 -486 182 299 -510 366 -134 56 382 -234 -221 513 -38 31
4993 31 240 -512 641 68 -237 218 -53 116 318 -266 -29 648 -207 331 -138 -310 610 -210 -262 219
5013 219 -22 162 288 -558 186 405 -461 327 -257 -6 426 -355 -334 207 -153 63 200 -761 436 -54
5033 -54 -412 145 -409 0 259 -358 -362 256 -405 245 -53 -581 626 -181 -147 8 -243 56 195 -456 -82
5054 -82 324 -363 491 -411 -147 557 -206 18 50 -7 222 371 -573 389 90 -101 525 -475 247 406 17
5075 17 -80 259 -180 434 175 -635 658 -206 -86 198 -348 133 252 -245 -146 206 -344 514 -235 -441 511
5096 511 -297 193 -140 -211 88 253 -591 -50 145 -244 579 -685 -7 267 -243 -25 -53 -168 238 275 -649
5117 -649 379 -171 -61 272 -617 191 220 -155 -64 16 -285 416 69 -413 578 -289 305 44 -402 257 333
5138C33n14K87kk79Q71j223M37M92n79N08m09k54N56j4n66O62m52P2N98j230P60
5159E4J24l35L08k38j86O35k60o14Q49p44O29M3q17P10j24k34K14k54n2P90q13
5180c15Q0N04o27P34m15l32O01l7l58L80l43j8P52j110N92K4l60N90n71j19O30
5201B82r7m52N27p36O93J93r16P51l53J24J91m14j80Q50n32j23M31p93R93m51
5221a2m13O19j57j36L59m64k6R42j061M36j78k16Q31o11k07N09j27j82M37q47
5241e04P01J59p65O12l72M7M66n38l7N15l30lL84q74R91k62n44N63m14L18J61
5262B74o00M6P39p86N89j81n99J141p66q7K99j65R4L29q78M41M63q06P94o39J18
5283a80N84n76kL44l08K35J65r28J054k09m17O13q09N43K38n67o0O17n71N10o5
$$ plain form
5138 333 -181 106 104 -175 696 -527 -90 402 -177 331 -78 -332 224 210 -356 306 -146 -74 524 -706 54
5159 54 178 -157 151 -87 -273 362 102 -512 337 -407 222 265 -552 158 34 -200 14 -240 -292 498 -315
5180 -315 -235 269 -358 376 -39 -371 230 193 -165 215 -128 -146 606 -504 88 112 -248 342 -229 -348 282
5201 282 185 -267 260 -476 217 410 -506 245 -108 16 207 -207 -387 463 -69 -192 239 -554 439 -12
5221 -12 -425 194 37 -99 260 -204 -230 712 -349 87 -91 -307 524 -87 -294 215 88 -94 343 -504
5241 -504 197 356 -409 203 -169 -122 344 -194 -231 284 -46 -49 335 -539 452 190 -354 209 -205 113 274
5262 274 -326 -280 459 -327 262 81 -518 623 -143 -230 69 -96 -2 327 -551 -110 353 -453 341 -298 -180
5283 -180 404 -172 -174 170 -138 97 262 -666 388 179 -238 375 -434 109 347 -220 -280 337 -234 276 211
5304B11q14J218o95J13J38l67L69L04p71J93N86q46Q20o18j95R13o85K64k0l39
5324b21M16K67r76O63K5m50P85j063M53N24n37j7Q3j77M52Qr25J157n53o3L61
5345B12p04O05J01m10M6K87m50P44o03l87J010o96L93p3l72M65J03o26J40L78
5365A63n22R06r96L81N01o20M23l03q9M35J64q96P66l09J7O30j230Q07Ml11J76
5386I7k1k80N96j80p11J002q03M87J7o31O92j11l28L05k16l14J108r84mO97p59
5407c41O75l83m09O19Q9o20M45l63QR00j263P00J9l24L65l19j82P03j53n24O58
5428C00p38O03J63r43P70j01k15L42l67k18Q38n08j62N64p15O59j86m06M96r9
5448G7j11K73n04J43P41j010N81n8l24O74o74n3N00n9l54M87p23O50K09r65O36
$$ plain form
5304 211 -603 615 -80 33 171 -196 173 477 -294 -101 485 -361 459 -159 -354 559 -126 138 118 -221
5324 -221 195 462 -514 149 174 -276 509 -554 -101 423 -114 -131 -48 -225 227 235 -690 467 -86 -149 212
5345 212 -492 113 214 -196 -150 137 -313 431 -172 -559 451 -245 148 75 -297 168 271 -355 -215 163
5365 163 -359 547 -449 -68 433 -187 236 -67 -156 279 443 -453 313 4 21 651 -579 228 232 -79 97
5386 97 76 -204 392 212 -499 503 -300 187 204 -427 265 154 -174 131 -85 -399 709 -275 -279 418 -341
5407 -341 334 -49 -458 161 250 -370 75 -288 -280 620 -643 57 76 -248 117 -202 -384 319 166 -358 300
5428 300 -438 165 328 -615 155 54 -161 181 -186 -404 434 -74 -236 328 -387 272 86 -320 176 77
5448 77 -34 239 -265 -122 619 -391 190 132 -192 482 -192 -245 255 196 -158 329 -394 256 465 -500 136
5469A36j85m6M26n31j46P94m60j61L38p14Q91j36n49N11k02m7K74m31p4P91q49
5490c70M75o5l89Q70o38k08M60j49m5K82o00K59N28p40N56l28K5N68o26j30N76
5511C11l97J03K23q08Q02o5n36N69m24K92L43o40J15M73o03M78n4n98R11n93j30
5532b28M09l82K95K17n76J47O60r53P64n34j64R45p45PK40k06J45L73q91P28j17
5553A34m84O69o50L41L14n28j7M42l81L72L9q02J022n54Q7J91n37M80J67m56M4
5574a07M57o83O64m25l19R27p33J73O2j97K10J65o36M68K24n35Q52j042K68O62
5594D55o77K21J25k98K75J63r12R44m08JM78r87P17J93m52J62J51m51P59m05o05
5615e51J193q46M42j39n01N25J78m89J49J12l49R40r78j0P24o74M60k66k22O04
$$ plain form
5469 136 -49 -95 331 -200 -346 448 -12 -173 165 -549 342 206 -343 168 -34 -81 193 -238 -312 479 -370
5490 -370 105 40 -349 521 -117 -325 135 -14 -59 223 -377 -118 410 -330 226 -102 -77 491 -135 -265 311
5511 311 -86 17 240 -568 234 169 -367 202 -222 70 413 -227 -112 361 -242 236 182 -416 495 -98 -228
5532 -228 181 -201 94 311 -265 -118 542 -411 353 -181 -345 600 -145 -138 102 -104 41 414 -477 251 134
5553 134 -350 319 -331 10 324 -204 -221 221 -160 212 251 -551 471 -83 4 195 -342 138 305 -151 -107
5574 -107 350 -333 331 -94 -413 514 -219 -46 16 -181 29 194 -442 26 250 -285 567 -475 -207 455
5594 455 -222 -1 124 -174 101 264 -648 296 -112 -111 367 -620 97 290 -162 0 151 -300 459 54 -551
5615 -551 642 -204 238 99 -402 123 301 -188 -39 73 -276 664 -314 -324 400 -274 186 -80 -302 302
5635C02L2p19M97l11K1P24j176P10J74l75L59k55k92O54o6p06Q02p59M08L78r97
5656e95P93j33k06J38j16k78Q83p46rM64o60Q38l91l80O68n7l96L35l59mQ87j096
5678d20L14L33m63N18k86k96O29j68n66O48n18M17L09r12O31j30k06M51l30l80
5698d25R61n32j51N91q81Q46k53n42N34j3j86L52m96p9Q52r55L46J95m62P45o11
5719a64k44O33j77k01L15o02M42M51r83O20j65n4M36m90k46O99k74j99M34p12
5739d81P37o0o31P03l62N9L88o29j00Q47q29M95l6n81R71n52k56M09l7qK44o34
5761c43L09N49p81O18m86K2O70o92p8M09k69J01K81q86P23J67o77O69m88K44L47
5782D09n07j84O38o50M65Q0r16J193n30k55L64m46K76K95n42O2N47p17O00l50
$$ plain form
5635 302 334 -385 112 -199 -178 546 -630 80 254 -121 238 -17 -309 345 279 -427 375 -384 24 402 -595
5656 -595 198 65 -141 -3 -119 -397 486 -260 -269 195 -465 373 -18 -398 270 213 -183 152 -207 -211 676 -420
5678 -420 -106 227 -236 282 -4 -300 329 161 -405 243 -275 142 451 -461 170 40 -166 285 -45 -425
5698 -425 536 4 -147 444 -437 409 156 -386 148 135 -51 301 -195 -274 578 -377 -31 164 -298 447 -164
5719 -164 -408 225 48 -153 162 -440 2 453 -530 90 -75 -129 307 -183 -429 270 -4 -203 231 -481
5739 -481 256 196 -435 268 -94 -35 353 -276 -376 471 -358 137 101 -480 491 -61 -317 92 55 47 291 -343
5761 -343 -34 515 -266 352 -134 -112 558 -134 -212 197 -72 29 310 -576 147 314 -363 306 -182 62 409
5782 409 -98 -282 356 -294 171 251 -665 528 -2 -257 107 -339 -63 232 -310 -248 299 -418 182 -168
5802a68j26P98p17P6J50j13Q2L67r26O11L11q04Q96q55M11M68o60P9K79m04M22
5823A77J17r64J050k80j52L63p52N49K46m99J17K67o57P80m61l91J084p88K09
5842A5J44l42L48J89o91L68K36n84R30j027K06O11o64L76j26j32L91l3q49J003
5862C69l34k52P53j169P24M0l29J96Q1m37N87j21p00J036q48N55O2n83N76q9k12
5883i5M7J27m25R11q52O9N96p70P57m45j49M41O5o27N91k93k02R09j160O19J37
5904B51n73M20j59j42M65r7o09P06o15N80J84j015Q18j33j40J25j70k21Q58m71
5924F2l30P18r71Q39j87n32N91j62j21K13j86k38Q97j062M82J79n56P40n57k7
5944b08M44j38m20N39n38L62M49r92P74k80k7L50m22l27Q38l96k04N67r56R57
$$ plain form
5802 -168 -294 504 -213 -137 13 -100 -18 349 -577 34 345 -459 437 -418 -7 461 -199 -120 159 -245 177
5823 177 294 -670 380 100 -52 311 -441 108 354 -145 -28 239 -418 362 -99 -490 594 -194 15
5842 15 159 -183 165 354 -337 31 267 -317 613 -414 -208 403 -261 115 -11 -143 248 215 -634 369
5862 369 35 -217 536 -633 91 131 -198 -2 79 -358 229 108 -592 444 -404 151 213 -370 206 117 -95
5883 -95 -48 79 -346 565 -287 -218 378 -392 365 -80 -229 212 277 -350 241 -52 -254 655 -505 114 251
5904 251 -322 98 -61 -203 262 165 -444 262 -353 227 411 -604 214 81 -59 66 -104 -325 533 62
5924 62 -268 450 -521 318 131 -401 190 28 -93 120 -66 -304 593 -469 13 192 -364 376 -181 -208
5944 -208 236 98 -322 217 -321 41 490 -502 272 -8 -35 315 -107 -434 404 8 -196 371 -585 372
5964C72j38p43O78k05m9K40m22p9R06r80M49Q9n23R30o58k03M58k8j06K62n89
5985c39K51O42r94O28k02p9N49n74k18N40k06j0L47r77Q82J6o94O54n33K89L48
6006C20m66j29P30o14L13j4o50J068n00k89L53k89J85L73p26K29N44p74O69m83
6026a50q4Q04q16K1L49j95L4N02r86P39J66p85Q29p82M54K31n31l3N12m45K10
6047D4K48r23J090m19k17M08o48M45J07l09o0O72q72O67m17k50R61q30L70q5j42
6068a60J95K75q69N08M52p39Q55j011M35M38n49K09P9l26L17K68r99R79k56k38
6088a37N88r48P65M7l69K4J62l63O56k23q85J174q25N24Kn94M23J84m46J84L28
6109B71o80R69q85M0O67o65L42l8k80L27K21p77O02j28k05P75j136N78K21l82
$$ plain form
5964 372 234 -509 169 -36 -85 155 -267 -346 560 -420 29 118 -405 525 -133 -336 122 94 -12 250 -339
5985 -339 -88 554 -440 188 -14 -93 456 -118 -336 204 -2 -12 335 -642 240 256 -438 216 -317 -28 320
6006 320 -146 -275 455 -159 154 140 -510 558 58 -231 122 -167 18 391 -335 -106 438 -336 333 -150
6026 -150 -234 570 -246 -225 124 -71 -37 465 -521 218 384 -401 428 -354 100 331 -200 -233 279 -166 44
6047 44 292 -631 459 40 -177 231 -417 28 135 -174 -234 438 -434 233 -184 -434 527 -303 67 -18 -160
6068 -160 35 310 -559 -51 401 -338 517 -494 -59 379 -170 39 118 -208 109 377 -622 357 101 -137
6088 -137 451 -497 268 315 -54 -30 132 -231 425 202 -683 491 -334 190 192 -402 21 205 -241 -57 271
6109 271 -409 560 -325 -285 382 -283 59 21 -259 68 289 -488 114 -14 -219 556 -580 -2 219 -163
6129a63L04r3k60L71m5p31J061p28M08J19p71O50K9k71J10J26m47R85p66k44Q23
6150D67q07P06k70k40L31J17m62K20q1k50R48j104M82L07o89N99l89j37L59J78
6170B85p12P74o19J82N09r61O68j19j04J83j70j63P55n20k99O83q70P90j40n70
6190d18N86j35j25J35j77j49Q73r47K43L19n94Q39n43k96O54j34k58L62n91L01
6210e5O08j119Q14k24j76M69l99k7L77j59l06N75r12Q50Np67O99m30J49L07m18
6231a39j67P97o74L12R9p53J087o69r4M62l34J6K95n63K75M97q89P11m05k94P27
6252B97m72k6K97j91LM38r35P74J1o20P95p34L80L25m52k34P27n93J33L43q14
6273e48J047n71j45L96l18J38L24n46L9O94r72P47m29k67R37o33R6J14j65P1M31
$$ plain form
6129 -163 141 48 -212 159 114 -617 444 -284 124 243 -528 122 151 -120 -10 116 -331 654 -112 -356 467
6150 467 -340 366 96 -144 187 304 -158 62 -19 -269 679 -425 57 364 -325 274 -115 -252 107 285
6170 285 -427 347 -272 -90 419 -542 126 7 -97 86 -84 -247 508 -12 -311 372 -498 292 152 -418
6190 -418 168 33 -92 43 -134 -283 590 -357 -114 205 -389 450 -93 -389 265 131 -127 235 -356 -55
6210 -55 553 -566 248 24 -152 317 -82 -109 268 109 -197 378 -534 316 321 -446 253 -177 -28 279 -139
6231 -139 -306 491 -183 129 228 -525 562 -107 -201 261 -73 -57 238 -325 -50 447 -442 269 -136 -430 297
6252 297 -175 -201 96 -95 -92 346 -589 185 196 -424 371 -363 17 342 -110 -344 383 -210 -77 266 -548
6273 -548 499 -72 -217 179 -139 -1 323 -223 -184 510 -462 285 -144 -411 526 -107 -11 103 -62 9 440
6294D40r73N94L55p18Q07q67L32N77n37j99L78l18L05J86r49J020m13j81M32o96
6314d25M68K43l92j55N45o27O13l35n63J260p61K48j4k92K75K50o33K13M38p78
6334d22Q80q89K60O29p07L34j14qJ57K26r30Q89k48k05O35r24N77N0k75l1K25
6355A09l24M21m2q44J190p13L19M6n87N94j2k33o7L94o12R03o89k62Q21p34N69
6376B47j92l21M22P9n44M31J6m34Q71j134N94K10l20K60l00l7L77J29q75Q76m73
6397a18J29L95q71O48r3j37J08N0l32P15m84k86O82r19P27k83k78N36r1k14J99
6418H3k2l67R38j015L56L45o91Q52n74l8L29N4n90N56n19J89N60j056O89j83j03
6439b07L16m63j19P31k49l28P06q36O37j05m94P40l58k5K13k45j92P94o77J46
$$ plain form
6294 440 -533 61 416 -302 505 -362 -30 547 10 -189 189 -129 176 362 -587 433 20 -161 271 -425
6314 -425 43 286 -106 -261 284 -343 270 -65 -628 632 -129 119 105 -187 88 338 -295 -82 356 -422
6334 -422 458 -431 -171 458 -249 85 -29 -37 120 346 -584 305 57 -148 487 -437 140 190 -85 -116 109
6355 109 -215 206 164 -680 510 -203 116 162 -425 169 157 -76 -143 251 -361 542 -147 -409 412 -322 247
6376 247 55 -266 156 235 -309 122 138 -296 575 -559 35 245 -75 185 -115 -152 225 354 -521 355 -118
6397 -118 11 406 -465 183 90 -47 61 111 -221 494 10 -276 406 -513 214 -69 -347 189 98 -116 83
6418 83 61 -306 632 -383 -27 318 -373 479 -95 -133 196 250 -340 216 -303 -114 446 -610 79 -104 -207
6439 -207 109 -354 -473 258 9 -319 387 -449 188 83 -411 329 -29 -54 159 -86 -278 516 -161 -15
6459a5L15o38Q66n00k66L88j03j72N01n46L7P62j045N63p0k63O19n90m3L57j6
6480A41k74N04p97N25K13o65O04l91J53K55m19k21O66n54K66K46q03R91m68l17
6500c45N13l07L3L49m37KO26q78O12k35k45Q09o12n5K09j3j63M68p92M74M00r59
6522e46Q18n11J83L09l37k48O03m32P7M44r06J000l77j26M82n65K53K57m38j38
6542a98O59p88O02k40m80J019p10J45L5j86R5M05o86K04M52q96R55p39J08N45
6562C01m97J17J60j12l4L38q57Q00j86l46P45r54N13K22l66p7L90m80M44j04n97
6583e80J122q03K65P7m42M18J79l29J4L69o90R22p04j14Q53p88M07k09p6J70L61
6604D22p58N98j63l90Q79r39K67L17l43K04N5l96L91J92q20R46n87K20L32q76
$$ plain form
6459 -15 300 -338 528 28 -238 150 47 -125 376 -170 -133 629 -416 147 77 -186 433 -157 -200 157 141
6480 141 -133 371 -426 99 312 -353 251 -140 13 268 -151 -372 294 -260 6 252 -551 440 -28 -345
6500 -345 168 -139 -106 243 -194 -192 434 -444 168 -67 -312 497 -115 -170 39 26 -137 331 -461 13 413 -546
6522 -546 272 -239 -56 253 -84 -332 271 -161 -84 360 -546 454 77 -49 433 -132 121 378 -60 -198
6542 -198 461 -327 275 35 -445 574 -136 9 44 -142 -47 358 -328 -124 328 -568 387 -352 -244 301
6562 301 -196 -79 81 -31 -65 273 -584 216 30 -316 429 -525 -12 210 -156 -233 157 -323 121 17 -580
6583 -580 542 -261 4 81 -361 57 236 -93 -79 290 -400 522 -182 -296 557 -231 176 -33 -109 61 422
6604 422 -336 262 99 -291 588 -351 -84 233 -110 94 149 -247 144 336 -484 462 -125 95 427 -449
6624d49O35o8j77J70J03n38O77m61k63Q24q25O13k21l79L93J37l78J57M6l22Q87
6645E61r91L28K32l67M34l95o9M17J31o32N99m75K36N57j056P14q0k33J76l6l30
6666b79N21j00m97Q36r28P68j57o13P19j43k11J78j25l05R45p51P0L39o53P76
6686C90m29k34M45L3l65M80o13N6P86j052P10j56k62M81l34p4L21k3m82O24p83
6707d81O81J7p46Q27l42N9J91k91k66O74n58N4M55o74P99n65j64M85j38j62M21
6728B76n48k4Q32r79N37K3l23N90n33j94M51L7l89P08q13L40K59o79P14n06J31
6749i0L34l06k51M78k47OM93r86R35l04l33M79l67J36L45n35r3O53p50N08j29
6770b4l43P99m80j33K80j30n5M25n99K43L85o50O67o89K94L91k97j57K30k38M9
$$ plain form
6624 -449 186 118 -59 111 214 -324 353 -108 -371 453 -372 241 20 -359 34 171 -207 -50 -4 -326 561
6645 561 -430 -102 130 -237 197 -198 -267 150 281 -351 248 -227 9 566 -490 224 144 -89 87 51 -279
6666 -279 242 142 -355 481 -447 321 164 -449 270 127 -84 94 -31 -336 609 -142 -72 267 -386 390
6686 390 -39 -273 172 205 -160 320 -293 -237 549 -503 207 51 -211 270 -64 -138 183 160 -322 302 -481
6707 -481 200 217 -529 298 -44 15 206 -85 -351 323 -235 -181 274 -400 399 -166 -330 155 17 -145 276
6728 276 -272 -296 536 -443 94 117 -206 384 -149 -343 108 145 -244 464 -349 -9 250 -429 285 -221 -90
6749 -90 244 -62 -313 165 -82 -76 417 -569 366 62 -271 208 -159 -23 322 -213 -306 347 -403 105 -24
6770 -24 -367 432 -48 -181 99 -31 -86 339 -260 -17 368 -282 385 -304 -10 381 84 -73 157 -81 -32
6791c2L39q41Q36k50l18M59n73L73K05l14j86O02o53M71K5p46J142o28l7K20m04
6812c10K18K68l88pN89q22Q75o35q6P34o11J40J10k43K8M48r34P75k4l92O90r38
6834e15N24K30l49N8K60k83L31m3q71J213o80J92J94p11N94P8l34M5M30p65R26
6855E24n98l02R12p96N02j62l12L10K27o36L35J80m91R58j109M07L63m67L01m3
6875A03k95K57K21q87R10m72O2M40q79O45m7l48J61J77m60P26j76o21Q73q94O90
6896A86l4n27M47J78n36K02J83n23J035q45M7N83p94O90k58k46K97J25o65P64
6916C09l36j91Q16r85M68K2j55K90j99k88M80k1o02R05q99O56P2p38O46k42l1
6937b3J72k15k83P42m90n1M25o47P02l25k97L87K8k86L53l57j36R53j028N63k19
$$ plain form
6791 -32 307 -534 302 52 -266 193 -380 -7 198 -116 -302 300 -353 118 143 -603 539 -89 -126 94 -310
6812 -310 -92 176 -212 -219 370 -452 423 -212 -298 436 -175 -35 75 -168 -140 308 -626 149 125 -267 423 -515
6834 -515 9 239 -110 -52 208 -75 256 213 -658 555 -125 67 261 -450 144 222 -112 -67 363 -402 524
6855 524 -74 -376 536 -260 242 80 -232 78 305 -331 4 184 -307 651 -458 -51 312 -155 146 103
6875 103 -192 65 286 -601 309 -163 -101 339 -540 105 58 -290 -129 48 -412 314 138 -483 390 -504 186
6896 186 152 -375 72 250 -286 -84 99 -424 611 -234 -187 396 -398 292 34 -212 85 210 -455 309
6916 309 -27 -218 598 -387 81 103 -52 238 39 -249 231 210 -392 513 -386 270 342 -396 250 8 -23
6937 -23 149 -66 -349 393 -97 -148 277 -370 332 7 -290 97 125 -161 192 -165 -301 652 -376 187 -32
6958c2k59N97m80r8L88mm49P19p85L40M09q51P62m12N3L13k02m36Q06m78k3M47
6980C25r58J015k51m82N02j51P6K67m80j83Q65r58N23Km98Q95o45j24K11K3j34
7001a60N36p64L63M32q64P08m86J62L67l26j62L52j38j28M62q79Q30j85m40M35
7021A15l63J76K50k60k53O64o95L77N2n80R79n84M2J53j31j07O19q28J76O26r44
7042e16R61n65j58P64o16P5J06r0n3O01j090Q48p2m68O48o75K47K84j84l04O53
7063C96o62L15K50q86J068n96J01K12l93J97K64l84j1N29r33J078o92l38J004
7082E19p25L95k98k0J4M95r22O16J52p21R76q73L31K60m02J08J69j76J54M67j221
7103g02J081m58q6N91r25N51J5n1k02M82p08P64k70o12J009q24M92j00l25K90
$$ plain form
6958 -32 -291 306 -174 -272 116 112 -337 382 -403 -63 346 -505 257 -155 -102 211 9 -427 379 -99 -122 325
6980 325 -633 382 131 -351 151 0 76 343 -137 -320 545 -413 110 112 -386 509 -136 -260 -49 -26 -160
7001 -160 376 -388 -25 407 -457 251 -235 -73 294 -32 -194 158 20 -108 354 -525 305 120 -320 115
7021 115 -248 -72 178 -82 -335 329 -366 11 63 -517 462 -122 -80 73 -58 -165 454 -374 -198 428 -516
7042 -516 445 -120 -278 486 -130 -55 51 -39 -92 509 -581 267 195 -273 375 -300 -53 231 47 -257 396
7063 396 -266 49 299 -587 481 -115 -14 198 -195 2 266 -118 -129 400 -533 545 -147 -485 519
7082 519 -206 189 -109 -129 -115 380 -542 74 226 -495 481 -392 -61 199 -203 -95 74 -102 52 519 -702
7103 -702 379 -79 -165 426 -499 52 67 16 -186 296 -412 352 82 -530 479 -345 147 47 -278 12
7123A2J93l75K02J48o39J137r16J22L88o07N56l31p3K12L31q20P26k87k10R18
7143F87j230O79Nk55J34Lk89M47J11q54J056q35M80J98p16O30j24j55j01K31m88
7164c86R39o91j35N93p68Q09k93k29L93K1n00M42j97l61J071j118M46J59l42M16
7184B69l09j93L24J05n90P10p06M09M53q80N78j99j6Q8j6l94O56k32l85O96p85
7205d17P13j54m21L49M9j40J90k78k75R57r92M50K05p10Q14m25o3K47J09m21O00
7226C87p32K30O39r64O73k51j09M03k56k91N34j97k25O57j010P56p7m58M69j48
7246C0j08L06k36k83P09p51K99K74o98P66l90j4Q8M7k58N07m58m4O96r49P92l69
7268d4k19N16k78k02M29k84j35O37r63P75Pn71N83m54J42L21k34l88P59o27K56
$$ plain form
7123 12 205 -170 32 180 -459 678 -238 -116 272 -335 221 -110 -183 29 360 -460 266 -21 -231 687
7143 687 -543 136 141 -114 20 23 -266 181 292 -562 494 -341 139 337 -379 251 127 -28 -129 102 -386
7164 -386 553 -138 -273 320 -448 361 68 -161 232 253 -247 195 -2 -363 708 -410 36 195 -147 269
7184 269 -40 -233 91 196 -394 316 -390 19 472 -408 170 -29 -45 43 27 -367 289 57 -328 368 -417
7205 -417 296 142 -279 70 119 -21 169 -109 -384 573 -419 31 236 -474 340 -85 -148 99 208 -213 387
7226 387 -345 -115 524 -440 233 -18 -127 276 20 -271 263 66 -159 498 -512 244 167 -291 178 30
7246 30 -78 228 -8 -291 418 -333 -34 240 -458 308 -82 -96 -8 39 -219 288 -170 -214 482 -467 325 -44
7268 -44 -263 253 -25 -227 202 -82 -217 420 -543 232 239 -332 251 -203 -61 260 26 -362 397 -230 26
7289B6L28r11R60m14j85L65j97lL75l65k92Q40r10P03m24k26Q04n24m7Q8O3j78
7311a24O37q83L71L42n43O03o92L03K78l22m4L24m40J54M34j139J208m96l8K80
7331B13n67L04K08p5l64O37p55O59k06n99J010p43M02m1k18l4M76o60J88M17p06
7352d54J019r15J28M81n23L11K8k19J0P66j246Q56j50k77O30q07M25J56l0k31
7372d2K70m74N15N8j036J170o24L59P3n46L62J32k88j20N44p92Q79m92k72P14
7392C90q13O62k47j17j7N13p68N51j31l06R09j044M37kk71K75P6l47L25K92q66
7413d99Q79p18K38N18q70N83q6l3j60K75n71R65m42m76Q09r11O05q4k43L34K12
7434C25m90J87J26p54J142q61J96L26n35N85j96k12J91K75n55O58o17m1P90j081
$$ plain form
7289 26 354 -557 403 -11 -196 169 -28 -31 344 -21 -313 527 -383 320 -104 -330 474 -50 -97 -9 54 -124
7311 -124 513 -370 1 343 -200 403 -289 14 292 -30 -74 250 -190 -36 398 -741 467 -29 -67 213
7331 213 -354 -50 158 83 -281 356 -399 260 54 -545 465 -278 124 83 -135 -169 307 -353 -165 252 -454
7352 -454 565 -350 -222 259 -264 47 75 -144 -134 632 -614 242 92 -185 445 -362 63 219 189 -42
7372 -42 228 -246 269 327 -709 461 -163 196 269 -277 85 217 -71 -191 353 -439 440 -52 -324 390
7392 390 -423 239 -8 -125 -142 371 -397 154 23 -283 626 -418 19 17 -254 21 97 -250 75 367 -499
7413 -499 380 -338 -100 418 -452 131 45 12 -148 127 -444 521 79 -397 412 -499 106 22 -221 113 325
7434 325 -165 22 148 -606 536 -325 -129 197 -338 247 51 -161 30 305 -250 408 -209 -250 540 -541
7454e41O49Jk69K52j05l68O90j52m91Q04r29N41J65n90N24j47j21K43j44m24R34
7475E22p98K60L13p51P75l97j16K61N7k93M88n68r8R11r28N25j38j81M55k82k10
7496a93K91M9m10O27p69M94K54o81N61l24ML61k39m15Q34o17O8L97q58R63m78
7517h1j67L38p2k22N66m80j99P17o91M85k17k32N46k90j51K37q8k56P51q24M18
7538H8K46p48P62n25K08J53r7m29N64l70K4M92r33R02l13k35M45m80J23M14k67
7559B4l17P28q76O51j19n45Q90n41J11N2j18k21P37p51K66M10q73R25o06p2M58
7580B13k84m5J79k26j9N75q66O99j58l19O80o89K38J76j14l45O79p17N02J15p31
7601d57Q08n46K47J37l33J64J96l17j21O00p56Q47m41l32O83m98L59j58j70j5
$$ plain form
7454 -541 108 109 -160 92 -13 -381 309 157 -334 470 -459 82 247 -343 181 34 -87 156 12 -412 522
7475 522 -276 -16 297 -454 321 -76 -192 69 126 -167 321 -247 -345 566 -362 163 25 -156 299 17 -193
7496 -193 98 147 -263 364 -405 89 343 -338 223 -101 -97 264 25 -390 444 -173 -105 292 -566 397 -81
7517 -81 -248 90 18 -204 362 -118 -317 400 -291 194 -23 -255 291 1 -150 87 -1 -257 494 -330 88
7538 88 334 -414 348 -177 31 184 87 -342 222 -148 -124 368 -565 337 24 -211 234 -246 -123 291 24
7559 24 -293 435 -441 210 91 -454 436 -105 6 58 -60 -281 456 -295 -29 381 -492 433 -173 -245 213
7580 213 -71 -116 63 -163 -182 393 -473 226 68 -251 429 -260 -22 154 40 -305 374 -343 159 274 -457
7601 -457 351 -195 52 189 -144 20 216 -101 -222 378 -378 469 28 -304 379 -119 240 82 -88 -103
7621a03M96p46M82R1o02R30r38L53J34j79K3L22m55K82K43q24Q66p00K25M97o97
7642c00L34J35k10r2K97n58O14j44n23Q46r05O73q3k63J52K44l48J25J36n89R33
7663D74p47J91J17m01M53j49j04J99L09o78N93m57P9N73p61L49R7j55J14j8m48
7684c70O25l7n84Q28q29M93N7m47L27K20k64K9J29o49R02m98NL39n76N31k16j95
7706a80K68O9l39L98m01r3Q12r45M12P5k47L01q0m19L86J52n23O43o81M34K35
7727B77n82L44j7l2K49j97m65P23l75J14K89p09N71o5l10K17L9k40M52l53k19
7748b89P56q53M61O1m04N46k41k06K15K2l09O60p31K53M11p15O61l48J3J82Qn99
7770d46P91l69p3M33q08O90o5l78L68k07j01L51j18m28P32p43N19l1m71N68k15
$$ plain form
7621 -103 393 -353 129 220 -382 548 -390 -37 97 -82 -59 263 -192 90 333 -491 375 -325 -100 397 -300
7642 -300 34 169 -41 -133 164 -394 220 76 -447 399 -506 167 84 -179 -27 217 -131 -6 130 -459 474
7663 474 -273 -82 35 -366 87 -62 -166 33 342 -336 257 -200 -121 452 -309 40 137 -18 96 78 -370
7684 -370 255 218 -366 462 -367 126 183 -264 63 283 19 48 177 -472 430 -68 -63 276 -300 231 15 -180
7706 -180 88 157 -182 216 -185 -278 534 -411 1 76 -171 130 50 -369 17 169 -354 289 -392 42 277
7727 277 -305 39 22 -10 239 42 -423 300 -75 39 328 -381 190 125 -185 32 71 -169 283 -70 -289
7748 -289 467 -386 75 136 -268 278 37 -169 46 68 -241 419 -312 -59 352 -363 298 -50 -37 145 153 -446
7770 -446 345 -24 -97 336 -472 218 153 -225 143 -64 -165 186 68 -360 372 -371 148 117 -354 214 -1
7791aj64J72N9l23P09o99J30L74n98O54m34rK94j56k38L19j36j54O16r09P71j26
7813A51l48M44m37J27J86J2m66O61o45M48J42q20R21m72P0P7j18K6K91m10l8N57
7835C59p54P74m78j68O09m21J06l9p1l7O09q16L74K70o44P46o84K02K10j63p6
7856i2K81l45R8M60r60R17n26J17L86m69J00K01j20j84N74q67P18j84n36P39n44
7877b36M12j51m8j37M81n48K91Q9n60R57p07J08J87l82L02J01j79r2M75p80O38
7898B21l17j03O51p11L54j54J07p5K36n70N17N3o63Q51p02L76J24l55J42K29l00
7919h9L4K82p23J078n84m9L40m93M44k17r7K9L80o36M80j06l47Q02r17M91j9j45
7941f2J25K6l39K93L41p90Q71p72L10L00p08M12K3j43O6K84o34O90k94k91N34
$$ plain form
7791 -1 -165 7 66 -257 452 -247 -117 257 -341 313 -121 -130 164 8 -230 89 -47 -201 415 -494 277 151
7813 151 -197 247 -190 -63 123 135 -331 330 -315 133 275 -545 376 -96 -26 51 -67 -41 250 -160 -198 359
7835 359 -395 379 -99 -267 342 -79 27 -12 -83 -120 489 -327 47 317 -327 419 -265 -63 147 -16 -92
7856 -92 189 -156 -58 402 -558 359 -167 -50 336 -133 -33 168 48 -136 438 -429 289 105 -431 308 -236
7877 -236 176 25 -23 -160 321 -227 64 153 -407 550 -157 -49 138 -244 58 159 -20 -112 363 -417 221
7898 221 -96 -199 452 -259 95 -59 48 -27 209 -361 156 209 -454 397 -305 71 195 -160 -18 211 -89
7919 -89 -55 227 -496 582 -2 -51 289 -204 240 23 -74 -45 335 -301 179 73 -274 528 -389 102 83 -62
7941 -62 63 89 -250 43 384 -406 465 -307 3 303 -405 7 30 -113 -47 237 -397 293 -1 -292 242
7962B42o63N55m7k76R5K02l06M02k42m09Q82p18L42L1k11L42j70k27J88J68n13
7983c33O98o06J28M43o08M02j09o8J86k8l72N20k37j95N35p64O52k29j92J80J18
8004A21j65K16p6l95P33o20K15R8l73M86j60k09O7K28l35M53n09J51M75o94M05
8025A12j94n8L03j09l60M02Jl79P18p62M87Om16K98j39qK27r7m61O85m17R9K44
8048A82n37N98k76jj6J40k63M40l18r3N37p72P61m31j30M05j95o3P7O3k86O14
8070D36p34M29j2l51N53m94J57o0K07l35M54m90K17L78p89P12m05J47qn2j2K17
8092A65j45k51N94o13N24j91k50L78l34J75j2jk59M61m91J77J84m39P13n79O8
8113a26J17J21k30J61p7j38N78q17O24k13j06N00n22J34P6m7k59N43o04N16o1
$$ plain form
7962 242 -421 134 87 -189 -94 108 -198 204 -38 -447 435 -283 59 90 -121 221 51 -176 12 180 -333
7983 -333 365 -241 -113 330 -278 124 15 -53 133 105 -267 253 16 -179 356 -408 244 15 -177 3 121
8004 121 -44 172 96 -299 434 -186 29 127 -246 240 80 -129 -62 166 -169 284 -225 -74 401 -293 112
8025 112 -82 -140 163 54 -306 96 97 -282 436 -326 161 167 -249 49 -90 -98 129 32 -429 256 -161 -62 182
8048 182 -355 243 -33 -34 -50 90 -173 267 -51 -144 393 -379 382 -49 -179 226 31 -32 45 108 -178 436
8070 436 -298 131 119 -232 321 -173 -16 -76 131 -204 250 -240 -23 355 -434 278 -127 20 12 -40 -52 165
8092 165 20 -231 363 -250 274 83 -167 211 -123 52 40 39 -220 241 -250 -73 111 -328 385 -194 -126
8113 -126 -9 112 -118 43 -34 -172 406 -411 213 0 -106 394 -128 6 82 35 -224 319 -285 231 170
8134A70o02Q52o50K58m7Rj63M78l70j19M49o48P53m42j8K91k90K25j17l5j45M91
8156C30o54L91k3l45P07o96L33r0J2j39K90l36J46K86n49N57m56K27K37m20K14
8177B2N9j83oK57n43O06j02k93M79o83M66%j57j29
$$ plain form
8134 170 -432 420 -230 28 -19 -10 -173 305 -65 -184 265 -383 370 -72 -90 201 -89 136 19 -16 -161 330
8156 330 -324 67 44 -301 406 -290 43 -47 -35 -174 116 -220 -74 212 -337 220 -236 -9 228 -192 22
8177 22 81 -102 -108 149 -394 212 110 -183 296 -387 79 79 -78 -207
8191b07
$$ Imaginary data points
##PAGE= N=2
##DATA TABLE= (X++(I..I)), XYDATA
0@%%%%%%%qJ6j6K4m0M8n7Q1j12J41j73K12k54L07l74M48n32O31p40Q60r98J159
29F23j342J543j766K012k285K589k925L297l704M150m641N175n758O399p102P866
45D131q700R612j0604J1690j2881J4187j5623J7208j8963K0912k3093K5551k8336
58a4909L1529l5235L9593m4802N1167n9163O9563q3749J04487j38360K07385n90002
70d62496M97199p7592k68105M96912p40382M72680L24503o42703J42673P34274
80D76963p16615P47064o60098l72154J086159o06513N1126J27343l88710L32543
90G7108K43685q71746N17081K53365n47014P37955q54446K17765O51632n56545
100a31160O4314J67349k59737M77265R7202q38776Q48908k36910j66667M72444
$$ plain form
0 0 0 0 0 0 0 0 0 -8 8 -8 16 -24 24 -33 48 -64 77 -96 116 -138 169 -205 243 -289 342 -398 462 -536 623
29 623 -719 824 -942 1070 -1215 1374 -1551 1746 -1958 2192 -2449 2726 -3032 3367 -3735 4131
45 4131 -4569 5043 -5561 6129 -6752 7435 -8188 9020 -9943 10969 -12124 13427 -14909
58 -14909 16620 -18615 20978 -23824 27343 -31820 37743 -46006 58481 -79879 127506 -462496
70 -462496 34703 -42889 -310994 185918 -554464 -81784 242719 -399984 -257311 476963
80 476963 -239652 507412 -152686 -524840 561319 -45194 5932 133275 -255435 77108
90 77108 320793 -550953 -33872 219493 -327521 410434 -444012 -226247 425385 -131160
100 -131160 -66846 100503 -159234 318031 415233 -423543 425365 188455 21788 494232
110D94232p33831M90245L25524n79998N104J98651l86931O38134l12700n48235
120d09805Q25271n80324Q7319J38749m65581N01279J99151o30034K14762R1659
130b7554l25266P52315o03188j7770N76539n50005J98044p706k83703N03506Q9746
141C04958o43692M52377k25801q7195N29740p15718L09623K85789m25472J44454
151g0937m2572k69041N95184j54156m60463N85308m17575K13373K02023n55555
161c74411M44896J84119l56915J95956p0233k35496O59669m66192j12310M70538
171C39621m32674L19838q6243m02889M15740R6957l91636L26448k52885p2541
181a40264N22351o61777K06851K42979k79263K90055j78493l07105M74894m4221
$$ plain form
110 494232 -239599 250646 576170 -3828 1276 199927 -187004 451130 138430 -409805
120 -409805 415466 -164858 -77539 61210 -404371 96908 296059 -333975 -119213 -27554
130 -27554 -352820 399495 -203693 -221463 355076 -194929 3115 -4591 -288294 215212 304958
141 304958 -338734 113643 -112158 -199353 330387 -385331 -75708 210081 -215391 -70937
151 -70937 -113509 -382550 212634 58478 -401985 183323 -234252 -20879 181144 -374411
161 -374411 70485 254604 -102311 93645 23412 -212084 447585 -18607 -130917 339621
171 339621 -93053 226785 140542 -262347 153393 250350 -141286 185162 -67723 -140264
181 -140264 382087 -279690 -72839 170140 -109123 180932 2439 -304666 170228 126007
191A26007l19174M44702m05476K20739K29586o13004L45568J03430j66188K24611
201A90801k07157k59907N37251l22337j27622L64147m18262M02404o9025m49686
211c59393L41930N2222j66595K69128k76669q6277N21440n29949J42482J71638
221G9957k60907M28658k07460l03289L56032k6259j74736L34351m05603J89169
231I913L12457n71703K79352k4306j04025L31858k41994k26863M19918k10556
241b5949q5313K75011m41996M37386L9619m20235K77416p6433l9330K75531k74146
252e8439j02559M58851l99746J00163P1323l15160M98014j51499k62045K34176
262G3079q7548o1344K73087l84939J29720L51935m59652K46093j38589j20280
$$ plain form
191 126007 -193167 251535 -153941 66798 296384 -316620 28948 132378 -33810 190801
201 190801 -16356 -276263 260988 -61349 -188971 175176 -243086 159318 90293 -359393
211 -359393 -17463 34759 -131836 137292 -139377 -225654 295786 -234163 -91681 79957
221 79957 -180950 247708 40248 -263041 92991 66732 -108004 226347 -179256 9913
231 9913 322370 -249333 30019 5713 -98312 233546 -8448 -235311 184607 -25949
241 -25949 -111262 163749 -278247 159139 198758 -221477 55939 -20494 -59824 215707 -58439
252 -58439 -160998 297853 -101893 -1730 69593 -245567 252447 100948 -161097 73079
262 73079 -14469 -75813 197274 -187665 -57945 293990 -165662 80431 -58158 -178438
272a78438M06600k10386j74492K80941j57904j9949K23882m72509L83224J16386
282A97355l45988K59695k20224R971K94114k36484j12263L58908k83568J24400
292D5916M7996m09174M99774r8035j67586J77559j74682L1214K36946l27716K0438
303a17350L35752l49459K76399j86259k07323M26364j93912p6313J42959j29637
313g8779M2098K06273m44339K38124J68691k66644L18552l11278M498K90830k03259
324c5233n9716K02279j70705J46905Q8679m66362M03144o2618j06432K20668k94881
335a34272J02672J96542k52200l3392K28984k37567L00040j19497l13229M22483
345A60564j96346K6176J02911j90406J38899J76154l41791Q9792J48376k10476
$$ plain form
272 -178438 228162 17776 -156716 124225 -33679 -53628 170254 -302255 80969 197355
282 197355 -148633 111062 -109162 -99191 194923 -41561 -153824 205084 -78484 45916
292 45916 93912 -315262 184512 86477 -81109 96450 -78232 -47018 189928 -137788 -117350
303 -117350 218402 -131057 145342 -40917 -248240 178124 -15788 -92101 50858 -78779
313 -78779 -36681 169592 -274747 -36623 132068 -134576 183976 -127302 -122804 168026 -35233
324 -35233 -94949 107330 -63375 83530 172209 -294153 108991 46373 -60059 160609 -134272
335 -134272 -31600 164942 -87258 -120650 108334 -129233 170807 51310 -261919 160564
345 160564 -35782 -9606 93305 -97101 41798 217952 -123839 -34047 114329 -96147
355i6147L70240l06479p7090L03287k19447K8275M5271j46525J77810J12541m11959
366b20223K42468l7545r1488K83383l56979J05201J96005k00126M717O8778j58882
377a64691K94080k7344l27592L37480j77329N4402J28748k87557J86506J54334
387A71037k40805L6079L2618j67667L65322k30274j41632K93182k14875J02082
397E067m975k06426K26752J26966k87953J56884o1933o2978L24688l37662O9382
408e2188K07708j61467Q0854l8163j70402K85724K0331k67874K47157j83630O8112
419C6162J46485l33924J61341J31518j52007O0994o1972j65918L42127j64753
429E3j32503K42499k05727J68134q988k50120K00737J13818j74288J32960j17131
$$ plain form
355 -96147 274093 -32386 -109476 193811 -25636 2639 47910 -98615 79195 191736 -220223
366 -220223 22245 -15300 -106788 176595 -180384 -75183 120822 -79304 -74587 -5809 -164691
377 -164691 129389 102045 -225547 111933 -65396 -10994 117754 -169803 16703 171037
387 171037 -69768 -33689 -1071 -168738 196584 -33690 -175322 117860 -97015 5067
397 5067 92 -206334 20418 147384 -140569 16315 -45618 -108596 216092 -121570 -52188
408 -52188 155520 -5947 74907 36744 -133658 152066 172397 -95477 151680 -31950 36162
419 36162 182647 -151277 10064 141582 -10425 50569 -11403 -177321 164806 53
429 53 -132450 110049 -95678 72456 63468 -186652 14085 127903 -46385 86575 -30556
440c0556p2985L26149l14595L6953J50722j46417J57427r3756k06126K22865L5987
451F5668j96828K04283k08067P5249J88309l41998J40279P2342p1585J29079q7910
462c1179j68141K90799r2608j09474K16284k29264K19822K7848k60726J54299
472A7660M5536o8854J33105j22511j11425L09512k57134J6631J04531j75787K50495
483A41759q8578j89663J49286J9416r9816J80163j99003M7875K42211l10362J33862
494B7150p592o3525K12787j09269j44125J93990o3061p8317J71365k67535K02282
505G4150P9136k60879J34317p1806j7542J53747j25820j10993K44926j75468J7569
516e8663P5866k27392K91005m1045j50686J12584m5222j6068J56740j78203j064
$$ plain form
440 -30556 -103541 222608 -91987 -55034 95688 -50729 106698 12942 -193184 29681 65668
451 65668 -131160 73123 -134944 -59695 128614 -213384 -73105 -763 -72348 56731 -31179
462 -31179 -199320 91479 -1129 -110603 105681 -123583 96239 124087 -136639 17660
472 17660 63196 -5658 127447 4936 -106489 203023 -54111 -37480 67051 -108736 141759
483 141759 53181 -136482 12804 32220 -67596 112567 -86436 -38561 203650 -106712 27150
494 27150 19558 -43967 168820 59551 -84574 109416 46355 -31962 139403 -128132 74150
505 74150 153286 -107593 26724 -45082 -62624 91123 -34697 -145690 99236 -76232 -58663
516 -58663 17203 -210189 80816 39771 -110915 1669 -43553 -59621 97119 -81084 -82148
527h2148K46367k41065J24027n9481j17069K58779j01625j03719J15579n9353
537a9708k6951J45403k70772J50805J34907k12113J61026j42267j2160J94455
547A02625j12128p7514J81018j11717N2139P5361k79656K71873m425j11312J19729
558A05993j35027K7719J42802j64766l9624J97915j78973J41497p0912j89325
568a62701K68141r7901m2112P1469q4356L0489J27728k37481P1385J42639j64344
579g7044J99552j73583m5410J96513j12589l1987Q5765p8222O6733R0404k90233
590a70101J89018J0598q8439J61110j98709M4302J31168j29314m0158J20637j21900
601i1788J58474j3024k38214K49329r6045L465Q7185j42430Q4991J14610j76381
$$ plain form
527 -82148 164219 -76846 47181 -12300 -129369 129410 27785 -75934 39645 -19708
537 -19708 -46659 98744 -172028 -21223 113684 -98429 62597 -79670 -91830 102625
547 102625 -9503 -87017 94001 -17716 34423 109784 -169872 102001 97576 -13736 105993
558 105993 -29034 -1315 141487 -23279 -62903 135012 -43961 97536 26624 -162701
568 -162701 105440 7539 -34573 36896 -47460 -16971 110757 -126724 -55339 87300 -77044
579 -77044 122508 -51075 -96485 100028 -12561 -44548 41217 -37005 29728 120132 -170101
590 -170101 18917 29515 -58924 102186 -96523 -52221 78947 -50367 -90525 30112 -91788
601 -91788 66686 53662 -184552 64777 -31268 -27803 59382 -83048 1943 116553 -59828
612e9828J3487R9430j36724K29165j42802j01313K06829j36238L2435K7743j01213
623f9029J03537R5875k28370J05226L846q1314K11338k12330K9519J34908j16887
634b3681J5210J9295j00064J58661L3608k16627J80222r5348J3022J17866j98849
645i6685R6968R9471j17140J3612J2587j15805K17183q4621j24416J80380j35990
656e4456P0572K1177j53103J19906R0037j45124P0068l8389p4417K22024j81614
667e3319k825J29610j06952P3127k6773j32249J52079N0227j53830J30272j08327
678d8960J9092J42533k09781O9910Q7196p2725N8294m1935j25092J99796m6294
689C2034j02486J40091j36483J01327L4298j79820R2119P3228p8530P8563p3714
$$ plain form
612 -59828 -46341 53089 -83635 145530 2728 -98585 108244 -27994 4441 32184 -69029
623 -69029 34508 130383 -97987 7239 11085 -70229 141109 -71221 -41702 93206 -23681
634 -23681 -8471 10824 -89240 69421 103029 -113598 66624 -28724 -15702 102164 -96685
645 -96685 283 99754 -17386 -3774 8813 -106992 110191 25570 -98846 81534 -54456
656 -54456 16116 37293 -115810 4096 94133 -50991 19077 -19312 -93729 128295 -53319
667 -53319 -56144 73466 -33486 39641 12868 -119381 32698 82925 -70905 59367 -48960
678 -48960 -29868 112665 -97116 -27206 59990 -12735 45559 3624 -121468 78328 32034
689 32034 -70452 69639 -66844 34483 68781 -111039 -18920 54308 -24222 54341 -19373
700a9373q3911K17106j53265q810R1673r9258J26729l2262j48214J10587N1942
711E2944r7433J20646j30237J7177J64305k01476N6419L6233m1785J04558n3261
722B8090j36349J55986j8559q0054J23091j61845J23365O0309j77850O7231K0247
733C662k2432R2799o8954j01979J99924j15956r945O7742j28135J73417k1753
744F8390j30910O2397K2193m7198J07607j23324j7156J81714j81661N7071j5613
755a6490n6344J51531n5047j08855R3681m979n3741J15136j75861J07692J00212
766I6935j64643P9669n1221r12J12149o2871r1649J51303p5383o690O2272j73428
778a24469J83289L96j06127N6922m0153l172R5613j00205m1276J70719j35501
$$ plain form
700 -19373 -103284 113822 -39443 -48253 43420 -55838 70891 38629 -109585 1002 52944
711 52944 -44489 76157 -54080 -36903 127402 -74074 -17655 18578 -23207 81351 28090
722 28090 -108259 47727 29168 -50886 72205 -89640 33725 94034 -83816 -16585 3662
733 3662 -18770 74029 5075 -96904 103020 -12936 -22881 44861 -83274 90143 68390
744 68390 -62520 -123 22070 -25128 82479 -40845 -58001 123713 -57948 -877 -16490
755 -16490 -72834 78697 23650 -85205 8476 3497 -50244 64892 -110969 -3277 96935
766 96935 -67708 11961 -39260 -40172 71977 9106 -82543 68760 -6623 -13313 48959 -124469
778 -124469 58820 59216 -46911 10011 -30142 -33314 62299 -37906 -79182 91537 -43964
789d3964O6053k5596j02659J81844m6932o1428N6487j9794j4376J00997j59798
800f9166N5824J21041j37185J02824r3393k5130J26418o3098o0222Q8683m9699
811c103P725O8328j96145J46484K2026q1902Q4817r6699J5433R0755p9051m7297
823f8629J27502r6267Q1187r111j51759J74342m9601k1786M6469o1216J7474Q6906
835G5511j31592N105J03490j13323J32514r7517o2706J32288o8727j2163L9253
846B133m4237L2162Q2428j76202R1746L0003o4675J28611j26262J8382Q8011o3211
858a111k5560O2890o8836Q5735K8976j71652J42889n5309k421O6819j07623M3843
870a360P1923q6399j8217O2383r5003J47226o0781r6669J35834q3684L3165J6349
$$ plain form
789 -43964 22089 -3507 -106166 75678 28746 -32682 23805 4011 -10365 90632 -69166
800 -69166 -13342 107699 -29486 73338 -20055 -45185 81233 18135 -42087 46596 -3103
811 -3103 4622 72950 -123195 23289 45315 -36587 48230 -48469 -33036 57719 -21332 -68629
823 -68629 58873 -37394 43793 34682 -117077 57265 7664 -14122 32347 -28869 -11395 75511
835 75511 -56081 -50976 52514 -60809 71705 -25812 -88518 43770 -24957 -37120 2133
846 2133 -42104 -9942 72486 -103716 -11970 18033 -46642 81969 -44293 -25911 62100 -1111
858 -1111 -26671 36219 -32617 53118 82094 -89558 53331 -1978 -4399 62420 -45203 -1360
870 -1360 70563 -15836 -34053 28330 -66673 80553 19772 -76897 58937 -24747 8418 24767
882B4767o9932N4873Q0921j26619L8718J6832p1267J56577j28936n593Q9841p1054
894a0872J6503l60o9074P8644N3039j46072R7497n4112q991J02098j37815N0328
906b9187O3397n3320O223P871p9762J31381j3547j01600J19363q7871N0378K8705
918D2031j09490O4176O2240o9883K5308j4497p1241J52454r8806k6347Q7525p4724
930c1254O1103j6594q8047P5460N3674r1687P4834n8661j2673J20455j34027L5039
942a2378N2835m1215M7242k2346q8636J07066J846p8870R4340r5949N3411M7482
954F4828j25337M7282L7627l6920M7384l6217p7916J37863p3047k4107O7281q1019
966e2298R1658o255r7843N2895L6963n1001P4894p2631k0226J25175j22608K9468
$$ plain form
882 24767 -45165 9708 90629 -35990 2728 19560 -51707 104870 -24066 -29659 60182 -10872
894 -10872 5631 5271 -63803 14841 67880 -78192 19305 -34807 -43798 58300 -79515 -29187
906 -29187 34210 -19110 -12887 -5016 -84778 46603 33056 -68544 50819 -37052 13326 42031
918 42031 -67459 -3283 58957 -10926 14382 -115 -71356 81098 -17708 -44055 43470 -31254
930 -31254 29849 13255 -74792 668 54342 -37345 37489 -21172 -33845 86610 -47417 -12378
942 -12378 40457 -758 46484 24138 -64498 42568 44414 -34456 59884 -36065 17346 64828
954 64828 -60509 -13227 24400 -12520 34864 -1353 -79269 58594 -14453 -38560 28721 -52298
966 -52298 39360 33105 -64738 -11843 25120 -25881 49013 -23618 -43844 81331 -41277 -11809
978a1809J8359l9197Q2167k5713q9423P4823M749n3219Q9103j11408N8789O5920
990F3141j14441M3395m758j1623O7919k8662q2981J15286n1190j4262N7971j08294
1002f8499J12280P358q1789K9501L122j9986P3277o3059m4253J28964j02957L4166
1014H125n831o3031J13280k2440o4965L7863K212l1228Q4524j13389L6378R0094
1026G1592j06033O0310n0132j4262Q6162k8928o4653P4655l2111o897O1419j36877
$$ plain form
978 -11809 6550 -32647 49520 23807 -65616 9207 13956 -39263 49840 -61568 -2779 63141
990 63141 -51300 -7905 -12663 -24286 43633 14971 -68010 47276 -3914 -18176 39795 -68499
1002 -68499 43781 51139 -30650 -1149 1973 -18013 55264 -7795 -52048 76916 -26041 8125
1014 8125 2294 -60737 52543 30103 -34862 3001 5213 -26015 58509 -54880 -18502 71592
1026 71592 -34441 25869 -24263 -38525 47637 18709 -45944 28711 -3400 -10297 51122 -85755
$$ [...]
8191A44
##END NTUPLES=NMR FID
##END=
