##TITLE=1H_AX3108
 aceton-d6
 8 sc, 
 1.9.2023
##JCAMPDX= 6.0         $$ Bruker NMR JCAMP-DX V2.0
##DATA TYPE= NMR FID
##DATA CLASS= NTUPLES
##ORIGIN= UXNMR, Bruker Analytische Messtechnik GmbH
##OWNER= root
$$ XWIN-NMR		Version 3.5
$$ Fri Sep  1 13:50:33 2023 Russian Standard Time (UT+4h)  she@DPX200
##.OBSERVE FREQUENCY= 200.13135
##.OBSERVE NUCLEUS= ^1H
##.DELAY= (6, 6)
##.ACQUISITION MODE= SIMULTANEOUS
##.ACQUISITION SCHEME= undefined
##.AVERAGES= 8
##.DIGITISER RES= 18
##SPECTROMETER/DATA SYSTEM= spect
##.PULSE SEQUENCE= zg30
##.SOLVENT NAME= Acetone
##.SHIFT REFERENCE= (INTERNAL, Acetone, 0, 15.7039)
##AUDIT TRAIL= $$ (NUMBER, WHEN, WHO, WHERE, WHAT)
$$ ##TITLE= Audit trail, XWIN-NMR		Version 3.5
$$ ##JCAMPDX= 5.01
$$ ##ORIGIN= Bruker BioSpin GmbH
$$ ##OWNER= she
$$ F:/spectra/data/she/nmr/H-F/1/audita.txt
$$ ##AUDIT TRAIL=  $$ (NUMBER, WHEN, WHO, WHERE, WHAT)
(   1,<2023-09-01 13:49:23.18 +0400>,<she>,<DPX200>,
      <created by zg, POWCHK disabled, PULCHK disabled
       configuration hash MD5:
       00 E9 B6 7A A2 85 ED C7 34 08 36 98 17 FE 4E 26
       data hash MD5: 16K
       56 65 ED F1 E4 B6 42 6B 7E 69 21 9C CB 1F A0 18>)
$$ ##END=
$$ 
$$ hash MD5
$$ 81 82 3B DD A9 C0 99 43 C7 4E 11 63 D7 AF 11 A2
##$RELAX= 
##$RELAX= 
##$RELAX= 
##$RELAX= 
##$RELAX= 
##$RELAX= 
$$ Bruker specific parameters
$$ --------------------------
##$DU= <F:/spectra>
##$EXPNO= 1
##$NAME= <H-F>
##$PROCNO= 1
##$TYPE= <nmr>
##$USER= <she>
##$AMP= (0..31)
100 100 100 100 100 100 100 100 100 100 100 100 100 100 100 100 100 100 
100 100 100 100 100 100 100 100 100 100 100 100 100 100 
##$AQSEQ= 0
##$AQ_mod= 1
##$AUNM= <au_zg>
##$AUTOPOS= <>
##$BF1= 200.13
##$BF2= 200.13
##$BF3= 200.13
##$BF4= 200.13
##$BF5= 200.13
##$BF6= 200.13
##$BF7= 200.13
##$BF8= 200.13
##$BYTORDA= 1
##$CFDGTYP= 0
##$CFRGTYP= 5
##$CHEMSTR= <none>
##$CNST= (0..31)
1 1 145 1 1 1 1 1 1 1 1 1 1 1 1 1 1 1 1 1 1 1 1 1 1 1 1 1 1 1 1 1 
##$CPDPRG= <>
##$CPDPRG1= <>
##$CPDPRG2= <>
##$CPDPRG3= <>
##$CPDPRG4= <mlev>
##$CPDPRG5= <mlev>
##$CPDPRG6= <mlev>
##$CPDPRG7= <mlev>
##$CPDPRG8= <mlev>
##$CPDPRGB= <>
##$CPDPRGT= <>
##$D= (0..31)
0 1.2 0 0 0 0 0 0 0 0.06 0 0.03 0 0 0 0 0.0002 0 0 0 0 0 0 0 0 0 0 0 0 
0 0 0 
##$DATE= 1693561762
##$DBL= (0..7)
120 120 120 120 120 120 120 120 
##$DBP= (0..7)
150 150 150 150 150 150 150 150 
##$DBP07= 0
##$DBPNAM0= <>
##$DBPNAM1= <>
##$DBPNAM2= <>
##$DBPNAM3= <>
##$DBPNAM4= <>
##$DBPNAM5= <>
##$DBPNAM6= <>
##$DBPNAM7= <>
##$DBPOAL= (0..7)
0.5 0.5 0.5 0.5 0.5 0.5 0.5 0.5 
##$DBPOFFS= (0..7)
0 0 0 0 0 0 0 0 
##$DE= 6
##$DECBNUC= <off>
##$DECIM= 32
##$DECNUC= <off>
##$DECSTAT= 4
##$DIGMOD= 1
##$DIGTYP= 9
##$DL= (0..7)
0 120 120 120 120 120 120 120 
##$DP= (0..7)
150 150 150 150 150 150 150 150 
##$DP07= 0
##$DPNAME0= <>
##$DPNAME1= <>
##$DPNAME2= <>
##$DPNAME3= <>
##$DPNAME4= <>
##$DPNAME5= <>
##$DPNAME6= <>
##$DPNAME7= <>
##$DPOAL= (0..7)
0.5 0.5 0.5 0.5 0.5 0.5 0.5 0.5 
##$DPOFFS= (0..7)
0 0 0 0 0 0 0 0 
##$DQDMODE= 0
##$DR= 18
##$DS= 0
##$DSLIST= <SSSSSSSSSSSSSSS>
$$ [...]
##$SUBNAM2= <"">
##$SUBNAM3= <"">
##$SUBNAM4= <"">
##$SUBNAM5= <"">
##$SUBNAM6= <"">
##$SUBNAM7= <"">
##$SUBNAM8= <"">
##$SUBNAM9= <"">
##$SW= 18.05172834244
##$SWIBOX= (0..15)
0 0 2 0 0 0 0 0 0 0 0 0 0 0 0 0 
##$SW_h= 3612.71676300578
##$TD= 16384
##$TD0= 1
##$TE= 0
##$TE2= 300
##$TE3= 300
##$TEG= 300
##$TL= (0..7)
0 120 120 120 120 120 120 120 
##$TP= (0..7)
150 150 150 150 150 150 150 150 
##$TP07= 0
##$TPNAME0= <>
##$TPNAME1= <>
##$TPNAME2= <>
##$TPNAME3= <>
##$TPNAME4= <>
##$TPNAME5= <>
##$TPNAME6= <>
##$TPNAME7= <>
##$TPOAL= (0..7)
0.5 0.5 0.5 0.5 0.5 0.5 0.5 0.5 
##$TPOFFS= (0..7)
0 0 0 0 0 0 0 0 
##$TUNHIN= 0
##$TUNHOUT= 0
##$TUNXOUT= 0
##$USERA1= <user>
##$USERA2= <user>
##$USERA3= <user>
##$USERA4= <user>
##$USERA5= <user>
##$V9= 5
##$VALIST= <valist>
##$VCLIST= <CCCCCCCCCCCCCCC>
##$VD= 0
##$VDLIST= <DDDDDDDDDDDDDDD>
##$VPLIST= <PPPPPPPPPPPPPPP>
##$VTLIST= <TTTTTTTTTTTTTTT>
##$WBST= 1024
##$WBSW= 4
##$XGAIN= (0..3)
0 0 0 0 
##$XL= 0
##$YL= 0
##$YMAX_a= 1031276
##$YMIN_a= -1086218
##$ZGOPTNS= <>
##$ZL1= 120
##$ZL2= 120
##$ZL3= 120
##$ZL4= 120
##$ABSF1= 10
##$ABSF2= 0
##$ABSG= 5
##$ABSL= 3
##$ALPHA= 0
##$AQORDER= 0
##$ASSFAC= 0
##$ASSFACI= 0
##$ASSFACX= 0
##$ASSWID= 0
##$AUNMP= <proc_1d>
##$AZFE= 0.1
##$AZFW= 0.1
##$BCFW= 1
##$BC_mod= 2
##$BYTORDP= 1
##$COROFFS= 0
##$CY= 11.3945322036743
##$DATMOD= 1
##$DC= 2
##$DFILT= <>
##$DTYPP= 0
##$F1P= 15.7292609196834
##$F2P= 12.9074282941183
##$FCOR= 0.5
##$FTSIZE= 0
##$FT_mod= 4
##$GAMMA= 1
##$GB= 0.15
##$INTBC= 1
##$INTSCL= 1
##$ISEN= 128
##$LB= 0.24
##$LEV0= 0
##$LPBIN= 0
##$MAXI= 10000
##$MC2= 0
##$MEAN= 0
##$ME_mod= 0
##$MI= 1.114404
##$NCOEF= 0
##$NC_proc= 0
##$NLEV= 6
##$NOISF1= 3.799351
##$NOISF2= 2.8
##$NSP= 1
##$NTH_PI= 0
##$NZP= 0
##$OFFSET= 15.70392
##$PC= 1
##$PHC0= -21205.89
##$PHC1= 8.05272
##$PH_mod= 1
##$PKNL= yes
##$PPARMOD= 0
##$PSCAL= 0
##$PSIGN= 0
##$REVERSE= no
##$SF= 200.130013532006
##$SI= 16384
##$SIGF1= 3
##$SIGF2= 2
##$SINO= 400
##$SIOLD= 16384
##$SREGLST= <1H.CDCl3>
##$SSB= 0
##$STSI= 0
##$STSR= 0
##$SW_p= 3612.71676300578
##$SYMM= 0
##$S_DEV= 0
##$TDeff= 0
##$TDoff= 0
##$TI= <>
##$TILT= no
##$TM1= 0
##$TM2= 0
##$TOPLEV= 0
##$USERP1= <user>
##$USERP2= <user>
##$USERP3= <user>
##$USERP4= <user>
##$USERP5= <user>
##$WDW= 1
##$XDIM= 8192
##$YMAX_p= 0
##$YMIN_p= 0
$$ End of Bruker specific parameters
$$ ---------------------------------
##NTUPLES= NMR FID
##VAR_NAME=  TIME,          FID/REAL,        FID/IMAG
##SYMBOL=    X,             R,               I
##VAR_TYPE=  INDEPENDENT,   DEPENDENT,       DEPENDENT
##VAR_FORM=  AFFN,          ASDF,            ASDF
##VAR_DIM=   8192,          8192,            8192
##UNITS=     SECONDS,       ARBITRARY UNITS, ARBITRARY UNITS
##FACTOR=    0.0002768,     1,               1
##FIRST=     0,             0,               0
##LAST=      2.2672688,     0,               0
##MIN=       0,             -1086218,        0
##MAX=       2.2672688,     1031276,         0
$$ Real data points
##PAGE= N=1
##DATA TABLE= (X++(R..R)), XYDATA
0@%%%%%%qJ6j6J6k4L2l2M0n6P2q8J04j28J60j92K25k65L16l74M36n03N82o74P76
30D15q86J007j145J299j467J650j854K081k326K591k883L206l559L941m358M815
46B527n318N864o457P113p840Q638r517J0499j1601J2844j4253J5868j7748J9962
60A0581k2608K5844k9913L5201m2374N2696o8886R7973j65568N85107J34111j623225
72a011061P35621J306716r59037j158457J299166P90036j427244m73442J536446
81F38744N1373j444423K74754J310373n98042j056028Q17057P78017r93690m20938
91f42803J039272Q4722j010377K40862Q90054n05876p29775P38502N02024q90013
101b83408k50479R64293n456r56564K27546R02155m27664p93819N88524O40706
$$ plain form
0 0 0 0 0 0 0 0 -8 8 -8 8 -16 16 -16 24 -32 40 -48 56 -72 88 -104 121 -144 172 -202 234 -269 313 -361 415
30 415 -471 536 -609 690 -777 873 -981 1100 -1226 1365 -1518 1688 -1871 2070 -2288 2527
46 2527 -2791 3073 -3384 3729 -4111 4527 -4990 5509 -6092 6752 -7501 8367 -9381 10581
60 10581 -12027 13817 -16096 19105 -23269 29427 -39459 58514 -107054 478053 612164 -1011061
72 -1011061 -275440 1031276 72239 -1086218 212948 1002984 -424260 -897702 638744
81 638744 690117 -754306 -479552 830821 232779 -823249 -6192 771825 -221865 -642803
91 -642803 396469 481191 -529186 -288324 601730 95854 -633921 104581 606605 -283408
101 -283408 -533887 430406 424950 -531614 -304068 598087 170423 -623396 -34872 605834
111F05834o95075m60082P34409K87732p28117j28486O85787j7900o05517J40376
121a81039M90943k19938l68514K62389K55743k85707j48225K92846M2690k75631
131a34443M5751K43551j08144k17471J58268K00440k10036j79253K57249J53102
141B09014k92933j33795L28608J18911l75560r0454M23423M2727m57614J3825
151b13848M79873p6385m95596J55687M91886k50315m52082L40597L79175m13536
161e4544k84685M71602J67249n11846k0607N14628j42118m67979K96815L80539
171C49054m32674k61666N48769J08012o31874P7918O60821k73760o30940M56003
181c0337N53552o17047m33315P50522K67472q35987o8195Q55066j35864q11801
$$ plain form
111 605834 -89241 -549323 185086 472818 -255299 -383785 302002 284102 -321415 -181039
121 -181039 309904 89966 -278548 -16159 239584 -46123 -194348 98498 141188 -134443
131 -134443 -88692 154859 46715 -170756 -12488 187952 -22084 -201337 55912 209014
141 209014 -83919 -217714 110894 229805 -145755 -236209 187214 229941 -227673 -213848
151 -213848 266025 189640 -305956 -150269 341617 91302 -360780 -20183 358992 -54544
161 -54544 -339229 132373 299622 -212224 -232831 281797 139679 -328300 -31485 349054
171 349054 -83620 -345286 203483 311495 -320379 -242461 418360 144600 -486340 -30337
181 -30337 523215 -93832 -527147 223375 490847 -345140 -413335 441731 305867 -505934
191e05934L25598P17473m95384n72389O32518L77846p13829j54452P28414o9883
201B69978o84919K81659N90956m74376m44014O29386K51179p24758l7632P57012
211D14471j74189p34961L75938O59848n57632n28852O96428L55604p75470j65917
221d34732P97544k4360p68967K09220O86273l73615n50501M94650L80557n62561
231a46492j99344N83647J6310n60317J62097M87666l17141l72499M30166K35875
241C19968m99201r4619N31980m8154n26371J84553M78571k96210m00149L72352
251B2720L10185m18509k15829M39858J16543m30684k2232L90570n1729l33604
261a92711J03133K72936j40783k07858J65566J37132j70653p1611J59344K0881
$$ plain form
191 -505934 -180336 537137 41753 -530636 101882 479728 -234101 -388553 339861 269978
201 269978 -414941 -133282 457674 -16702 -460716 168670 419849 -304909 -342541 414471
211 414471 240282 -494679 -118741 541107 -16525 -545377 151051 506655 -268815 -434732
221 -434732 362812 338452 -430515 -221295 464978 91363 -459138 35512 416069 -146492
231 -146492 -345836 237811 254121 -306196 -144099 343567 26426 -346073 84093 319968
241 319968 -179233 -273852 258128 209974 -316397 -131844 346727 50517 -349632 22720
251 22720 332905 -85604 -301433 138425 254968 -175716 -197948 192622 140893 -192711
261 -192711 -89578 183358 42575 -165283 283 137415 -33238 -104849 54495 75376
271G5376j45519K0527J33910o0613j18290R5653R9036j20519q5619J42579P9344
282A15865j71517o9594K04274N0663k32343k8083K57251L285k84331L2814L06996
293A85280q4155l12287J40922K98373j94627k71115K47487K27616k98633j59897
303b21036L34975P1691l45008K3243L30921j18550k95861K14473K34078l03379
313g4453j41309L68405K8144m01871R1596M06977k13637l83133L35257L22747
323C38723m42370k26679N18090J09493n58666J7318N66063j50622n35172K82240
333h1582M59662l93526l46642M70353K11849n11545o4243N16485r1548m77632
343c08369K41683L92737l66001k74308M54988J36886n08669J3189N23524j68846
$$ plain form
271 75376 -70143 -49616 84294 23681 -94609 1044 100080 -20439 -106058 36521 115865
282 115865 -55652 -125246 79028 129691 -102652 -130735 126516 129801 -154530 -121716 185280
293 185280 101125 -211162 -70240 228133 33506 -237609 9878 237494 -61139 -221036
303 -221036 113939 185630 -159378 -136135 194786 76236 -219625 -5152 228926 -74453
313 -74453 -215762 152643 180787 -221084 -129488 277489 63852 -319281 15976 338723
323 338723 -103647 -330326 187764 297257 -261409 -244091 321972 171350 -363822 -81582
333 -81582 378080 -15446 -362088 108265 320114 -191431 -255674 260811 169263 -308369
343 -308369 -66686 326051 -39950 -314258 140730 277616 -231053 -217864 305660 136814
353A36814m91791L12220M16797m26298l13192N06374J92120n52832n7693N59342
363B81861p9876n20883K02317M45450k97628l47103L65680K31989m05007j03516
373b26716M07671k5535l72054J38599L09194k29636k29332K99967J34268l44953
383a38527k8504L56791p3802l38076J60553K99726k30699k47219K84726J80508
393B25477l16050j06231L19830L7722l02755J8897K73981o6200k34623J03404
403d6548J84427j23954j31553J27422Q5820j22671m7234J15280J1067j02453K0169
414c0228Q4550m1547o9340N6782O1000p4159n4006R4326M3803j12533l3643J30123
426E5128K5108j52605j1294J77622j3216j96695M4781K06695p8457k10458J16491
$$ plain form
353 136814 -354977 -42757 374040 -52258 -365450 140924 333044 -219788 -277481 281861
363 281861 201985 -318898 -116581 328869 31241 -315862 49818 281807 -123200 -226716
373 -226716 180955 155420 -216634 -78035 231159 1523 -227809 72158 206426 -138527
383 -138527 -167031 189760 115958 -222118 -61565 238161 7462 -239757 44969 225477
393 225477 -90573 -196804 123026 160748 -142007 -123110 150871 84671 -149952 -46548
403 -46548 137879 13925 -117628 9794 95614 -27057 -74291 40989 52056 -50397 -30228
414 -30228 54322 12775 -56565 217 61217 -12942 -66948 27378 71181 -41352 -74995 55128
426 55128 80236 -72369 -83663 93959 80743 -115952 -71171 135524 57067 -153391 -36900
437c6900K05561j60626j83896K03042J43848k34354r1914K52944L2087k59762
447a29970L7203K48864j12453k13301J81876J55726k36790q3785K76169P5k97413
458a73799R4403K92625j90850k58144K76253J99888l43819j25052L92560L5005
468A99070m16805O6163M08403j65853l67547K51870L01994l19898k17050L67580
478A07927J14202l87259r63L72650j08623l27095K04573K58050k83798j68447
488b18783L41517O1029l68658N3517L61861j61946l26348K57113K67539l36048
498f9207j86717L91486Q8676m14607J3791M05065j08923l69254J92499L10505
508B53314k60591k30170L04846J35721l19218l9979L06676m8610k73121J27608
$$ plain form
437 -36900 168661 8035 -175861 27181 171029 -63325 -155239 97705 129792 -129970
447 -129970 -92767 156097 43644 -169657 12219 167945 -68845 -152630 123539 123614 -173799
458 -173799 -79396 213229 22379 -235765 40488 240376 -103443 -228495 164065 199070
468 199070 -217735 -151572 256831 90978 -276569 -24699 277295 -42603 -259653 107927
478 107927 222129 -165130 -166093 206557 97934 -229161 -24588 233462 -50336 -218783
488 -218783 122734 183763 -184895 -131378 230483 68537 -257811 -698 266841 -69207
498 -69207 -255924 135562 224238 -190369 -176578 228487 119564 -249690 -57191 253314
508 253314 -7277 -237447 67399 203120 -116098 -156077 150599 101989 -171132 -43524
518d3524K19974j92166j49495K34408P0828k51833N505K49503p5684k31041J38228
529b5297J96256j87507j48483K17432R6883k29162m8371K28118L366k15700L7450
540g5015J90597o8292j57177Q6017J23012r4219r0816R6913N9001r3163k9340
551e2482Q2526O383o9821R855N9985k4554n1442L9244M1816n1584l3102O2039
563A8863K7836p5385k2655R2956J2249j10303L201J24491k0949j36900M2377J47046
575A02827p0467j49294J02824J39641j33227j20074J59224R2459j81110n4876
585a12073J95002P282j94477M4258J77998r3115j48572J37279J07064j74919n2161
596a06434J99983j3430k06233Q1525J93816j45865j65816K04511J21697k53002
$$ plain form
518 -43524 176450 -15716 -165211 69197 140025 -111808 -106303 143200 67516 -163525 -25297
529 -25297 170959 -16548 -165031 52401 149284 -79878 -128249 99869 103235 -112465 -75015
540 -75015 115582 47290 -109887 -23870 99142 4923 -85893 11020 70021 -23142 -52482
551 -52482 30044 36427 -33394 -23539 36446 11892 -39550 -306 41510 -10074 -43176 18863
563 18863 46699 -28686 -51341 41615 53864 -56439 -53238 71253 50304 -86596 -44219 102827
575 102827 32360 -116934 -14110 125531 -7696 -127770 31454 123913 -57197 -112073
585 -112073 82929 90211 -104266 -60008 117990 24875 -123697 13582 120646 -54273 -106434
596 -106434 93549 80119 -126114 -44589 149227 3362 -162454 42057 163754 -89248
606h9248o1452K83756r113k92070Q0981K79381j49101k47499K10442J95486k58198
617e6635j25839K84608M6993k87286L2320K68939j08314k30014J76475J70243
627A71490k28405r4794K57649J3198k64193O7705K50143j44236k15519K10742
637B3780J61581k59412r4937K86125K4062k92083M6211K78651j12533k45186J68401
648a5340J94162k07121j32961K27095O8123k30076k594K16050o0018j83900J12417
659a4163J37604j49504q4454J71480K8892j79590K7019J72795p9135j50857J20850
670I37J18910j49446q2948J66619M5230j72963p043J66758k6690j49717N1591
681c8762J27011o7693j02756P7605P6996q0877n1009P6335K9001o6848j2897N7184
$$ plain form
606 -89248 -150700 133056 123943 -168127 -87146 192235 43134 -204365 6077 201563 -56635
617 -56635 -182474 102134 149127 -138159 -105839 163100 54786 -175228 1247 171490
627 171490 -56915 -151709 105940 119138 -145055 -77350 172793 28557 -186962 23780
637 23780 185361 -74051 -168988 117137 141199 -150884 -104673 173978 61445 -183741 -15340
648 -15340 178822 -28299 -161260 65835 133958 -96118 -98712 117338 57320 -126580 -14163
659 -14163 123441 -26063 -110517 60963 89855 -89735 -62716 110079 30944 -119913 937
670 937 119847 -29599 -112547 54072 99302 -73661 -80704 86054 59364 -90353 -38762
681 -38762 88249 20556 -82200 -4595 72401 -8476 -59485 16850 45851 -20997 -33894 23290
693B3290L21m8409J1006L8966j9827l0208K5845K4498l2236k1166M1775J6620
705C0475n2966r441O3541J208p4349Q730Q6259k3844r5812M4010R9300o5978r6305
718h5172Q7569Q7811j08962p2293J28876M7409j42227j5496J45839j9270j39888
729h5804N4632J24672q9544r8325J20477O0283j41600j4771J50393l3234j47750
740a00571Q1907J32608j28617j03551J68097O2108j94686j3743K07134l7194k06040
751a32548Q8760J89828j36984j57643J75605J12774k00135o1136K10589N689k06334
762a11535N0803J85611j03181j48706J45036J00099j73059m4833J87191j4400
772G3026j86001P4112J67453j27808j33492J69720Q9238j97928l8861K12033j5155
$$ plain form
693 23290 23611 -24798 -13792 25174 5347 -24861 984 25482 -6754 -27920 13855 30475
705 30475 -22491 -31932 31609 32817 -41532 -32802 53457 29613 -66199 -22189 77111 11133 -85172
718 -85172 2397 90208 -18754 -91047 37829 85238 -56989 -72485 73354 54084 -85804
729 -85804 -31172 93500 3956 -94369 26108 86391 -55209 -69980 80413 47179 -100571
740 -100571 -18664 113944 -14673 -118224 49873 111981 -82705 -96448 110686 73492 -132548
751 -132548 -43788 146040 9056 -148587 27018 139792 -60343 -121479 89110 94799 -111535
762 -111535 -60732 124879 21698 -127008 18028 118127 -54932 -99765 87426 73026
772 73026 -112975 -38863 128590 782 -132710 37010 126248 -71680 -110541 101492 86337
783H6337k10137O8354J91126j14105j58317J48165J16879j69948o9785J78680
793F7249J9667j72533K8616J51640o8966j20615R9312Q3615j19886m2407J29489
804E5181o13j26401M0283J12398p2380r1947R6798O7400j13883l9436J21938J0714
816F0052j20165J4526J10955l4029r8023M9167Q1884n9683o2923O3911M3757o1891
828a2462k7615N6766J4484n0570l097M2933o350l3840J2309K5974j5927k0881
840a8276K0379J6637k5939j1923L1463P085l6941k943M4477k890n3381J2694O0412
853D0854k5286o4132L8711O5430n3569o3472P0329N5416q6232m0643R7759K1432
865E6597j03787K45J04879k4633r9388N0639Q4777p4181o1720R1511L3698j02505
$$ plain form
783 86337 -123800 -55446 135680 21575 -136742 11423 128302 -41646 -111431 67249
793 67249 86916 -85617 -57001 94639 25673 -94942 4370 87985 -31901 -74308 55181
804 55181 54568 -71833 -31550 80848 8468 -83479 13319 80719 -33164 -72600 49338 60052
816 60052 -60113 -45587 65368 31339 -66684 -17517 64367 4684 -58239 5672 49429 -12462
828 -12462 -40077 16689 31173 -19397 -22494 20439 14089 -19751 -7442 18532 2605 -18276
840 -18276 2103 18740 -7199 -19122 12341 19426 -17515 -20458 24019 21129 -32252 -19558 40854
853 40854 15568 -48564 -9853 55577 2008 -61464 8865 64281 -21951 -62594 35165 56597
865 56597 -47190 -46945 57934 33301 -66087 -15448 69329 -4852 -66572 24939 58637 -43868
877d3868j857J06597l3497j01115O9258Q4562j00538n9058J24336K7862j40306
888f7624Q129J46783m7403j40956Q5449J22583j17011r5089J40524O0800j55001
899e8816k1083J58254k1547j47762O1356J25094r4214r3766J18783N6110j34198
910e1789j3039J37420l1260j27445P1279J06866j04161p8872J29272M4659j44911
921f1981n855J48178l2754j39407O6730J21523r4442r6711J15500O5249j27096
932d1066l0031J27494m487j17514L4610J00396o0010p7071P9593M8015r0506j6432
944d7009R1541j3119q5047L8890P3123o0699n6030P7053L4658q5439j2708Q6194
956D1408o496q2055K2744P4161l6345o2172M5429M7690m8605l4066M7433K2913
$$ plain form
877 -43868 -45725 60872 27375 -73740 -4482 80080 -20458 -79516 44820 72682 -67624
888 -67624 -59495 87288 39885 -101071 -15622 106961 -10050 -105139 35385 96185 -58816
899 -58816 -79899 78355 56808 -90954 -29598 95496 1282 -92484 26299 82409 -51789
910 -51789 -64828 72592 41332 -86113 -14834 92032 -12129 -91001 38271 82930 -61981
921 -61981 -67836 80342 47588 -91819 -25089 96434 1992 -94719 20781 86030 -41066
932 -41066 -71097 56397 51910 -65604 -30994 69402 9392 -67679 11914 59929 -30577 -47009
944 -47009 44532 31413 -53634 -14744 58379 -2320 -58350 18703 53361 -32078 -44786 41408
956 41408 34912 -47143 -24399 49762 13417 -48755 -3326 44364 -4241 -38307 9126 32039
968C2039m4605j2971M0114M137l3285J728K6005m336k0844O449J7275r550j3425
981a1269J2255R826j4442p660J8090N679k3803j659K9893m777l4578J2164L8181
994B7900k0295m1389L1052M1790m3625l7364N4950K9093o3771j8542P0663N111
1006C5573p4935J2085P3542l0426o5593M6830N2658o0269l5949P0966J4711p6785
1018c7592J0291P4992l5392o5853N7724N1359p6802l2017R1809P412r9781K0242
1030c3608R8767m6840r0010P0236P5316r0142n4573J04940K7982j11402J167J08238
1042F0071k8799r7657N3718Q0594p5213n6619R0598K6964r6681M094R3882l3293
1054B1659q4168O0031O7616q2938m3973R8375J6007j04362J2097J02291l8206
$$ plain form
968 32039 -12566 -25537 14577 18714 -14571 -12843 13162 8826 -12018 -5569 11706 2156 -11269
981 -11269 986 10812 -3630 -11290 6800 12479 -11324 -12983 16910 12133 -22445 -10281 27900
994 27900 7605 -33784 -2732 39058 -4567 -41931 13019 42112 -21659 -40201 30462 35573
1006 35573 -39362 -27277 46265 15839 -49754 -2924 49734 -10535 -46484 24482 39193 -37592
1018 -37592 -27301 47691 12299 -53554 4170 55529 -21273 -53290 38519 45931 -53850 -33608
1030 -33608 65159 18319 -71691 -1455 73861 -16281 -70854 34086 62068 -49334 -48167 60071
1042 60071 31272 -66385 -12667 67927 -7286 -63905 26693 53657 -43024 -38930 54952 21659
1054 21659 -62509 -2478 65138 -17800 -61773 36602 52609 -51753 -39656 62635 24429
1065B4429r3668O1897P7986q0953n5833R2230L0744r5052o396R1358j6318q2076
1077e1652L7040O6474n3161m5840O2107K4167o4786l518O2982j6236n6494L4201
1089d716M4658m7498k9860N4927J5371n8262j668N8531j1918n4646K3807M6681
1101C5407l1538l7296L5309K8581l7034k0010L7058J0956l3879l562K8412o85
1113A1719k3372L156J9570n745j5364P619J0878p746q268Q073P286j0242o004
1126h440J3782K994j6647J65J9574l320k3760Q593K7536j6482k8639K4974K6988
1139B7318l2692k3761M0399J8477m7982r571N3108k365n3796J4542N0884k6015
1151H546m5334L7577L5772m7794k1535N3865M587n4685J2400N1447k8981m4545
$$ plain form
1065 24429 -69239 -7342 70644 -10309 -66142 26088 56832 -38220 -44616 46742 30424 -51652
1077 -51652 -14612 51862 -1299 -47139 14968 39135 -25651 -29169 33813 17577 -38917 -4716
1089 -4716 39942 -7556 -37416 17511 32882 -25380 -27048 31483 19565 -35081 -11274 35407
1101 35407 3869 -33427 1882 30463 -6571 -26581 10477 21433 -12446 -16008 12404 11719
1113 11719 -11653 -8497 11073 5328 -10036 -2417 8461 715 -7553 520 7806 -2436 -8440
1126 -8440 5342 8336 -8311 -8146 11428 8108 -15652 -7059 20477 3995 -24644 330 27318
1139 27318 -5374 -29135 11264 29741 -18241 -27812 25296 22931 -30865 -16323 34561 8546
1151 8546 -36788 789 36561 -11233 -32768 21097 25684 -29001 -16601 34846 5865 -38680
1163c8680M5403L2379n8985j5368O7070l757o9398K2684O7202m1465n9949N9167
1175F303M6453p2576k8244P9610Q601q1122J1243P7619l1108o8054M9105N1999
1187D9829o1751l2308O8270J1675o9813R366O6420l0526n6588M8873M1180o1633
1199a7006k3191O9029M433p1951J5141O9435l4280o0523M9824M7040o0340l1537
1211d3926O6338J5028o8225K585O4649j9494n5195L2389M2600m1148k8554M6535
1223A3582J3394m8248K757M4760j7255l6977K7888K7572l5344j7519M0516O209
1235B1335m2153N165L9699j4339l4546K0332K9038k4559k3064K7412J6007k7681
1247g354r316K5133M821k1898k147J9493m97j6539K603J2871l130j0097K819Q990
$$ plain form
1163 -38680 6723 39102 -19883 -35251 31819 28062 -41336 -18652 48550 7085 -52864 6303
1175 6303 52756 -19820 -48064 31546 40147 -40975 -29732 47887 16779 -51275 -2170 49829
1187 49829 -11922 -44230 24040 35715 -34098 -24732 41688 11162 -45426 3447 44627 -17006
1199 -17006 -40197 28832 33265 -38686 -23545 45890 11610 -48913 911 47951 -12389 -43926
1211 -43926 22412 37440 -30785 -28200 36449 16955 -38240 -5851 36749 -4399 -32953 13582
1223 13582 26976 -21272 -18515 26245 8990 -27987 -99 27473 -7871 -25390 15126 21335
1235 21335 -20818 -15653 24046 9707 -24839 -4507 24531 -28 -23092 4320 20327 -7354
1247 -7354 -16670 8463 13284 -8614 -10761 8732 8235 -8304 -5701 7170 4040 -6057 -3238 5752
1261E752l523q191N369O462o910m677Q258L537j0955j486J4527k630j6958P763
1275c662J7759j2711j8063J8192J7591k4882j4595L1246Q745l5367j620L7257
1287A9890n696l8047J4317L6360k3707l0762L1709K1917l6793j1900L9628Q92
1299A7808m0339J1660L7355k4307k9939L4630J9656m1807q141M6595m953m8299
1311c0081J9416M5237l3061l7518M3608K7194n1042j5398N5987J421n6708J3545
1323a7400N2241k6985m3499L7267L2419m4879j9186M9476L789m9463J1945M4421
1335C0146k5691l5686L6334K4979m4580j2007M9508k818m9429J7125M4705k8780
1347C806l7394L7996K8060m4862j6450M8138L610m6793P956M1995j7151l5484
$$ plain form
1261 5752 2229 -5962 -593 5869 -1041 -5718 2540 6077 -4878 -6364 8163 5533 -11425 -3662
1275 -3662 14097 1386 -16677 1515 19106 -5776 -20371 10875 19620 -15747 -17367 19890
1287 19890 14194 -23853 -9536 26824 3117 -27645 4064 25981 -10812 -22712 16916 17808
1299 17808 -22531 -10871 26484 2177 -27762 6868 26524 -15283 -23424 23171 18218 -30081
1311 -30081 -10665 34572 1511 -36007 7601 34795 -16247 -31645 24342 25763 -30945 -17400
1323 -17400 34841 7856 -35643 1624 34043 -10836 -30022 19454 23243 -26220 -14275 30146
1335 30146 4455 -31231 5103 30082 -14498 -26505 23003 20185 -29244 -12119 32586 3806
1347 3806 -33588 4408 32468 -12394 -28844 19294 22904 -23889 -15933 26062 8911 -26573
1359b6573K4827K7012l0557j6444L2862N365l1421M266K7889j2291k3151J9245
1371A029J6741k4566q690K6652Q37k6073N502K4473j0904k1923J5853J7562j8961
1384b468j2394J9637P890j8759m703J7843J519j6078J315J3146k552j0302K464
1397c442Q511k355p491K924O124l166m875L035M646l816m635O028L252q113r82
1412d355R620j426j1092M221J2729q553j3073J3659J1266j7958q232K1353M735
1425A2894k4484MK6641o466k6228J3137K3282j8599j9037K3078J3610k6915o160
1438a5243K8839k730k7668J1394K3781j8660j8455K5074J1417l0333k115L2701
1450A8002q177l1546J7534K8053k5769k2649L2978J4931l8076n235L9897n095
$$ plain form
1359 -26573 -1746 25266 -5291 -21735 11127 16492 -14929 -10663 17226 4935 -18216 1029
1371 1029 17770 -6796 -15486 11166 12003 -14070 -8568 15905 5001 -16922 -1069 16493 -2468
1384 -2468 -14862 4775 12665 -6094 -10797 7046 8565 -7513 -6198 6948 4396 -5906 -3442
1397 -3442 5069 2714 -4777 -1853 4271 1105 -3770 -735 3911 95 -4540 1488 4740 -3373 -4355
1412 -4355 5265 3839 -7253 -3032 9697 1144 -11929 1730 12996 -4962 -13194 8159 12894
1425 12894 -11590 -11586 15055 8589 -17639 -4502 18780 181 -18856 4222 17832 -9083 -15243
1438 -15243 13596 10866 -16802 -5408 18373 -287 -18742 6332 17749 -12584 -14699 18002
1450 18002 9825 -21721 -4187 23866 -1903 -24552 8426 23357 -14719 -19954 19943 14848
1462A4848l8187J4342L4151k2456k8093K9567J9278l4053q785L5058j767l2932
1474a9029J1126K9007j9950k2645K7263J3861l1762l868L2922n634l1628J4295
1486f042K8509k2446k2755K8856J4855l2368o223L2810j588l1527R113K8273j6082
1499C385k2509K1030J5096k3264p636K3355Q08k2161N918J9182j1911j4151J5783
1512B925Q450j7508l277J8047j509j7719O317J5743j0116j2532J2111R321j2859
1525b606o683J3247M103j2998j494J1630k85r730Q62Q391j139p566J807O329k101
1540A767m983J740M512j794m508K661M067l934k804M635J739n472o64O918j383
1555B497q147M462Q083p453p201R991O181j2819m382J5754J025j7566L305J7662
$$ plain form
1462 14848 -23339 -8997 25154 2698 -25395 4172 23450 -10603 -19388 15670 13903 -19029
1474 -19029 -7903 21104 1154 -21491 5772 19633 -12129 -15997 16925 11291 -20337 -6042
1486 -6042 22467 21 -22734 6122 20977 -11391 -17614 15196 13608 -17919 -8806 19467 3385
1499 3385 -19124 1906 17002 -6262 -13898 9457 10265 -11896 -5978 13204 1293 -12858 2925
1512 2925 11375 -6133 -9410 8637 7128 -10591 -4274 11469 1353 -11179 932 10253 -2606
1525 -2606 -9289 3958 8061 -4937 -6431 5199 4914 -4816 -3954 4437 3298 -4268 -2461 3868 1767
1540 1767 -3216 -1476 3036 1242 -3266 -605 3462 -472 -3276 1359 3098 -2374 -3038 3880 2497
1555 2497 -5650 -1188 6895 -558 -7759 2232 8413 -4406 -8788 6966 7991 -9575 -6270 11392
1569A1392p321j6738J1130J5010j5033j1833J8492O767k0126j137K0099m428j8746
1582a2472R837J6168j5218j1578J9490N299k1584J274K1904p697k0805J4066J8063
1595A6747k0173j3027K4531O526k6516lK6869o552k5552J3147K2088j9017j6357
1608a7289K2721R737k4370l020K4573m138k2847J1199J8828j6942j2950K0531
1620F033O599k2426o8K2865o790k1263J3153J7521j7982j2537K0929P285k2515
1633i196j750K2659l907k0996R056J7508j2708j3209J4883Q778j6137m001J6214
1646G194j127j4530N494J1528q433q306J0518M992j2035j112J2284k717j1115
1659g365N585R334p452p576Q967N463r864l037R819Q13q723L34P699j052o869
$$ plain form
1569 11392 4071 -12667 -1537 13473 -1560 -13393 5099 11866 -8260 -9397 10702 6274 -12472
1582 -12472 -2635 13533 -1685 -13263 6227 11526 -10058 -8784 13120 5423 -15382 -1316 16747
1595 16747 -3426 -16453 8078 14604 -11912 -11915 14954 8402 -17150 -4003 18085 -932 -17289
1608 -17289 5432 15169 -9201 -12221 12352 8214 -14633 -3434 15394 -1548 -14498 6033
1620 6033 12632 -9794 -9862 13003 6213 -15050 -1897 15624 -2358 -14895 6034 13319 -9196
1633 -9196 -10946 11713 7806 -13190 -4134 13374 666 -12543 2340 11118 -5019 -9020 7194
1646 7194 6067 -8463 -2969 8559 126 -8180 2338 7330 -4705 -5817 6467 3750 -7365
1659 -7365 -1780 7554 102 -7474 1493 6956 -2908 -5945 3874 4687 -4036 -3702 3997 2945 -3924
1674c924J819N768k185m507J903L717j511l628J650L458k128k925K359K602k720
1689b52k436L660J742m869j85N544j561n710L279N663n242n379P747M028r926
1704c897j697J1106o64j1821L230J2025o275j1215R351R136j1761o083J3086K855
1718G376j3693O26J3654m727j2248Q653R352j1512n689J3313J870j4521K600J4569
1732I623p450j2844J1676R761j4783o062J6843J992j8014K660J7717p467j5620
1745a1968J1490J2305j4208q521J6064M202j7023Q72J6201n715j3815R581J0464
1758I929j2335o709J4405K276j5368K689J4593p198j2414J0642R654j3300o289
1771i425J5135K206j5688J955J4683n469j2707Q188J0228j0282p190J1698L467
$$ plain form
1674 -3924 -2105 3663 1478 -3029 -1126 2591 1080 -2548 -898 2560 432 -2493 -134 2468 -252
1689 -252 -2688 972 2714 -2155 -2340 3204 1643 -4067 -788 4875 -367 -5746 2001 6029 -3897
1704 -3897 -5594 5512 4848 -6973 -3743 8282 2007 -9208 143 9279 -2482 -8565 4521 7376
1718 7376 -6317 -5691 7963 3236 -9012 -359 8993 -2519 -8208 5105 6975 -7546 -4946 9623
1732 9623 2173 -10671 1005 10766 -4017 -10079 6764 8756 -9258 -6598 11119 3652 -11968
1745 -11968 -478 11827 -2381 -10902 5162 9364 -7659 -6787 9414 3699 -10116 -535 9929
1758 9929 -2406 -9115 5290 7566 -7802 -5113 9480 2282 -10132 510 10164 -3136 -9425
1771 -9425 5710 7916 -7772 -5817 8866 3397 -9310 -1122 9106 -1176 -8366 3332 6799
1784F799j1698J18J0536l019q760N067O941o957m359Q100J387q063J083P301k875
1799A601o413M349N386n799l639O327K004o172q08N733J04n401P14M787j393l873
1815b493J521L066j299k701J225K537j467k068J455J638j207j686J481J582k085
1830e01r55K524Q3k695O56K933j526l289K965L062m475k166N625R39o374K26P204
1847D236j855p697M057P213o089n869P431M440q693k509R615m1r746K925Q741
1862F159n424o984P271M956q921k363J0045q44j0144M299Q982p039p269R288N112
1877G124j1270k124J2354j376j2169M733J0806p281r006R532O528j1255l363J1980
1891E213k82j1311L445R870o081p934Q378N296j0058j941J0574j522r932M421
$$ plain form
1784 6799 -4899 -4781 5755 2736 -6024 -957 5984 -973 -5332 2768 4155 -3908 -2825 4476 1601
1799 1601 -4812 -463 4923 -876 -4515 1812 3816 -2356 -3164 2569 2673 -2728 -2014 2773 1380 -2493
1815 -2493 -972 2094 795 -1906 -681 1856 389 -1679 -224 1414 207 -1479 2 1584 -501
1830 -501 -1456 1068 1151 -1544 -888 2045 519 -2770 195 3257 -1218 -3384 2241 3180 -3194 -2968 4236
1847 4236 2381 -5316 -1259 5954 -135 -6004 1427 5867 -2826 -5335 4280 4239 -5507 -2582 6159
1862 6159 735 -6249 1022 5978 -2943 -5306 4739 3895 -6249 -1950 7032 -7 -7276 2012 7124
1877 7124 -4146 -6270 6084 4708 -7461 -2728 8078 797 -8209 1323 7851 -3404 -6767 5213
1891 5213 4931 -6380 -2935 6935 854 -7080 1298 6594 -3464 -5405 5169 3647 -6285 -1864
1905a864Q676o881o925R054M453j0435j460J0618j317r971L627Q934n694p333
1919f518P404N069q295k506Q278J75p662J795O721l678n201N131L244n894j099
1934c036N816o32n488K163M897l672l807M723K400n058j039M815K58m698N89M341
1950B572j461l511J865K537j649k135J455J949j493j479J364J093j032j090Q62
1965a53J273j215j111J639O30j734l07J932k1k318Q08K461j835k231K866J551
1981B235l560r10M352k4m969J314N126k792m709L989L953m962l049N925J755o656
1997b982J59O572k056n830L562M871m984l540O323J497o924Q12O738k921o041
2012d744M785N026o581l421Q011J169q695J313Q391l353p678N283O518p127m643
$$ plain form
1905 -1864 6812 -69 -6994 2060 6513 -3922 -5382 5236 3919 -6052 -2425 6509 815 -6518
1919 -6518 886 5955 -2340 -4846 3432 3607 -4055 -2260 4461 783 -4418 713 3957 -1937 -3036
1934 -3036 2780 2148 -3340 -1177 3720 48 -3759 964 3364 -1694 -2733 2082 2340 -2358 -1769 2572
1950 2572 1111 -2400 -535 2002 353 -1782 -327 1622 129 -1350 14 1107 75 -1015 -153
1965 -153 1120 -95 -1206 433 1063 -671 -978 954 933 -1385 -577 1884 49 -2182 684 2235
1981 2235 -1325 -2235 2117 2093 -2876 -1562 3564 772 -3937 52 4005 -957 -4006 1919 3674 -2982
1997 -2982 -2823 3749 1693 -4137 -575 4296 -688 -4228 2095 3592 -3332 -2520 4218 1297 -4744
2012 -4744 41 5067 -1514 -4935 3076 4245 -4450 -3137 5254 1901 -5777 -494 6024 -1103 -5746
2027e746Q358K284q707J76Q215k262p422M300O104o202m001P313J571p559P24
2042b854P305k892o531M873N222o635l183P535J084p632P47P453k697o710M437
2057d78N387n782l486O159J787o093k56N831j342n155K850L897l860k301M121
2072A279R48m178K36M148j564l502K588K580l172j592L242J003l385k72L364n34
2088A189k964J065K355j251j869J194J717j409j273J390Q11j021o91P53O90p40
2104e4o76R47L05q28k54Q26L06j090q6J464o09j334J119J142j574r10K080P35
2122A509k889j1L326r29l335J815L110k548k946L526K274m354j073M624j37m511
2138b549J188M238k237l786L473K684m395j207M723k88m466J513M283k973l656
$$ plain form
2027 -5746 2612 4896 -3811 -3635 4580 2318 -5104 -804 5300 -902 -4903 2410 3981 -3578 -2854
2042 -2854 4451 1559 -4972 -99 5123 -1512 -4695 2840 3924 -3708 -2961 4492 1795 -4915 -478
2057 -478 4909 -873 -4359 1800 3587 -2506 -2762 3069 1727 -3428 -578 3319 -541 -2842 1279
2072 1279 2227 -1951 -1715 2433 869 -2633 -45 2535 -637 -2229 1013 2016 -1369 -1641 1723 1189
2088 1189 -1775 -710 1645 394 -1475 -281 1436 27 -1246 144 955 -66 -757 -4 686 -54
2104 -54 -730 217 522 -306 -560 266 572 -518 -604 860 251 -1083 36 1178 -396 -1306 774 1509
2122 1509 -1380 -1391 1935 1006 -2329 -514 2596 48 -2898 628 2902 -1452 -2525 2099 1962 -2549
2138 -2549 -1361 2877 640 -3146 327 3011 -1384 -2591 2132 1844 -2622 -1109 3174 201 -3455
2153c455M392K358n281p82N557p38n450K034N225l533m404M854K956n542j359
2168c168N643ln585J506N196l177m013M323K485m883q87M952m58m955K006M422
2184C404l496l308M546J883n019o09N169n58n157K014M537l262l482L984K280
2199B926m191j244M340R0m249J268L478k222k486K687J563k957o86L229m48l008
2215a910J506K280k089j567K423R32k548m22K754m32k450J007J977j210j527J170
2231a06J314j354q93J344M32j027j69O58K48m94m20O31J56n17j09M17K34m48l78
2250d81Q75o9r93N63O76o12p00R27P54j506m03J933k11k073Q94J933j233j988
2268a714J793J869k577j255L008M10l013L35K887q76k993J897K419k676j460L071
$$ plain form
2153 -3455 937 3295 -1986 -2768 2789 2051 -3399 -1365 3860 327 -4077 777 3733 -1809 -3168
2168 -3168 2475 2472 -3113 -1607 3589 412 -3601 722 3207 -1676 -2563 2389 1931 -3024 -1018 3404
2184 3404 -92 -3400 1146 3029 -1990 -2599 2570 2012 -3145 -1131 3406 144 -3338 646 2926
2199 2926 -1265 -2509 1831 1921 -2328 -1060 2418 196 -2290 397 1960 -997 -1683 1546 1098 -1910
2215 -1910 -404 1876 -213 -1780 643 1575 -973 -1395 1359 927 -1523 -516 1461 251 -1276 -106
2231 -106 1208 -146 -1039 305 737 -290 -459 199 447 -47 -467 164 320 -197 -306 111 345 -103 -481
2250 -481 394 325 -668 -105 571 -41 -741 186 940 -566 -969 964 753 -1320 -426 1507 274 -1714
2268 -1714 79 1948 -629 -1884 1124 1534 -1479 -1144 1743 867 -2126 -229 2190 -486 -1946 1125
2284A125M39l199M71L165j393l049K615K261l514j127L933Q8m091R15M157k116
2300F80l824L383K843m093j680M334O36m518M81M452j825l781L030K647l621j554
2316b410L945L65m109R41L958k308l200L352K118l914j080M186K6m314J182M125
2332B863k478l257L283K213l609j329L756M73l973P82L509j809k472K299J642
2347A893k606r22K811J13k927J020K403j699j762K048J104k203p14K576q2k434
2363a381P88K008j124j542J127J377j390j000J556M47j412mR14N8p84O4P34l22
2381A14m06L11J80k18q6k4L29j98k88L84J48l58j88M41L50q42k34J277k33j353
2401h94N49J374p82j575J283J519j851j188K325N94k436n1K514m90k584J236K400
$$ plain form
2284 1125 1564 -1635 -1164 2001 608 -2441 174 2435 -1079 -2206 1727 1815 -2276 -1361 2796 680
2300 680 -3144 239 3082 -1011 -2691 1643 2279 -2239 -1758 2694 869 -2912 118 2765 -856 -2410
2316 -2410 1535 1900 -2209 -1268 2690 382 -2818 534 2652 -1262 -2342 1844 1870 -2444 -1262 2863
2332 2863 385 -2872 411 2624 -985 -2314 1442 1915 -2058 -1276 2233 424 -2048 251 1893
2347 1893 -713 -1635 1176 1289 -1638 -618 1785 86 -1676 372 1476 -727 -1441 1135 1053 -1381
2363 -1381 -593 1415 291 -1251 -124 1253 -137 -1137 419 866 -546 -550 364 422 -362 -298 436 114
2381 114 -292 19 199 -19 -105 -129 200 2 -286 98 246 -112 -300 141 491 -351 -585 692 459 -894
2401 -894 -345 1029 247 -1328 -45 1474 -377 -1565 760 1354 -1082 -1133 1381 891 -1693 -457 1943
2418A943k084j675K575P62k688p9K819p37k814J762K382k714j478L165N87l401
2434a675K33L590j241l479K400K814l243j870L606J079l839k04M094j137l685
2449b557K234K818k945j882L301J025l677J23L764j432l239K518K304l107j472
2464b224L517O65l903M70L937j680l352K545K488k972j813L367J014l683J71L414
2480A961j201k738J840J944k187j340K637N15k801N11K456j324j884J747J421
2495A557k113q57K369J75k499O50K121j127j702J321J357j431j015J688M62j623
2511f67N2J165j11r80K52Q29m43n53N21J80l67R6L6J65k37j21K75M7k88R6J47
2532I4J47l81j84P02j63p03L40P77n08q80O84J068j186q75J536M06j579q6J573
$$ plain form
2418 1943 -141 -1816 759 1521 -1167 -1246 1573 836 -1978 -216 2166 -548 -2026 1139 1726 -1675
2434 -1675 -1442 2148 907 -2572 -172 2642 -601 -2471 1135 2214 -1625 -1829 2265 1128 -2557
2449 -2557 -323 2495 -450 -2332 969 1994 -1683 -1560 2204 772 -2467 51 2355 -752 -2224
2464 -2224 1293 1958 -1945 -1475 2462 782 -2570 -25 2463 -509 -2322 1045 2059 -1624 -1453 1961
2480 1961 760 -1978 -138 1806 -381 -1721 916 1431 -1370 -859 1597 273 -1611 136 1557
2495 1557 -556 -1413 956 1131 -1368 -718 1403 276 -1426 -105 1252 -179 -1194 494 956 -667
2511 -667 -615 550 439 -541 -289 540 97 -456 65 245 -122 -26 10 175 -62 -183 92 139 -149 -53 94
2532 94 241 -140 -324 378 215 -488 -148 629 121 -759 -75 993 -193 -1068 468 874 -705 -791 782
2551G82p7j794N93J775j205j307J594P69j825k46J939k35k120J053J819j743j259
2568a487K258N32k422l5K659o17k833J632K409k397j680K750J080l097l49L238
2584A641n80l118J639K481k308j699K606J031k956j51L097q31k903J918K136k536
2600e33j404K939P04l275K91L388j457k961K241K309k719j591L044Q88l353J48
2616a341L228j161k649J756K014k186j370K536O60k818M26K456j239j881J730
2631A61J379k080r51K428L02k588N75K193j121j758J459J402j625j085J881N08
2647A080j980K00J579m73j190N54J080r19o71J131R4j000K74O90k50o69L90N66
2665D86n48m18O62J32m84j31L99K64n41k69P38J40o47k34O23M35r84k74J228N6
$$ plain form
2551 782 705 -1089 -496 1279 74 -1233 361 1130 -695 -941 998 763 -1357 -304 1515 -228 -1487
2568 -1487 771 1303 -1119 -1154 1505 888 -1945 -313 2096 -301 -1981 769 1849 -1248 -1597 1641
2584 1641 1061 -2057 -418 2063 -245 -1944 662 1693 -1263 -1414 1683 852 -2051 -133 2003 -533
2600 -533 -1937 1002 1706 -1569 -1278 2110 653 -2308 -67 2242 -477 -2068 976 1864 -1489 -1341
2616 -1341 1887 726 -1923 -167 1847 -339 -1709 827 1487 -1331 -905 1551 312 -1569 161
2631 161 1540 -540 -1491 937 1239 -1349 -774 1419 298 -1460 -1 1401 -224 -1309 572 1080
2647 1080 -900 -700 879 406 -784 -230 850 -69 -740 391 485 -515 -241 449 199 -470 -80 486
2665 486 -62 -480 182 314 -170 -301 98 362 -179 -448 290 430 -217 -451 172 607 -377 -651 577 633
2685F33j337K15J282l98j384O96J446j248j018J547M93j663n2J763l89j848J050
2702b12J742j875j041K143M69k382J80K494p94k612J682K268k472j517K824Q63
2718A760l065j66L202o79l178J730K622k547j743K899J022l175j73L364r84l197
2734b308K199K476k884j621L286P58l670K67L859j543l408K465K659l006j873
2749b344L467J062l833l8L823j191l259K046K459k556j704K977Q91l324K40L214
2765A930j300k643J999K021k521j424K977O02l224M66K957j253k452J702K082
2780A919k172j510K523P90k706O7K337n75j919Q41J641j212j177J509N38j501
2796f07l9J263j94j052L56J082p57p95R18M05q14k82P18L27q09k79R70L5q55j5
$$ plain form
2685 633 -704 -489 793 395 -989 -293 1153 -95 -1113 434 927 -736 -788 975 586 -1262 -212
2702 -212 1530 -345 -1386 757 1226 -1156 -976 1518 724 -1888 -206 2062 -410 -1927 897 1760
2718 1760 -1305 -1471 1731 1052 -2126 -396 2226 -321 -2064 835 1857 -1318 -1491 1873 889 -2308
2734 -2308 -109 2367 -517 -2138 1148 1906 -1764 -1497 2362 819 -2589 -124 2535 -471 -2344
2749 -2344 1123 2185 -1648 -1686 2137 946 -2313 -267 2192 -364 -2068 909 1800 -1524 -1284 1930
2765 1930 630 -2013 -14 2007 -514 -1938 1039 1641 -1583 -1117 1840 587 -1865 -163 1919
2780 1919 -253 -1763 760 1550 -1156 -1089 1248 673 -1246 -405 1236 24 -1153 356 894 -607
2796 -607 -646 617 423 -629 -273 809 52 -743 175 580 -234 -516 202 529 -280 -559 411 446 -409 -424
2816d24Q47Q1j000n0J244k91j188N21J066n78j110Q11J097j199r09J636K96j559
2834g09K0J620m59j671R58J671j669j174K149N49k475J01K546o68k742J619K466
2851B132k463j790K957J077l226l67L474n41l495J642K972k456k221K988J463
2866B146l405n18L634n78l613J924K871k734k070L261J222l709k41M009j002l848
2882b651K239L124l027k350L624J449m048l96M240q57l864J868L213k642k408
2897b486L201J459l608l34L738r01l335J911K633k474k032L110J154l456k18L578
2913A940r28l098J616K620k205k019K694J278l024l92K920l72k545Q84K208j356
2929B21j813J869J088k063l45J969k70j653N42J515r29j243J292P97j365m02J266
$$ plain form
2816 -424 423 504 -496 -546 698 407 -781 -260 806 228 -882 -71 1026 -173 -1082 554 850 -709
2834 -709 -689 931 472 -1199 -241 1430 -239 -1413 736 1285 -1190 -1089 1457 789 -1953 -334 2132
2851 2132 -331 -2121 836 1913 -1313 -1680 1794 1253 -2242 -600 2372 -84 -2305 683 2146
2866 2146 -1259 -1777 1857 1279 -2334 -410 2461 -273 -2343 918 2140 -1569 -1810 2199 1197 -2651
2882 -2651 -412 2712 -315 -2665 959 2408 -1640 -2036 2204 1347 -2517 -649 2564 -78 -2486
2897 -2486 715 2174 -1434 -1768 1970 1069 -2266 -355 2278 -196 -2228 882 2036 -1420 -1638 1940
2913 1940 1012 -2086 -470 2150 -55 -2074 620 1898 -1126 -1518 1402 1030 -1515 -631 1577 221
2929 221 -1592 277 1365 -698 -1043 926 656 -997 -455 1060 131 -1112 180 977 -388 -790 476
2946D76K46j265j22J302j39j215L66J027k77j071K53J222m32j343P94J105p77
2963A50j146R25J153j268r25J693M60j824rJ779l76j857Q98J839j624j429K187
2980F26Q01k494j73K632m03k808J300K673k244k103K830J455l261p82L653r9l829
2997b226J240L525k258k829L012J919l475j052L890Pm145J380L768k575k957L337
3013E61K096l963j162M598k76m654J725M242l015l340L730K481m341j416M881
3028B147o0m795J361M324k429l544L278K632l999j415M362%m221J260L776k307
3044C70l168L172K273l776j221M235k14l970J210L585k038l106K791K376l395
3059h76j328L586K75l325M42L050j119k633J752K020k239j165K229N54k179lK098
$$ plain form
2946 476 722 -543 -665 637 498 -717 -351 676 399 -672 -419 803 371 -972 -178 927 150
2963 150 -996 -71 1082 -186 -1111 582 1042 -782 -791 988 612 -1245 -347 1492 -132 -1561 626
2980 626 1427 -1067 -1240 1392 989 -1819 -519 2154 -90 -2193 637 2092 -1169 -1951 1702 1603 -2226
2997 -2226 -986 2539 281 -2548 464 2383 -1092 -2144 1746 1753 -2392 -1012 2756 181 -2776 561
3013 561 2657 -1306 -2468 2130 1854 -2800 -1075 3167 152 -3188 542 3023 -1318 -2734 2147
3028 2147 2087 -2708 -1347 2977 548 -2996 282 2914 -1085 -2500 1862 1862 -2359 -1099 2677 370
3044 370 -2798 374 2647 -1129 -2350 1885 1671 -2299 -1089 2496 458 -2648 143 2519 -876
3059 -876 -2204 1382 1657 -1668 -1226 1824 705 -1928 -176 1844 -395 -1560 669 1223 -956 -959 1139
3076A139n35j908J151J436j458r00J387O46j410m29J450K62j627K34J369l19j259
3093g71L43J304m63j391P65J231r14j073R51J141j282j033J590P28j802k71J768
3110H21q5j863N36K024j208j866J904J339k333p62K700J49l006N88L155j544k978
3127b429K569K302l194j643L747Q42m198K35M341j508l929K577L184l318k414
3142b836M028J389m600N7M531j457m016K602L313l555k423M317J371m985L02M829
3158B867j682m358K853L649l868k794M744J479n144mN065j330m573K400L966l463
3174a93k962M304J597m699j34M541j114m105K157L490l169k552L986J266m181
3189a768q9M055q83l928J973L322k849k503L544J346l541n28L505k93l345J114
$$ plain form
3076 1139 604 -1304 -153 1283 -175 -1075 312 958 -452 -881 569 831 -796 -562 807 488 -771
3093 -771 -428 876 413 -978 -213 1018 104 -969 -18 1123 -159 -1192 398 1126 -676 -947 821
3110 821 736 -1127 -591 1433 225 -1641 263 1602 -731 -1493 1207 1356 -1650 -1062 2093 549 -2429
3127 -2429 140 2442 -752 -2395 1352 2194 -2004 -1769 2572 1064 -2865 -288 2896 -422 -2836
3142 -2836 1192 2581 -2019 -1962 2569 1112 -2904 -302 3011 -544 -2967 1350 2721 -2264 -1962 2867
3158 2867 1185 -3173 -320 3329 -539 -3333 1411 2890 -2254 -2258 2807 1477 -3096 -696 3270 -193
3174 -193 -3155 1149 2746 -1953 -2087 2454 1340 -2765 -608 2882 -287 -2839 1147 2413 -1768
3189 -1768 -1857 2198 1315 -2613 -640 2682 -167 -2670 874 2220 -1321 -1849 1656 1363 -1982 -868
3205h68K920j832k170K279J377k444o32K411K6k285N55K063j203j462J359J109
3221A203j541o89J570L98j688Q6J384j43j309K51J204l34j267M93J270o86j173
3238i71P69J208r20j241J253J096j577p33J771L63j827j31K112m78k182J207J870
3255A589j771j389K089J017k530m08K930n31k933J419K595k134k173K794J626
3270B190l410q43L859j84l930J373L488k242l017L052K289l797j262M296J0m276
3286b404J234L870k262l373L351K486m188j220M605j03m557J308M272k520l727
3301c228L621K795m519j527M923O8m667R94M464k182l893L348K794m013j516M257
3317A719K77m255Q53M009k033l392L132K314l731j135L855J50l843Q44L660j918
$$ plain form
3205 -868 2052 220 -1950 329 1706 -738 -1370 1041 1067 -1218 -663 1400 197 -1265 94 1203
3221 1203 -338 -1027 543 941 -747 -661 723 580 -729 -478 726 392 -875 -382 888 202 -971
3238 -971 -202 1006 86 -1155 98 1194 -383 -1116 655 1018 -809 -940 1172 694 -1488 -281 1589
3255 1589 -182 -1571 518 1535 -995 -1403 1527 996 -1937 -518 2077 -57 -2230 564 2190
3270 2190 -1220 -2063 1796 1612 -2318 -945 2543 301 -2716 336 2625 -1172 -2434 1862 1872 -2404
3286 -2404 -1170 2700 438 -2935 416 2902 -1286 -2506 2099 1996 -2561 -1253 3019 499 -3228
3301 -3228 393 3188 -1331 -2858 2065 2133 -2534 -1540 2924 742 -3151 197 2991 -1022 -2538 1719
3317 1719 1996 -2259 -1406 2603 570 -2822 310 2624 -1107 -2242 1613 1763 -2080 -1236 2424 506
3333E06l110K877K165l252j273L333M60l347L66L202j229k695J850J957k099j301
3349a590K246P28k380j8K185n23j919J036J383j131j168J403Q03j609l18J508
3365F36%j321J97J195k02j343M88J216p27r27O35R78o90j085R50J006j203p53
3383i50J297N21j343l81J614Nj836M87J849j036j577J443J327j856j020K407L30
3400A281k737N36K606j215k434J933K096k603j635L392O99l671L55L545j191l367
3416b410K073K920k958k212L698J079l948O0L968j179l605K105L206l218k260
3431b681L954J016m145O2M146j197l976K401L442l548k421M224J228m426q5M431
3447B425r98m293K233L608l205k602L819J498m044m31M102o65m005K004L204k851
$$ plain form
3333 506 -2604 273 2438 -814 -2087 1246 1706 -1641 -1275 1927 698 -1997 -147 1810 -289 -1590
3349 -1590 656 1384 -996 -1014 1171 648 -1271 -235 1148 17 -1151 252 1055 -554 -872 636
3365 636 636 -685 -488 707 505 -838 -350 866 139 -788 -153 825 135 -950 0 1006 -197 -950
3383 -950 347 868 -475 -856 758 763 -1073 -586 1263 227 -1350 93 1420 -436 -1456 951 1281
3400 1281 -1456 -920 1686 471 -1963 -30 2066 -537 -2172 1220 1919 -1752 -1397 2148 957 -2410
3416 -2410 -337 2583 -375 -2587 1111 2190 -1758 -1698 2270 1091 -2514 -409 2797 -421 -2681
3431 -2681 1273 2289 -1856 -1794 2352 1155 -2821 -420 3022 -526 -2947 1277 2505 -1921 -2006 2425
3447 2425 1427 -2866 -633 2975 -230 -2832 987 2485 -1559 -1990 2112 1447 -2558 -554 2650 -201
3463b01k261L330J311l596l52L784p90l529J806K881k543k048K883J331l145n68
3479a707L258l27l028J151K439j645j839J930J368k305n52K283j67k054O45J674
3495A124q90j436J265J050j518n79J528J59j378J29J199j46j214L77J183o32j014
3512g93P18Q70o78r49P83R60r91q23J128O17j173n86J465L86j705nJ791n51j616
3531a152Q86J498j240j334J733J000k217l02K327l34k299Q90K221j571j961K268
3547D13J461k813p14L010Pl078P64L016j593k804K610K017l127j172L397K46l480
3564a840N95L511j714l009K668K155l248j247L630K71l825Q39L677k009l130K892
3580B16K300l460j362L816M64m076P68L795j828l227K703K406l234j541L589N46
$$ plain form
3463 -201 -2462 868 2179 -1417 -1769 2015 1225 -2304 -498 2383 -160 -2208 675 2006 -1139 -1707
3479 -1707 1551 1224 -1804 -653 1786 141 -1698 232 1600 -705 -1257 1026 859 -1195 -550 1124
3495 1124 234 -1202 63 1113 -405 -984 544 703 -675 -546 653 507 -707 -330 853 221 -793
3512 -793 -75 795 117 -832 -49 911 -80 -903 225 842 -331 -917 548 934 -771 -776 1015 464 -1152
3531 -1152 -266 1232 -8 -1342 391 1391 -826 -1128 1199 865 -1434 -544 1677 106 -1855 413
3547 413 1874 -939 -1653 1357 1364 -1714 -950 2066 473 -2331 279 2296 -831 -2003 1394 1640 -1840
3564 -1840 -1245 2266 552 -2457 211 2366 -882 -2129 1501 1772 -2053 -1214 2463 454 -2676 216
3580 216 2516 -944 -2306 1510 1974 -2102 -1334 2461 633 -2594 109 2515 -719 -2260 1329 1875
3596A875l775N80L568j662k836K344K073k834j366L285M07l437O85L124j560k535
3612b064K151J945k587j364L002M60k984L41K739r74k289J386J928j884j321K124
3628F09O42k100j7J819l66j650P00J477j065j066J291N41j243k14J149J03j259
3645f49K09J189n37r09N86P60o09o99O15P70q04o48R18M47q61l80P97N19j145
3664d31k39J238k0j263K82J237n71j175R20J096j413o55J640K90j839K08J906
3681A211p14j891J280J719k006j138K328N99k500r4K737p40k592J423K325k123
3697a76j700K588J007k886l19L075n90k905J457K447k155j805K617J145k988l38
3713a526L289p74l046J653K545k258k021K879J311l325m06L501o65l267J528K773
$$ plain form
3596 1875 -1900 -1320 2248 586 -2250 94 2167 -667 -2033 1252 1659 -1778 -1093 2031 471 -2064
3612 -2064 87 2032 -555 -1919 1083 1543 -1441 -1100 1639 665 -1624 -238 1690 -194 -1515 609
3628 609 1251 -849 -866 953 587 -1063 -363 1114 49 -1017 274 815 -428 -642 507 610 -649
3645 -649 -440 749 212 -697 -111 649 40 -659 -44 726 -78 -726 192 639 -222 -602 195 714 -431
3664 -431 -670 568 548 -715 -433 804 233 -942 -22 1074 -339 -994 646 936 -903 -695 1211
3681 1211 497 -1394 -114 1605 -401 -1539 789 1388 -1112 -1206 1531 791 -1801 -378 1947 -176
3697 -176 -1876 712 1719 -1167 -1486 1589 999 -1906 -449 1998 -157 -1962 655 1800 -1188 -1526
3713 -1526 1763 989 -2057 -404 2141 -117 -2138 741 2052 -1273 -1679 1822 1157 -2110 -582 2191
3729B191k152k197K708J478l111o42L355m90k939J222K522j879k006K398J327
3744A785k825m18K907n10k604J125K269j712j782K211J179k504m49K435j39k277
3760a309P20K013j161j699J618J118j863m33J712P6j690L51J477o71j291J088
3776E6Q33j139m55J115K20j180O1J096l16r11M87P21n56o12N63O24o71n50P24
3795A10L81o81l08O87L32p81l37J066p9r16J61R37k42j023M82J092q95q41J114
3814B59N18j241k50J375l5j514M95J469j076j245J532R31j752n62J953J81k260
3831a222N48K111j154j798J583J444k040r49K415L21k541L92K434j057k150J641
3847b2J682k070j165K532L43k639M58K505j185k189J772J781k304j175K707L94
$$ plain form
3729 2191 39 -2158 550 2028 -1083 -1725 1630 1140 -1799 -577 1945 66 -1940 458 1785
3744 1785 -1040 -1458 1449 939 -1665 -540 1729 17 -1765 446 1625 -879 -1328 1107 968 -1309
3760 -1309 -589 1424 263 -1436 182 1300 -563 -996 716 792 -898 -547 930 259 -1032 56
3776 56 889 -250 -705 410 630 -550 -489 607 291 -620 -133 588 32 -580 -17 607 -64 -614 110
3795 110 491 -190 -498 189 521 -260 -597 469 390 -526 -365 572 330 -693 -211 881 -14 -855 259
3814 259 777 -464 -714 661 626 -888 -393 1076 0 -1245 287 1218 -534 -1096 857 1038 -1222
3831 -1222 -674 1437 283 -1515 68 1512 -528 -1477 938 1259 -1282 -890 1544 487 -1663 -22
3847 -22 1660 -410 -1575 957 1300 -1339 -881 1624 439 -1750 22 1803 -501 -1676 1031 1425
3863A425k845M02K681j123k273J587J950k237j234K562M94k657K74K491r79k121
3879a603J464J805k067j146K379L58k313L23K184q81j994J418J520j802r83K082
3895G44L94k050J3J985n02j886J114J430j400r48J533M86j510j78J542k10j462
3912i05O90J046q81p11Q88N63j020k84J051l8r84L38P34l70n53L76N63n50m67
3931e14O28L49n48k30N10J69n08k20O38J04p19N0N27P0o96R9Q08l28q05O55N94
3952F33p03n25Q46L26j020j01J234l63j176P54R36q82q86J308N18j552j16J684
3970I15l72j540O98J425j135j152J478Q55j823k87J854k16j787O58J652j068j485
3987a330J632Q98j853k92J865j92j879P43J731j208j475J681R47j960l76K080
$$ plain form
3863 1425 -1420 -1018 1663 540 -1733 -146 1804 -433 -1667 895 1389 -1268 -994 1497 518 -1603
3879 -1603 -139 1666 -401 -1547 832 1190 -1123 -800 1384 503 -1491 -73 1447 -355 -1338 744
3895 744 1138 -912 -899 1086 584 -1302 -188 1242 -158 -1106 427 913 -597 -775 767 557 -905
3912 -905 -215 831 -50 -761 127 690 -330 -614 437 399 -585 -247 487 117 -436 -60 503 -47 -514
3931 -514 114 463 -85 -315 195 364 -144 -364 274 378 -341 -291 236 306 -390 -291 517 189 -616 39 633
3952 633 -70 -595 251 577 -443 -544 690 327 -849 -95 841 -41 -927 381 899 -653 -769 915
3970 915 543 -997 -299 1126 -9 -1161 317 1172 -651 -938 916 700 -1087 -429 1223 155 -1330
3987 -1330 302 1200 -653 -945 920 728 -1151 -408 1323 115 -1360 321 1268 -692 -1068 1012
4003A012j88k051P03J916j222j546J698J006j938m42J939j7j998O17J740j077
4019A52j382J467R14j614m91J733rj696N34J533j084j151J366P00j457l78J537
4036F74m6j406L79J338q17r72R34P12j094m17J161J12j170K67R20n10o97O35N85
4055E88p33l01P07J27p38J46N98k97m48K94M25l42m01M80K27m49j20L35J52l86
4075a36j47M16J32m54K0L36J0l42m1N07j66m73J90N03l81l31M22L61n92k47P26
4096C13k0p09K53O93m27o56N73O54q93l75J113nj082K06R94m58r12P80P38j014
4116b34n51J200K06j174J12J212m51j187Q44R26j195n25J283K04j375J51J362
4133H08n48j214R37R92j257o03J408J86j414J30J405n64j261R94R21j203n45J353
$$ plain form
4003 1012 824 -1227 -524 1392 170 -1376 322 1328 -610 -1052 887 870 -1128 -511 1229 152
4019 152 -1230 237 1151 -463 -954 779 770 -926 -392 1141 57 -1094 272 972 -485 -863 674
4036 674 628 -778 -399 939 122 -850 84 796 -298 -715 446 558 -612 -345 575 65 -632 3 588
4055 588 -145 -446 261 388 -350 -204 394 97 -351 -57 368 26 -375 105 332 -117 -237 98 250 -136
4075 -136 -283 133 265 -189 -169 167 177 -165 -206 301 135 -338 -148 355 -26 -357 65 426 -166 -413 313
4096 313 293 -416 -163 530 103 -553 20 674 -219 -594 519 514 -568 -362 632 174 -738 42 780 -234
4116 -234 -785 415 621 -553 -441 771 320 -867 -23 903 -292 -817 466 670 -705 -554 808
4133 808 260 -954 -17 975 -282 -885 523 709 -705 -575 830 266 -995 -1 920 -283 -828 525
4151E25K21j429Q7J443n27j250R42Q05r91n86J266J50j308J91J274o39j019Q94
4169D9O96r63n10J115K44j197J33J113m55r22O70P21q15n56R35K90j016Q3Q62
4188D77l18o46M06N82m94l94N66J79n82N8M94j61m49K44M24l98k79L44K49m67
4208a65o3L55M6k98oK85o0k17N6K08m7k24K8K13j6l13J75K61j68k76K36K73l53
4231g0j98M26O5m68J03M74k54m09K60M95m98l60O92J24p38R2P14k43o99L69P30
4252F07o68n02Q18K54q75j8Q46j58r25N04Q35p84n79R10K93r38q0R80k17r93N44
4273a46Q48p89n71J016K02j039KJ084k70j088O19Q65p81o57R78L52j087q7J116
4292E67k24j058N71Q30p82n52Q90K59r60K0R74l05q77N76O87p15m60P76K63q90
$$ plain form
4151 525 746 -683 -596 847 320 -930 12 817 -174 -760 506 656 -652 -461 813 174 -845 49
4169 49 745 -218 -728 387 631 -566 -433 680 225 -697 -27 694 -121 -677 258 548 -468 -385 477
4188 477 159 -487 -81 501 7 -387 179 358 -224 -166 328 167 -282 -38 386 -12 -291 53 302 -165
4208 -165 -228 127 173 -125 -131 154 94 -123 -67 141 94 -130 -102 111 95 -218 -43 218 50 -226 10 283 -70
4231 -70 -268 158 223 -245 -142 332 78 -331 -71 424 -74 -434 258 382 -356 -264 450 207 -492 -123 607
4252 607 -61 -563 255 509 -366 -384 462 304 -621 -117 718 -66 -645 265 558 -380 -460 520 303 -690 -146
4273 -146 702 -87 -658 358 560 -479 -477 607 337 -751 -132 733 -48 -705 273 625 -462 -549 567
4292 567 343 -715 -144 686 -96 -648 242 501 -459 -439 535 230 -647 -71 616 -99 -559 217 480 -410
4312d10k4R51k41p87M77N58n86m37O34L07p43l9O55j39n88L03M67l65l17M13K36
4333C25o05P9N03j89l68J95L43k65k67L57J70m31l1K55M9k81O5K54j01k18J48
4354a3J60j53j13O8J71p5k05J39J78j49r8J08J76k01j79L08N6l08M1K97j52l06
4376b50J45L62k14l43L84J59m80j7N62j28n63K54M95l63m60O08K61o83j01P31
4396C59p6p23K91O68m99n47O82L27p43q0P86j14q28L15Q18o90n27P69L33q49q5
4417d13Q28q7r06M41P66o39n85Q07L22q91n9Q54j16q75M29O76n93n21P01L33p95
4438c23q8Q88j51q62M58O40n58n20P44K75q08p1Q48j94p80M11N59m18m69N57L62
4459E00p75p8O75j27o12K70N27l69l61M86K43n99j6N01j20m27J69L39j83l07L27
$$ plain form
4312 -410 -434 517 276 -511 -34 524 -62 -499 135 442 -301 -340 315 176 -412 -109 358 -7 -324 89 325
4333 325 -280 -201 302 113 -255 -60 283 18 -249 108 278 -153 -184 71 120 -161 -96 158 57 -161 -13
4354 -13 147 -6 -119 -51 120 45 -160 -21 157 8 -90 18 194 -7 -186 122 178 -130 -89 208 56 -250
4376 -250 -105 257 43 -300 84 243 -237 -254 308 180 -383 -129 366 3 -457 151 412 -271 -372 359
4396 359 283 -440 -149 519 20 -527 155 482 -261 -341 445 331 -497 -182 636 -54 -581 188 521 -328 -413
4417 -413 415 328 -578 -137 629 -10 -595 212 534 -357 -416 438 322 -553 -124 552 -41 -562 139 472 -323
4438 -323 -411 477 326 -536 -78 562 4 -516 228 503 -305 -376 472 278 -502 -91 468 50 -419 138 500
4459 500 -275 -353 322 195 -417 -147 380 11 -350 136 379 -220 -236 265 145 -282 -113 226 43 -264 63
4480F3J49l50o7L36Kk58J3K55q2k47K07Q4j18j37J45J50j56p0J12M9r1l5N0J05
4504A09j46j23K47Nk03L6K03r5k37J61K52k22k91M04J39m58j5M58o0l69J04M74
4526C73l68l76M44L04n51j36N38J03o85J89O13m15m50N31K74n67k04O38N9p47
4546d33J91P43m51n99O55L46p53j62Q49l9q49K89P66m85o55P12M50q62k50R52
4566D15l4q65K67Q47n77o10O30M26o92k77Q96K1j003L89P33n19n72O30M26p72
4586b41k78R51pq83K83O46m03n62N41M17o63j90P05l5p00K48N51k54n12L89L63
4607C66n15r6N16p9m66J31M55k05m11L71K52m08j43M26j4l63M3L16pl88K11J97
4629A89k13j25K55J1j66p7K10P1k14m7J34J1n8q3J95J1k41J27J17q8j45KK57o6
$$ plain form
4480 63 212 -138 -205 131 133 -125 -112 143 61 -186 21 105 -13 -150 -5 145 -11 -81 31 80 -11 -46 4 109
4504 109 -37 -160 87 92 -111 -75 128 33 -204 -43 209 -13 -304 100 239 -219 -234 224 164 -205 -101 373
4526 373 5 -371 73 377 -174 -310 228 331 -354 -165 448 33 -417 114 388 -179 -383 255 314 -433
4546 -433 -242 501 50 -549 106 452 -301 -463 386 347 -502 -213 553 68 -587 125 575 -287 -537 415
4566 415 381 -484 -217 630 53 -557 73 499 -193 -470 426 447 -556 -167 566 47 -525 105 531 -241
4586 -241 -519 432 425 -458 -175 471 68 -494 47 464 -199 -389 316 281 -419 -171 380 126 -386 3 366
4607 366 -149 -245 271 192 -274 -143 312 107 -304 67 319 -89 -232 194 180 -183 -140 176 169 -219 -8 189
4629 189 -24 -149 106 117 -49 -126 84 155 -59 -106 28 39 -19 -102 93 104 -137 -10 107 19 -126 -124 133 67
4653F7k89K55K02l49l9L44j9l60j5N00k23l65K97K86l73k34N19J06n46kN74j78
4675A58n80M07M16m66m01O97J77q16P7Q00l19o98M67N35n30m51P54K18q65O0R14
4696E54l25q18N08P06o89m95P86L33r49L1Q61k70p46M38O51o06n37P89L05q92
4716c65M4Q57k69p60M09O06o54m46Q56J63q59K4Q73k50p85M02P33o35n11P80J92
4737D05p20j8O98q4p60M36N10n40l57O01J62o05P0M79r9n03K06M51l44k78L84
4758I4J89m38j5L48j8m12J07L75k31k27J99K12k09j26J81J35k53K2J83l7o5j24
4780a10J47M0j47n6K42r9q6l6K12l2k56J63K06k21j71K86Q1k74j28M51l2m47J97
4803g0M09l47l79L76L49m78k48O52K5o31J52N99l08n51L94N34o67k66P67M3p34
$$ plain form
4653 67 -222 33 235 -114 -153 191 172 -188 -203 297 74 -291 6 292 -81 -315 204 310 -236 -238 336 158
4675 158 -422 -15 401 -65 -466 231 408 -408 -331 469 150 -548 -81 454 -76 -527 227 445 -420 -360 554
4696 554 229 -589 -81 625 -64 -559 227 560 -389 -358 503 233 -513 -75 576 -30 -567 222 527 -365
4716 -365 -321 536 267 -493 -84 522 -132 -578 278 441 -418 -394 479 229 -556 -154 579 -56 -567 213 405
4737 405 -315 -333 365 281 -479 -43 467 -73 -430 171 333 -272 -202 277 178 -325 -119 332 -12 -290 94
4758 94 283 -155 -170 178 160 -252 -145 230 -1 -228 -29 183 -26 -152 29 164 -89 -67 116 79 14 -110
4780 -110 37 77 -70 -126 116 17 -69 -105 107 75 -181 -18 188 -33 -204 82 163 -111 -239 212 180 -267 -70
4803 -70 339 -8 -387 -11 338 -140 -388 264 289 -342 -190 409 101 -450 -56 478 -189 -455 312 355 -379
4824c79J97O45l32o51M65O16p38l27Q78J9q28J79Q27l76q16O67N86p96l82R32
4844C86Q0r66K13Q66m13q41O41P13q95l26Q85J00q90J76P66l70p36O43N56q18
4864b30k49P74J13q38J56Q78m81p46O14N20p02k08O90R0p73Q1P66l05o30M53M68
4885D41n32l11N67J46o38M6O40l02m17L91K73l53k94M88J33m94JN06k05l37K15
4906c6K86k31k70K47K03l02l5K43Lk36K9J42Q1j53l8J47n5j40O1J71j6k26P6K02
4930A53j97j35J58J57k07q5K50M8l44O0L67j30l81K34L70l39l61N52K05o51J8
4951b58O13j71n98K99O31n01n31O79L63q79qP87j02q29L31P61n76n71P42L82r55
4972c91m1Q52n5r07L19R32o89p08R44L78r93j78R68Oj010L01R73o74p25Q89M40
$$ plain form
4824 -379 -182 463 131 -520 -55 561 -177 -504 374 393 -435 -256 571 195 -621 46 632 -164 -546 386
4844 386 466 -500 -287 579 166 -675 -34 679 -216 -542 343 443 -447 -271 495 125 -611 32 588 -230
4864 -230 -479 295 408 -430 -274 604 123 -623 -9 511 -191 -399 291 381 -392 -311 455 150 -480 -27 441
4885 441 -91 -402 165 311 -327 -281 359 57 -360 31 304 -49 -343 145 278 -216 -215 291 86 -251 -36
4906 -36 250 19 -251 -4 199 -103 -138 105 108 -128 -99 43 124 -29 -67 80 25 -115 -54 117 101 -125 -49 153
4930 153 -44 -179 -21 136 -71 -156 94 142 -202 -142 225 95 -286 -52 318 -21 -382 170 375 -276 -258
4951 -258 355 184 -414 -115 516 15 -516 163 526 -353 -361 426 324 -505 -174 587 11 -560 182 564 -391
4972 -391 -432 420 365 -542 -223 709 20 -688 256 634 -359 -537 431 437 -573 -272 701 27 -698 191 631
4993F31r65k03J008jj034K62J001o47o67Q21M26r09k87J131j27j057M23P76n50
5012C2p25P99N22q77k79R15pr08L25P08m43n83N59M95p06l06P98J7p52K43N83
5033D10l25m42L44M11m93k50O30k7o00J56M61j04m56K13L77l97j79L63J46k63
5053b5j38K26J30l63L8L05n7j64l9K50m2l01R2K72r6k78J43J77r6k84K90K18l58
5076a00j41M35j9m62J24N01k03n66L99M64n39k87O36J33o89q5Q19j62q13M59O99
5097F03p05m31P02M14r04j67J029k33r36M49Q47p47n80Q44M97j101j18J165k16
5116D12j203N86J004p81q04J023N39j237j33J270k29j210M87J090p87q85J021
5133A63N57j150k51J294j20j263M38J095o72r21R90N58j146k02J198q7j109L88
$$ plain form
4993 631 -334 -537 471 470 -564 -302 699 52 -615 206 632 -277 -564 567 440 -617 -194 582 32
5012 32 -693 106 628 -249 -528 387 380 -528 -203 505 62 -521 38 533 -173 -479 319 336 -416 -173 410
5033 410 85 -357 -13 398 -95 -345 285 258 -342 -186 275 171 -285 -72 305 -92 -271 92 238 -25
5053 -25 -163 63 193 -170 -132 173 116 -48 -87 163 121 -180 -88 184 88 -190 -47 130 34 -250 40 258 -100
5076 -100 -241 194 175 -287 -163 338 135 -431 -32 432 -107 -394 242 375 -314 -399 420 258 -555 -96 603
5097 603 -102 -533 169 583 -321 -488 541 308 -628 -179 668 -79 -659 185 682 -419 -537 628 412
5116 412 -791 -205 799 18 -786 237 776 -461 -594 676 447 -763 -276 814 27 -858 163
5133 163 720 -430 -681 613 493 -770 -332 763 91 -830 160 718 -428 -630 568 481 -628 -240
5151b40R24n68r05Q99O21j073k45J074j9j038K44R35m75p92P29N76q56k51P42
5170B82J35q06J18Q10l39o82N29L75n34k53N30J94o29J7N99j82n47L09L95l33
5190a2k83K87K72k80k30L56J25l73o2L19Q0l56l9L40l1l12N2L45p6l70J37M39
5212C28l33l23L60K52m15j63N36J35p13O8P53l31o39L99N94o49m31Q12L28r84
5232d16j7J000l32q96O02P68p48p22J023M37j223n9J183k31j119N80R96q72p99
5251h45J122N05j286j07J251j61j273M78J244r02r45J186O20j436j07J326p7j406
5269h13M23J358r72r79J198O87j365k50J366n3j382M32J260q87r45J149O14j300
5287d59k34J285n1j359M89J223q43q91J030N92j115l38J209L3j249L34J149o90
$$ plain form
5151 -240 684 116 -789 110 731 -342 -587 487 468 -570 -326 609 134 -658 71 647 -209 -460 282
5170 282 417 -389 -271 539 200 -482 47 422 -112 -365 165 359 -270 -253 346 164 -383 -74 321 -12
5190 -12 -295 -8 264 -16 -246 110 235 -138 -200 119 199 -157 -196 144 113 -199 -147 198 122 -248 -111 328
5212 328 -5 -328 32 284 -131 -294 242 377 -336 -268 485 154 -485 -86 508 -141 -572 240 568 -416
5232 -416 -433 567 235 -661 -59 709 -39 -761 262 699 -524 -583 600 369 -750 -170 826 -46 -845
5251 -845 277 782 -504 -611 640 479 -794 -316 928 26 -919 267 887 -549 -656 670 593 -813
5269 -813 -390 968 -4 -983 215 902 -463 -713 653 600 -782 -350 910 23 -922 227 841 -459
5287 -459 -693 592 541 -818 -329 894 51 -840 190 782 -333 -671 538 571 -678 -344 805 115
5305A15q51Q06O46r27l94R82J55j047J77Q68m03n75M05M93n17m03P25J04p03J24
5325b20N23j58m69J86M88l23l63L42K75l85j36L11J94l43k03M58N0l95n3L69M6
5346A94m40K7N34j74m72K70M06l45m32M80L69o13k31P50m6p64K45O72k49p93N74
5367c8P07q71m51J011J86j071P8J100l30j117O60R98j001o67J170L87j314l4J330
5386G33k41j355O16J262j095q26J296N18j436k10J594l18j577Q34J311j235r51
5403a080J433O57j659k25J737k69j716Q22J448j119j168J385P56j590l06J725
5419H31j72j619O50J386r83j139J241P72j484l39J622k07j471O03J291q73j087
5436i78J136P98j405l04J450r4j379M45J084o02r87R42O90j156l93J230K3j063
$$ plain form
5305 115 -736 70 716 -211 -605 377 532 -515 -338 530 127 -448 -43 450 -67 -470 255 359 -344 -220
5325 -220 303 145 -324 -138 350 27 -336 6 281 -104 -240 71 265 -78 -281 177 227 -168 -221 148 194
5346 194 -246 -219 315 141 -331 -61 345 0 -432 48 417 -196 -427 323 277 -487 -242 430 181 -612 -38
5367 -38 669 -202 -653 358 544 -527 -449 651 321 -796 -136 862 -139 -806 364 751 -563 -597 733
5386 733 492 -863 -247 1015 -80 -906 390 908 -528 -738 856 538 -1039 -205 1106 -129 -1080
5403 -1080 353 1010 -649 -874 863 594 -1122 -300 1148 29 -1139 246 1002 -588 -894 831
5419 831 659 -960 -310 1076 93 -1046 195 967 -517 -856 766 559 -912 -309 982 109 -978
5436 -978 158 956 -449 -753 697 603 -776 -331 753 151 -836 106 796 -360 -753 477 500 -563
5454e63J84R48m26q29O31O27p27l47P33J67p02m6P33j69o37L09M88l57l41K91
5474c3L76l77l44M80K15m47j01L84R5l45j76N10O2n89N8N53j40n37K50N41m31
5495Dn00N98M61q55j53Q23M5r52J61J016m87r24Q23O80r74n11J204K18j328O8
5515e83J441n73j257Q84J057j130p70J425M17j628M2J631n21j476Q81J245j167
5532h2j000J480O26j765m2J797m76j682Q96J502j353j148J694O30j838p8J842
5549A003m38j779Q71J592j297j241J747O73j855k03J854k68j782P78J625j254
5565B6j246J623O97j750k20J748k28j665O33J518j170j045J383O55j479l22J558
5582G16j10j462M96J275q17j086J090P10j131l55J149M8j152K73J021n01q14O44
$$ plain form
5454 -563 -379 569 143 -686 -55 572 -155 -502 231 398 -304 -350 383 214 -423 -114 374 17 -324 -33
5474 -33 343 -34 -378 102 317 -130 -231 153 248 -97 -273 237 299 -290 -232 321 181 -356 -106 435 4
5495 4 -496 102 563 -292 -445 378 423 -529 -368 648 161 -763 60 740 -234 -745 459 677 -651 -583
5515 -583 858 285 -972 -88 969 -161 -931 494 911 -717 -675 956 435 -1041 -160 1085 -82
5532 -82 -1082 398 1024 -741 -783 1014 538 -1144 -248 1254 -99 -1247 447 1077 -761 -839 1003
5549 1003 565 -1214 -343 1249 -48 -1289 458 1131 -724 -927 927 659 -1123 -345 1280 26
5565 26 -1220 403 1100 -650 -870 878 650 -1015 -382 1136 -34 -1079 304 959 -520 -842 716
5582 716 606 -856 -360 915 98 -988 102 812 -319 -674 475 523 -629 -356 665 164 -650 -6
5600fO01p66l73P80J60p74J9P60k22n81K88N32l25n10M51L04m19k41M90J20l52
5621f4k39M79J36n37j8N49o1n54L3O01j27o74M36N19n55m97P03L82p16l37R40
5642C99L7j015K87R73n71q56Q08P14j029m90J257J67j385K29J336o15j226R43
5660c7J034j259p37J566K66j663J91J575n36j600J104J271j448r02J732M51j804
5677g96L4J809n42j739J171J371j553r73J830M11j886L4J905n79j738J113J460
5694A332j531j024J722N39j818l5J866m50j770R55J381j308j016J600N73j726
5710g10j21J783l54j700Q96J320j233r28J394O16j601j40J624l38j451P04J185
5727I46r70r53J249N72j329k37J356j44j168M36R61o04q04Q25M45q48k37Q44N9
$$ plain form
5600 -6 595 -171 -544 236 396 -378 -359 401 179 -402 -114 418 93 -417 34 338 -81 -322 168 288 -64
5621 -64 -303 176 312 -225 -243 306 245 -309 -276 325 198 -476 -40 479 -76 -573 130 512 -204 -541 399
5642 399 436 -579 -292 681 110 -746 62 776 -253 -743 514 681 -704 -475 861 246 -980 -37
5660 -37 997 -262 -999 567 833 -830 -639 936 400 -1200 -96 1175 -273 -1175 557 1008 -796
5677 -796 -762 1047 505 -1234 -63 1308 -245 -1218 612 1023 -863 -829 1076 497 -1241 -128 1332
5694 1332 -199 -1223 499 1038 -780 -815 1051 601 -1169 -214 1167 -141 -1157 443 1016 -710
5710 -710 -831 952 598 -1102 -206 1114 -119 -1047 347 963 -638 -778 846 508 -943 -239 946
5727 946 -24 -977 272 844 -485 -722 634 490 -678 -242 719 115 -689 136 581 -267 -504 340 399
5746C99q01J26O97k18o11L40N31n05l09L94K86m50k21N25J47n34k8N22q9m03j4
5767b16N18p3n94K50N17l08n12L51N78n77m48O56L87q91r4R25j88q55L63Q90o40
5788C9q59J027M85j099k88J305m3j393M37J328q12j188J269P73j431m69J602P4
5806G57j631L17J663q13j447J202J125j522p32J741K39j917L54J825q80j503J272
5823E0J178j567q08J872K43j996L54J883r16j579J308J267j712q06J941K75k021
5840a034K55J936p91j626J210J297j566q00J747K92j883K66J777p03j498J041
5856h0J195j363p96J605L77j705J51J479n03j331Q21J177j145p77J312L27j257
5873e13o0J210k83j042M80R56p98o47R05L61r12j08Q51p1q36K84P15m30n41M49
$$ plain form
5746 399 -402 -276 421 203 -408 -68 463 -42 -351 43 329 -121 -342 183 330 -204 -232 290 201 -202 -216
5767 -216 302 229 -365 -115 402 94 -418 -67 511 -66 -514 142 529 -362 -456 469 281 -574 -211 679 39
5788 39 -820 207 692 -407 -695 610 567 -826 -389 939 127 -1061 208 981 -450 -919 683 757
5806 757 -874 -557 1106 293 -1154 48 1173 -349 -1081 660 899 -1018 -664 1161 281 -1222 50
5823 50 1228 -339 -1147 725 968 -1028 -674 1209 293 -1286 22 1289 -423 -1229 712 987 -1034
5840 -1034 -779 1157 366 -1260 -50 1247 -319 -1119 628 920 -963 -697 1080 377 -1121 -80
5856 -80 1115 -248 -1044 561 938 -767 -616 863 360 -971 -150 1027 -118 -895 417 744 -513
5873 -513 -573 637 354 -688 -208 748 -50 -697 208 569 -343 -451 400 329 -507 -223 492 62 -479 -30
5893c0L83m54k74N51J49m83j07N05k0m33k7M57M7n45P9N16k10m94K53N96l50n35
5915d26M94M41o54l51P59J54p67n9Q65j46r32M68Q34q10n18R20L83j118j82J328
5935F83k03j288N32J199q96q89J075P52j437l99J631j21j631O69J456j045j228
5952a140J316R61j689m55J835oj897O10J671j069j347J393J064j848n02J973r2
5969G78j874N78J725j019j496J469J067j757n76J914Oj854M39J804r63j463J327
5986A05J147j692o47J824M8j683L83J579p81j461J275R85j500n27J559J25j548
6003h09L12J450o88j337J118Q61j212m97J256J51j171M7J182m04j016O68P50p79
6021a18m69P95L07q54k1Q00k09o21K97N10m15l55M04L57m99k41N14K4m09l7L99
$$ plain form
5893 -30 353 -101 -375 176 325 -158 -265 240 220 -213 -240 217 264 -281 -202 314 104 -390 -137 459 109 -426
5915 -426 68 509 -145 -496 263 417 -350 -409 456 310 -622 -154 680 -130 -648 272 655 -463 -645 683
5935 683 480 -808 -276 923 27 -862 213 965 -472 -871 760 639 -992 -323 1133 88 -1140
5952 -1140 176 1137 -552 -1007 828 822 -1075 -465 1206 137 -1210 183 1247 -601 -1103 870 778
5969 778 -1096 -518 1207 188 -1308 161 1228 -529 -1105 809 815 -1039 -600 1204 241 -1222 105
5986 105 1252 -440 -1087 737 785 -898 -515 1064 283 -1178 97 1082 -418 -945 614 739 -809
6003 -809 -497 953 265 -1072 46 907 -305 -802 454 605 -566 -519 663 259 -757 -89 661 -118
6021 -118 -587 208 515 -339 -360 440 231 -390 -93 417 2 -353 51 408 -91 -332 182 206 -203 -240 159
6042A59P9m30J4M25m9m69J57M11j66n34K74N12m20l77N28L83o97k10O89Q6p89
6063d24J28Q65l66p90N84O02p31n40R67L59j162J9J191l76j160P18R80r16r02
6082i54J338M81j484j08J572l12j519P43J237j052j008J378O65j576k02J593k55
6099E37j577P87J394j148j113J509O35j687j72J768l31j687P80J522j267j127
6115a177J571O52j666k51J743k20j747P76J504j203j113J406P65j612l01J666
6131G93j65j615O87J355j043j048J273P29j432l06J371j13j328M54J258q23r23
6148h76J056O03j142l21J260n6j144L16R70n55p98P39O06q34l83R05J18q54J20
6167b70O84k85m99L29N07m83l88N38K11n43o4M43J6m78J01M49q9m24J08L35o7
$$ plain form
6042 159 238 -192 -178 247 198 -271 -114 297 131 -403 -129 383 -37 -414 114 497 -200 -410 279 365 -424
6063 -424 -296 569 203 -587 -3 599 -132 -672 295 654 -508 -489 702 326 -834 -116 864 -52 -954
6082 -954 384 865 -619 -727 845 533 -986 -243 994 -58 -1066 312 977 -599 -801 792 537
6099 537 -1040 -253 1141 -7 -1120 389 1024 -663 -835 933 602 -1085 -305 1217 -50 -1177
6115 -1177 394 1046 -620 -871 872 652 -1095 -319 1185 -18 -1131 275 1040 -572 -873 793
6131 793 628 -987 -300 1055 12 -1036 237 966 -466 -772 599 486 -842 -388 870 47 -876
6148 -876 180 783 -359 -680 580 524 -620 -304 666 111 -687 52 658 -176 -559 346 464 -390 -270
6167 -270 414 129 -370 -41 466 -17 -405 133 344 -199 -263 180 196 -282 -181 268 179 -245 -137 198 131
6188A31l68J16M54k45m13L22L05l55k85M09L24o19j70P36k8o73J54P55m54o91
6208e95O39N85q55l64J040J9j017J89J003m48j010Q01Q24j064m92J313J11j337
6226f58J63J283m96j187Q46J007j182p14J482K55j519J12J488n06j376R85J024
6243A007j228p28J469L11j569P3J653o34j445R56J161j188q19J441M23j627P1
6260f73J606n34j417Q57J206j240p59J388L87j504J9J539m79j278P94J034j109
6277a63p63J344L61j413K1J376l84j185O97R45r47o99J124L84j188nJ098k79r37
6296f13M66P60o32o32P77L86p88p8P26j11o78K46N72l49m41L95K62l41k06L91
6316A12J81m45o2M00l6l23L0L55n6l25O5K76j01l34K34L26k81l11L07L29l82l02
$$ plain form
6188 131 -237 -121 333 88 -325 -3 302 -53 -338 71 395 -224 -394 342 314 -359 -205 550 96 -595
6208 -595 44 629 -226 -590 450 469 -548 -359 644 196 -814 -13 811 -253 -745 568 679 -658
6226 -658 -495 788 292 -895 -49 958 -224 -938 544 799 -720 -608 880 374 -1002 -17 1007
6243 1007 -221 -949 520 831 -738 -665 988 354 -1091 -135 1026 -162 -981 460 883 -744 -673
6260 -673 933 399 -1018 -161 1045 -195 -954 434 821 -683 -664 875 396 -882 -88 946 -163
6277 -163 -926 418 779 -634 -613 763 379 -806 -109 836 -111 -810 314 698 -490 -495 603 324 -613
6296 -613 -147 613 -19 -651 126 512 -276 -354 372 261 -417 -171 401 52 -389 6 268 -73 -279 112
6316 112 293 -152 -214 186 150 -173 -143 212 156 -169 -104 172 71 -263 -29 297 16 -295 12 341 -41 -343
6338c43M93J48n69j5O12j26o22L14O29n33n37P47L17q40p6Q48k4r59K64R24n67
6359H5q15Q34N75r88l33J148k4j157L45J136o29j041R57P33j139m12J242R1j306
6378f98K96J292p21j071J015P39j109m97J292Q7j396L51J265o92j100J004Q45
6395I02j258m73J396L9j406L40J287o76j063R63Q53j211n18J341O7j292K76J188
6413G55n02j065Q21P88j086m40J147J35j090J29J080m42r08P31O71r32m24R71
6431C39J15r50J75Q66l47o90L99O57o86l50O64K49p58ON99j10n14K72L93l90k76
6452c37M71J52l96r5L72Jk73M4J86o1j67k1L39j31k20J27J46j06k35J93K42k03
6474B8k73L43J53l56j52M32O3m64J2N79k77m88L76M34n00l62O96J69o77j26P95
$$ plain form
6338 -343 150 298 -271 -286 326 200 -422 -108 521 -12 -549 198 515 -325 -401 447 423 -536 -272 652 85
6359 85 -730 104 679 -309 -642 506 482 -675 -330 806 177 -864 93 826 -313 -725 517 608 -698
6378 -698 -402 890 169 -902 113 852 -257 -754 538 625 -771 -420 845 153 -947 57 902
6395 902 -356 -829 567 606 -800 -460 827 151 -912 51 904 -307 -825 516 583 -709 -433 755
6413 755 253 -812 9 797 -289 -729 418 553 -537 -408 672 230 -678 53 724 -208 -632 339
6431 339 454 -496 -321 545 198 -492 -93 564 -122 -472 192 441 -317 -311 288 178 -336 -64 329 -61 -337
6452 -337 134 286 -110 -205 167 168 -105 -61 125 64 -103 -124 215 84 -136 -9 137 31 -204 -11 231 28
6474 28 -245 98 251 -105 -257 175 238 -226 -214 365 88 -400 -24 410 -90 -452 244 413 -264 -390 405
6495D05k06o75M34N57o08m68P45L49q50j04R39k31q70M47Q07p34o24R60L37j049
6515d39n6J091k38j064N30Q95p43p53J066L97j100j71J132j82j042M73R15p29
6533a8p26R44N11j179q0J112j51j069M37R79p81o83R87M00j080j26J084j83j021
6552f43M82Q35p55o10R35L22r54p4R94k07r44M79P69o39n99P64L53p95j74Q33
6572C72q7p31L03N84m20m71N38K95n48j81N91J9n26J07N18l17l26K91K40k72k16
6593b37K96J49l60O1K77j11k63R0L14j61j94J23J67j48j47J64J03j30j20J32J82
6614A87k49j29L01P6l64PL63l7m16K22L34k59l30L60L00n51j40N63k0n49K05N33
6636D07k99n65N23M07o62k53P61K0p72J88Q17m52o88O22N01p50l01P99J34r19
$$ plain form
6495 405 199 -476 -42 515 -93 -561 184 533 -317 -421 518 287 -583 -136 671 -63 -687 273 610 -439
6515 -439 -495 596 358 -706 -176 719 -24 -777 289 686 -414 -585 547 365 -677 -204 711 -18
6533 -18 -744 200 711 -468 -548 564 413 -656 -219 760 -21 -704 283 683 -397 -523 561 378 -643
6552 -643 -161 674 -81 -691 244 566 -388 -462 532 325 -619 -140 629 -10 -609 155 508 -287 -461 372
6572 372 285 -446 -143 441 21 -450 88 383 -165 -346 245 264 -262 -155 363 46 -280 11 251 -21 -237
6593 -237 59 208 -152 -91 186 75 -188 -98 216 55 -139 -16 151 3 -144 20 123 -7 -127 5 187
6614 187 -62 -191 110 186 -178 -171 192 155 -261 -39 295 36 -294 66 366 -185 -325 238 218 -331 -126 407
6636 407 108 -457 66 473 -189 -442 319 339 -433 -245 572 120 -568 54 555 -195 -496 303 437 -482
6656d82J99Q46m30p30O48N10p74l14Q81Q5r47J93R01m34q02P24N55r03k33R34
6676D27Rr31K07R34n00q17P06N79q06l79R06J37r78K12Q86m31p49O16N17p41l56
6697e52Q54J34q69J29P69l08o63M83M71n63l14P29M7o85J22O47l04n63M78L41
6717C83m80k47N75P4n64L3N00j28n00K87L06l31j57L50J57l55j00L95p5l10R8
6738h9K69j17k17J42J41j60o1J13R0j57p7J90N2j97p5K43P3k55n8L43p6l11Q9
6761a05L11j65k73K03K91k95k19L89R4m75Q4M00j49m97L27M17m12k67N15J74o47
6782b99P0N98k14n88L51N04m86m06O50K58p81K1O90q1p78M54N67o01m05O76J94
6803C94p40n6Q45j59p91L48P13n45n79P68K67p49j21Q40j42p92L70O68n93m66
$$ plain form
6656 -482 -283 563 133 -597 51 561 -213 -527 354 439 -508 -315 586 152 -650 74 629 -274 -507 427
6676 427 436 -495 -288 646 146 -671 35 614 -192 -571 335 472 -506 -294 592 161 -588 28 545 -196 -552
6697 -552 302 436 -433 -304 465 157 -506 -23 448 -115 -429 300 347 -338 -216 431 127 -436 42 383
6717 383 -97 -344 231 305 -259 -226 274 146 -354 -67 239 -92 -249 101 258 -97 -197 198 123 -187 -89
6738 -89 180 63 -154 -12 129 -31 -92 21 111 -46 -123 67 119 -78 -153 90 163 -92 -150 193 117 -194 -105
6761 -105 206 41 -232 -29 262 -33 -252 137 231 -244 -160 240 91 -406 -79 338 -74 -341 174 348 -299
6782 -299 -229 369 155 -433 -82 422 -64 -470 180 438 -343 -322 368 287 -491 -37 530 -71 -476 200 394
6803 394 -346 -402 443 284 -507 -159 554 9 -570 198 465 -284 -405 435 293 -499 -129 539 -54 -520
6823e20O83K59p00p4Q03k15p08L69O22n40m58O65K75p74L0O85j84o71L47O28n85
6844f3l96O74J61n92q3N96j41m72J99M70l97l07M61J90n02k6M67m5m44J57K95
6865B02k12k28K90K12l04j55K85K7l11J20K13j12j59J24J86j82r2J43O4j24o9
6886h2J45M0j81KJ20M1q0n2J27K7k17P8J28l7j90J05K51k28j01J59J16l21ML32
6910A86n6l19J40K96k83k68L77J77l91j31M61K5m99J47M59k74l95L77L01n36j17
6931c23N40L8n59J30N57l17m52M94K79n27k06O70p6o12K27N31l84m27M89L37n98
6952a89j60O19Kp12L13N41l66n01M87M16o10k11O71l0n90K04O24m59m69N05K94
6973C79n58j21N50k4n19J89N36l35m52M42J82m21r6N27o8n06J35M95k77l41L16
$$ plain form
6823 -520 163 422 -278 -352 451 236 -472 -103 519 -21 -479 186 461 -313 -283 402 218 -453 -106 522 -63
6844 -63 -459 215 376 -216 -299 297 156 -316 -117 353 -44 -351 110 300 -202 -228 239 194 -250 -93 202
6865 202 -10 -238 52 264 -40 -195 90 117 -194 -74 139 27 -132 -8 178 -4 -96 47 111 -13 -82
6886 -82 63 103 -78 -76 44 85 5 -47 80 107 -110 -32 96 59 -131 -26 225 -3 -104 55 171 -150 -146 186
6910 186 130 -189 -49 247 -36 -304 73 250 -141 -272 189 214 -285 -138 321 47 -348 29 330 -206 -323
6931 -323 217 255 -304 -174 383 66 -386 108 387 -140 -346 324 248 -364 -137 394 10 -417 72 409 -189
6952 -189 -349 270 272 -440 -127 414 48 -453 34 450 -160 -371 300 270 -320 -116 508 49 -420 85 379
6973 379 -179 -300 250 226 -293 -104 432 97 -355 87 269 -152 -248 279 211 -295 -160 335 58 -283 33
6994C3K11l51j96M90Km07J00L28k07k22K55K14k93j30K91M1l20J17K24j25j83
7015a28J27J27j40j08J95L3k04K1J47m3q9O4O6k2j37J06M5j1j66J02Q3o4r2J09
7039B1K3o2p1J29Q3k11j8J68K3k19J30J36j25k25K45J59k71q6K94R1m17J22L01
7062B20j38l31L07J73l15j25L87jm01J03M45k05m23K89L02l96j73M80J5m78J88
7083g7L60k63l29L87K23m07j99N35Qm97J49M15k39m06L68L66n21j83M98M3n12
7104b81J36M92k97l62L54K92m96j80N33k0m37J90L85l20l16L86K62n11n7M13L7
7125B03m51J56L68k68k79K96J96l58j10L91Kl54J06K99j82k04K25R3k18r7L48
7146A62j5l22J09K08j45j51J42J18j64o7J85K9j80M7J37n7j27J6J05Pj21P3P9
$$ plain form
6994 33 244 -107 -303 187 189 -218 -118 210 3 -219 36 250 -43 -173 118 159 -161 -44 180 55 -128
7015 -128 -1 126 -14 -122 73 106 -98 -77 70 27 -62 2 68 46 -91 15 60 49 -117 -15 68 4 -88 21
7039 21 44 -18 -89 40 123 -88 -106 62 85 -134 -4 132 7 -218 27 186 -85 -171 123 214 -203 -81 220
7062 220 82 -249 58 231 -84 -209 178 177 -224 -121 324 119 -304 -15 287 -109 -282 198 213 -265 -77
7083 -77 283 20 -309 78 301 -106 -305 230 238 -259 -110 305 66 -340 28 394 -127 -310 188 231 -281
7104 -281 -145 347 50 -312 42 334 -162 -342 191 171 -266 -76 309 -11 -327 59 321 -190 -247 166 203
7125 203 -248 -92 276 8 -271 25 221 -137 -247 144 146 -208 -102 197 15 -189 36 129 -89 -186 162
7146 162 147 -175 -66 142 -3 -154 -12 106 -58 -125 60 89 -91 -44 93 36 -91 -75 30 37 -84 -11 68
7169F8l4j15J09Q1j89QR7J1j04L5P7K0j71J1K41n5j18J0J13j37j14J88N5j72j8
7194a03K41k6k66R8K12j68j78K08J74k80q3K79P0l59R5L22k17k81K94K01l61j03
7216b31M37l3l70M5M18j76l86K96K98m32j36M76k6n03K43L94k50l59L12K82l96
7237i7j69M97l6m66J43M34k88l53M11K55m58j58N17j6m87J43M57k63l51L83J69
7258B67m16j06M42l2m45J35M47k45l04L35K16m59q9M44k1l76J11L53k26k48K56
7279C9J97l41p8L01M2l66J40K30j57j86J92J16j77r6K45j7j98Q6J29o8j74J36
7301eJ21l7j70J06O5j00o3J79l1j30N8N1Nj55M7J32n0j13M2J26j7j53J53O2j27
7326dj46K41O8l47J10K27j22j55R2K17j52k30K25J84k63j55M23j34k62M4M03k44
$$ plain form
7169 68 34 -81 28 109 -80 -72 25 36 -68 -33 44 64 -107 -96 145 90 -28 -18 95 -42 -156 32 87 -85 -103
7194 -103 138 112 -154 -56 156 -12 -190 18 192 -88 -171 108 178 -181 -86 236 19 -262 32 233 -128 -231
7216 -231 206 173 -197 -152 266 90 -296 0 298 -134 -270 206 180 -323 -80 314 64 -295 17 299 -97
7237 -97 -266 231 195 -271 -128 306 18 -335 76 331 -127 -285 232 216 -271 -128 329 66 -285 98 267
7258 267 -149 -255 187 155 -290 -155 292 47 -257 78 294 -165 -254 190 169 -207 -96 257 31 -217 39
7279 39 236 -105 -183 118 160 -206 -66 164 7 -179 13 129 -48 -144 101 84 -114 -28 101 33 -141 -5
7301 -5 116 79 -91 15 80 -20 -83 96 65 -65 -7 44 49 -106 -59 73 23 -90 -48 78 61 -92 61 123 -4
7326 -4 -150 91 159 -188 -78 149 27 -128 -36 181 29 -201 24 208 -55 -210 213 79 -183 -139 264 20
7348B0l40M23J78m35r6N21j16m03J23M56k61m26M45L00n26j28M99m5m45J08N11
7369C63l24l99M33K89n58p6N31J8n94J60M83k65m72M91K61m89j43N76m5n66K49
7390g7M71l60l72L76K78n20r3N59n0n09K03M66l56l22L24K87m60j15N06l6n05
7411c05J65M29k54l13L00K84l86j34L81Qm02J03M28k38l20K91J78l19q8L15J2
7432A35k48j5K34J2l20J72K06j91j37K09N1k02K1J36kj46N1J16o5q9O5R6j00j03
7456a14J08J05j31r5J51P6j17j28J96O5k36j4K63m7l12J60K85k51k19K78K34m13
7478a56p9M08K9l88J04L51k72k95L69K34m23j58N43K6n45J07M41k58m04M00L38
7499C72n36k07N64P7o13J67N41l09m45L86M25o08k70O43J91p48J25O48k90n81
$$ plain form
7348 20 -320 103 281 -154 -250 271 155 -248 -125 331 70 -356 89 389 -137 -265 234 189 -256 -148 363
7369 363 39 -360 73 362 -196 -272 259 277 -317 -157 326 61 -411 80 341 -148 -291 285 240 -326 -77
7390 -77 394 34 -338 38 316 -204 -297 262 212 -297 -94 372 16 -306 18 305 -155 -270 236 200 -305
7411 -305 -140 289 35 -278 22 306 -80 -214 167 175 -227 -124 304 66 -254 37 215 -104 -192 123 135
7432 135 -113 -128 106 118 -202 -30 176 -15 -152 57 108 -94 -73 63 61 -85 -34 82 17 -72 -7 89 -11 -114
7456 -114 -6 99 -32 -127 24 100 -17 -145 51 116 -120 -134 129 82 -230 -70 215 -36 -255 23 257 -156
7478 -156 -235 173 202 -186 -82 269 -3 -298 71 305 -118 -276 267 293 -252 -145 296 38 -366 34 372
7499 372 -164 -371 193 270 -343 -176 365 56 -389 -3 422 -186 -456 187 378 -370 -245 403 113 -468
7519d68M63M61o68j84O31R7o87J02O74k80o41N00M26n40k63N96J04o14K7O97l32
7540A01n42M30M26n41k88N99J13n81P3N82k93m42L46L66m55k42N46J05n55N5M86
7561B89j88l98K53K99k89k26L81J71m17o1L95r2l43J10L63k46k03L04N5k49r9
7582a91K90J5k34k6K75m9j58L9J75r9j34O4J77j23j30J84P8k18j02K32N9k12q9
7605a77L17Rl05J12K53j71k47K32K48l68j21L57Q4m51N9N11k64l88L00L91m74
7626i3k69N38J19m89m5O07j92o09M15M94n32l87O69J12o50nO54j28o66L90N03
7647D36m83m67P18K73p69n8P83k06p20M40N02n13m52P19K28p56j8P67j56q18M63
7668h7N94n61n01P36K13p02n4P23j38p19M21O55o18m24O14K50p16j5P14j47o35
$$ plain form
7519 -468 -5 456 -212 -396 235 332 -355 -253 421 141 -500 0 426 -114 -377 219 323 -291 -264 433 101
7540 101 -441 -11 415 -126 -414 185 298 -283 -210 372 79 -363 -17 349 -106 -348 198 303 -252 -197 289
7561 289 101 -297 -44 255 -34 -260 121 292 -125 -186 209 117 -226 -116 247 1 -202 102 157 -92 -191
7582 -191 99 114 -120 -146 129 80 -78 -39 136 37 -97 -33 144 21 -109 75 153 -65 -167 65 124 -88 -177
7605 -177 140 149 -156 -44 209 38 -209 23 271 -97 -218 139 223 -228 -169 342 78 -310 -10 381 -93
7626 -93 -362 176 295 -194 -239 368 176 -433 -18 476 -56 -443 226 338 -312 -317 337 209 -457 -67 436
7647 436 -47 -514 204 477 -292 -350 433 227 -493 -53 449 -64 -516 203 431 -325 -343 424 268 -550 -87
7668 -87 507 -54 -555 181 394 -308 -362 361 223 -496 -75 580 -38 -462 152 402 -314 -329 385 238 -397
7689c97K86N56m21m87N46L22o02j58O44n3n58K10M66k88m64M16L39m99j57N59
7709B60r0m37J32L98k03l24K56K84l67j38L34L7l08rL36m2k79J05K17j22j99J30
7731b9J45j76j07K20J33k20j70L18M2k83p6K85Q1l90J03L54j32l31K42K35k92
7752d8k68M12J60m37j01N59j39m58J57N52l63m18M89L01n92j39O18rp08K07P06
7773D81m19n87N87L91o72k57P76M8p98K17P33l67p15O29N20p33k94P62J76r55
7793d77J73Q23l91p09O10O00q34l73Q46J27q61J31R05l90p63O15N45p71l23Q72
7813C55J40r49J07R06l81p22N23O06p25l90P90K07q50L4Q72l35p40N20N34n70
7833f8l68O35K34p61J1P44k00o69L97M23n06k41N04J86n74J7N06q7m66J71M45
$$ plain form
7689 -397 -111 445 24 -463 83 405 -197 -355 289 236 -322 -112 354 66 -398 18 357 -142 -299 260
7709 260 170 -267 -135 263 60 -264 -8 276 -91 -229 105 142 -166 -175 161 119 -160 -55 162 40 -159 -29
7731 -29 116 -60 -167 53 186 -34 -204 114 156 -127 -203 82 163 -227 -124 230 98 -233 9 244 -48
7752 -48 -316 96 256 -181 -282 277 138 -320 -163 389 26 -392 97 398 -194 -333 285 276 -432 -225 481
7773 481 62 -525 62 453 -219 -476 300 348 -450 -233 500 133 -582 47 567 -166 -460 302 478 -477
7793 -477 -304 519 128 -581 29 629 -205 -578 268 395 -466 -335 570 180 -583 32 577 -194 -517 355
7813 355 495 -454 -347 559 178 -544 -21 585 -140 -530 260 467 -383 -349 523 188 -552 -32 502 -68
7833 -68 -436 199 433 -328 -317 427 227 -442 -45 378 -128 -369 135 321 -253 -236 270 183 -283 -112 333
7854C33l62l02L55K28l30j30L30Q7l13m7L42j69j59J06J77j38j96J97J89k19j60
7875a81K37O5j88n6K09L0k30j0K88n2l10R8L38k00k95K98K44m17j68N07Q5n13
7897b21j7N03p5o16L09N24m15m51O08K33o85p8P53r7p32L05O60m63n86O85L72
7918E16q15j85R12j13q74L85P42n85n98P54M61q86k45R71l8r52L30Q65n55p57
7938f67Q19M91r67j51R41o9r61L35Q83n75p21P20N31r25j98R35Nr92K70Q91m78
7959A17p33P08M95q85k14R09M7r36J99Q30m44o92P05M73p78l24Q61R7q29J05P12
7980D23k87o20N23L93n94k90P18N5o15M8N66k09n19M25L07l16l48M84J67m72n9
8001b20M02m6l30P7L00j67k14J92K00k73r6K35J21k65j09K83Q6k93j0K48Nk79
$$ plain form
7854 333 -29 -331 24 252 -78 -208 122 209 -104 -151 191 22 -137 -31 146 8 -188 9 198 -21 -181
7875 -181 56 121 -67 -123 86 116 -114 -124 164 112 -198 -100 238 38 -257 41 285 -132 -300 207 292 -221
7897 -221 -238 265 190 -426 -117 407 -8 -459 149 382 -303 -381 372 275 -457 -152 508 45 -541 144 516
7918 516 -299 -484 428 315 -559 -174 568 -17 -615 139 600 -286 -531 440 402 -550 -220 645 90 -667
7938 -667 152 643 -324 -475 466 397 -564 -229 654 79 -642 78 609 -316 -514 421 426 -566 -296 595 117
7959 117 -616 92 587 -298 -512 397 444 -492 -293 537 93 -599 106 579 -199 -523 338 435 -394 -289 423
7980 423 136 -484 39 432 -162 -452 266 321 -294 -246 320 111 -408 17 324 8 -340 144 311 -161 -220
8001 -220 182 136 -194 -117 183 16 -198 -6 194 -79 -175 60 181 -84 -193 90 176 -117 -127 121 126 -153
8023a53M4L31j39l13J53L27k63k94L58K24m33j41N00R4o04J12N74k78m91L40M97
8044D45n56k85O64J25p53M0P61k25p02M62N92o44m32P46K65q92j2Q62k41q92N95
8065g7P15o89o41R60L17j039N0R25k36r55N16Q90q37o12R41L56j028p2J096j96
8085C84j049M96R53q39o49R47M01j076o3J046j75j091N55Q31p10o61R45L26r57
8104c86r8R40p8r49L65Q83o86n94P36M33r07r1Q21j17p79L20P34m72n31N33L60
8125D37o38j96P63n2o88K11M99k36m65L50L78m59k19M75O9l93JM39j62l10J28
8146f8K83j48k54K16J67k59p5J82J29k66m2K41M9k83k7K33J9k42jL76j16k99K22
8169C7J96k31l08M39J78m70q7M93j5n34J52N51l16n34N03M03o44k05P12l4p40
$$ plain form
8023 -153 -109 222 83 -230 -77 250 -13 -307 51 275 -158 -299 201 295 -309 -197 377 99 -392 -52 445
8044 445 -111 -396 268 393 -360 -320 441 216 -486 -24 568 -76 -508 238 503 -389 -401 461 220 -672 -77
8065 -77 638 -51 -692 268 585 -454 -404 521 285 -670 -154 736 -101 -713 228 584 -444 -516 580 384
8085 384 -665 -169 784 -55 -704 243 644 -432 -495 551 376 -715 -160 671 -39 -700 245 571 -386
8104 -386 -484 456 378 -571 -206 677 -9 -603 133 566 -341 -432 389 272 -507 -187 547 75 -456 77 437
8125 437 -201 -397 366 314 -374 -163 336 100 -365 -15 363 -96 -315 160 229 -164 -163 276 114 -196 -68
8146 -68 215 67 -187 29 196 -63 -138 44 173 -93 -135 106 155 -128 -155 78 97 -145 -146 230 114 -185 37
8169 37 233 2 -306 133 311 -159 -246 247 232 -302 -150 401 85 -449 54 457 -187 -392 320 286 -454
8190d54J47
$$ plain form
8190 -454 -307
8191c07
$$ Imaginary data points
##PAGE= N=2
##DATA TABLE= (X++(I..I)), XYDATA
0@%%%%%%%Qj6J6j6K1k9L3m1N6p2Q8j04J27j59J93k26K64l13L72m34N00n78O69
30C59p70Q78r98J136j290J454j634J835k058K300k561K850l168L514l890M300
46B257m750N245n783O370p018P733q522R392j0361J1453j2684J4082j5691J7563
60I286j9776K2436k5703K9836l5252M2690n3609P1373j06381K83731q25440J388
72f05421J471214o17836j095607Q31351Q74622j144268m47553J238113Q5664j301045
82g10766L46045J180381o64924j033409R72471P76250j168764m99484J304483
91E02283J63979j304250J29756J237998m04031j088563O18481Q95976p91228o39921
101f79520Q72763L75842q80663j20203Q20453j02883p19255L04581N64844m58372
$$ plain form
0 0 0 0 0 0 0 0 0 8 -8 8 -8 13 -16 17 -24 32 -40 48 -56 71 -88 105 -121 143 -170 202 -232 268 -310 359
30 359 -411 467 -531 605 -685 769 -865 970 -1088 1212 -1349 1501 -1667 1847 -2043 2257
46 2257 -2493 2752 -3031 3339 -3679 4054 -4468 4924 -5437 6016 -6668 7414 -8277 9286
60 9286 -10490 11946 -13757 16079 -19173 23517 -30092 41281 -65100 218631 -606809 -605421
72 -605421 865793 247957 -847650 -16299 858323 -285945 -733498 504615 590279 -710766
82 -710766 -364721 815660 150736 -882673 89798 866048 -302716 -802200 502283
91 502283 666262 -637988 -508232 729766 325735 -762828 -144347 751629 -39599 -679520
101 -679520 193243 569085 -311578 -431781 388672 285789 -433466 -128885 435959 -22413
111b2413l76520N51966J80263n87027k084N86416j62649n49536L07731M75045
121D01192m15755l78021M77385K85185n08893k01360N22841J18409n13309m2823
131b55149M78697r315m38019M1603M05920p2106l74469J04821L33889j29444k92732
142b06304J48354K58884j77038k19678K16539J60211k50606q5198K71851M930
152A21945k87851Q6632K95440j97040k76213L13818K21821m16692j43049N01823
162B20634M6133n71895P6144O13913k21997o08619L69891N54811n00495m64627
172d86107O10766L40518o95803j78583P35759q369p15598J94048O41133l62535
182G5229n23184N10341L60482o23804j55600O79970o8390o71264K84537O08458
$$ plain form
111 -22413 -398933 153033 333296 -253731 -255815 330601 167952 -381584 -73853 401192
121 401192 -14563 -392584 84801 369986 -138907 -340267 182574 300983 -212326 -255149
131 -255149 223548 214233 -223786 -182183 223737 151631 -222838 -118017 215872 86428 -206304
142 -206304 -57950 200934 23896 -195782 20757 180968 -69638 -154836 117015 121945
152 121945 -165906 -79274 216166 19126 -257087 56731 278552 -138140 -281189 220634
162 220634 266767 -305128 -228984 384929 162932 -445687 -75796 479015 -21480 -486107
172 -486107 124659 465177 -230626 -409209 326550 318181 -397417 -203369 437764 75229
182 75229 -447955 62386 422868 -200936 -356536 323434 255044 -416220 -131683 476775
192D76775m82097m98026O54389L37425p81261j36747Q42628p6725q38582K80926
202b21295P80256m69050o68671O29743N03310p39962l01429P85652Q9886p72274
212c83834J16505P06749l11302n85950M77110M14015n91381k13213O46948O749
222B82396o51230J96304O05726l87236n05910N44575L61880o49848j97195P02759
232C02221K8569p09918J38806O68698k93277n77091M12848M51190m87113l12297
242c77364N21558J69526n20391k5640M77978j04778l97567K04310K97233k71305
252b6440j91601L13585Q2164l30348K7923L15687j23634k76750J94125K30070
262B14781k45030j81326K82850J26815l02543p1356L00743K7550k87711K482K74888
$$ plain form
192 476775 -5322 -503348 151041 488466 -292795 -429542 413086 336361 -502221 -221295
202 -221295 558961 89911 -578760 50983 554293 -185669 -487098 298554 388440 -383834
212 -383834 -267329 439420 128118 -457832 19278 433293 -158088 -371301 275647 282396
222 282396 -368834 -172530 433196 45960 -459950 84625 446505 -203343 -400538 302221
232 302221 330790 -379128 -240322 428376 135099 -441992 -29144 422046 -65067 -377364
242 -377364 144194 313720 -206671 -232311 245667 140889 -256678 -52368 244865 -26440
252 -26440 -218041 95544 177708 -152640 -124717 190970 67336 -209414 -15289 214781
262 214781 -30249 -211575 71275 198090 -104453 -175809 124934 152484 -135227 -132745 142143
273A42143k8318k60031N2651K38145o8826k15529P7416K00082q9831j85893J10417
284b7574J62291j30887j30600J47167R6577j64956n5643J84739j053j94441O9756
295d4624J85417j38530j61948K04784J26592k71348p1949L30572n582l67544R5595
306a18565L77328j86122l64987K75941L29143l63229k62105M33969J66871m74146
316a85902n7868M82953n5465m63710J71977M11010k83637l19778L72723J98903
326B71206m27976o3841M50793p8935m40403K25652L88868l61819k95580M68692
336A36657J73831n38703l7369N73086j08909n67140K56858N13872l87993m18280
346d04090M85732K96281n47101j58132N71745Q642n52826J39829M86667k67525
$$ plain form
273 142143 113825 -146206 -93555 144590 75764 -139765 -62349 137733 47902 -137991 -27574
284 -27574 134717 3830 -126770 20397 116974 -47982 -103625 81114 80061 -114380 -44624
295 -44624 140793 2263 -159685 45099 171691 -99657 -171606 158966 153384 -214160 -118565
306 -118565 258763 72641 -292346 -16405 312738 -50491 -312596 121373 288244 -185902
316 -185902 -243770 239183 183718 -279992 -108015 302995 19358 -300420 72303 271206
326 271206 -156770 -220611 230182 151247 -289156 -63504 325364 -36455 -332035 136657
336 136657 310488 -228215 -265584 307502 198593 -368547 -111689 402183 14190 -404090
346 -404090 81642 377923 -169178 -327310 244435 253077 -299749 -159920 326747 59222
356E9222l83736L63229K58863m26840j18877M55770l0631m42201J73900L87320
366B96019k93982l03934L85558K02850m49326q7151M79827l6028m70212J50020
376a26359M26013k42812l59625L13721K76654l62235j78399L80609P4584l65163
386a63012J9598L24468r7784k68162J61494J97842k07703j15451K28613L2611
396A12514k25094L9220K07034r9489j79645J50294J41653j86977r6608K04551
406F7453N5222k08013k2808K06142m742j99736K9395J85936m5966j69349N3103
417e3363J57715n8576j49869O7879J39198p7866j25150Q5846J11937r6729r6721
428i5699J13179P1745j28695l6173J36371m071j37123M7470J32397r7435j15882
$$ plain form
356 59222 -324514 38715 297578 -129262 -248139 207631 177000 -265201 -91301 296019
366 296019 2037 -301897 83661 286511 -162815 -249966 229861 193833 -276379 -126359
376 -126359 299654 56842 -302783 10938 287592 -74643 -253042 127567 202151 -163012
386 -163012 -143414 181054 83270 -184892 -23398 174444 -33259 -148710 79903 112514
396 112514 -112580 -73360 133674 34185 -145460 4834 146487 -40490 -137098 67453
406 67453 122675 -85338 -108146 97996 93254 -106482 -77087 108849 62883 -106466 -53363
417 -53363 104352 45776 -104093 -36214 102984 25118 -100032 -14186 97751 1022 -95699
428 -95699 17480 89225 -39470 -75643 60728 56657 -80466 -32996 99401 1966 -113916
439a13916J51052Q1479j97977l2558K32169k4445k54560Q8784K63197j61171k49645
450b17591K32975K11310k92742j54376L35827Q4863l62066k983L65734q7183l39529
461b25761J73218K85041k44426k10414K98208J19931l32092j4944L37916r5990
471I0687l10702J98792K55489k84902j79902L52156Q6606l95660K1038M06843
481B40445j31347l83899K31145L33516l14525k61222L78795J68443m16386o1557
491b16592M19929m6202l90861J44071L35926k28167k58263K94002J59512l32022
501a18667m9288L37209n8656l13850J56558K67286k41228j99006L06431J12608
511A99397l43432j9411L50704o9224l33742J48560K96420k15894k39537K64308
$$ plain form
439 -113916 37136 118615 -79362 -111920 120249 95804 -158756 -69972 193225 32054 -217591
450 -217591 15384 226694 -66048 -220424 115403 200266 -161800 -164783 200951 113768 -225761
461 -225761 -52543 232498 -11928 -222342 75866 195797 -136295 -151239 186677 90687
471 90687 -220015 -21223 234266 -50636 -230538 121618 208224 -187436 -166398 240445
481 240445 109098 -274801 -43656 289860 -24665 -285887 92908 261351 -155035 -216592
491 -216592 203337 157135 -233726 -89655 246271 18104 -240159 53843 213355 -118667
501 -118667 -167955 169254 110598 -203252 -46694 220592 -20636 -219642 86789 199397
511 199397 -144035 -163446 187258 118034 -215708 -67148 229272 13378 -226159 38149
521C8149J68220k87314r3924K87253K4044k69612M0148K35539r5301j85670J34344
532d124J27052j54395o9057J59900J4879j54806L5781J38350p9571j11058J10426
543A3377Q0202j28894n1534J39920K4712j44988J090J42053k1855j33414L4621
554d4710J25027m2690j18813N0691J11484n7486j02658O1129R5894o5334r0812
565g8278P4082Q2010q5379o6484R4508M6918j01330k4301J07285m407j08960M0052
577b4284J00475p7181q1236J10944N4160j41106j8937J66060k6260j79868P8469
588c8764J77533j29910j60905J76555J32267k17377r0589K48407L5732k62373
598a29424K6036K56322q6879k32708J43223J93039j92727j36200K28848O5015
$$ plain form
521 38149 206369 -80945 -174869 112384 136428 -133184 -93036 142503 47202 -138468 -4124
532 -4124 122928 -31467 -100524 59376 74255 -80551 -44770 93580 14009 -97049 13377
543 13377 93579 -35315 -86849 53071 77783 -67205 -66115 75938 54083 -79331 -44710
554 -44710 80317 37627 -81186 -30495 80989 23503 -79155 -18026 77868 12534 -78278
565 -78278 -4196 77814 -7565 -74049 20459 67377 -33953 -58254 49031 44624 -64336 -24284
577 -24284 76191 -990 -82226 28718 82878 -58228 -77165 88895 62635 -117233 -38764
588 -38764 138769 8859 -152046 24509 156776 -60601 -151190 97217 132949 -129424
598 -129424 -103388 152934 66055 -166653 -23430 169609 -23118 -159318 69530 134545
608A34545k44666J2377K38760q8296k13695J59338J69785k20973j06804K64859
618A05230L0537k85398M9366K83549j26988k60918J98580K17253k57807j54380
628b00976K96450P9951l10856l261L03391p1313k75078J39657K25976j94638j59649
639a70346K29232Q4789k42677q552K37196o5934k12402J33715J68809j87421j11512
650a45103K22191M8662k39213J5615K39339p8686k21360J34878J86276j77012
660a4413j40440K02907R0107k14146l7884K10793j3564j91570N8328J58933r1165
671A7886j19390J12060P7228j22750l3672J22394q433j10136M3334R0162o8800
682a17o7639Q6744M4297r8270k0391J02315j541r9019J7439R2940k7842q7392
$$ plain form
608 134545 -110121 -97744 141016 52720 -160975 -1637 168148 -52825 -159629 105230
618 105230 135767 -149631 -100265 183284 56296 -204622 -6042 211211 -46596 -200976
628 -200976 95474 175425 -135431 -138692 164699 93386 -181692 -42035 183941 -10697 -170346
639 -170346 58886 143675 -99002 -107554 129642 63708 -148694 -14979 153830 -33591 -145103
650 -145103 77088 125750 -113463 -97848 141491 62805 -158555 -23677 162599 -14413
660 -14413 -154853 48054 138161 -75985 -113869 96924 83360 -108210 -49882 109051 17886
671 17886 -101504 10556 87784 -34966 -68638 53756 45323 -64813 -21479 68683 -117
682 -117 -67756 18988 63285 -34985 -55376 46939 45398 -53621 -36182 56758 28916 -58476
694e8476L5892Q1468m1790p4706M4461O9425m5542o6879M8489O4466n4250n9040
706e6482O0271N1165o5836m1776P2491K8375p8978q935Q1268j4686p6978L8941
718a1160O7328o3382n1990Q7757K8645j08750L194J21346l9398j24290P6468J18298
730A04066j13367j02310J48055P4377j75097l6574J89988n914j92423N0010J82630
741A23441r3814j59156J33512J21438j63054p3472J78885K0721j81266L3882J69899
752A11016q7961j42893J35788J01543j71511n0908J92925m207k00333O1480J92397
763A37336j17233j67529J65021J28232j99621p9954K19808K6455k25148K9741
773h2892K13534q3668j84605J28627J42192j60488r1783J79109L6054j83118K1724
$$ plain form
694 -58476 -22584 58884 17094 -57612 -13151 56274 10732 -56147 -7658 56808 2558 -56482
706 -56482 3789 54954 -10882 -52658 19833 48208 -30770 -39705 41563 26877 -50101 -11160
718 -11160 56168 -7214 -59204 28553 57198 -51552 -48358 72988 33590 -90700 -14232 104066
730 104066 -9301 -111611 36444 110821 -64276 -100850 89138 83224 -109199 -59189 123441
741 123441 29627 -129529 3983 125421 -37633 -111105 67780 88501 -92765 -58883 111016
752 111016 23055 -119838 15950 117493 -54018 -104926 87999 83792 -116541 -55061 137336
763 137336 20103 -147426 17595 145827 -53794 -133748 86060 112515 -112633 -82892
773 -82892 130642 46974 -137631 -9004 133188 -27300 -119083 60026 96080 -87038 -65314
784f5314J70458p5563j42220J19538J03260j51270n7956J70739Q493j76217M1512
795e4540J66269q5885j43635J20453J12912j44506p7366J58270L8089j59475O98
806f8716J48110l3912j27760N9544J02115p8041p2660Q9040M0382r0521r452Q3497
818D1626j6638p1330L7462N6517n4018l9032O5399J9805o9796k775O9319j0462
830B6077o6952K1078O3305k9794n7702L5321N1463l7297m7317L8301M5067m0431
842A119m2336M2936L8709m4912l5497M8080L1552n3247k4080N8148J2567o0184
854b7145J033N9254j5867n5986L2934M8243n1183l3734O6863J3860p7707R049
866c0386Q3680l4345q4291O1836P7034q8815o0695J10714L7878j25886j0931J34327
$$ plain form
784 -65314 105144 29581 -112639 6899 110159 -41111 -99067 71672 80165 -96052 -54540
795 -54540 111729 25844 -117791 2662 115574 -28932 -106298 51972 90061 -69414 -68716
806 -68716 79394 45482 -82278 -22734 79381 1340 -71320 17720 58102 -32419 -41871 41626
818 41626 24988 -46342 -8880 47637 -6381 -45413 19986 39791 -30005 -32780 36539 26077
830 26077 -40875 -19797 43508 13714 -43988 -8667 42796 5499 -41818 -3517 41550 1119
842 1119 -41217 1719 40428 -4484 -39981 8099 39651 -13596 -37676 20472 33039 -27145
854 -27145 -26112 33142 17275 -38711 -5777 42466 -8717 -42451 24412 38272 -39435 -30386
866 -30386 53294 18949 -65342 -3506 73528 -15287 -75982 34732 72610 -53276 -64207 70120
878G0120j9748j34190N2671J23185q3681j01363J08277P2009j25260l7335J33967
889E8652j965j31918M3049J16967q0157r1324J10017N8055j31416j9135J43110
900G3935k4016j42291O7097J28153j04565j03711J34016P1925j54562l4197J64181
911G5965p213j60383M7222J43851q1015j18362J07455Q5888j25677m7478J33175
922E3428O343j28068L2295J12437o5389q9381R2330N9733j11423k4837J20072
933E7540j1430j17549M4436J06429p2470q8891R5221O5105j10437l6844J15710
944D6820Q337j11710J6955J01164l8446q5326N5834O4167o6502m0154O9122J7400
956C7661o5633K396N8276j9689m7290L3604L3031m2134j8082M5169N580m5496
$$ plain form
878 70120 50372 -83818 -31147 92038 8357 -93006 15271 87280 -37980 -75315 58652
889 58652 56687 -75231 -32182 84785 4628 -86696 23321 81376 -50040 -69175 73935
900 73935 49919 -92372 -25275 102878 -1687 -105398 28618 100543 -54019 -88216 75965
911 75965 68752 -91631 -44409 99442 18427 -99935 7520 93408 -32269 -79747 53428
922 53428 59771 -68297 -36002 76435 11046 -78335 13995 73728 -37695 -62532 57540
933 57540 46110 -71439 -27003 79426 6956 -81935 13286 78391 -32046 -68890 46820
944 46820 55157 -56553 -39598 61566 23120 -62206 -6372 57795 -8707 -48861 20261 37661
956 37661 -27972 -25576 32700 13011 -34279 -675 32356 -9778 -27860 17309 22889 -22607
968b2607M763M4388j3972m1161K0997L5966k4186l1836K5261K9709k6428k8141
980b7247K8019K6052k8795k4547K9452K4271l2327k2654L6514J8155l9764j1787
992b4658M1493M665m2713M452M2642j6438l8488K9050K9585l9517j8060M8110
1004B0123M198n5032J3181N7965l3133n4643N2545M5437o8875l2317Q2303J5287
1016D7039r2084O148R5220k9799r0044N1619P8375p0156o1751Q5335L9683r5127
1028c5542j2806R6572j5192q9512M0990P5765o3608n6353Q2561L0750r4731q62
$$ plain form
968 -22607 -17844 26544 12572 -28589 -7592 28374 4188 -27648 -2387 27322 894 -27247
980 -27247 772 26824 -1971 -26518 2934 27205 -5122 -27776 8738 26893 -12871 -24658
992 -24658 16835 21500 -21213 -16761 25881 9443 -29045 5 29590 -9927 -27987 20123
1004 20123 24321 -30711 -17530 40435 7302 -47341 5204 50641 -18234 -50551 31752 47039
1016 47039 -45045 -38897 56323 26524 -63520 -11901 66474 -3682 -65433 19902 59585 -35542
1028 -35542 -48348 48224 33032 -56480 -15490 60275 -3333 -59686 22875 53625 -41106 -41968
$$ [...]
8191D44
##END NTUPLES=NMR FID
##END=
