##TITLE=1H_AX3008
 aceton-d6
 8 sc, 
 31.8.2023
##JCAMPDX= 6.0         $$ Bruker NMR JCAMP-DX V2.0
##DATA TYPE= NMR FID
##DATA CLASS= NTUPLES
##ORIGIN= UXNMR, Bruker Analytische Messtechnik GmbH
##OWNER= root
$$ XWIN-NMR		Version 3.5
$$ Thu Aug 31 13:51:44 2023 Russian Standard Time (UT+4h)  she@DPX200
##.OBSERVE FREQUENCY= 200.13135
##.OBSERVE NUCLEUS= ^1H
##.DELAY= (6, 6)
##.ACQUISITION MODE= SIMULTANEOUS
##.ACQUISITION SCHEME= undefined
##.AVERAGES= 8
##.DIGITISER RES= 18
##SPECTROMETER/DATA SYSTEM= spect
##.PULSE SEQUENCE= zg30
##.SOLVENT NAME= Acetone
##.SHIFT REFERENCE= (INTERNAL, Acetone, 0, 15.7039)
##AUDIT TRAIL= $$ (NUMBER, WHEN, WHO, WHERE, WHAT)
$$ ##TITLE= Audit trail, XWIN-NMR		Version 3.5
$$ ##JCAMPDX= 5.01
$$ ##ORIGIN= Bruker BioSpin GmbH
$$ ##OWNER= she
$$ F:/spectra/data/she/nmr/H-F/1/audita.txt
$$ ##AUDIT TRAIL=  $$ (NUMBER, WHEN, WHO, WHERE, WHAT)
(   1,<2023-08-31 13:50:23.14 +0400>,<she>,<DPX200>,
      <created by zg, POWCHK disabled, PULCHK disabled
       configuration hash MD5:
       00 E9 B6 7A A2 85 ED C7 34 08 36 98 17 FE 4E 26
       data hash MD5: 16K
       98 02 20 8A EE 28 DD 28 6F F5 67 ED 76 2D 42 61>)
$$ ##END=
$$ 
$$ hash MD5
$$ A0 FE 26 26 75 C6 40 6E 6A D0 DD EC 36 8D A1 56
##$RELAX= 
##$RELAX= 
##$RELAX= 
##$RELAX= 
##$RELAX= 
##$RELAX= 
$$ Bruker specific parameters
$$ --------------------------
##$DU= <F:/spectra>
##$EXPNO= 1
##$NAME= <H-F>
##$PROCNO= 1
##$TYPE= <nmr>
##$USER= <she>
##$AMP= (0..31)
100 100 100 100 100 100 100 100 100 100 100 100 100 100 100 100 100 100 
100 100 100 100 100 100 100 100 100 100 100 100 100 100 
##$AQSEQ= 0
##$AQ_mod= 1
##$AUNM= <au_zg>
##$AUTOPOS= <>
##$BF1= 200.13
##$BF2= 200.13
##$BF3= 200.13
##$BF4= 200.13
##$BF5= 200.13
##$BF6= 200.13
##$BF7= 200.13
##$BF8= 200.13
##$BYTORDA= 1
##$CFDGTYP= 0
##$CFRGTYP= 5
##$CHEMSTR= <none>
##$CNST= (0..31)
1 1 145 1 1 1 1 1 1 1 1 1 1 1 1 1 1 1 1 1 1 1 1 1 1 1 1 1 1 1 1 1 
##$CPDPRG= <>
##$CPDPRG1= <>
##$CPDPRG2= <>
##$CPDPRG3= <>
##$CPDPRG4= <mlev>
##$CPDPRG5= <mlev>
##$CPDPRG6= <mlev>
##$CPDPRG7= <mlev>
##$CPDPRG8= <mlev>
##$CPDPRGB= <>
##$CPDPRGT= <>
##$D= (0..31)
0 1.2 0 0 0 0 0 0 0 0.06 0 0.03 0 0 0 0 0.0002 0 0 0 0 0 0 0 0 0 0 0 0 
0 0 0 
##$DATE= 1693475422
##$DBL= (0..7)
120 120 120 120 120 120 120 120 
##$DBP= (0..7)
150 150 150 150 150 150 150 150 
##$DBP07= 0
##$DBPNAM0= <>
##$DBPNAM1= <>
##$DBPNAM2= <>
##$DBPNAM3= <>
##$DBPNAM4= <>
##$DBPNAM5= <>
##$DBPNAM6= <>
##$DBPNAM7= <>
##$DBPOAL= (0..7)
0.5 0.5 0.5 0.5 0.5 0.5 0.5 0.5 
##$DBPOFFS= (0..7)
0 0 0 0 0 0 0 0 
##$DE= 6
##$DECBNUC= <off>
##$DECIM= 32
##$DECNUC= <off>
##$DECSTAT= 4
##$DIGMOD= 1
##$DIGTYP= 9
##$DL= (0..7)
0 120 120 120 120 120 120 120 
##$DP= (0..7)
150 150 150 150 150 150 150 150 
##$DP07= 0
##$DPNAME0= <>
##$DPNAME1= <>
##$DPNAME2= <>
##$DPNAME3= <>
##$DPNAME4= <>
##$DPNAME5= <>
##$DPNAME6= <>
##$DPNAME7= <>
##$DPOAL= (0..7)
0.5 0.5 0.5 0.5 0.5 0.5 0.5 0.5 
##$DPOFFS= (0..7)
0 0 0 0 0 0 0 0 
##$DQDMODE= 0
##$DR= 18
##$DS= 0
##$DSLIST= <SSSSSSSSSSSSSSS>
$$ [...]
##$SUBNAM2= <"">
##$SUBNAM3= <"">
##$SUBNAM4= <"">
##$SUBNAM5= <"">
##$SUBNAM6= <"">
##$SUBNAM7= <"">
##$SUBNAM8= <"">
##$SUBNAM9= <"">
##$SW= 18.05172834244
##$SWIBOX= (0..15)
0 0 2 0 0 0 0 0 0 0 0 0 0 0 0 0 
##$SW_h= 3612.71676300578
##$TD= 16384
##$TD0= 1
##$TE= 0
##$TE2= 300
##$TE3= 300
##$TEG= 300
##$TL= (0..7)
0 120 120 120 120 120 120 120 
##$TP= (0..7)
150 150 150 150 150 150 150 150 
##$TP07= 0
##$TPNAME0= <>
##$TPNAME1= <>
##$TPNAME2= <>
##$TPNAME3= <>
##$TPNAME4= <>
##$TPNAME5= <>
##$TPNAME6= <>
##$TPNAME7= <>
##$TPOAL= (0..7)
0.5 0.5 0.5 0.5 0.5 0.5 0.5 0.5 
##$TPOFFS= (0..7)
0 0 0 0 0 0 0 0 
##$TUNHIN= 0
##$TUNHOUT= 0
##$TUNXOUT= 0
##$USERA1= <user>
##$USERA2= <user>
##$USERA3= <user>
##$USERA4= <user>
##$USERA5= <user>
##$V9= 5
##$VALIST= <valist>
##$VCLIST= <CCCCCCCCCCCCCCC>
##$VD= 0
##$VDLIST= <DDDDDDDDDDDDDDD>
##$VPLIST= <PPPPPPPPPPPPPPP>
##$VTLIST= <TTTTTTTTTTTTTTT>
##$WBST= 1024
##$WBSW= 4
##$XGAIN= (0..3)
0 0 0 0 
##$XL= 0
##$YL= 0
##$YMAX_a= 1023181
##$YMIN_a= -1084658
##$ZGOPTNS= <>
##$ZL1= 120
##$ZL2= 120
##$ZL3= 120
##$ZL4= 120
##$ABSF1= 10
##$ABSF2= 0
##$ABSG= 5
##$ABSL= 3
##$ALPHA= 0
##$AQORDER= 0
##$ASSFAC= 0
##$ASSFACI= 0
##$ASSFACX= 0
##$ASSWID= 0
##$AUNMP= <proc_1d>
##$AZFE= 0.1
##$AZFW= 0.1
##$BCFW= 1
##$BC_mod= 2
##$BYTORDP= 1
##$COROFFS= 0
##$CY= 11.3945322036743
##$DATMOD= 1
##$DC= 2
##$DFILT= <>
##$DTYPP= 0
##$F1P= 15.7292609196834
##$F2P= 12.9074282941183
##$FCOR= 0.5
##$FTSIZE= 0
##$FT_mod= 4
##$GAMMA= 1
##$GB= 0.15
##$INTBC= 1
##$INTSCL= 1
##$ISEN= 128
##$LB= 0.24
##$LEV0= 0
##$LPBIN= 0
##$MAXI= 10000
##$MC2= 0
##$MEAN= 0
##$ME_mod= 0
##$MI= 1.114404
##$NCOEF= 0
##$NC_proc= 0
##$NLEV= 6
##$NOISF1= 3.799351
##$NOISF2= 2.8
##$NSP= 1
##$NTH_PI= 0
##$NZP= 0
##$OFFSET= 15.70392
##$PC= 1
##$PHC0= -21206.23
##$PHC1= 9.65272
##$PH_mod= 1
##$PKNL= yes
##$PPARMOD= 0
##$PSCAL= 0
##$PSIGN= 0
##$REVERSE= no
##$SF= 200.130013532006
##$SI= 16384
##$SIGF1= 3
##$SIGF2= 2
##$SINO= 400
##$SIOLD= 16384
##$SREGLST= <1H.CDCl3>
##$SSB= 0
##$STSI= 0
##$STSR= 0
##$SW_p= 3612.71676300578
##$SYMM= 0
##$S_DEV= 0
##$TDeff= 0
##$TDoff= 0
##$TI= <>
##$TILT= no
##$TM1= 0
##$TM2= 0
##$TOPLEV= 0
##$USERP1= <user>
##$USERP2= <user>
##$USERP3= <user>
##$USERP4= <user>
##$USERP5= <user>
##$WDW= 1
##$XDIM= 8192
##$YMAX_p= 0
##$YMIN_p= 0
$$ End of Bruker specific parameters
$$ ---------------------------------
##NTUPLES= NMR FID
##VAR_NAME=  TIME,          FID/REAL,        FID/IMAG
##SYMBOL=    X,             R,               I
##VAR_TYPE=  INDEPENDENT,   DEPENDENT,       DEPENDENT
##VAR_FORM=  AFFN,          ASDF,            ASDF
##VAR_DIM=   8192,          8192,            8192
##UNITS=     SECONDS,       ARBITRARY UNITS, ARBITRARY UNITS
##FACTOR=    0.0002768,     1,               1
##FIRST=     0,             0,               0
##LAST=      2.2672688,     0,               0
##MIN=       0,             -1084658,        0
##MAX=       2.2672688,     1023181,         0
$$ Real data points
##PAGE= N=1
##DATA TABLE= (X++(R..R)), XYDATA
$$ plain form
0 0 0 0 0 0 0 0 -8 8 -8 8 -16 16 -16 24 -32 40 -48 56 -71 88 -104 120 -141 170 -200 229 -266 309 -357 407
30 407 -463 528 -602 682 -767 861 -967 1084 -1209 1345 -1499 1665 -1845 2041 -2255 2493
46 2493 -2750 3031 -3336 3677 -4052 4463 -4919 5431 -6008 6656 -7395 8249 -9249 10434
60 10434 -11863 13633 -15883 18857 -22977 29075 -39020 57940 -106256 476188 635826 -997485
72 -997485 -307632 1023181 108668 -1084658 173088 1010931 -385243 -915427 603717
81 603717 718948 -728655 -518322 818089 278841 -827982 -54616 796361 -176661 -688467
91 -688467 361003 546375 -509231 -369621 602574 187878 -658914 8320 657804 -190386
101 -190386 -610681 347902 524293 -466367 -420370 555324 296580 -606399 -162912 615814
$$ packed form
0@%%%%%%qJ6j6J6k4L2l2M0n6P2q8J04j27J59j92K24k61L11l70M29m95N75o66P64
30D07q70R91j130J284j449J628j828K051k293K554k844L164l510L886m296M748
46B493n243N781o367P013p729Q515r382J0350j1439J2664j4051J5644j7498J9683
60A0434k2297K5496k9516L4740m1834N2052o8095R6960j64196N82444J59638j633311
72i97485O89853J330813r14513j193326J257746Q37843j396174n30184J519144
81F03717J15231j447603K10333J336411n39248j106823P73366Q50977r73022n11806
91f88467J049470J85372j055606J39610R72195m14696q46792O67234O49484q48190
101a90386m20295R58583J76391r90660M5997R75694k58744r02979M43487P78726
$$ plain form
111 615814 32591 -584991 77669 530592 -169717 -458153 244469 367422 -295369 -264888
121 -264888 315870 166078 -314562 -77026 301455 -6786 -276292 84798 236234 -148205
131 -148205 -189300 195563 145565 -235713 -102849 272631 54787 -299864 -4270 314816
141 314816 -41646 -324312 86023 330954 -136512 -326474 190447 305328 -239133 -272222
151 -272222 281232 230497 -321021 -174145 353485 99733 -367148 -15289 358847 -70155
161 -70155 -332725 156409 287622 -242667 -216492 317614 120865 -369019 -12060 395248
171 395248 -102324 -397888 221245 371239 -337679 -309527 436044 219218 -505655 -112182
181 -112182 546223 -6294 -555949 132958 526978 -255814 -457505 357931 357917 -432541 -238727
$$ packed form
111F15814n83223o17582O62660M52923p00309k88436P02622J22953o62791L0481
121b64888N80758j49792m80640K37536L78481l08241k69506L61090J51436l84439
131a48205m1095L84863m9998l81278J32864L75480k17844l54651K95594L19086
141C14816l56462k82666M10335K44931m67466j89962N16921J14881n44461l3089
151b72222N53454n0735n51518J46876N27630k53752m66881L51859L74136m29002
161g0155k62570M89134J31213n30289K6175N34106j96749m89884L56959M07308
171C95248m97572k95564O19133J49994p08918K8152P45571k16826p24873L93473
181a12182O58405n52517n49655O88907L94020p82792k01691Q15436j4p90458J93814
$$ plain form
192 -238727 479024 103082 -491883 42348 463298 -181799 -395811 300762 300511 -395313
202 -395313 -184364 463018 50163 -494986 92389 485107 -226490 -438663 341519 364969
212 364969 -434999 -266896 501512 147607 -530592 -20047 519289 -100430 -474692 207055
222 207055 403019 -296983 -305326 361607 187489 -391660 -64104 387603 -52844 -357038
232 -357038 159730 302449 -252712 -224168 321795 130466 -360439 -34713 372489 -55698
242 -55698 -363348 139906 332263 -212289 -279876 263403 215864 -291273 -150450 301604
252 301604 85458 -296667 -21230 273812 -35693 -235310 78331 190546 -108482 -144987
262 -144987 131365 96442 -145440 -45690 147382 -363 -141167 38444 133561 -73330
$$ packed form
192b38727P17751l75942n94965N34231M20950o45097k14012O96573k51o95824
202c95313K10949O47382m12855n45149N87375L92718p11597k12173P80182K3450
212C64969p99968J68103P68408l53905o78199N10545N39336o19719l74262O81747
222B07055J95964p00002q343O66933j74118n79149L27556M51707m40447l04194
232c57038N16768J42719n55161K8544N45963j91329m90905L25726M07202m28187
242e5698l07650N03254J92357n44552o7587N43279m7539n07137J40823M52054
252C01604k16146l82125K75437K95042l09505j99617L13641J12215k99028l6505
262a44987K76352l4923k41882R9750J93072j47745j40804J79611R5117k06891
$$ plain form
272 -73330 -124352 107626 109579 -137224 -90853 159795 73398 -179792 -55763 200279 32297
283 32297 -216261 -2892 223540 -27267 -224308 58002 220808 -93148 -207615 131144
293 131144 180226 -164210 -141307 188876 95549 -206877 -41775 216206 -21696 -209804
303 -209804 88557 184631 -150216 -145327 203928 94639 -249904 -30539 281916 -45195
313 -45195 -292269 123314 280437 -195929 -250984 261458 203915 -316818 -137345 353314
323 353314 56891 -364167 27331 351196 -108894 -316990 185913 259986 -251802 -180461
333 -180461 296275 86715 -314925 10767 310030 -107735 -282224 200098 228981 -278446
343 -278446 -153610 333012 66163 -361892 24782 367077 -116035 -346925 201629 299842
$$ packed form
272g3330n1022K31978J953k46803M6371K50648q6397k53190J24029K56042j67982
283C2297k48558K13369K26432k50807j97041K82310J62806l13956j14467L38759
293A31144M9082l44436K2903L30183r3327l02426J65102K57981k37902j88108
303b09804K98361R6074l34847M889L49255j09289l44543K19365L12455l27111
313d5195k47074M15583J57123m76366n5055N12442n7543n20733J79473M90659
323C53314k96423m21058L91498L23865m60090k08096N02903P4073n11788P1341
333a80461M76736k09560m01640L25692K99263m17765j74489M82322K8883n07427
343b78446J24836M86622k66849m28055L86674L42295m83112k30890N48554R8213
$$ plain form
353 299842 -270969 -231868 316962 153087 -340163 -69158 341439 -17279 -317913 98380
363 98380 270057 -164146 -205634 210898 132934 -240271 -54319 251160 -27032 -240033
373 -240033 102502 209117 -164354 -166219 211757 115732 -245736 -58281 262863 -2104
383 -2104 -260102 56947 241430 -101593 -213148 137154 176608 -163353 -131962 175813 84295
394 84295 -173512 -40952 161585 2999 -143979 31445 119780 -60385 -89338 79859
404 79859 58249 -91250 -30699 99457 4765 -105218 21616 105877 -45222 -102571 64017
415 64017 99554 -80823 -97000 99115 90789 -116751 -79862 130529 67208 -142088 -52666
426 -52666 153579 32483 -161842 -5793 161925 -23210 -154032 51848 140212 -81534
$$ packed form
353B99842n70811L9101N48830j63875m93250K71005M10597l58718l00634M16293
363I8380J71677m34203m1488M16532p7964l73205J85952L05479k78192k13001
373b40033L42535J06615l73471j865L77976r6025l61468J87455L21144k64967
383b104k57998L17049J84483l43023j11555L50302L9454l39961L1391L07775r1518
394H4295k57807J32560K02537j58586j46978J75424Q8335j80165k8953J69197
404G9859k1610j49499O0551J30156r4692j09983J26834Q4261j51099n7349J66588
415F4017L5537j80377j6177J96115q326k07540L6889K10391o3321k09296Q9422
426e2666K06245j21096j94325J56049J67718j85135j30822K05880Q8364k21746
$$ plain form
436 -81534 -118467 111333 85114 -135274 -42341 148775 -4624 -152791 54075 147324 -106135
447 -106135 -128731 156460 95135 -197453 -50599 225855 151 -241883 55190 243655
457 243655 -113299 -226812 167516 191851 -210555 -144089 240336 87410 -256414 -22902
467 -22902 255080 -45040 -232898 107949 192552 -160016 -139512 199748 76084 -225403
477 -225403 -4303 231973 -69700 -217736 137535 186567 -194873 -142520 240399 86921
487 86921 -270465 -22319 280051 -43671 -268915 103841 241474 -155646 -199942 197285
497 197285 144884 -223456 -80761 230151 15641 -219110 45206 193844 -99906 -155191
507 -155191 145230 104147 -175691 -46555 189032 -10484 -188249 63636 175401 -111960
$$ packed form
436h1534l6933K29800k6219k20388R2933J91116j53399j48167K06866R3249k53459
447a06135k2596K85191o1325k92588J46854K76454k25704k42034K97073J88465
457B43655l56954j13513L94328K4335m02406O6466L84425j52926l43824K33512
467b2902K77982l00120j87858L40847Q4603l52568K0504L39260j23664l01487
477b25403K21100K36276l01673j48036L55271M9032l81440N2353L82919j53478
487H6921l57386K48146L02370l23722k25244L72756J37633l97120m4296L97227
497A97285n2401l68340J42695L10912k14510k34751K64316J48638k93750n5285
507a55191L00421m1083k79838J29136K35587j99516j77765K51885J11765k87361
$$ plain form
517 -111960 -150382 151278 114899 -176898 -75240 188813 36216 -190037 1262 181269
527 181269 -36050 -161813 63969 134446 -82192 -104545 92463 74387 -97064 -43389 95154
538 95154 13277 -86003 12166 72842 -32067 -59270 49029 44871 -63854 -28661 74460
549 74460 12412 -80977 1172 86280 -13438 -91707 26797 94897 -40872 -94628 53164
560 53164 92650 -64827 -89749 78016 82882 -91672 -70219 102288 53437 -109148 -34097
571 -34097 113512 11012 -113712 16483 106215 -45142 -90255 70914 68185 -93406 -40500
582 -40500 112208 6172 -123892 33331 124936 -73263 -115790 110242 98192 -143522 -72133
593 -72133 171075 36910 -188110 4208 192015 -46021 -183782 86091 164365 -122976
$$ packed form
517a11960l8422L01660l6379k91797J01658K64053j52597k26253J91299J80007
527A81269k17319j25763K25782P0477k16638k2353J97008j8076j71451N3675J38543
538I5154q1877r9280R8169O0676j04909k7203J08299m158j08725L5193J03121
549G4460o2048r3389Q2149Q5108r9718p8269J18504O8100j35769n3756J47792
560E3164L9486j57477k4922J67765M866j74554K1453J72507m8851j62585P5051
571c4097J47609j02500j24724J30195Q9732j51357m5113J61169k729j61591N2906
582d0500J52708j06036j30064J57223R1605j98199m2527K26032j2050k41714P1389
593g2133K43208j34165k25020J92318J87807k38036j37761K69873P8274k87341
$$ plain form
603 -122976 -132928 152957 90086 -170928 -40784 175069 -10185 -166827 60409 146046 -107453
614 -107453 -111712 145856 66368 -171226 -15453 182779 -36946 -181430 88695 166165 -135997
625 -135997 -136767 173201 97073 -196825 -52296 207286 5358 -204549 41562 187491 -83921
636 -83921 -156901 116683 117438 -138123 -73409 148883 26367 -148174 20856 134654 -63533
647 -63533 -110197 97740 79087 -122947 -43836 139311 5616 -144954 32676 139121 -66332
658 -66332 -124457 92923 104234 -112780 -79626 125373 51464 -128576 -22984 122671 -1990
669 -1990 -110476 22754 94222 -39911 -73960 52259 50842 -58121 -28180 58513 8277
680 8277 -56299 9542 52014 -25849 -45003 39106 36441 -48505 -29025 55971 22658 -63077
$$ packed form
603a22976r952K85885o2871k61014J30144K15853j85254j56642K27236Q5637k53499
614a07453m259K57568p9488k37594J55773J98232k19725j44484K70125P7470l02162
625a35997p70L09968p6128k93898J44529K59582k01928k09907K46111J45929k71412
636h3921p2980K73584P55k55561O4714K22292j22516j74541J69030J13798j98187
647f3533m6664K07937j8653k02034P9111J83147j33695j50570J77630J06445k05453
658f6332n8125K17380J1311k17014L3154K04999p3909j80040J05592J45655j24661
669a990j08486J33230P1468j34133l4049J26219j417j08963K9941Q6693n0236
680H277o4576O5841M2472p7863j9154Q4109k665q4946J9480Q4996l3313q5735
$$ plain form
692 -63077 -15798 69253 8260 -73310 -1227 76421 -5473 -79676 13976 81526 -24573 -79838
704 -79838 35562 74701 -45957 -67087 56581 55741 -66839 -39195 74049 18398 -76237
715 -76237 4150 73754 -27602 -66690 52011 53213 -74943 -32704 93111 7173 -104782
726 -104782 20787 110092 -50715 -108162 81146 96901 -108607 -76996 129493 50981 -142836
737 -142836 -21045 148246 -12127 -143896 46025 128514 -76298 -103597 100028 72175
747 72175 -116440 -35634 124525 -4542 -122007 44853 108262 -80941 -85672 110308 56474
758 56474 -132434 -21899 145410 -16356 -146854 54045 137027 -87288 -118278 114506
768 114506 92265 -134546 -59849 144965 23414 -143948 12399 132375 -44702 -112529
$$ packed form
692f3077M7279Q5051o0993q1570P2083P7648q1894p4203R3652O7550j06099n5265
704g9838J15400L9139j20658k1130J23668q40j22580K7644J13244n5651r4635
715g6237Q0387O9604j01356l9088J18701J202j28156M2239J25815q5938j11955
726a04782J25569Q9305j60807n7447J89308J5755k05508L1611K06489p8512j93817
737a42836J21791J69291j60373j31769J89921Q2489k04812k7299K03625k7853
747G2175j88615Q0806J60159j29067j17465J66860O3409j89203m731J95980n3834
758E6474j88908J10535J67309j61766j30498K00899Q2982k24315l0990K32784
768A14506k2241k26811P4697K04814j21551j67362J56347J19976j77077o7827
$$ plain form
778 -112529 72220 85444 -93306 -51995 105175 15682 -106789 19451 99834 -51146 -85800
789 -85800 78476 65266 -99446 -39631 111550 12439 -114904 13052 111255 -36017 -101817
800 -101817 55659 86410 -69748 -67006 76883 46750 -78015 -27402 74962 8954 -67659
811 -67659 7779 56013 -20904 -42301 29612 28556 -35596 -15275 39618 2001 -40889 10426
823 10426 39507 -20242 -37315 27973 35394 -35219 -32977 41855 29415 -46781 -25693 50549
835 50549 22533 -54542 -18615 58655 12777 -61179 -5449 61714 -2147 -61082 10905 58713
847 58713 -21444 -52917 32395 43064 -41667 -30364 48842 15381 -54346 2390 56361 -22577
859 -22577 -53136 42602 44652 -60487 -32253 75861 16164 -88050 3944 94667 -26492
$$ packed form
778a12529J84749J3224j78750M1311J57170q9493j22471J26240Q0383j50980l4654
789h5800J64276j3210j64712N9815J51181r9111j27343J27956R8203j47272o5800
800a01817J57476L0751j56158K742J43889l0133j24765N0613J02364o6008p6613
811f7659P5438M8234p6917k1397P1913j056o4152K0321N4893l7617m2890N1315
823A0426K9081n9749j7073O5288P421p0613K242P4832j2440p6196K1088P6242
835E0549k8016p7075L5927P7270m5878p3956N5730O7163o3861n8935P1987M7808
847E8713q0157l1473Q5312J0669q4731J1303P9206l3461o9727N6736N3971p8938
859b2577l0559R5738K050j05139K8234J08114n9697j04214R1994R0723j21159
$$ plain form
870 -26492 -94115 48661 87035 -68501 -74483 85729 56357 -98436 -32716 104095 6272
881 6272 -101617 20060 92138 -44618 -76200 66594 53542 -83355 -25415 92274 -4947
892 -4947 -92997 34758 86682 -62801 -73362 87442 52836 -105755 -27352 115641 118
903 118 -117460 26601 112001 -51916 -98960 73569 78636 -88622 -53868 96014 27534
914 27534 -96496 -1010 90436 -24598 -77283 46848 58027 -63072 -35435 73112 11907
925 11907 -77708 12198 76384 -35424 -68475 54992 55567 -69273 -40167 78617 23470 -83397
937 -83397 -5640 82453 -11566 -75751 25604 65257 -35577 -52735 42571 38668 -46174 -23279
949 -23279 45387 8557 -40674 3651 34142 -13400 -26792 21705 18319 -27762 -9168 30829
$$ packed form
870b6492o7623J42776L8374j55536n982J60212k9372j54793O5720J36811r7823
881F272j07889J21677P2078j36756l1582J42794j3052j36897N7940J17689r7221
892d947q8050J27755N1924j49483j0561J60804l4606j58591P8403J42993j15523
903A18j17578J44061Q5400j63917m7044J72529N067j67258L4754J49882o8480
914B7534j24030R5486R1446j15034n2685J24131J1179j21099K7637J08547o1205
925A1907q9615Q9906O4186j11808l3051J23467N75j24840K9106J18784n5147j06867
937h3397P7757Q8093r4019o4185J01355L9653j00834j7158R5306l903q4842K2895
949b3279O8666l6830m9231M4325L0491m7542j3392M8497l386m6081J8594L9997
$$ plain form
961 30829 1175 -31821 4825 32748 -10119 -33172 15270 32566 -19221 -31444 21832 31081
973 31081 -24613 -30964 28375 29444 -32104 -26494 34853 22969 -37430 -18519 40146 11852 -41626
986 -41626 -2931 40330 -6478 -36553 15674 31136 -25284 -22984 34529 11288 -41339 2834
998 2834 44433 -17528 -44396 32457 41446 -47546 -34113 61202 22177 -70866 -7524 76062
1010 76062 -8077 -77106 24618 73509 -41157 -64059 55471 49379 -65126 -31644 70321
1021 70321 12242 -71057 8705 66308 -29676 -55164 47485 39179 -60942 -20527 69842 -179
1033 -179 -74049 22448 71791 -43910 -63089 61781 49843 -75150 -33609 84302 14715
1044 14715 -87956 6105 84738 -25678 -75064 41847 61227 -54268 -44167 62968 23757
$$ packed form
961C0829k9654l2996L6646K7923m2867k3053M8442J7296n1787j2223N3276R249
973C1081n5694o351N9339J069o1548N610O1347j1884o0399J8911N8665k8294n3478
986d1626L8695M3261m6808l0075N2227J5462n6420K300N7513k3241n2627M4173
998B834M1599o1961k6868P6853Q989q8992J3433R5315l9025r3043O3342Q3586
1010G6062q4139o9029J01724M8891j14666k2902J19530o092j14505L3482J01965
1021G0321n8079q3299P9762N7603r5984k5488J02649q306j00121M0415R0369p0021
1033a79p3870R6497M9343j15701j9179J24870j1938j24993M1541J17911o9587
1044A4715j02671R4061P8633j10416m9386J16911J9380j15495J0101J07135l9211
$$ plain form
1055 23757 -66052 -2136 62643 -18085 -54042 35142 42123 -49212 -27141 59401 9403 -64016
1067 -64016 8641 62870 -24668 -57895 38032 49972 -48953 -39050 56281 25804 -58687 -12706
1079 -12706 56778 1409 -52294 8653 45588 -17318 -36081 23157 25072 -25534 -14722 25567
1091 25567 5514 -24778 3470 22315 -11742 -17846 17656 13011 -21424 -9115 24572 5534
1103 5534 -27356 -1513 28677 -2234 -28726 4522 28897 -6335 -29943 8972 30040 -12004
1115 -12004 -28940 14283 27703 -16542 -26563 19844 23957 -23562 -18926 26136 12817 -27232
1127 -27232 -6279 27968 -1579 -27476 11195 24191 -20739 -17956 28643 10304 -35183 -1233
1139 -1233 40646 -9975 -43369 22638 41914 -34704 -36921 44733 29668 -53233 -19936 59732
$$ packed form
1055B3757q9809O3916O4779q0728l5957Q9184O981r1335K2071Q6542m9998p3419
1067f4016P2657N4229q7538l3227R5927J1940r8925R903R5331l0477q4491M5981
1079a2706O9484n5369n3703O0947L6935o2906j8763N9238J915n0606J0812M0289
1091B5567k0053l0292K8248J8845l4057o104L5502m645l4435J2309L3687j9038
1103E534l2890K5843L0190l0911k6492L3248K4375l5232k3608L8915K1068m2044
1115a2004j6936M3223J3420m4245j0021M6407M113m7519M636M5062j3319m0049
1127b7232K0953L4247k9547k5897L8671J2996m4930K783M6599j8339m5487L3950
1139a233M1879n0621l3394O6007J9276p6618k217Q1654j5065q2901L3297P9668
$$ plain form
1151 59732 7137 -61945 7050 59197 -20337 -52724 31974 43217 -42253 -29981 49760 13386
1163 13386 -52369 4082 50033 -20604 -44154 35893 34786 -49407 -21204 59231 4749 -63465
1175 -63465 11972 62931 -27609 -58713 42274 50242 -54789 -37420 62706 22012 -65431
1186 -65431 -6685 63970 -8225 -58922 22522 49363 -34563 -35901 42187 20725 -45707 -5621
1198 -5621 46048 -9449 -43171 24166 36117 -36263 -25791 44316 14723 -49195 -3404 51467
1210 51467 -8424 -50256 19782 44966 -28564 -37365 34075 28997 -37544 -19923 38903 10009
1222 10009 -36877 -593 31882 -6430 -25704 11501 19341 -15628 -12079 18247 4195 -18424
1234 -18424 2504 16956 -7371 -15631 11346 14368 -15196 -12188 17795 9729 -18829 -8441 19583
$$ packed form
1151E9732n2595o9082O8995N2147p9534l2387Q4698J1243q5470J2272P9741l6374
1163A3386o5755N6451M5951p0637k3550Q0047j107q4193K8203Q0435n4482o8214
1175f3465P5437N0959r0540l1104J00987P968j05031J7369J00126m0694q7443
1186f5431N8746P0655p2195n0697Q1444K6841q3926j338P8088k1462o6432M0086
1198e621N1669n5497l3722O7337J1951p2380J0472P0107k9593o3918M5791N4871
1210E1467n9891m1832P0038K5184p3530q801P1440n078o6541J7621N8826k8894
1222A0009m6886L6284L2475l8312j9274L7205P840l4969L549L0326j4052k2619
1234a8424K0928J4452k4327q260K6977L022k9564L008K9983q066k8558J0388K8024
$$ plain form
1247 19583 8030 -21135 -6875 22633 5186 -23256 -3826 23730 2692 -25003 -285 25787
1259 25787 -3528 -24849 7341 22653 -10566 -19889 14383 16032 -18504 -9737 21239 1937
1271 1937 -21757 5938 20859 -13706 -18947 22246 14666 -30332 -7430 35920 -1120 -38941
1283 -38941 9836 40204 -19069 -39140 29020 34501 -37551 -26596 43213 17335 -46212 -7217
1295 -7217 47128 -4170 -44715 16023 38197 -26043 -28584 33325 17525 -38236 -5149 40869
1307 40869 -8660 -39591 22293 34099 -33705 -26105 42442 16553 -48961 -5148 52410 -7695
1319 -7695 -51449 19981 46380 -29898 -38978 37694 29650 -43442 -17860 45691 4843 -43471
1331 -43471 7118 38045 -17183 -30631 25766 21025 -32319 -9345 35356 -2939 -34521 13583
$$ packed form
1247A9583j1553k9165J4260K9508j7447k8442J9430K7556k1038k7695K4718K6072
1259B5787k9315k1321L2190J5312l3219r323L4272J649l4536Q767L0976j9302
1271A937k3694K7695J4921l4565n241M1193p580m4998K2902M3350l7040l7821
1283c8941M8777L0368n9273k0071O8160N481p2052J0955O9809k5878o3547L8995
1295g217N4345n1298m0545O0738K2174o4240k541O1909j5800n5761L3087M6018
1307D0869m9529l0931O1884J1806o7804P600O8547k5889o5514M3813N7558o0105
1319g695m3754P1430K6399p6278r080P6672q044p3092K5582O3551m0848m8314
1331d3471N0589L0927n5228j3448N6397m741n3344K2974M4701l8295l1582M8104
$$ plain form
1343 13583 31430 -22703 -26719 30712 19828 -36326 -11163 38592 2744 -37915 4364 35695
1355 35695 -10761 -32017 16385 26165 -20012 -19172 21003 12663 -20416 -7024 19123 1192 -16700
1368 -16700 4085 12603 -7778 -8169 9920 4530 -11633 -1237 13190 -2488 -13597 5776 12895
1381 12895 -7662 -12534 8874 12840 -10580 -12631 12273 11748 -13093 -11242 13636 11227 -15099
1394 -15099 -10529 16899 8590 -17886 -6230 18085 4054 -18522 -953 18615 -3490 -16916
1406 -16916 8014 13541 -11640 -9509 14836 4882 -18007 1390 19903 -8884 -19363 15976
1418 15976 16898 -22080 -13520 27666 8660 -32492 -1750 34985 -6228 -34440 13557 31980
1430 31980 -20132 -27860 26275 21402 -31073 -12637 32913 3204 -31791 5758 28809 -14470
$$ packed form
1343A3583J7847n4133m016N7431j0884n6154K5163M9755l5848m0659M2279L1331
1355C5695m6456k1256M8402R780m6177Q40M0175q340l3079J3392K6147j7931j7892
1368a6700K0785Q518k0381l91J8089n390j6163J0396J4427j5678j1109J9373P119
1381A2895k0557m872K1408L966k3420k051K4904n25k4841J851K4878k409k6326
1394a5099M570K7428q309k6476J1656K4315j4031k2576J7569J9568k2105j3426
1406a6916K4930N527k5181K131K4345r954k2889J9397J8513k8787j0479L5339
1418A5976R22l8978Q560M1186j9006m1152L0742L6735m1213k8212M7997J8423
1430C1980n2112p728N4135m873n2475J8436M5550k9709l4995L7549K3051m3279
$$ plain form
1442 -14470 -23719 22622 15838 -28790 -5991 31774 -4040 -32226 13643 30639 -22971 -26609
1454 -26609 31438 19575 -37197 -10946 39834 2371 -40179 6203 38463 -14838 -33760 22290
1466 22290 26275 -26977 -17735 29106 9115 -29566 -86 27900 -9110 -23341 16747 16798 -21975
1479 -21975 -9601 25442 2368 -27451 5608 27241 -13319 -24308 19248 20035 -23212 -15370
1491 -15370 25901 10081 -27318 -3971 26474 -1677 -23451 5831 19715 -8684 -15773 11032
1503 11032 11090 -12237 -5781 11607 1220 -9947 2068 8311 -4897 -6625 7658 4303 -9456
1516 -9456 -1773 9951 321 -10307 434 11267 -1426 -11939 2716 11910 -3253 -12100 3410
1529 3410 12902 -4453 -13522 6086 13170 -7562 -12349 8653 11601 -10203 -10123 12193 7308 -13250
$$ packed form
1442a4470r249M6341o784m4628K2799L7765l5814k8186M5869J6996n3610l638
1454b6609N8047j1863n6772K6251N0780l7463m2550M6382L2260n3301j8922N6050
1466B2290L985n3252R242M6841j9991l8681K9480K7986l7010j4231M0088N1l8773
1479b1975J2374L5043k3074k9819L3059K1633m0560j0989M3556P87m3247P842
1491a5370M1271j5820l7399K3347L0445k8151k1774K9282J3884k8399p089K6805
1503A1032N8k3327O456J7388j0387j1167J2015O243j3208j728J4283l355j3759
1516i456P683J1724r630j0628J0741J0833j2693j0513J4655R194j5163q847J5510
1529C410R492j7355r069J9608P084k0732m787K1002K948k1804Q0K2316m885k0558
$$ plain form
1543 -13250 -3587 13099 16 -12339 3690 11233 -8171 -8694 12483 4464 -15542 480 17382
1556 17382 -5363 -18396 10735 18329 -16733 -16162 22094 12149 -25553 -7352 27824 2141 -29039
1569 -29039 4093 28399 -10677 -25087 16245 19945 -20163 -14078 23040 7190 -24540 878
1581 878 23635 -9073 -20164 15964 15292 -21364 -9420 25808 2413 -28443 5659 28375 -13368
1594 -13368 -25841 19718 21998 -24802 -16852 28944 10097 -30729 -2408 29799 -4594 -26821
1606 -26821 10509 22605 -15738 -16877 19737 9528 -21443 -1787 20726 -5028 -18604 11209
1618 11209 15399 -16814 -10764 21047 4872 -22955 876 23071 -5811 -22148 10344 20203
1630 20203 -14360 -16680 17069 12303 -17824 -8238 17624 4596 -16780 -921 15002 -2564
$$ packed form
1543a3250R663J6686j3083j2355J6029P543j9404n23K1177q019k0006J6022J6902
1556A7382k2745j3033K9131P594l5062N71L8256r945l7702J8201L5176k5683l1180
1569b9039L3132K4306l9076j4410M1332L700m0108O085L7118j5850l1730K5418
1581H78K2757l2708j1091L6128o72l6656J1944L5228k3395l0856L4102K2716m1743
1594a3368j2473M5559K280m6800P950M5796j8847m0826K8321L2207l4393k2227
1606b6821L7330J2096l8343j139L6614j0209l0971J9656K2513k5754j3576K9813
1618A1209M190l2213O050L1811j6175k7827K3831K2195k8882j6337L2492R859
1630B0203l4563k320L3749m766l0127R586K5862j3028k1376J5859J5923j7566
$$ plain form
1642 -2564 -11959 4815 8616 -5937 -5702 6776 2816 -7440 390 7170 -3235 -6168 5009 5309
1656 5309 -6388 -4981 7882 4226 -9210 -3160 9720 2477 -9888 -2454 10737 2070 -11681
1669 -11681 -1012 11907 107 -11878 574 12204 -1823 -12332 3817 11547 -5869 -9826
1681 -9826 7331 7827 -8700 -5476 10183 2027 -11030 2225 10344 -6299 -8705 9938 6685
1694 6685 -13492 -3681 16768 -571 -18665 5428 18795 -9982 -17846 14086 16032 -18233 -12645
1707 -12645 21457 7660 -22765 -2323 22446 -2820 -20993 7896 18217 -12817 -13495 16543
1719 16543 7400 -18412 -1115 18710 -5065 -17850 11469 15367 -17242 -10919 21583 5490
1731 5490 -23890 29 24963 -5688 -24646 11468 22301 -16528 -18085 19926 12936 -21741
$$ packed form
1642b564r395J6774L801j4553K35J2478l960j0256P830O780j0405k933J1177L00
1656E309j1697J407J2863l656j3436O050J2880p243j2365P434J3191q667j3751
1669a1681J0669J2919j1800j1985J2452J1630j4027j0509J6149P730j7416l957
1681i826J7157M96j6527L224J5659q156j3057J3255Q119j6643k406J8643l253
1694F685k0177R811K0449j7339j8094K4093J3367k8777p864L1932J946l4265N588
1707a2645L4102j3797l0425K0442K4769k5266j8173K8889J0321l1034o78L0038
1719A6543r143k5812J7297J9825k3775j2785K9319L898l2609O323L2502j6093
1731E490k9380K3919K4934l0651j8958L6114J0833l8829j557L8011o990l4677
$$ plain form
1743 -21741 -7754 22404 2060 -21603 3779 18835 -8883 -14507 12362 9680 -14735 -4623
1755 -4623 16229 -1113 -16164 6736 14330 -11408 -11458 14794 8324 -17292 -4637 18911 400
1768 400 -18873 3617 17388 -6654 -15099 8815 12614 -10542 -9410 11442 5643 -10958 -2365
1781 -2365 9468 -62 -7890 2137 6086 -4091 -3790 5265 1302 -5514 548 5523 -1813 -5827
1795 -5827 3251 5865 -4529 -5481 5261 5167 -5517 -5424 6090 5717 -7002 -5370 7629 5014 -7949
1810 -7949 -4763 8627 4313 -9605 -3037 9965 1295 -9690 302 9096 -1934 -8432 4039
1823 4039 6898 -6161 -4334 7604 1387 -8286 1577 8751 -4877 -8607 8682 7313 -12136 -4826
1837 -4826 14537 1976 -16193 1119 17400 -4802 -17397 8858 15750 -12258 -12860 14679 9619
$$ packed form
1743b1741J3987L0158k0344k3663K5382J5056k7718n624K6869k682k4415J0112
1755d623K0852j7342j5051K2900P594k5738n0K6252o470k5616J2655K3548j8511
1768D00j9273K2490J3771k4042q445K3914L799k3156J132K0852n799j6601Q593
1781b365J1833r530p828J0027L949j0177L01R055l963o816O062M975p336m014
1795e827R078K614j0394r52J0742r4j0684R3J1514l73j2719J632J2999k615j2963
1810g949L186J3390m314j3918O568J3002q670j0985R992Q794j1030o498J2471
1823D039K859j3059J827J1938o217r673R863P174j3628l730J7289j369j9449P310
1837d826J9363j2561j8169J7312J6281k2202j2595K6255O892k8008o02K7539n060
$$ plain form
1850 9619 -16477 -5636 17398 764 -16895 4184 14575 -8378 -11290 11669 7411 -14434
1862 -14434 -2625 16186 -2937 -16068 8286 14418 -12735 -11957 16547 8632 -19553 -4233 21175
1875 21175 -766 -20841 5361 19104 -9229 -16524 12642 12943 -15197 -8135 16288 2947 -15590
1888 -15590 1717 13973 -5868 -11428 9722 7852 -12615 -3310 13994 -1125 -13984 5097
1900 5097 13310 -8679 -11903 11992 9352 -14209 -6159 14969 3116 -14863 -502 14267 -2136
1913 -2136 -12872 4457 10450 -5925 -7703 6423 5326 -6516 -2946 6428 382 -5633 1840 4188
1927 4188 -3281 -2818 4302 1676 -5250 -393 6009 -1005 -6123 2068 5971 -2470 -6068 2940 6352
1942 6352 -3541 -6296 4071 5966 -4128 -5929 4337 6073 -5096 -5709 5806 4782 -6117 -3928
$$ packed form
1850I619k6096J0841K3034j6634j7659K1079J0391k2953k912K2959m258k1845
1862a4434J1809J8811j9123j3131K4354O132k7153P78K8504p915k8185J5320K5408
1875B1175k1941k0075K6202J3743k8333p295K9166L01k8140P062K4423j3341j8537
1888a5590J7307J2256j9841n560K1150j870k0467R305J7304j5119j2859J9081
1900E097Q213k1989l224K3895k640k3561Q050K1128j1853j7979J4361J4769j6403
1913b136j0736J7329N993j6375j778J4126j097j1842L570R374o046o015P473K348
1927D188p469M63P120k626o926M857O402p014n118Q191L903q441l598R008L412
1942F352r893k755J0367J895j0094j801J0266J736j1169o13J1515j024j0899K189
$$ plain form
1956 -3928 6405 2897 -6884 -1270 6950 -878 -6294 3014 4926 -4789 -3461 6552 1450 -8272
1970 -8272 1376 9207 -4659 -9080 7671 8263 -10263 -7020 12832 4914 -14920 -1845 15728
1983 15728 -1514 -15389 4612 14252 -7525 -12400 10384 9233 -12479 -5204 13147 1016 -12727
1996 -12727 2996 11586 -7004 -9402 10769 5942 -13476 -1751 14747 -2447 -15116 6529
2008 6529 14556 -10649 -12826 14297 9655 -16547 -6004 17566 2329 -17675 1568 16868 -5502
2021 -5502 -14486 8805 10980 -10887 -7174 11958 3188 -12311 951 11610 -5257 -9630 8619
2034 8619 6785 -10922 -3751 12594 542 -13549 3042 13321 -6462 -11883 8834 9884 -10448
2047 -10448 -7711 11567 5142 -11989 -2181 11230 -341 -9600 2168 7800 -3504 -5856 4722
$$ packed form
1956c928J0333l508r781N614Q220p828n416R308J912r715J328J0013n102r722
1970h272R648P831j3866m421J6751N92j8526L243J9852p918j9834J3075J7573
1983A5728j7242j3875K0001R640k1777m875K2784j151k1712P275J8351j2131j3743
1996a2727J5723Q590j8590k398K0171m827j9418J1725J6498j7194j2669K1645
2008F529Q027k5205k177K7123m642k6202J0543K3570j5237k0004J9243J5300k2370
2021e502q984K3291K175k1867L713J9132q770j5499J3262J0659j6867m373J8249
2034H619j834j7707P171J6345j2052j4091J6591J0279j9783n421K0717J050k0332
2047a0448K737J9278o425j7131R808J3411j1571r259J1768N632j1304k352J0578
$$ plain form
2060 4722 3496 -5246 -1036 4897 -922 -4170 2324 3622 -3614 -2950 4860 1886 -5510 -906 5585
2075 5585 505 -5676 -375 6102 -140 -6313 527 6198 -643 -6180 591 6486 -1090 -6633 1937
2090 1937 6169 -2365 -5663 2802 5144 -3636 -4345 4511 2710 -4882 -911 4739 -726 -4445 2482
2105 2482 4018 -4701 -2831 6771 845 -7925 1251 8745 -3358 -9173 5731 9168 -8357 -7967
2119 -7967 10463 5957 -11772 -3778 12483 1300 -12764 1623 11993 -4722 -10059 7130 7393
2132 7393 -8779 -4449 9958 1081 -10476 2823 9831 -6534 -7885 9475 5484 -11700 -2773
2145 -2773 13429 -540 -14254 4330 13644 -7584 -11949 10037 9815 -11907 -7063 13307 3580
2158 3580 -13500 99 12300 -3197 -10322 5708 7936 -7916 -4923 9372 1314 -9692 2268
$$ packed form
2060D722j226q742M210N933n819l248O494J298p236O64P810k974p396M604O491
2075E585n080o181N301O477o242o173O840N671o841n537O771N895p576n543Q570
2090A937M232q534l298Q465K342q780p09Q856j801p592L971N650n465l719O927
2105B482J536q719J870R602n926q770R176P494j2103n815J4904L437j7525L90
2119g967J8430m506j7729P994J6261j1183j4064J4387J0370j6715n337J7189K63
2132G393j6172M330J4407q877j1557J3299P008j6365j351J7360l991j7184Q927
2145b773J6202j3969j3714J8584R314k1228m365K1986k22k1722M844K0370r727
2158C580j7080J3599J2201j5497p125J6030K228j5852K993J4295q058j1006J1960
$$ plain form
2171 2268 8955 -5207 -7712 7795 5997 -10020 -3606 11476 830 -11706 1747 11064 -3733
2184 -3733 -10200 5504 8850 -6969 -6748 7676 4384 -7437 -2372 6814 662 -6046 1122 4822
2198 4822 -2619 -2981 3430 1223 -3660 149 3788 -1480 -3898 2922 3428 -4011 -2643 4391 2120
2213 2120 -4596 -1873 4858 1484 -5070 -992 4755 748 -4416 -999 4483 1014 -4592 -645 4405
2228 4405 285 -4062 -148 4021 -281 -3907 1226 3331 -2027 -2206 2526 1209 -3006 -31 3605
2243 3605 -1663 -3788 3693 3124 -5395 -2149 6659 1092 -7886 318 8925 -2350 -9134 4507 8320
2258 8320 -6152 -7299 7444 5913 -8674 -3836 9414 1119 -9078 1458 7882 -3651 -6287
2271 -6287 5656 4372 -7494 -1503 8526 -1666 -8459 4608 7659 -7132 -6501 9568 4635
$$ packed form
2171B268O687j4162k505J5507j798j6017O414J5082j0646j2536J3453R317j4797
2184c733o467J5704L346j5819K21J4424l292j1821N065R186o152o708P168L700
2198D822p441l62O411k207m883L809L639n268k418O820N06p439J368P034k271
2213B120o716K723O731l374o554M078N747m007n164L417N482l469n606L947N050
2228D405m120m347L914M169m302l626N133K105n358j79M732j317m215K975L636
2243C605n268k125P481n69q519L246Q808n567q978Q204Q607j1275o784J3641L813
2258H320j4472j147J4743j531j4587M838J3250q295j0197J0536O424j1533k636
2271f287J1943j284j1866N991J0029j0192o793J3067L051j4791O31J6069m933
$$ plain form
2284 4635 -11550 -1895 12406 -954 -12304 3582 11557 -5861 -10182 8081 7871 -9698 -4854
2297 -4854 10113 1694 -9614 1066 8708 -3797 -7171 6438 4598 -8179 -1638 8896 -1182
2310 -1182 -8920 3832 8641 -6454 -7438 8790 5327 -10216 -3010 10551 951 -10541 1105
2323 1105 10072 -3291 -8626 4941 6442 -5705 -4287 5849 2284 -5866 -147 5352 -2108 -4093
2337 -4093 3605 2445 -4342 -1071 4929 -256 -5407 1670 5352 -3026 -4715 3629 4051 -3926 -3722
2352 -3722 4230 3365 -4534 -2634 4285 2050 -3822 -2034 3597 2001 -3639 -1623 3414 1100 -2925
2367 -2925 -1021 2693 699 -2727 168 2360 -981 -1528 1629 731 -2121 -84 2989 -968 -3716
2382 -3716 2568 3646 -4109 -3388 5280 2927 -6505 -2348 7889 1053 -8770 743 8832 -2319 -8410
$$ packed form
2284D635j6185R655J4301j3360j1350J5886P975j7418m321J8263k10j7569M844
2297d854J4967q419j1308J0680P642j2505l374J3609j840j2777O541J0534j0078
2310a182p738J2752M809j5095r84J6228l463j5543P206J3561r600j1492J1646
2323A105Q967j3363n335J3567J501j2147J418J0136l565q150N719N499p460j985
2337d093P698j160o787L271O000n185n151P077L682q378j689Q344M22p977K04
2352c722P952q65p899J900O919k235n872J788N631j596n640K016N037k314m025
2367b925J904L714j994l426K895K192l341n47L157q98k852K037L073l957k748
2382c716O284J078p755P21Q668k353r432M157J0237o836r823R513Q089j1151o091
$$ plain form
2397 -8410 3764 7744 -5389 -6432 7057 4267 -7853 -1710 7733 -605 -7317 3140 6453 -5749
2411 -5749 -4714 8039 2041 -9251 643 9760 -3249 -9832 6044 9199 -8892 -7391 10957
2424 10957 4891 -12118 -2370 12440 -188 -12324 3063 11211 -5810 -8867 7702 6042 -8755
2437 -8755 -3151 9226 62 -9094 3339 7997 -6368 -5756 8420 3407 -9823 -923 10775 -1866
2451 -1866 -10911 4839 9933 -7162 -8210 8683 6448 -9796 -4390 10386 1867 -10146 563
2464 563 8886 -2450 -7264 3697 5617 -4855 -3502 5628 1075 -5534 1148 4712 -2821 -3944
2478 -3944 4233 3153 -5532 -1824 6398 286 -6409 908 6187 -1642 -5971 2381 5624 -3182 -4745
2493 -4745 3478 3897 -3297 -3309 3059 2931 -3074 -2304 2880 1686 -2327 -1345 1982 1146 -2062 -583 2061
$$ packed form
2397h410J2174L980j3133j043J3489k790j2120O143R443q338o712J0457L313j2202
2411e749J035J2753n998j1292R894R117j3009o583J5876L155j8091J501J8348
2424A0957o066j7009R748J4810j2628j2136J5387Q148j7021l057J6569j660j4797
2437h755N604J2377r164r156J2433M658j4365O12J4176n013j3230Q900J1698j2641
2451a866r045J5750N094j7095j048J6893k235j6244N406J4776q519j2013J0709
2464E63Q323j1336m814J0961J920j0472J353R130m553o609O682L564p533j123
2478c944Q177j080q685L708Q222o112o695P317N279p829m329Q352L243q806j563
2493d745Q223M19p194j2O368j28o005P70N184j194m013R82L327q36l208J479K644
$$ plain form
2510 2061 -352 -1639 1033 1214 -1654 -1049 2662 629 -3842 376 4615 -1669 -5023 2753 5313
2525 5313 -3898 -5476 5515 4972 -7011 -3796 7883 2432 -8327 -1044 8611 -676 -8438 2786
2539 2786 7257 -4570 -5510 5718 3520 -6528 -1348 7055 -1329 -6915 4200 5824 -6516 -4195
2553 -4195 8251 2284 -9669 -1 10715 -2768 -10681 5461 9627 -7645 -8059 9283 6204
2566 6204 -10633 -3658 11375 694 -10784 2062 9494 -4335 -7693 6328 5461 -7979 -2451
2579 -2451 8760 -776 -8505 3621 7652 -6050 -6411 8337 4504 -10111 -1906 10927 -674
2592 -674 -10719 2961 10018 -4910 -9017 6831 7151 -8118 -4687 8402 2386 -8037 -336 7263
2606 7263 -1669 -6165 3567 4332 -4785 -2071 5250 228 -5333 1425 5267 -3218 -4755 4796 3654
$$ packed form
2510B061k413j287K672J81k868O05L711k033m471M218M239o284l354P776K560
2525E313r211j578J0991n43j1983L215J1679n451j0759P283R655r287p762J1224
2539B786M471j1827r40J1228k198j0048N180Q403q384n586J1115J624j2340K321
2553d195J2446n967j1953R668J0716j3483p913J6142M166j7272m14J7342l079
2566F204j6837O975J5033j0681j1478J2846P432j3829l358J4021q67j3440N528
2579b451J1211r536p729J2126M031j3702l61J4748l833j4615Q205J2833j1601
2592f74j0045J3680P057j4928m107J5848L20j5269L431J3089o016j0423P701P599
2606G263q932m496R732P65r117K714P321n022n561O758L842q485j537R551j142
$$ plain form
2621 3654 -5548 -2484 5881 1708 -6081 -842 6177 -138 -5796 864 4998 -1111 -4488 1190 4090
2636 4090 -1518 -3471 1638 2678 -1507 -2163 1276 1806 -1444 -1270 1639 416 -1523 280 1339 -872
2652 -872 -1402 1703 1480 -2832 -1012 3789 254 -4373 343 5029 -965 -5745 2103 6039 -3463 -5728
2668 -5728 4572 5058 -5429 -4341 6355 3170 -7104 -1457 7220 -533 -6519 2205 5620 -3790
2682 -3790 -4337 5416 2411 -6645 132 7074 -2559 -6768 4853 6092 -6951 -4971 9022 3010
2696 3010 -10262 -584 10707 -1716 -10391 3891 9702 -6072 -8200 7931 5821 -8974 -3179
2709 -3179 9141 598 -8799 1957 7837 -4603 -6045 6724 3467 -7948 -832 8498 -1704
2722 -1704 -8675 4326 8068 -6921 -6605 8740 4570 -9810 -2556 10298 479 -10339 1833
$$ packed form
2621C654r202L064Q365m173p789N239P019o315n658O660M134o109l377N678K900
2636D090n608j953N109J040m185o56L439N30l250J74K909j223j939J803J059k211
2652h72n30L105k23m312J820M801l535m627M716M686n994m780P848L936r502k265
2668e728J0300M86j0487J088J0696l185j0274N647Q677p753n986Q724L415r410
2682c790n47R753l005r056O777O942r633m209J1621J239j3043J980J3993o012
2696C010j3272R678J1291j2423q675J4282N811j5774k128J6131k110j4795N795
2709c179J2320q543r397J0756N880j2440j442J2769l257j1415P116R330j0202
2722a704o971J3001L742j4989L16J5345m170j4380P254J2854r819j0818J2172
$$ plain form
2735 1833 9593 -3940 -7929 5354 6012 -6108 -4071 6625 2009 -6598 369 5886 -2329 -4525
2749 -4525 3840 3145 -4832 -1694 5720 17 -6107 1779 5851 -3243 -5174 4133 4557 -4922 -3790
2764 -3790 5568 2635 -5653 -1495 5129 810 -4729 -258 4241 -323 -3664 869 2763 -934 -1983
2779 -1983 912 1543 -1057 -1098 1386 413 -1397 242 1340 -694 -1634 1174 2009 -2121 -2134 3013 1944
2796 1944 -3800 -1723 4549 1532 -5437 -872 6212 -172 -6514 1301 6386 -2322 -6166 3440 5562
2811 5562 -4694 -4250 5612 2582 -5801 -918 5727 -799 -5441 2811 4560 -4717 -2912 6131 984
2826 984 -6910 950 7441 -3091 -7532 5430 6661 -7470 -5211 8841 3433 -9664 -1528 10145
2840 10145 -783 -9932 3181 8663 -5218 -6917 6562 4762 -7584 -2371 8134 -394 -7826
$$ packed form
2735A833P760j3533l989J3283O58j2120K037J0696m616q607O967N517q215k196
2749d525Q365o95p977L138P414n703o124P886M072r094j931R307M24r479J132
2764c790R358k933q288M158O624m319n539M471M499m564l341M533J894l697j049
2779a983K895O31k600m1K484r73j810J639J098k034r40K808Q35m130j3N147j069
2796A944n744K077O272l017o969M565P084o384o342P815N085q708l844R606K122
2811E562j0256M44R862l030q383M883O645o526m642Q252J749r277J805R043n147
2826I84p894P860O491j0532m441J2962J231j4131K259J4052n408j3097Q136J1673
2840A0145j0928r149J3113N482j3881j699J3479j800j2346N213J0505q528p432
$$ plain form
2853 -7826 3188 6615 -5493 -4873 7252 2934 -8637 -655 9457 -1985 -9312 4518 8350
2866 8350 -6353 -7011 7824 5360 -8960 -3192 9374 852 -8909 1277 7871 -2952 -6447 4449
2880 4449 4698 -5529 -2488 5956 138 -5682 1814 4971 -3454 -4109 4916 2825 -6034 -1244 6589
2895 6589 -242 -6483 1391 6211 -2390 -5781 3401 4946 -3955 -3837 4078 2976 -3854 -2231 3784
2910 3784 1439 -3464 -597 2874 29 -2188 267 1792 -637 -1362 1112 716 -1464 -173 1649
2925 1649 -262 -1916 588 2342 -1262 -2733 1960 2783 -2601 -2784 3136 2884 -3897 -2788 4802 2136
2941 2136 -5351 -1386 5538 631 -5736 334 5776 -1634 -5258 2931 4164 -3786 -2919 4520 1574
2956 1574 -5158 290 5280 -2307 -4807 4246 3786 -5782 -2486 7173 942 -8226 1157 8604 -3390
$$ packed form
2853g826J1014L427j2108O20J2125m318j1571P982J0112j1442p327J3830L832
2866H350j4703o58J4835k464j4320N768J2566q522r761J0186O594j0823l495J0896
2880D449K49j0227L041Q444n818n820P496L157q425o55R025k091q859M790P833
2895F589o831o241P874M820q601l391R182J545q901J18P915j102o830J623O015
2910C784k345m903K867L471k845k217K455J525k429p25K474l96k180J291J822
2925A649j911j654K504J754l604j471M693Q23n384j83N920k52o781J109P590k666
2941B136p487L965O924m907o367O070N442p410l624Q189J233p950Q67P439k946
2956A574o732N448M990p587k500R053m60r568L296R659o231r168R383P447j1994
$$ plain form
2971 -3390 -8187 5289 7206 -6882 -5919 8218 4012 -9109 -1715 9136 -661 -8401 2794 7232
2985 7232 -4678 -5505 6262 3242 -7387 -601 7590 -2045 -7093 4309 6184 -6494 -4799 8294
2999 8294 2789 -9449 -390 9663 -1824 -9397 3753 8664 -5611 -7175 7035 5163 -7767
3012 -7767 -2982 7822 914 -7390 1062 6602 -2999 -5125 4488 3236 -5308 -1316 5701 -438 -5741
3027 -5741 2352 5411 -3997 -4391 5329 3224 -5947 -2108 6418 933 -6502 343 6198 -1430 -5421
3042 -5421 2200 4478 -2522 -3666 2819 2716 -2918 -1614 2671 704 -2186 -152 1830 -377 -1531
3057 -1531 999 1113 -1534 -599 1770 290 -2052 -151 2497 -72 -2998 543 3333 -914 -3628
3072 -3628 1264 4071 -1893 -4310 2810 4188 -3545 -3760 4084 3208 -4662 -2478 5267 1387 -5463
$$ packed form
2971c390m797J3476J917j4088R63J4137m206j3121P394J0851r797p740J1195M438
2985G232j1910q27J1767l020j0629O786Q191r635n048J1402J875j2678J695J3093
2999H294n505j2238R059J0053j1487p573J3150M911j4275j564J4210j872j2930
3012g767M785J0804o908q304Q452N540r601k126R613j252q544L992P017o139n303
3027e741Q093L059r408l94R720k105r171L839Q526n485p435O845N855p628l991
3042e421P621K278p000j144O485j03n634J304M285j967k890K034J982k207j154
3057a531K530J14k647R35K369j480k342J901K648k569k926L541K790m247k714
3072c628M892K807n964k417P120J378p733k15P844q76p870K184P745l880o850
$$ plain form
3087 -5463 51 5066 -1394 -4452 2533 3596 -3728 -2371 4785 624 -5376 1230 5342 -3014 -4993
3102 -4993 4788 4325 -6401 -3123 7783 1402 -8503 466 8632 -2238 -8344 4038 7595 -5799
3116 -5799 -5980 7086 4013 -7735 -1910 7817 -332 -7425 2648 6458 -4762 -4659 6424 2541
3130 2541 -7336 -442 7843 -1924 -7844 4340 6963 -6539 -5493 7940 3749 -8890 -1892 9297
3144 9297 -178 -9116 2337 8098 -4092 -6671 5251 4836 -6077 -2910 6441 807 -6202 1372
3158 1372 5348 -3055 -4110 4353 2725 -5379 -1125 6003 -586 -5984 2224 5539 -3493 -4897 4390
3173 4390 4104 -5135 -3093 5565 1924 -5391 -910 4961 156 -4504 507 3926 -1147 -3146 1480
3188 1480 2185 -1520 -1523 1524 982 -1614 -236 1633 -416 -1394 864 1330 -1312 -1286 1738 1330 -2343
$$ packed form
3087e463N514N015o460l058O985J063p324J357P156m161o000O606M112q356j979
3102d993R781m63j0726L278J0906o381r905Q969Q166j0870o106J2382L557j3394
3116e799j81J3066l073j1748N825R727q149p093J0073L810j1220J03J1083l883
3130B541r877O894Q285r767n920J2184K623j3502J046J3433m191j2639O998J1189
3144I297r475q938J1453N761j2190k579J1922m15j0913L167R351n634p009P574
3158A372L976q403j055Q463j628q104M254P128o589n398Q208L315r032j404R287
3173D390k86r239K042Q658l641p315M481N871m805m660N011L419n073j999M626
3188A480P05l705lL047n42k596J378J869k049r78K258M66k642K6L024m08l673
$$ plain form
3205 -2343 -1081 2778 906 -3129 -701 3599 544 -4162 25 4437 -663 -4449 1212 4431 -1821
3220 -1821 -4313 2640 3844 -3514 -2845 3936 1816 -4235 -678 4229 -666 -4173 2228 3446 -3642
3235 -3642 -2281 4640 987 -5400 531 5981 -2209 -6034 4036 5434 -5623 -4331 6808 3115
3249 3115 -7596 -1516 8163 -350 -7966 2216 7078 -3795 -5831 5003 4171 -5988 -2329 6504
3263 6504 35 -6299 2086 5469 -3923 -4336 5479 2855 -6795 -1010 7447 -1100 -7481 3076 6889
3278 6889 -4651 -6041 6043 4734 -7131 -3003 7536 1197 -7317 534 6713 -1963 -5747 3328
3292 3328 4414 -4357 -2694 4862 909 -4755 714 4429 -2203 -3855 3581 2798 -4572 -1576 4987
3307 4987 384 -5201 684 5092 -1740 -4747 2643 4023 -3270 -3139 3382 2420 -3405 -1603 3295
$$ packed form
3205b343J262L859j872m035K428M300l055m706M187M412n100l786N661L219o252
3220a821k492O953J204p358O69O781k120o051L557M907m895l507O401J218p088
3235c642J361O921l653o387N931N450q190l825J0070J398j1057J292J1139l693
3249C115j0711O080R679q513p616J0182M862j0873k036J0834q32j0159L659Q833
3263F504o469o334Q385L383r392m13R815k624r650N785Q457q547o381J0557L813
3278F889j1540j390J2084j309j1865M128J0539o339q514P851O179q676l784R075
3292C328J086q771J663P556l953n664N469L715o632j652P436p83p370K996O563
3307D987m603n585N885M408o832l007P390J380p293J31O521r62n825J802M898
$$ plain form
3322 3295 835 -3003 -4 2377 -402 -1674 591 1298 -868 -731 1109 172 -1101 274 1102 -434
3338 -434 -1260 656 1450 -1086 -1580 1427 1629 -1702 -1763 2090 1952 -2579 -1884 3214 1558 -3545 -1289
3355 -1289 3882 849 -4166 -207 4297 -739 -4020 1570 3462 -2198 -2842 2850 1919 -3456 -698
3370 -698 3729 -757 -3526 2014 3069 -3134 -2367 4265 1512 -5161 -122 5670 -1308 -5649 2583
3385 2583 5384 -3837 -4771 5075 3707 -5990 -2311 6259 768 -6134 706 5747 -2201 -4942 3640
3400 3640 3539 -4631 -1825 5125 92 -5230 1566 4987 -3283 -4267 4872 3047 -5884 -1525 6474
3415 6474 119 -6641 1394 6434 -2943 -5739 4204 4573 -5004 -3197 5297 1842 -5411 -349 5106
3430 5106 -1224 -4313 2438 3070 -3241 -1891 3768 630 -4085 752 3946 -2188 -3392 3127 2685
$$ packed form
3322C295k460l838K999K381k779j272K265P07k166J37J840r37j273J375Q28j536
3338d34q26J916P94k536m94L007K02l331o1L853j38m531O95N098j656n103K256
3355a289N171l033n015L959M504n036l281N590J892n660o44N692r31n375K758
3370f98M427m486k769N540J055o203P67O632k753o673N039N792o978m341Q232
3385B583K801r221r34R846j368r697L679Q570n491o902O840N041p948k741Q582
3400C640j01q170K806O950n033n322O796L421q270r84R139j825q931M359P999
3415F474o355o760Q035N040r377k796R943L69r577J807Q494l455p253N062N455
3430E106o330l089O751O32o311J350N659l138m715M837L194o134j204O519m42
$$ plain form
3445 2685 -3804 -1955 4319 1168 -4567 -108 4463 -660 -3992 1155 3541 -1560 -3089 1918 2427
3460 2427 -1999 -1623 1887 1109 -1642 -657 1496 173 -1289 315 990 -653 -556 726 323 -955 -232
3477 -232 1246 44 -1532 306 1604 -450 -1850 530 2095 -887 -2366 1298 2320 -1687 -2271
3492 -2271 1891 2273 -2374 -2134 2820 1597 -3135 -896 3111 273 -3050 481 2962 -1406 -2351 2292
3508 2292 1481 -2816 -523 3134 -497 -3379 1690 3315 -2957 -2828 4079 1897 -4802 -971 5302
3523 5302 -6 -5622 1352 5460 -2671 -4823 3690 3820 -4414 -2741 4872 1440 -5026 84 4764
3538 4764 -1608 -3932 2808 2984 -3694 -1791 4520 357 -4847 1288 4747 -2716 -4126 3864 3397
3553 3397 -4777 -2424 5605 1102 -5918 251 5545 -1412 -5054 2394 4338 -3291 -3292 3930 1950 -4116
$$ packed form
3445B685o489J849O274l151n735M459M571n123l332N147K386n101j529N007N09
3460B427m426L76L510p78k751R85K153j323j462J604O75j643R7J282m03j278P23
3477b32J478j202j576J838J298k054j400K380J565k982j479L664J022m007n84
3492b271M162L82m647K40M954j223m732K239M007k838l323L531K481m368r45M643
3508B292q11m297K293L657l631k882N069J625o272J29O907k182o699L831O273
3523E302n308n616O974M108q131k152Q513J30q234J673P613l432o466N110M680
3538D764o372k324O740J76o678J903O311m163n204O135L459p463j410P990m67
3553C397q174K353Q029m503p020O169N294o957l642P448J944p629jP222j980o066
$$ plain form
3569 -4116 -623 3855 -554 -3404 1619 2737 -2672 -1816 3386 657 -3627 404 3591 -1301 -3406
3584 -3406 2127 3036 -2878 -2391 3296 1613 -3393 -981 3363 460 -3199 181 2843 -680 -2247
3599 -2247 951 1677 -939 -1234 962 787 -1060 -155 833 -230 -633 439 506 -673 -523 902 509
3616 509 -1145 -305 1269 308 -1456 -391 1790 316 -2130 -71 2348 -170 -2403 352 2620 -702
3632 -702 -2810 1254 2632 -1762 -2229 2043 1847 -2240 -1327 2612 510 -2647 386 2293 -1147 -1941
3648 -1941 1787 1389 -2509 -685 3034 -300 -3319 1338 3185 -2225 -2936 3089 2539 -3911 -1840 4514
3664 4514 779 -4717 269 4568 -1175 -4178 2088 3656 -3079 -2651 3564 1422 -3810 -183 3629
3679 3629 -965 -3352 2215 2764 -3312 -1689 3949 504 -4322 613 4354 -1699 -4190 2849 3590
$$ packed form
3569d116L493M478m409k850N023J118n409Q56N202k729m284M031L187m892k105
3584c406N533R09n914M87N687j683n006K412M344k903l659L380K662l523j567
3599b247L198P26k616k95K196j75j847R05R88j063m03J072O7j179J50J425l93
3616E09j654Q40J574r61j764J065K181j474k446K059K419k518k233K755K268l322
3632g02k108M064J378m394m67M272j96m087R13L939k102l157L033J907l440p94
3648a941L728l98l898J824L719l334l019M657J847n410p11O025n50o450K071O354
3664D514l735n496M986M299n743l003O266J568o735M28O215k142n232L627L812
3679C629m594k387N567N49o076J623N638l445m826M935L741o053k491P039P41
$$ plain form
3694 3590 -3781 -2697 4307 1724 -4518 -775 4496 -361 -4210 1456 3504 -2162 -2542 2622 1643
3709 1643 -2875 -601 2964 -522 -2709 1545 2165 -2244 -1494 2748 883 -3126 -113 3315 -691
3724 -691 -3185 1398 2777 -1790 -2374 2104 2000 -2378 -1517 2400 840 -2208 -412 1918 143 -1626
3740 -1626 177 1325 -446 -954 591 445 -567 -179 598 57 -751 276 803 -510 -696 735 617
3757 617 -765 -783 969 858 -1317 -793 1467 715 -1582 -753 1787 708 -2168 -358 2269 24 -2242
3774 -2242 297 2205 -646 -2122 1110 1795 -1606 -1249 1729 594 -1917 23 1987 -822 -1894
3789 -1894 1639 1442 -2380 -827 2849 143 -3138 603 3356 -1458 -3314 2402 2791 -3085 -2177 3466
3805 3466 1478 -3763 -654 3920 -358 -3612 1311 3060 -1953 -2261 2510 1461 -2958 -463 3157
$$ packed form
3694C590p371J084P004k583o242L743N271m857l849N666K048n666l80N164r79
3709A643m518K274L565l486k187M254O20m409P50M242j865m009L013L428m006
3724f91k494M583J379m567n84M478j04m378Q61L917j560l048J796K330j775j769
3740a626J803J148j771n08J545j46j012L88P77n41q08J027N27j313j86J431j18
3757F17j382j8J752j11k175N24K260p52k297Q29K540j079k876J810K627k245k266
3774b242K539J908k851j476L232O85l401L57K978j135k511J940J964k809j072
3789a894L533j97l822J553L676k706l281L741K753m814j856N716L89n876R08N643
3805C466j988n241L109M574m278l254M923J749n013l08M771j049m419K495L620
$$ plain form
3820 3157 -749 -2893 1816 2464 -2562 -1848 3300 1107 -3813 -150 4042 -850 -3798 1713 3458
3835 3458 -2344 -2934 2994 2196 -3424 -1222 3541 326 -3264 502 2835 -1145 -2278 1840 1541 -2332
3851 -2332 -607 2375 -232 -2300 982 2147 -1588 -1799 2257 1269 -2595 -639 2674 184 -2648
3866 -2648 276 2570 -798 -2314 1229 1804 -1373 -1388 1282 1023 -1300 -726 1247 260 -1023 54
3882 54 660 -163 -462 310 383 -485 -127 624 -159 -630 233 608 -297 -836 284 999 -575 -1080 618 1093
3902 1093 -764 -1245 917 1379 -1207 -1296 1517 1107 -1655 -930 1820 700 -1994 -270 2045 -254
3918 -254 -1802 664 1521 -1013 -1211 1371 786 -1725 -66 1845 -630 -1776 1243 1545 -1839 -1343
3934 -1343 2392 851 -2923 -135 3113 -569 -3022 1152 2821 -1789 -2585 2372 2019 -2817 -1174
$$ packed form
3820C157l906k144M709O48n026P14N148k193m920L663M192m892k948N511J745
3835C458n802n90N928p98n620K202M763l215l590L766K333l980j133M118k99l873
3851b332J725K982k607k068L282J165l735k11M056r88l864J956L313k490k832
3866b648K924K294l368j516L543N75l177j5K670k59k323N74J973r87j283J077
3882E4O06q23k99P72P3q68L58P51p83m71Q63L75r05n39J120P15j574n05J698M75
3902A093j857m81K162M62k586q9K813m10k762P25K750j120k694J724K315k299
3918b54j548K466Q57k534j98K582n85k511J659J911k475j146L019L02l384M96
3934a343L735j541l774K788L248l682k453M174J669m610p96M957l53m836J643
$$ plain form
3949 -1174 2947 463 -2937 242 2691 -1117 -2290 1807 1456 -2309 -641 2568 -209 -2617 977
3964 977 2684 -1779 -2253 2602 1622 -3002 -874 3237 288 -3328 436 3238 -1189 -2810 1800 2227
3980 2227 -2086 -1633 2235 976 -2391 -232 2160 -540 -1782 1082 1278 -1432 -735 1724 176 -1960
3996 -1960 471 1895 -953 -1639 1423 1376 -1655 -1160 1947 735 -1997 -349 1919 15 -1733 199
4012 199 1579 -317 -1325 556 993 -645 -597 545 479 -474 -297 457 53 -405 184 244 -262 -89 225
4031 225 206 -439 -190 659 113 -698 -86 812 74 -934 -42 1199 -92 -1386 386 1324 -415 -1389
4049 -1389 614 1440 -923 -1316 1185 1074 -1324 -687 1368 406 -1443 -21 1422 -616 -1183 973
4065 973 783 -1296 -371 1526 -153 -1735 754 1764 -1421 -1506 1823 1174 -2222 -853 2487 302
$$ packed form
3949a174M121k484l400L179K449l808j173M097l51l765J668L209k777k408L594
3964I77J707m463m74M855r80m624K128M111k949l616L764K802m427j621M610M27
3980B227m313M53L868j259l367K159K392k700j242K864J96k710O97K459j548k136
3996a960K431J424k848o86L062m7l031M95L107j212k732J648K268j904j748J932
4012A99J380j896j008J881M37j638M8J142o6r53J77P54m04m58N89O0n06J73L14
4031B25j9o45K49Q49n46q11O12Q98p38j008Q92J241j291j294J772R38j739r74
4049a389K003Q26k363l93K501j11k398O37K055r62j849J422J443k038n67K156
4065I73j90k079R25J897j679j582K489J010l185q5L329o49l396J369L340k185
$$ plain form
4081 302 -2718 303 2627 -954 -2342 1379 1914 -1717 -1467 2095 893 -2122 -57 2022 -604 -1660
4097 -1660 1127 1343 -1586 -818 2114 150 -2194 518 2196 -1171 -1998 1646 1751 -2128 -1352 2499
4113 2499 733 -2582 -148 2470 -365 -2285 761 1992 -1242 -1450 1547 864 -1603 -234 1528
4128 1528 -235 -1425 729 1128 -1220 -677 1570 233 -1609 152 1628 -503 -1581 843 1446 -1188
4144 -1188 -1129 1344 781 -1334 -620 1312 399 -1235 -104 1036 -123 -733 91 550 -141 -460 189 221
4162 221 -234 -35 214 -108 -121 148 201 -248 -205 358 166 -450 -234 520 318 -626 -405 853 447 -989
4182 -989 -305 1182 227 -1255 -180 1411 -24 -1408 347 1359 -596 -1218 681 992 -957 -767
4198 -767 1151 375 -1188 132 1110 -497 -915 871 710 -1282 -418 1589 -82 -1755 585 1801
$$ packed form
4081C02l020L021K324l581j388L721N35l631K50L562j202l015K065K079k626j056
4097a660K787K16k929P68K932j964k344K712J678l367q27L644J05l879P76L851
4113B499j766l315K434K618k835j920L046J231l234k08K997o83k467J369J762
4128A528j763j190K154L99k348N43K247j337j842J761J476k131j078K424O03k634
4144a188N9K473n63k115P14J932r13j634J131J140j159o10Q24M59o91l19O49L2
4162B21m55J99K49l22j3K69N3m49M3N63j92o16K16P54k02r44K21J258m06j436
4182i89O84J487r55j482J075J591j435j384J755J012j955o22J899L11j949J90
4198g67J918p76j563J320R78j607m18J786j61j992Q64K007j671j673K340J216
$$ plain form
4214 1801 -984 -1741 1514 1505 -1876 -1118 2231 598 -2305 -171 2230 -316 -2134 832 1855 -1357
4230 -1357 -1338 1648 680 -1751 -137 1764 -546 -1668 1125 1333 -1716 -885 1984 314 -2254 186
4246 186 2336 -836 -2299 1379 1979 -1801 -1517 2036 1060 -2089 -581 2170 48 -2039 516 1681
4262 1681 -902 -1226 1171 800 -1346 -269 1404 -296 -1302 839 1070 -1189 -813 1433 548 -1671
4278 -1671 -181 1750 -262 -1694 516 1490 -752 -1342 825 1122 -1044 -849 1055 547 -920 -371
4294 -371 822 195 -732 -13 545 -161 -351 254 162 -231 -67 328 -5 -437 220 443 -328 -461 317 524
4314 524 -326 -690 484 707 -690 -706 739 721 -853 -746 981 676 -1189 -482 1289 274 -1299 -56
4332 -56 1239 -246 -1290 518 1039 -862 -697 1022 333 -1109 59 1250 -499 -1134 1020 908 -1516
$$ packed form
4214A801k785p57L255rl381P58L349j633k903K134K401k546j818K966J023l212
4230a357J9K986r68k431J614J901k310j122K793K08l049Q31K869j670k568K440
4246A86K150l172j463L678O00l780K84L553r76l149J508K751k122k087K555J165
4262A681k583l24K397l71k146J077J673j700j006K141K31k259L76K246q85k219
4278a671J490J931k012j432K210R74k242n90K167K97k166J95J904n08j467N49
4294c71J193o27r27P19N58p06j90O05r2l93J64L95l33m32O57K23p71j33P78K07
4314E24q50l64J174K23j397j6J445j8j574J07J727l05j865P07J771j015j573J243
4332e6J295j485j044J808N21j901J65J719o89j442J168J191j749o35K154j12k424
$$ plain form
4349 -1516 -516 1749 270 -1999 188 2168 -672 -2075 1230 1856 -1609 -1493 1801 1134 -2077 -658
4365 -658 2124 8 -2079 554 1690 -1018 -1373 1360 875 -1646 -305 1870 -410 -1752 982 1572
4381 1572 -1453 -1288 1969 894 -2293 -396 2421 -216 -2357 698 2180 -1113 -1946 1500 1576 -1827
4397 -1827 -948 1924 367 -1807 91 1640 -511 -1398 962 971 -1274 -402 1315 22 -1443 412
4413 412 1371 -855 -1246 1243 987 -1480 -678 1496 416 -1610 -157 1566 -109 -1410 385 1253
4429 1253 -456 -958 510 774 -530 -601 542 263 -442 -89 368 -39 -277 130 281 -205 -174 384 48
4448 48 -482 -9 530 58 -722 10 846 -122 -924 232 930 -372 -1087 432 1104 -729 -1113 888 952
4467 952 -976 -798 1110 663 -1261 -331 1302 -22 -1140 343 980 -527 -753 891 468 -1213 -60
$$ packed form
4349a516J000K265j479k269K187J980k840j403L305O26l465J16L294o67l211J419
4365f58K782k116k087K633J136k708l55K733m85k521J341K175k280j342K734N90
4381A572l025J65L257j075l187J897K817k637k141L055J482l293q33L446P6l403
4397a827Q79K872j557k174J898J549k151q87K360Rk245Q72J717j293j465J855
4413D12R59k226l91K489k56k467Q02K174j080k026J453J723j675j301J795Q68
4429A253j709n02J468K64j304p1J143k79p05L53M57m07k38M07J51m86L1N58l36
4448D8n30M73N39m72p80P32Q36r68q02J156O98j302p15J519O72j833l84K001O4
4467I52j928J78J908m47j924R30J633j324j118J483O37j507k26J644m23j681J153
$$ plain form
4484 -60 1243 -428 -1301 834 1233 -1232 -1130 1640 758 -1959 -330 2091 -90 -2092 457 1954
4500 1954 -927 -1854 1321 1384 -1678 -951 1778 428 -1752 100 1721 -677 -1452 1200 1023 -1499
4516 -1499 -464 1741 -11 -1825 577 1867 -1201 -1638 1617 1274 -1947 -877 2049 465 -2151
4531 -2151 9 2121 -512 -1884 840 1481 -1126 -1165 1313 661 -1339 -238 1311 -355 -1087 696
4547 696 877 -987 -528 1238 230 -1450 190 1374 -599 -1234 799 1153 -1078 -1053 1208 797 -1350
4564 -1350 -457 1261 187 -1090 -103 1029 -45 -879 227 642 -339 -419 238 291 -313 -172 369 24
4582 24 -303 147 264 -272 -203 282 324 -436 -338 631 222 -704 -162 746 217 -833 -141 1037 15 -1108
4602 -1108 158 1094 -220 -1074 326 1086 -530 -938 722 711 -864 -396 868 113 -916 154 913
$$ packed form
4484f0J303j671q73K135L99k465J02K770q82k717J629K421k181k002K549J497
4500A954k881r27L175O3l062P27K729j350k180J852J621k398p75K652j77k522
4516a499J035K205j752j814K402J290l068m37L255l43l221J070K926j584k616
4531b151K160K112k633j372K724O41k607l9K478o52k000J101J549j666p32J783
4547F96J81j864M59J766j008j680J640J184j973o35K033L54k231K5K261m11k147
4564a350Q93J718j074j277R87J132j074q34J106M15r81q0O57N3o04J41N41l45
4582B4l27M50J17n36O9M85M2p60R8R69m09r26N42R08n29j050O92J178j022j123
4602a108J266R36j314q54J400P60j616m08J660j1j575M68J264p55j029J070P59
$$ plain form
4619 913 -554 -714 896 395 -1170 -112 1330 -271 -1461 678 1444 -1178 -1301 1449 971 -1668
4635 -1668 -779 1876 299 -1932 140 1905 -600 -1638 914 1312 -1090 -881 1415 425 -1557 130
4651 130 1487 -600 -1173 1017 962 -1427 -569 1750 141 -1940 443 1894 -897 -1788 1268 1556 -1644
4668 -1644 -1214 1915 735 -1921 -210 1864 -122 -1648 552 1411 -916 -1037 1226 542 -1295 -40
4684 -40 1182 -323 -1111 699 990 -1122 -731 1432 304 -1457 -40 1487 -223 -1511 538 1355
4700 1355 -770 -1088 853 874 -893 -695 912 499 -911 -192 761 -13 -531 151 382 -216 -292 324 143
4719 143 -393 107 341 -194 -319 216 397 -316 -464 466 466 -563 -387 672 498 -654 -512 862 474
4738 474 -962 -397 973 246 -1024 -182 1151 11 -1112 205 979 -415 -788 530 627 -735 -380
$$ packed form
4619I13j467j60J610n01j565J058J442j601j190K139P66k622j23K750m78k639
4635a668Q89K655j577k231K072J765k505j038K552L98k402K09K296r90j982J687
4651A30J357k087n73K190n5k389Q58K319j609k081K383J451k791q91L056K88l200
4668a644M30L129j180k656J711K074j986j526K200Q59k327j21K263o84j837J255
4684d0J222j505p88J810K91k112L91K163j128j761J417J527j710j288K049Q17
4700A355k125l18J941K1j767J98J607m13j410P19R53p74n18O82K31n98p6O16j81
4719A43n36N00K34n35j25N35J81p13j48R30%j029J76J059j74j152J42J374l88
4738D74j436N65J370p27j270Q42J333j140j123J317P74j394l73J318R7j362L55
$$ plain form
4755 -380 896 92 -889 241 811 -636 -662 944 587 -1269 -284 1536 -97 -1678 506 1639 -745
4772 -745 -1571 1113 1390 -1500 -1038 1755 664 -1791 -219 1773 -172 -1581 682 1455 -1083 -932
4788 -932 1386 452 -1454 93 1485 -611 -1480 1137 1210 -1631 -774 1854 371 -2035 -19 2087
4804 2087 -397 -2105 998 1785 -1338 -1385 1486 1048 -1591 -589 1623 69 -1523 408 1307 -773
4820 -773 -892 991 544 -1192 -133 1323 -366 -1294 780 1094 -1130 -946 1316 671 -1577 -353 1679
4837 1679 59 -1609 268 1341 -419 -1258 585 1049 -762 -798 793 401 -716 -243 600 17 -548
4854 -548 180 443 -372 -254 433 35 -469 -17 497 -92 -668 196 691 -351 -620 362 633 -411 -739
4873 -739 475 781 -670 -696 709 675 -708 -693 810 532 -914 -379 902 111 -857 -19 868 -199
$$ packed form
4755c80J276q04r81J130N70j447k6J606l57j856R85J820j633j581K184J133k384
4772g45q26K684K77k890M62K793j091k455J572J992j945j409K263P73k538J51
4788i32K318r34j906J547J392k096q69K617P3k841Q57K628j483k406K016K106
4804B087k484j708L103P87l123m7K871m38k639J002K212j554j592J931Q99k080
4820g73j19J883m47j736J059J456j689r28K074L14k224J84K262o45k248J224K032
4837A679j620j668J877J073j760q39J843M64j811l6J591l92j117M73Q43n83n65
4854e48P28K63q15J18O87l98n04M52N14n89n76Q64M95j042k69R82K71j044l28
4873g39J214L06j451k6J405l4j383J5J503k78j446N35J281p91r68Q38Q87j067
$$ plain form
4891 -199 -819 524 578 -800 -268 852 -36 -924 353 1051 -791 -928 1158 726 -1509 -471 1670
4908 1670 185 -1781 175 1885 -587 -1850 1008 1545 -1275 -1190 1425 817 -1587 -415 1645 -187
4924 -187 -1525 667 1223 -1006 -861 1331 449 -1613 69 1737 -614 -1574 1128 1409 -1483 -1190 1880
4941 1880 849 -2155 -319 2274 -207 -2079 578 1887 -985 -1585 1300 1195 -1597 -598 1575 59
4957 59 -1460 317 1327 -803 -1012 1123 591 -1436 -140 1545 -287 -1470 600 1475 -961 -1258
4973 -1258 1300 985 -1427 -682 1491 441 -1459 -164 1417 -117 -1164 353 985 -438 -702 550
4989 550 539 -607 -219 549 -73 -466 228 366 -385 -296 509 323 -674 -126 723 21 -815 24 806 -78
5009 -78 -878 126 954 -270 -944 347 880 -377 -948 520 976 -626 -813 691 607 -781 -482 843
$$ packed form
4891a99o20J343N4j378N32J120q88q88J277O98j842j37K086m32k235J038K141
4908A670j485j966J956J710k472j263K858N37k820Q5K615o08k404J172K060j832
4924a87j338K192N56k229J45K192q82k062J682J668k351r60K702K81k892K93L070
4941A880j031l004J836K593k481j872K657J309k872o00K885j05k792R99K173j516
4957E9j519J777J010k130k09K135n32k027J296J685j832j183K070Q75k436k97
4973a258K558l15k412P45K173j050j900J295J581j534j047J517O32j423k64J252
4989E50j1j146L88P68o22l93O94J38p51Q9Q05j86r97N48Q49p02q36Q39P82q84
5009g8q00J004Q28j224o74J291N33j257n71J468M56j602j87J504q4j388K99J325
$$ plain form
5027 843 308 -864 46 864 -354 -734 603 572 -724 -337 1065 61 -1219 363 1287 -785 -1249
5044 -1249 1068 1120 -1381 -968 1722 585 -1849 -182 1916 -159 -1835 602 1678 -977 -1400 1383
5060 1383 968 -1568 -407 1574 -118 -1509 537 1421 -1142 -1056 1579 622 -1827 -96 1939 -393
5076 -393 -1968 888 1876 -1396 -1584 1744 1169 -1988 -779 2030 315 -2116 190 1896 -675 -1568
5092 -1568 1061 1193 -1216 -696 1386 226 -1461 268 1341 -757 -1093 1206 822 -1405 -459 1653
5108 1653 75 -1791 361 1693 -694 -1494 932 1324 -1156 -1097 1309 750 -1387 -450 1194 133
5124 133 -1029 57 956 -309 -774 451 387 -530 -138 514 -20 -540 173 528 -403 -532 515 431 -625
5143 -625 -344 722 427 -756 -292 861 212 -882 -193 894 173 -972 -57 1055 -89 -1031 186
$$ packed form
5027H43n35j172R10Q18j218l80J337l1j296L87J402j004j280J582R24k072m64
5044a249K317N2k501M13K690j137k434J667K098k075j676K437J076k655m23K783
5060A383m15k536J161J981j692j391K046Q84k563Q6K635r57k449J731K035k332
5076c93j575K856R88l272j88L328n75l157J209K809j715k431K306J706k571q93
5092a568K629J32k409N20K082j160j687J729J073k098l36K299l84k227R46K112
5108A653j578j866K152J332k387q00K426L92k480N9K406n59k137R37J644j061
5124A33j162J086Q99j265m65J225o4r17L92O52n34n20P13L55r31j29J047q4j056
5143f25K81J066k95j183M64J153o49j094O89J087p21j145R15J112j144r42J217
$$ plain form
5160 186 925 -243 -903 420 804 -629 -511 733 268 -776 40 748 -307 -750 594 639 -991 -384
5178 -384 1265 105 -1448 163 1561 -542 -1570 943 1496 -1320 -1218 1524 931 -1682 -569 1847
5194 1847 102 -1831 368 1621 -775 -1302 1010 901 -1322 -484 1498 -67 -1514 627 1365 -1100
5210 -1100 -1126 1440 816 -1846 -420 2058 -103 -2154 592 1972 -955 -1751 1366 1475 -1681 -976
5226 -976 1841 446 -1747 18 1672 -421 -1383 850 1085 -1203 -579 1413 97 -1341 336 1407
5242 1407 -776 -1219 1167 971 -1478 -600 1583 300 -1621 9 1643 -275 -1541 579 1262 -793
5258 -793 -990 789 727 -892 -474 872 175 -762 59 622 -306 -402 416 270 -502 -174 661 -16 -662 256
5278 256 638 -360 -610 437 667 -508 -629 611 578 -693 -501 683 523 -818 -532 826 355 -864
$$ packed form
5160A86P39j168o60J323L84j433J18J244m65j044Q16P08j055m43J344M5j630O07
5178c84J649j160j553J611J398k103j028K513N53k816J02K742n93k613J113K416
5194A847j745j933K199J253k396n27K312j09k223Q38J982j565j447K141P38k465
5210a100k6K566o24k662J426K478k161k051K746J380k927p96L117J09l156P05
5226i76K817j395k193J765J654k093r62K233K35k288O24J992j316j438J677J071
5242A407k183m43K386j96k449Q78K183j283j921J630J634j918j266K120O83k055
5258g93j97J779o2j619M18J346o97r37Q21N63r28r6Q18j46p72L28Q35o77o46R18
5278B56L82r98k50J047K30j175j21J240l3j271J92J184j60j341K86J358m71j219
$$ plain form
5296 -864 -235 907 153 -895 -20 876 -187 -772 358 530 -522 -403 672 159 -822 103 862 -474
5314 -474 -832 794 701 -1063 -508 1354 336 -1560 47 1724 -401 -1661 708 1531 -1039 -1338 1267
5331 1267 1013 -1518 -574 1595 82 -1543 319 1342 -815 -1121 1147 729 -1495 -220 1579 -360
5347 -360 -1620 790 1500 -1285 -1319 1743 914 -1972 -505 2063 20 -2104 457 1955 -860 -1727
5363 -1727 1218 1350 -1374 -848 1518 405 -1569 116 1450 -526 -1183 978 811 -1281 -412 1464
5379 1464 -25 -1601 440 1510 -884 -1381 1199 1113 -1452 -850 1541 515 -1652 -151 1530 -225
5395 -225 -1380 410 1134 -599 -897 736 580 -806 -237 790 -12 -669 243 566 -455 -438 645 239
5413 239 -784 -92 831 -68 -837 94 824 -204 -857 346 787 -417 -821 416 798 -466 -815 562
$$ packed form
5296h64O29J142p54j048Q75Q96j063n85J130J72j052J19J075n13r81R25P59j336
5314d74l58J626r3j764N55J862j018j896J607J677k125j260K369Q23k570k99K605
5331A267k54k531R44K169j513j625J862J023k157l06K268m18k224J275J799j939
5347c60j260K410P10k785l4L062q29k886J467K568k043k124K561J498k815q67
5363a727K945J32k724N26K366j113j974J685J334j976o57K161j67k092Q69J876
5379A464j489j576K041J070k394m97K580q6k565O02K391j026k167J501J681j755
5395b25j155J790P24j733k98J633j56j386N69J027q02o57R12L23j021J7J083m06
5413B39j023O92R23q99p69R31P30j028o53J203M41j204m04J237L82j264l49J377
$$ plain form
5431 562 668 -665 -570 652 502 -708 -407 809 203 -746 35 633 -270 -612 509 409 -680 -248
5449 -248 928 -17 -1006 365 1062 -697 -1059 974 994 -1307 -800 1544 442 -1674 -158 1811 -245
5466 -245 -1741 566 1643 -941 -1270 1238 928 -1380 -459 1483 -5 -1475 471 1341 -966 -1007 1394
5483 1394 672 -1638 -186 1852 -273 -1888 815 1846 -1250 -1605 1685 1209 -1946 -815 2147 251
5499 251 -2096 234 1996 -703 -1672 1043 1306 -1330 -847 1588 252 -1575 306 1462 -812 -1203
5515 -1203 1171 857 -1510 -517 1733 95 -1841 335 1733 -722 -1587 1027 1398 -1357 -1039 1474
5531 1474 690 -1459 -403 1402 63 -1259 211 1007 -445 -760 629 479 -741 -234 699 -91 -786
5548 -786 305 638 -655 -553 694 386 -787 -374 915 204 -991 -120 945 -64 -978 64 868
$$ packed form
5431E62J06j333R5J222j50j210L01J216o06r49P81N98r03l42J121j00j089M32
5449b48J176r45r89J371O97j759l62K033K0k301N07K344j102k116J516J969k056
5466b45j496K307J077k584l29K508l10k308R21J942j488j470J946Q70k307m1K401
5483A394p22k310J452K038k125j615K703J031l096l55L290m76l155J131K962j896
5499B51k347K330J762k699r69K715K63k636M83K435j336j827J881J156k274l91
5515a203K374l14k367R93K250j638j936K176J398k455q65K614L71k755L18K513
5531A474p84k149J056J805j339j322J470P96j452l15J389j50j220N07R33p90o95
5548g86J091L33j293J02J247l08j173M13J289p11j195Q71J065j009r14J042Q04
$$ plain form
5565 868 -116 -929 232 963 -242 -786 326 780 -426 -659 474 517 -610 -329 633 115 -718 78
5583 78 608 -371 -610 595 489 -862 -270 1067 24 -1285 227 1314 -577 -1369 890 1240 -1158
5600 -1158 -1013 1424 753 -1601 -428 1731 25 -1709 409 1505 -756 -1232 1085 915 -1313 -379
5616 -379 1512 -149 -1508 646 1376 -1095 -1157 1508 757 -1794 -340 2023 -146 -2078 676 1988
5632 1988 -1095 -1766 1467 1361 -1764 -974 1860 358 -1868 -18 1778 -517 -1504 947 1089 -1320
5648 -1320 -704 1457 191 -1522 322 1423 -776 -1297 1256 1040 -1580 -677 1713 252 -1846 88
5664 88 1801 -434 -1650 767 1384 -1022 -1050 1180 724 -1214 -429 1146 31 -1038 329 833 -508
5681 -508 -586 666 328 -821 -49 855 -213 -812 362 751 -588 -681 659 623 -755 -519 799 382
$$ packed form
5565H68r84q13J161P31j205n44J112M54j206k33J133M3j127K81R62n18q33P96
5583G8N30r79k39J205j06j351N92J337j043j309J512J087j891p92K259L50k398
5600a158J45K437o71k354J173K159j706j734K118J096k261m76K317j70k228R34
5616c79J891j661j359K154P30k471o2K665p51k551J454K363k169j932K754J312
5632A988l083o71L233j06l125P90K834j502k226J850J796k295r87K451J42k409
5648a320O16K161j266j713J844J101k199n21K553k16k620R03K390j461k098J934
5664H8J713k235j216K417O17k406k8K230m56j938P85J575j115j069J367N04j341
5681e08p8J252l38j149P72R04j068n99J174L89j339r3J340l6j378K36J318m17
$$ plain form
5699 382 -826 -367 843 318 -805 -187 811 154 -786 -40 740 -74 -725 148 650 -262 -592 387 354
5718 354 -527 -186 573 22 -681 236 714 -488 -666 780 557 -969 -375 1264 183 -1468 111 1432
5736 1432 -392 -1555 723 1398 -1029 -1184 1297 897 -1447 -490 1467 74 -1458 240 1353 -695
5752 -695 -1066 1023 711 -1325 -312 1450 -195 -1521 621 1458 -1144 -1250 1511 939 -1787 -542
5768 -542 2025 128 -2123 327 1955 -788 -1734 1186 1376 -1472 -961 1609 477 -1696 41 1573
5784 1573 -572 -1296 1017 932 -1264 -569 1538 33 -1667 393 1597 -858 -1428 1120 1191 -1441 -870
5801 -870 1628 525 -1707 -188 1584 -187 -1517 483 1237 -692 -988 867 652 -894 -287 875
5817 875 -33 -773 288 681 -533 -544 762 292 -865 -48 833 -108 -906 289 889 -411 -828 538
$$ packed form
5699C82j208M59J210n25j123O18R98o57r40P46P80q14o51Q73N02r12l30R79l3
5718C54q81L41P59n51p03R17M78j202j78J446k23j526N94J639j081j651J579J321
5736A432j824j163K278O75k427j55K481m00k344R57J957j393j532J698J113k048
5752f95l71K089l12k036J013J762j645j326K142Q37k602j06K761n72k726J245
5768e42K567j897k251K450J628k743r46K920J90k848N11K570j132k173J737J532
5784A573k145p24K313q5k196O95K107j505j700K060J204k455n70K548P1k632N71
5801h70K498j103k232J519J772j771j330K000P54j929k96J855k15j546O07J162
5817H75r08p40J061L93j214j1J306m70j157Q17Q81r41p98J195O00j300m17J366
$$ plain form
5835 538 765 -598 -664 617 586 -597 -518 617 434 -641 -369 649 264 -590 -134 583 -33 -547 43
5854 43 458 -243 -407 364 278 -507 -146 697 -64 -752 278 804 -548 -763 766 757 -994 -591 1280 396
5874 396 -1404 -172 1370 -130 -1458 446 1388 -690 -1138 1010 886 -1162 -537 1227 135 -1333
5890 -1333 289 1171 -785 -980 1027 597 -1411 -243 1594 -260 -1657 642 1555 -1090 -1408 1432
5906 1432 1162 -1673 -704 1821 390 -1893 113 1755 -499 -1552 879 1269 -1150 -826 1385 341
5922 341 -1386 103 1299 -542 -1176 972 886 -1292 -564 1504 132 -1652 193 1562 -614 -1526
5938 -1526 908 1247 -1156 -992 1316 657 -1390 -321 1327 16 -1218 242 1007 -515 -751 705
5954 705 447 -714 -112 740 -158 -759 377 601 -591 -526 749 339 -858 -230 924 62 -916 68
$$ packed form
5835E38K27j363o6J281l1j183P9J135j83j075K72J018l85q54M56P17o16n14N90
5854D3M15p01j64P71q6p85L61Q43p61o88J030N26j352k15J529rj751M03J871q84
5874C96j800J232J542j500j328J904R42k078m48K148j24k048O25J764j092j468
5890a333J622Q82j956j95K007m30k008J168J837j854j397K299R13k645l18K840
5906A432k70k835R69K525j431k283K006J642k254j053K431L90k419L24K211j044
5922C41j727J489J196j841o34K148q6k178P28K068j372j784J845J369k176r12
5938a526K434L39k403J64K308o59k047J069J648j311j234J460P65j522k36J456
5954G05k58j161O02Q52q98o01J136K24j192O5J275m10j197O28J154q62r78R84
$$ plain form
5972 68 873 -209 -804 197 728 -329 -703 291 576 -355 -543 321 424 -340 -384 407 291 -411 -176 390
5992 390 9 -388 118 352 -335 -284 439 192 -576 -53 708 -95 -828 210 940 -461 -971 707 797 -963
6012 -963 -754 1129 578 -1253 -383 1287 59 -1299 198 1118 -528 -1030 747 746 -966 -436 1111
6029 1111 30 -1135 400 1066 -733 -911 1112 619 -1380 -329 1530 -20 -1629 446 1594 -800
6045 -800 -1454 1150 1260 -1451 -865 1579 407 -1546 -18 1521 -407 -1354 744 1057 -1107 -617 1189
6062 1189 175 -1371 201 1278 -680 -1160 1021 846 -1363 -595 1514 297 -1647 68 1584 -418
6078 -418 -1416 708 1217 -965 -967 1139 647 -1125 -281 1110 72 -956 271 805 -501 -582 660 332
6096 332 -763 -40 825 -201 -809 434 665 -641 -617 709 509 -843 -358 922 197 -853 -116 856
$$ packed form
5972F8Q05j082n95J001N31j057l74R94K85r31j88Q64J03p64m4P91j16p02K35N66
5992C90l81l97N06K34o87N1P23k47p68N23P61q03p33J038P30j401n10J678R0j760
6012i63K09J883n51j831Q70J670j228j358J497R20j646n02J777jj712N30J547
6029A111j081j165J535O66j799j78K023m93j999J051J859j550j609K075J148k394
6045h00o54K604J10k711N86K444j172j953J528J539j928r47K098L13k164M90J806
6062A189j014j546J572J077j958m80K181j75k209P68K109j217j944J715J516k002
6078d18r98K124N09k182kK106m92j772Q44J391j038j028J227N34j306q1J242l28
6096C32j095P23Q65j026o08J243K31j306K4J326k00j352M85J280p25j050P37R72
$$ plain form
6114 856 24 -816 26 634 -170 -586 133 528 -188 -457 284 420 -271 -268 314 185 -304 -91 354 -60 -369
6135 -369 232 395 -411 -370 565 295 -711 -236 859 27 -1057 181 1045 -312 -1110 533 1012 -730
6153 -730 -891 926 749 -1099 -435 1115 152 -1139 171 1088 -483 -878 820 541 -1012 -213 1157
6170 1157 -97 -1182 501 1155 -938 -1044 1212 784 -1493 -495 1652 107 -1743 303 1658 -664
6186 -664 -1532 907 1144 -1235 -869 1289 536 -1470 -68 1352 -344 -1195 703 963 -981 -569 1230
6203 1230 172 -1361 217 1362 -531 -1258 942 1126 -1211 -821 1443 526 -1539 -160 1517 -137
6219 -137 -1422 407 1211 -730 -966 847 701 -882 -328 931 46 -883 281 719 -503 -579 620
6236 620 327 -791 -110 861 -59 -914 267 900 -443 -751 554 638 -593 -592 619 493 -644 -387 701
$$ packed form
6114H56q32q40Q42O08q04m16P19L95p16k69P41J36o91LN82j29m89K13M45m14l09
6135c69O01J63q06M1R35k70j006M75J095q32j084J238Q64j357p98J643M79j742
6153g30j61J817j77j848O64J550r63j291J310R17j571l95J698k79j553P99J370
6170A157j254j085J683O54k093j06K256m28k277R98K147j545j850K046J355k322
6186f64q68K439K37k379L66K158p53k006J402J420j696q51J898K60j944M12J799
6203A230j058j533J578J145j893p27K200J84k337L90K264r17k065J379J677j654
6219a37j285J829Q04j941k36J813j46j583N54J259q85r29J164M38j222p6J199
6236F20k93j118O81R71r20q55J181O33j343l08J305Q4j231JJ211j26j137K57J088
$$ plain form
6255 701 303 -643 -175 617 112 -564 -47 513 -48 -484 76 392 -162 -332 257 203 -434 -110 428 -115
6275 -115 -495 221 568 -414 -543 610 478 -778 -421 966 274 -1084 -142 1138 -7 -1137 318
6292 318 1115 -564 -935 743 835 -870 -560 1035 291 -1054 80 1026 -376 -891 687 679 -955 -404
6310 -404 1109 121 -1348 243 1272 -627 -1253 910 1047 -1227 -815 1414 456 -1551 -150 1567
6326 1567 -246 -1474 581 1250 -840 -966 1081 568 -1167 -194 1206 -200 -1126 539 931 -899
6342 -899 -678 1092 402 -1273 -27 1408 -290 -1291 533 1177 -890 -1047 1041 725 -1182 -492 1251
6359 1251 165 -1239 97 1028 -301 -877 484 650 -597 -401 704 150 -668 155 654 -297 -524
6376 -524 509 425 -634 -296 822 104 -793 38 862 -150 -774 246 764 -337 -708 390 520 -410
$$ packed form
6255G01l98r46M68P92n05o76N17N60n61m36N60L16n54j70N89n4o37L24N38n43
6275a15l80P16L47r82j29J153j32j256L57J387o92j358R42J280j145j130J455
6292C18P97j679l71J678R2j705L10J595p44j345J134R46j402n15J578qj634N51
6310d04J513r88j469J591J029j899o26K163J37k274M12K229r58k007J401J717
6326A567j813j228K055O69k090j26K047n13j735R73J400j406r26J665L92j830
6342h99K21J770o90j675J246J435j698j001J824O44k067j57K088l16j907O90J743
6359A251j086j404J336R31j329n76J361J66j247J96J105n54q18Q23M99r51k27
6376e24J033q4j059L38J118p18q97Q31Q24j012o24J020N18j101l71J098J30r30
$$ plain form
6394 -410 -463 396 392 -446 -313 427 170 -415 -155 430 40 -404 25 370 -185 -339 246 215 -381 -146 415
6415 415 32 -585 118 716 -262 -637 439 703 -580 -582 745 546 -873 -301 996 183 -1037 51
6433 51 983 -310 -932 538 799 -699 -564 778 253 -935 3 896 -358 -875 671 702 -942 -431
6451 -431 1059 181 -1272 166 1282 -431 -1239 756 1096 -940 -921 1174 574 -1274 -272 1285 23
6468 23 -1272 372 1050 -613 -839 886 503 -965 -245 1109 -134 -1098 511 932 -727 -743 987
6485 987 477 -1201 -279 1189 -65 -1229 395 1127 -619 -1019 796 780 -920 -497 961 278 -926
6502 -926 30 856 -229 -710 426 494 -543 -285 682 62 -622 87 651 -304 -615 448 501 -589 -432
6521 -432 623 291 -657 -197 663 -10 -729 -24 682 -50 -585 165 454 -214 -452 189 395 -304 -333 323
$$ packed form
6394d10n3Q59mq38J33P40k57n85K60N85l90m44M29L45n55j54N85l1n96K35N61
6415D15l83o17P03N98r78l75J076K64j283kJ327j99j419N72J297q13j220J088
6433E1R32j293o22J470K61j498J35J342n25j188R38Q93j254n17J546L1j644N11
6451d31J490q78j453J438J116j713q08J995L40k036J9K095o00j848J002J557j262
6468B3j295J644O78j663k26J725l83j468P20J354j243r64J609M21j659j6J730
6485I87n10j678R22J468j254j164J624P32j746m00J815j6j700M23J458o83j204
6502i26R56Q26j085m81J136O8j037K58R67o20o84P09N64r55l11J063N3j090J57
6521d32J055l32r48M60Q60o73p19P05P06p32n35P50K89o68k38O41K06o99k9O56
$$ plain form
6541 323 203 -327 -142 339 52 -325 100 322 -163 -313 329 277 -444 -182 514 49 -651 5 695 -173
6561 -173 -815 309 701 -497 -695 624 542 -738 -434 864 206 -902 -27 835 -217 -762 474 682
6579 682 -613 -437 767 241 -803 52 905 -344 -815 606 760 -832 -550 1060 331 -1165 -68
6596 -68 1212 -232 -1207 505 1078 -750 -854 904 634 -1072 -289 1111 -4 -1076 270 944 -639
6613 -639 -737 764 468 -979 -154 1006 -162 -1050 430 1007 -709 -779 943 629 -1055 -318 1158 90
6631 90 -1152 244 1043 -405 -876 551 701 -738 -501 788 273 -751 -44 703 -187 -649 379 502
6649 502 -557 -315 633 197 -740 -34 712 -233 -719 347 620 -499 -526 527 408 -570 -291 618 162
6668 162 -574 -74 524 -31 -481 60 503 -136 -415 171 347 -207 -242 332 229 -323 -103 370 1 -440
$$ packed form
6541C23j20n30J85M81k87l77M25K22m85j50O42n2p21K62O96m65p00O56O90q68
6561a73o42J124L92j198j98J319q2j280L04J298o58j108Q75Q62j052n45J236K08
6579F82j295J76J204n26j044Q55Q53j249m71J421J54j592K82J610p29j496J097
6596f8J280j444r75J712N73j828j04J758k70j706P83J400j115j072J346O74j583
6613f39r8J501k96j447Q25J160j168q88J480N77j716p0J722l14j684P37J476j068
6631I0j242J396P99j448m71J427J50j439K37J289n15j024P07P47q90m62J028J23
6649E02j059K42R48m36r37P06P46r45m86J066K73j119k7J053j19r78K79R09m56
6668A62p36N00N98n55m50N41M43o39k79N86J76n54l5N74j03n52K20M73l69m41
$$ plain form
6688 -440 172 388 -272 -344 320 388 -487 -283 608 216 -672 -126 790 -54 -876 157 838 -345 -748 498
6708 498 656 -673 -516 767 279 -806 -52 807 -170 -725 419 627 -585 -461 809 277 -938 17
6726 17 987 -338 -948 532 854 -819 -688 1046 512 -1161 -207 1201 -88 -1188 304 1077 -546
6743 -546 -982 847 699 -1021 -427 1075 83 -1028 257 990 -525 -775 776 573 -983 -292 1066
6760 1066 48 -1129 329 1103 -552 -951 779 757 -998 -528 1008 259 -1066 11 1023 -269
6776 -269 -896 461 717 -587 -492 662 314 -796 -110 730 -145 -659 387 510 -496 -490 667 262 -792
6795 -792 -96 727 -19 -724 166 697 -281 -610 420 559 -419 -424 442 413 -516 -271 548 110 -464 -38 473
6816 473 -75 -420 108 343 -235 -319 305 151 -411 -121 459 2 -485 63 497 -238 -491 311 501 -486
$$ packed form
6688d40O12K16o60p2O64O8q75K04Q91l92q88N46R16q44q22J033O81j183m03J246
6708D98J58j329J57J283m88j085P54Q59r77n55J144K08j212J24J270n32j215R55
6726A7R70j325o10J480L22j673J31J734n34j673R54J408j289j100J492P73j623
6743e46m36J829j48j720N94J502r92j111J285P33j515k50J551k03j556O91J358
6760A066j018j177J458P74j655l99J730k2j755M70J536p49j325J077J012j292
6776b69o27J357K56j304R5J154l48j110O86Q40q75n14J046J23j006OJ157m05j054
6795g92O96Q23p46p05Q90N31r78l29J030J39r78nQ66k9r29K45Q19m38n74M26N11
6816D73n48l45N28K35n78q4O24j54n62K90N80m57m87N48M34p35k53Q02J90r87
$$ plain form
6836 -486 -442 581 435 -713 -237 813 120 -911 59 784 -169 -800 406 701 -529 -576 690 393
6854 393 -770 -119 781 -71 -789 400 658 -645 -575 790 321 -990 -157 1043 -117 -1118 404
6871 404 973 -673 -859 938 635 -1035 -425 1138 196 -1151 154 1039 -419 -929 655 710 -887
6888 -887 -478 1006 90 -1057 160 973 -473 -840 721 693 -920 -485 1088 199 -1161 113 1112
6905 1112 -332 -991 597 877 -809 -677 898 399 -911 -224 888 -70 -828 285 758 -461 -558
6922 -558 597 372 -686 -211 714 -8 -728 247 698 -383 -520 537 447 -606 -279 671 161 -728 2
6941 2 663 -136 -645 162 546 -294 -553 374 423 -402 -244 366 180 -381 -115 442 27 -435 146 340 -193
6962 -193 -322 309 306 -322 -263 435 154 -486 -35 576 -8 -527 115 646 -356 -629 493 488 -601 -424 617
$$ packed form
6836d86M4J023j46j148M76J050o93j031R70P25r53o31J206K95j230m7J266k97
6854C93j163O51R00q52p18J189K58j303P0J365m69j311Q33J200j160j001J522
6871D04N69j646j86J797l03j670O10J563r42j347J305Q85j458n10J584N5j597
6888h87M09J484r16j147J217Q13j446l67J561k8j613M35J573q89j360J274R99
6905A112j444o59J588K80j686J32J575m99j310O87J112r58p58J113M73j219r7
6922e58J155k25j058M75R25p22p20R75M51j081j37J057r0j053L27R50n10q89P30
6941BO61p99n09Q07L84q40k59R27M9q25J58O10j86n61K66N57m15m62N81J94n33
6962a93j29O31lo28N9O98k81o40M51O11n84n19O42N31j002k73J122nj089J77J041
$$ plain form
6983 617 292 -715 -114 768 -46 -794 201 683 -456 -536 597 398 -735 -208 817 -14 -775 278
7001 278 721 -503 -614 682 560 -828 -325 1052 25 -1037 209 974 -460 -959 638 782 -831
7018 -831 -516 944 250 -971 -18 938 -192 -855 503 724 -734 -517 838 303 -934 21 962 -244
7036 -244 -874 560 781 -765 -599 911 380 -952 -183 1021 -117 -999 320 855 -514 -700 623
7053 623 483 -775 -231 816 44 -718 165 676 -301 -565 479 388 -596 -253 666 52 -645 151 659
7072 659 -263 -566 371 518 -481 -403 577 304 -523 -203 537 57 -529 51 487 -121 -392 176 387 -239
7092 -239 -354 312 224 -359 -137 300 25 -337 62 358 -122 -382 272 305 -376 -225 376 196 -518 -121 556
7113 556 63 -625 80 588 -201 -564 247 583 -425 -514 502 351 -604 -160 676 10 -644 83 607 -398
$$ packed form
6983F17l25j007O01Q82q14p48R95M82j139q0J133j99j133N27J025q31p61J053
7001B78M43j224j11J296j22j388N03J377j027j062J246P65j434m99J597J44j613
7018h31L15J460o94j221R53R56j130o63J358K21j458K17J355n35j237R55R41j206
7036b44o30J434K21j546J66J510n31j332P69J204j138q82J319N35j369j86J323
7053F23j40j258N44J047p72p62Q83N11r77k64J044r1r84L43R19o14o97P96N08
7072F59r22l03R37J47r99P8R80k73q27L20P40m80n86N80M36o08k71N68K11o26
7092b39j15O66q8n83K22M37k75l62L99K96m80k60O54L3o81J51O01j80p14L97O77
7113E56m93o88P05N08p89l63Q11L36j008q9J016j51r55M44Q36o66o54P27N24j005
$$ plain form
7133 -398 -567 503 375 -619 -230 789 79 -814 149 801 -390 -693 617 543 -732 -399 900 197
7151 197 -925 -14 1030 -218 -899 490 722 -597 -542 732 312 -866 -59 879 -183 -769 444
7168 444 696 -622 -533 786 275 -889 -10 941 -175 -895 400 836 -586 -695 793 513 -875 -183
7186 -183 909 18 -856 169 784 -314 -690 547 489 -567 -228 618 153 -657 94 643 -270 -563 388
7205 388 392 -589 -326 569 107 -668 -6 630 -181 -578 261 491 -337 -443 442 389 -472 -186 454 167 -428
7226 -428 -55 410 -40 -359 129 303 -230 -225 259 149 -282 -164 376 70 -399 9 339 -100 -385 208 366
7247 366 -272 -392 379 316 -483 -287 505 144 -538 -8 603 -73 -629 209 613 -313 -468 401 368 -504 -246
7268 -246 606 97 -607 79 577 -342 -525 470 415 -553 -269 775 95 -813 82 757 -337 -775 438
$$ packed form
7133c98j69J070j28r94L89J019p10q93R63O52j191l03J310p4j275L33J299p03
7151A97j122R11J044j248o81J389K32j319N5J274m20j178Q07R38j062n86J213
7168D44K52j318Q9J319n11j164Q79R51j116p20J295M36j422j09J488k80j388O92
7186a83J092q91q74J025O15j098l76J237n8j056L39Q46m65q10P51N49r13k93R51
7205C88Mr81K63Q95m62p75O62O36q11l97Q39K30q28j06Q85n3q61K86O40k87n95
7226d28L73M65m50l19M88J74n33NM84j10m31J18N40l06m69M08L30m39k85N93J58
7247C66o38j20P71o3p99J96P92l61o82N30O11o76n56Q38M04r26j55Q69l3q72K58
7268b46Q52n09p04O86M98r19j83R95n5r68K84J044o80r08Q95O75j094m38J213
$$ plain form
7287 438 662 -693 -509 786 323 -861 -120 838 -24 -819 306 778 -518 -587 651 415 -672 -138
7305 -138 777 -63 -758 334 699 -557 -604 672 350 -808 -169 860 -8 -866 260 844 -399 -692
7323 -692 542 550 -640 -409 742 154 -772 1 689 -257 -616 326 455 -497 -333 525 116 -647 77 573
7343 573 -207 -500 296 502 -439 -316 522 243 -568 -81 568 32 -541 102 530 -182 -478 257 309 -302
7363 -302 -295 344 212 -308 -131 342 -5 -323 82 262 -132 -266 168 296 -298 -200 273 68 -380 -39 376
7384 376 -109 -452 126 430 -226 -375 292 413 -377 -360 434 228 -472 -102 554 -12 -511 68 466 -217
7404 -217 -403 332 357 -430 -249 480 49 -582 36 555 -214 -562 363 406 -583 -340 630 125 -709 19 699
7425 699 -129 -732 385 623 -505 -508 598 373 -678 -202 749 -36 -725 197 665 -348 -512 493 310
$$ packed form
7287D38K24j355J84J295m63j184P41R58q62p95J125M72j296o9J238k36j087N34
7305a38R15q40o95J092L65j256m7J276l22j158O39J029q68q58J126N84j243k93
7323f92J234Qj190K31J151n88r26P73O88r46l59R42J29r52J64Q58m09p63P24M96
7343E73p80k93P96K06r41J23Q38k79q11M87O49n36n73O43M28p12k96P35N2o11
7363c02PO39j32n20J77M73l47l18M05J80l94j34M34J28n94R8M73k05m48L41M15
7384C76m85l43N78L04o56j49O67J21p90J7P94k06p00L70O56n66m99N79L98o83
7404b17j86P35K5p87J81P29m31o31O18N19p69l48R25M3r89K43R70n05q34P28O80
7425F99q28o03J117K38j128lJ106k25j051M76R51p85o89R22M68j013j64J005j83
$$ plain form
7444 310 -596 -131 703 -42 -643 224 618 -387 -527 608 392 -655 -204 750 74 -750 149 695 -295
7463 -295 -656 395 515 -546 -355 634 147 -597 -30 555 -54 -527 323 446 -382 -319 430 143 -534 13
7483 13 491 -126 -526 254 389 -321 -359 406 274 -418 -140 477 38 -496 32 398 -109 -407 126 319 -177
7504 -177 -314 283 149 -257 -84 317 41 -253 1 297 -134 -236 214 204 -180 -135 331 157 -311 -48 340
7525 340 28 -413 100 369 -84 -395 209 387 -316 -336 344 270 -393 -161 416 21 -476 -2 407 -202 -348
7546 -348 269 347 -321 -208 398 117 -484 3 516 -232 -435 326 385 -419 -263 498 185 -651 -21 677 -124
7567 -124 -583 229 550 -362 -473 491 304 -571 -153 567 -15 -588 101 520 -328 -488 442 330 -541 -147
7587 -147 544 -46 -535 138 592 -353 -489 448 342 -553 -234 581 134 -605 42 565 -202 -531 285 426
$$ packed form
7444C10r06M65Q34p45o01Q67L94j005j40J135k16j047M51R54o76q24Q99N46r90
7463b95l61J051J20j061J91R89m87p44N67N85o09m73Q50J23q28O3P49k87o77N47
7483A3M78o17m00P80J35p10l8P65j32o92K78O17m39n34N28L66n07k98N33J93m96
7504a77j37N97j34m06J73M01k76k94K54K96m31j02M50j0l84M5M66j74m68K63L88
7525C40l12m41N13K69m53l11O04J78p03k0O80p4o63K32N77l95m97M74M09o09j46
7546c48O17P8o68J13O06k81o01M87N13p48k03P61N9q04J56P61l13q36O30O98q01
7567a24m59Q12L21r12j11R64j87q75M18P20n82n73O89M19q48j60R30j12q71L94
7587a47O91n90m89O73M54r45j36R37j06q95L19Q15m47p39O47N23p67l29Q16J41
$$ plain form
7607 426 -420 -330 474 131 -490 -8 471 -134 -470 185 344 -287 -240 399 182 -484 -24 425 -89 -442 149
7628 149 440 -254 -325 310 232 -349 -207 399 106 -366 -26 403 -59 -332 117 277 -193 -276 186 128 -208
7649 -208 -36 244 52 -248 9 224 -54 -282 116 245 -191 -207 317 145 -292 -61 296 10 -346 0
7669 0 352 -113 -298 187 236 -237 -276 257 202 -355 -101 357 2 -387 92 348 -174 -339 263 319 -373 -147
7691 -147 402 50 -389 57 427 -221 -422 306 368 -409 -263 495 104 -567 -51 484 -117 -535 234 479
7711 479 -393 -366 417 211 -476 -150 512 -81 -494 197 397 -261 -302 426 219 -469 -104 515 -35 -533 212
7732 212 525 -332 -404 428 315 -465 -221 550 59 -537 74 447 -222 -462 232 323 -333 -232 436 80 -525
7753 -525 83 403 -140 -331 247 314 -305 -253 460 154 -423 -18 446 -44 -387 166 344 -265 -327 372 271
$$ packed form
7607D26q46R0Q04l43o21M82M79o05l36O55J59o31M7O39k17o66M60M49n14l53N91
7628A49K91o94p1O35p8n81J42O06k93m72L40M29m62k73M49J60m70q3M62n8l36
7649b08J72K80j92l00K57K15k78k28L98J29m36j6N24j72m37K31L57k86l56L46
7669@L52m65j85M85M9m73l9N33n5n57K54M58l55l89M79K56n22j65O02N6o92K26
7691a47N49l52m39M46L70o48k01P28O2p77J46P58l91o71N16N35o01m18P69K45
7711D79q72K7P83k06o87L26O62n93m13O91K00o58m1P28k07o88L65O19n50m98P45
7732B12L13q57p2Q32j13p80K44P71m91n96O11L73o69k40O94R1o56J01O68l56o05
7753e25O08L20n43j91N78O7o19N2P13l06n77M05M64m90l43N53J78o09o2O99j01
$$ plain form
7774 271 -314 -125 369 53 -384 19 351 -110 -240 118 227 -157 -163 201 126 -262 -28 302 -54 -289 23
7795 23 300 -135 -266 164 219 -247 -219 248 141 -312 -79 335 18 -439 64 354 -163 -369 164 267 -258
7816 -258 -270 359 154 -350 -39 365 -53 -361 163 335 -270 -276 319 129 -432 -107 408 0 -468 107 460
7837 460 -228 -396 382 334 -510 -206 485 105 -507 -25 524 -175 -475 271 464 -397 -271 466 187 -543
7857 -543 -53 535 -124 -485 231 420 -367 -388 458 204 -605 -59 643 -85 -590 247 540 -368 -489 476
7877 476 313 -602 -138 568 18 -574 84 460 -220 -460 352 304 -470 -160 435 33 -532 31 426 -198
7897 -198 -403 343 344 -384 -161 418 143 -496 -14 453 -126 -538 222 378 -272 -309 344 303 -371 -136 383
7918 383 -23 -386 -8 302 -99 -284 148 243 -238 -238 264 112 -265 -101 291 -5 -361 55 292 -185 -315
$$ packed form
7774B71n85J89M94l16m37M03L32m61j30L58J09l84oL64p5l88K34L30l56k35L12
7795B3K77m35j31M30N5m66K8M67j07m53K33M14l17m57N03K90n17k06N33J03n25
7816b58j2O29k05n04L11M04m18l08N24J72o05oN95j90n61L25N15m08m68N75L53
7837D60o88j68P78m8q44L04O91l80o12M82N49o99l00P46J93q61J26P37k79p30
7857e43M90N88o59l61P16J89p87k1Q46k54q09N46P02p28n05Q37K93r08j21R65
7877D76j63r15M64P06n50n92O58L76o80k40Q12m8p74L10N95m02n65N63L95o24
7897a98k05P46Jp28K23N79k75o39M82M67n79m12P60J56o50l7O53m1o74K35N19
7918C83m06l63L78L10m01j85M32R5m81%N02j52l77J64L92k96l56M16K37m77j30
$$ plain form
7939 -315 222 233 -239 -273 320 209 -398 -112 426 27 -404 71 388 -91 -404 233 307 -307 -249 382 131
7960 131 -399 -52 445 -88 -439 144 346 -335 -349 347 219 -488 -199 512 50 -591 119 540 -297 -489
7980 -489 328 413 -505 -284 589 134 -596 38 632 -189 -511 258 539 -394 -358 540 195 -594 -59 605 -107
8001 -107 -592 282 509 -476 -397 544 267 -669 -144 680 -53 -704 178 638 -377 -552 501 376 -530 -224
8021 -224 563 118 -605 79 584 -259 -491 388 369 -429 -267 571 132 -573 78 538 -216 -463 285 385
8041 385 -378 -311 451 201 -537 -46 460 -11 -452 72 449 -209 -429 261 254 -299 -249 320 98 -382 -38
8062 -38 354 -56 -354 125 310 -177 -228 271 238 -288 -108 418 -16 -368 82 335 -125 -375 192 406 -284
8083 -284 -334 326 302 -333 -207 375 151 -481 -22 490 -89 -413 156 371 -315 -311 317 248 -448 -116 464 -41
$$ packed form
7939c15N37J1m72l4N93j11o07K86N38l99m31M75L17m79l13O37P4o14N8O31k51
7960A31n30L47M97n33l51N83K02o81j4O96j28p07K89P11m62o41P10M21q37j92
7980d89Q17Q5r18K21Q73m55p30O34N94q21l22P69K81r33L6Q98l45p89N35O64p12
8001a07m85Q74K27r85P9R41k77r36N25Q24p33o51Q82M60j015j75J053j25r06L06
8021b24P87m45p23O84N05q43k32Q79j9p98J62Q38m39p05O51M60p54k47P48J00
8041C85p63O7P62k50p38M91N06m71m41N24L77o58k20O90pn53N0N69k22m80L44
8062c8L92m10k98M79J85m87n1M99l3n26J80N26m34l52M50K53m60k50N67K14o90
8083b84n0O60k4o35J26N82k24o32M59N12n79l24N69K15o86MO28o9o96L32N80n05
$$ plain form
8105 -41 -539 147 415 -210 -417 429 358 -513 -233 577 121 -623 -8 619 -109 -629 343 496 -455 -452 547
8126 547 305 -560 -100 679 -170 -631 268 505 -373 -449 535 242 -583 -156 693 -92 -686 209 587 -317
8146 -317 -514 538 391 -626 -244 687 75 -702 62 620 -143 -590 406 513 -468 -288 617 117 -605
8165 -605 36 528 -135 -515 313 515 -458 -308 539 125 -582 -64 561 -79 -553 264 438 -356 -409 379
8185 379 296 -420 -200 479 70 -503
$$ packed form
8105d1m98O86K68o25k07Q46p1q71K80Q10m56p44O15O27p28n20R72J53r51LR99
8126E47k42q65M60P79q49m61Q99K37q78p6R84k93q25M27Q49p85n94Q95L78r04
8146c17j97J052j47j017L82R31o12p77P64N58p63m47R96J07r81J80R05n00p22
8165f05O41M92o63l80Q28K02r73J50Q47m14p07N18O25o40m74Q17J74p94n3P88
8185C79q3p16K20O79m09n73
8191e03
$$ Imaginary data points
##PAGE= N=2
##DATA TABLE= (X++(I..I)), XYDATA
$$ plain form
0 0 0 0 0 0 0 0 0 8 -8 8 -8 14 -16 17 -24 32 -40 48 -56 72 -88 105 -121 143 -171 203 -232 268 -310 360
30 360 -411 467 -531 605 -685 769 -864 971 -1087 1214 -1351 1503 -1668 1849 -2046 2260
46 2260 -2496 2755 -3034 3342 -3684 4058 -4471 4930 -5443 6022 -6675 7421 -8284 9296
60 9296 -10498 11957 -13769 16090 -19181 23523 -30086 41241 -64915 216536 -623152 -614536
72 -614536 884481 263909 -871788 -37969 891816 -261857 -778085 481828 646955
81 646955 -693608 -433284 808164 229321 -888988 4817 889228 -216712 -843964
90 -843964 421450 726198 -568726 -583716 677436 411893 -732211 -235071 745596 48100
100 48100 -699174 116053 612650 -252360 -495571 353744 363548 -427356 -213622 460881
$$ packed form
0@%%%%%%%Qj6J6j6K2l0L3m1N6p2Q8j04J28j60J93k26K64l14L74m35N00n78O70
30C60p71Q78r98J136j290J454j633J835k058K301k565K854l171L517l895M306
46B260m756N251n789O376p026P742q529R401j0373J1465j2697J4096j5705J7580
60I296j9794K2455k5726K9859l5271M2704n3609P1327j06156K81451q39688Q616
72f14536J499017o20572j135697Q33819R29785j153673n16228J259913J65127
81F46955j340563K60324J241448n78843j118309Q93805Q84411j105940o27252
90h43964J265414L04748j294924j4990J261152k65543j144104M97140R80667o97496
100D8100p47274Q15227M96597q65010k43211Q49315R804p90904K13734O74503
$$ plain form
110 460881 61646 -454824 77299 417804 -193744 -364231 292774 293530 -370178 -208151
120 -208151 417902 119741 -435926 -41125 436450 -28750 -424278 93761 395708 -148717
130 -148717 -352977 186374 307187 -211960 -263122 234348 214385 -251398 -158405 256901
140 256901 102440 -254038 -49317 249645 -8046 -240450 73064 217455 -138101 -180926
150 -180926 196752 136992 -252001 -84050 304271 15245 -343777 66904 361255 -151789
160 -151789 -358462 234967 338188 -317923 -294658 394691 223452 -451646 -131932 481514
170 481514 31090 -486217 75906 464247 -186711 -408163 289136 317866 -368309 -204683
180 -204683 419416 78076 -443227 59137 434072 -199696 -385485 327319 302149 -428812
$$ packed form
110D60881l99235n16470N32123L40505o11548j70487O57005P56o63708J62027
120b08151O26053k98161n55667L94801M77575m65200l95528N18039L01947n44425
130a48717k04260N39351J20813n19147n1162M97470j9963m65783R2993M15306
140B56901j54461l56478K04721K98962k57691k32404L13514J44391l55556m2825
150a80926L77678n9760l88993J67951L88321k89026l59022M10681K94351n13044
160a51789k06673N93429J03221o56111K3265O89349j71239o75098L19714O13446
170D81514m50424n17307N62123L88341o50958k21452O97299K8730o86175J63626
180b04683O24099l41340n21303N02364L74935o33768j85789P12804k5170p30961
$$ plain form
190 -428812 -196405 501842 74612 -544251 60215 547630 -196515 -508065 317332 433545
200 433545 -413712 -334556 484303 214391 -523616 -78286 522458 -59343 -480632 183391
210 183391 407141 -288223 -308688 371281 186887 -423444 -49692 436598 -86919 -413459
220 -413459 211109 362282 -319347 -285776 406351 185758 -461522 -73291 479514 -37138
230 -37138 -465973 138104 426654 -227627 -361722 298475 274449 -340927 -177299 353951
240 353951 81572 -344088 9577 313626 -93879 -261249 162714 192318 -208829 -118460
250 -118460 235420 46149 -247261 25041 243293 -91804 -221964 145753 189821 -183823
260 -183823 -155553 211148 119888 -229909 -80601 236471 42066 -230440 -10504 218849
$$ packed form
190d28812K32407O98247m27230o18863O04466M87415p44145l11550Q25397J16213
200D33545q47257P9156Q18859k69912p38007M45330O00744n81801m21289O64023
210A83391K23750o95364k0465O79969j84394o10331L73752M86290n23517l26540
220d13459O24568J51173o81629L3571O92127k20593o47280L88231N52805n16652
230c7138m28835O04077K88550o54281j34095O60197k4026o15376J63628N31250
240C53951k72379m25660L53665L04049m07505j67370M23963K9604m01147R0369
250a18460L53880j89271k93410K72302K18252l35097j30160L67717M4068l73644
260a83823K8270L66701r1260l49797J49308L17072j94405k72506K19936K29353
$$ plain form
270 218849 -15426 -205758 41098 187622 -65470 -162829 83933 136073 -98119 -110253
280 -110253 113349 80594 -128451 -43682 137425 3078 -139416 37259 137950 -80231
290 -80231 -131487 127725 113639 -174001 -83080 212230 45010 -242052 -1234 264492 -51207
301 -51207 -274027 110290 264371 -167272 -236781 216212 196154 -257302 -142179 287932
311 287932 73430 -300119 3948 289235 -80196 -258570 150738 211106 -214550 -145187
321 -145187 265401 61869 -294011 29659 298018 -120105 -280845 206373 242911 -284663
331 -284663 -181944 345545 102319 -380677 -14496 389776 -73905 -375117 160239 334974
341 334974 -237814 -269012 295940 184191 -328651 -91331 337056 -4093 -322058 98623
$$ packed form
270B18849k34275j90332K46856J46524k53092r7359K46762N2140k34192j2134
280a10253K23602l2755k09045Q4769J81107j34347j42494J76675J00691k18181
290h0231n1256K59212j4086k87640R0921K95310j67220k87062K40818K65726l15699
301e1207k22820L84317J54081m31643o9509M52993k0058m53456J15123M30111
311B87932k14502l73549L04067K85287l69431j78374M09308O0368m25656O9363
321a45187M10588k03532l55880L23670K68359m18123j60740M87218L6538n27574
331b84663J02719N27489k43226m82996L66181M04272m63681l01212N35356J74735
341C34974n72788l1198N64952j11749n12842K37320M28387l41149l17965M20681
$$ plain form
351 98623 280953 -183229 -215603 247823 135400 -289324 -48838 309649 -40831 -307111
361 -307111 128770 279406 -205016 -230755 261965 170215 -299547 -103063 318835 30739
371 30739 -316563 40830 291579 -102421 -249511 149704 197509 -183995 -137655 204431
381 204431 71349 -206579 -5572 190875 -51728 -163603 99518 129062 -138962 -86918
391 -86918 167083 39451 -180097 5895 180303 -44621 -173404 78080 160336 -106764
401 -106764 -139717 126798 114727 -136576 -91253 139992 70065 -140682 -48262 137236 26286
412 26286 -128059 -7747 116782 -7723 -106509 24565 94766 -43175 -78134 60202 58303
423 58303 -74449 -37697 88963 13786 -103323 16532 112342 -50952 -113368 85122 108375
$$ packed form
351I8623J82330m64182l2374M63426j12423m24724K40486L58487l50480k66280
361c07111M35881J50636m84422k5739M92720r1750m69762J96484M21898k88096
371C0739l47302L57393K50749l94000j47090L99215M7805l81504M6340L42086
381B04431j33082k77928K01007J96447k42603j11875K63121K9544k68024N2044
391h6918K54001j27632k19548J85992J74408k24924j28783K51484Q2256k67100
401a06764l2953K66515j2071k51303M5323K31245o9927k10747R2420J85498j10950
412B6286j54345J20312J24529j24505r8786J31074P0201j37941l4959J38336j899
423E8303j32752L6752J26660p5177j17109J19855R5810j63294o2416J98490K3253
$$ plain form
434 108375 -118634 -97522 152782 77073 -183465 -45646 204511 7548 -214262 33001
444 33001 214011 -76338 -201927 121003 174099 -160194 -131890 188013 80707 -203665
454 -203665 -23807 207018 -38252 -194513 100861 163352 -156002 -117247 198802 61599
464 61599 -228753 1688 243806 -70316 -239368 137552 214658 -195170 -174648 240084
474 240084 123347 -271358 -62147 285292 -5476 -277739 71274 250072 -128614 -207337
484 -207337 175398 152045 -209737 -85304 226583 12712 -222726 57508 201114 -120435
494 -120435 -165488 174535 116861 -216085 -56906 239458 -7325 -243451 68485 231294
504 231294 -123391 -205165 170499 165336 -204701 -114871 221683 61187 -222131 -9686 209477
$$ packed form
434A08375k27009K1112K50304p5709k60538J37819K50157j96963k21810K47263
444C3001J81010k90349j25589L22930N3096l34293K8304L19903j07306k84372
454b03665J79858K30825k45270j56261K95374O2491l19354L8755L16049j37203
464F1599k90352K30441K42118l14122j69052L76920P7106m09828K0522M14732
474B40084j16737l94705K09211L47439k90768k72263L49013J78798l78686p8723
484b07337L82735k3353l61782J24433L11887k13871k35438K80234J43606l21549
494a20435m5053L40023n7674l32946J59179K96364k46783k36126L11936J62809
504B31294l54685q1774L75664n163l70037Q9830L36554j60496k83318K12445K19163
$$ plain form
515 209477 -38474 -184474 80790 147353 -112143 -102499 129919 56232 -136317 -11483 133554
526 133554 -31389 -121138 69515 99477 -98521 -73373 117810 47015 -130225 -20860 136253
537 136253 -5178 -134480 28043 125927 -44866 -114794 57048 102902 -66825 -88555 73614
548 73614 72143 -75621 -56500 74911 42696 -74346 -28056 73227 11390 -69183 5246
559 5246 62826 -20844 -56133 37508 47643 -56193 -34576 73880 16824 -88106 3155 99434
571 99434 -25459 -108028 51502 110704 -80097 -104747 106756 91171 -129334 -72057 147993
582 147993 46356 -160909 -14017 164047 -21854 -155805 56635 137909 -88412 -111491
$$ packed form
515B09477k47951j46000K65264O6563k59496R644K32418p3687j92549J24834J45037
526A33554j64943q9749J90653K9962j97998K5148J91183p0795j77240J09365J57113
537A36253j41431j29302J62523R7884j70793o9928J71842M5854j69727k1730J62169
548G3614j471j47764J9121J31411l2215j17042M6290J01283o1837q0573P4429
559E246N7580q3670l5289R3641J0135j03836K1617J08456n7056j04930R1261R6279
571I9434j24893q2569J59530N9202j90801k4650K11503j5585k20505N7277K20050
582A47993j01637k07265J46892J78064j85901j33951K12440Q1274k26321k3079
$$ [...]
8191D9
##END NTUPLES=NMR FID
##END=
