##TITLE=1H_AP-17KHCl
 D2O
 8 sc, 
 23.10.2023
##JCAMPDX= 6.0         $$ Bruker NMR JCAMP-DX V2.0
##DATA TYPE= NMR FID
##DATA CLASS= NTUPLES
##ORIGIN= UXNMR, Bruker Analytische Messtechnik GmbH
##OWNER= root
$$ XWIN-NMR		Version 3.5
$$ Mon Oct 23 14:26:39 2023 Russian Standard Time (UT+4h)  she@DPX200
##.OBSERVE FREQUENCY= 200.13135
##.OBSERVE NUCLEUS= ^1H
##.DELAY= (6, 6)
##.ACQUISITION MODE= SIMULTANEOUS
##.ACQUISITION SCHEME= undefined
##.AVERAGES= 8
##.DIGITISER RES= 18
##SPECTROMETER/DATA SYSTEM= spect
##.PULSE SEQUENCE= zg30
##.SOLVENT NAME= D2O
##.SHIFT REFERENCE= (INTERNAL, D2O, 0, 15.7039)
##AUDIT TRAIL= $$ (NUMBER, WHEN, WHO, WHERE, WHAT)
$$ ##TITLE= Audit trail, XWIN-NMR		Version 3.5
$$ ##JCAMPDX= 5.01
$$ ##ORIGIN= Bruker BioSpin GmbH
$$ ##OWNER= she
$$ F:/spectra/data/she/nmr/H-F/1/audita.txt
$$ ##AUDIT TRAIL=  $$ (NUMBER, WHEN, WHO, WHERE, WHAT)
(   1,<2023-10-23 14:25:08.01 +0400>,<she>,<DPX200>,
      <created by zg, POWCHK disabled, PULCHK disabled
       configuration hash MD5:
       00 E9 B6 7A A2 85 ED C7 34 08 36 98 17 FE 4E 26
       data hash MD5: 16K
       9F 98 0C 6B F9 B8 59 71 1B FA 0E E4 A7 1B 2F AD>)
$$ ##END=
$$ 
$$ hash MD5
$$ E2 31 18 74 A4 9C 85 59 C2 CB DB 89 86 90 F4 0B
##$RELAX= 
##$RELAX= 
##$RELAX= 
##$RELAX= 
##$RELAX= 
##$RELAX= 
$$ Bruker specific parameters
$$ --------------------------
##$DU= <F:/spectra>
##$EXPNO= 1
##$NAME= <H-F>
##$PROCNO= 1
##$TYPE= <nmr>
##$USER= <she>
##$AMP= (0..31)
100 100 100 100 100 100 100 100 100 100 100 100 100 100 100 100 100 100 
100 100 100 100 100 100 100 100 100 100 100 100 100 100 
##$AQSEQ= 0
##$AQ_mod= 1
##$AUNM= <au_zg>
##$AUTOPOS= <>
##$BF1= 200.13
##$BF2= 200.13
##$BF3= 200.13
##$BF4= 200.13
##$BF5= 200.13
##$BF6= 200.13
##$BF7= 200.13
##$BF8= 200.13
##$BYTORDA= 1
##$CFDGTYP= 0
##$CFRGTYP= 5
##$CHEMSTR= <none>
##$CNST= (0..31)
1 1 145 1 1 1 1 1 1 1 1 1 1 1 1 1 1 1 1 1 1 1 1 1 1 1 1 1 1 1 1 1 
##$CPDPRG= <>
##$CPDPRG1= <>
##$CPDPRG2= <>
##$CPDPRG3= <>
##$CPDPRG4= <mlev>
##$CPDPRG5= <mlev>
##$CPDPRG6= <mlev>
##$CPDPRG7= <mlev>
##$CPDPRG8= <mlev>
##$CPDPRGB= <>
##$CPDPRGT= <>
##$D= (0..31)
0 1.2 0 0 0 0 0 0 0 0.06 0 0.03 0 0 0 0 0.0002 0 0 0 0 0 0 0 0 0 0 0 0 
0 0 0 
##$DATE= 1698056707
##$DBL= (0..7)
120 120 120 120 120 120 120 120 
##$DBP= (0..7)
150 150 150 150 150 150 150 150 
##$DBP07= 0
##$DBPNAM0= <>
##$DBPNAM1= <>
##$DBPNAM2= <>
##$DBPNAM3= <>
##$DBPNAM4= <>
##$DBPNAM5= <>
##$DBPNAM6= <>
##$DBPNAM7= <>
##$DBPOAL= (0..7)
0.5 0.5 0.5 0.5 0.5 0.5 0.5 0.5 
##$DBPOFFS= (0..7)
0 0 0 0 0 0 0 0 
##$DE= 6
##$DECBNUC= <off>
##$DECIM= 32
##$DECNUC= <off>
##$DECSTAT= 4
##$DIGMOD= 1
##$DIGTYP= 9
##$DL= (0..7)
0 120 120 120 120 120 120 120 
##$DP= (0..7)
150 150 150 150 150 150 150 150 
##$DP07= 0
##$DPNAME0= <>
##$DPNAME1= <>
##$DPNAME2= <>
##$DPNAME3= <>
##$DPNAME4= <>
##$DPNAME5= <>
##$DPNAME6= <>
##$DPNAME7= <>
##$DPOAL= (0..7)
0.5 0.5 0.5 0.5 0.5 0.5 0.5 0.5 
##$DPOFFS= (0..7)
0 0 0 0 0 0 0 0 
##$DQDMODE= 0
##$DR= 18
##$DS= 0
##$DSLIST= <SSSSSSSSSSSSSSS>
$$ [...]
##$SUBNAM2= <"">
##$SUBNAM3= <"">
##$SUBNAM4= <"">
##$SUBNAM5= <"">
##$SUBNAM6= <"">
##$SUBNAM7= <"">
##$SUBNAM8= <"">
##$SUBNAM9= <"">
##$SW= 18.05172834244
##$SWIBOX= (0..15)
0 0 2 0 0 0 0 0 0 0 0 0 0 0 0 0 
##$SW_h= 3612.71676300578
##$TD= 16384
##$TD0= 1
##$TE= 0
##$TE2= 300
##$TE3= 300
##$TEG= 300
##$TL= (0..7)
0 120 120 120 120 120 120 120 
##$TP= (0..7)
150 150 150 150 150 150 150 150 
##$TP07= 0
##$TPNAME0= <>
##$TPNAME1= <>
##$TPNAME2= <>
##$TPNAME3= <>
##$TPNAME4= <>
##$TPNAME5= <>
##$TPNAME6= <>
##$TPNAME7= <>
##$TPOAL= (0..7)
0.5 0.5 0.5 0.5 0.5 0.5 0.5 0.5 
##$TPOFFS= (0..7)
0 0 0 0 0 0 0 0 
##$TUNHIN= 0
##$TUNHOUT= 0
##$TUNXOUT= 0
##$USERA1= <user>
##$USERA2= <user>
##$USERA3= <user>
##$USERA4= <user>
##$USERA5= <user>
##$V9= 5
##$VALIST= <valist>
##$VCLIST= <CCCCCCCCCCCCCCC>
##$VD= 0
##$VDLIST= <DDDDDDDDDDDDDDD>
##$VPLIST= <PPPPPPPPPPPPPPP>
##$VTLIST= <TTTTTTTTTTTTTTT>
##$WBST= 1024
##$WBSW= 4
##$XGAIN= (0..3)
0 0 0 0 
##$XL= 0
##$YL= 0
##$YMAX_a= 632420
##$YMIN_a= -638534
##$ZGOPTNS= <>
##$ZL1= 120
##$ZL2= 120
##$ZL3= 120
##$ZL4= 120
##$ABSF1= 10
##$ABSF2= 0
##$ABSG= 5
##$ABSL= 3
##$ALPHA= 0
##$AQORDER= 0
##$ASSFAC= 0
##$ASSFACI= 0
##$ASSFACX= 0
##$ASSWID= 0
##$AUNMP= <proc_1d>
##$AZFE= 0.1
##$AZFW= 0.1
##$BCFW= 1
##$BC_mod= 2
##$BYTORDP= 1
##$COROFFS= 0
##$CY= 11.3945322036743
##$DATMOD= 1
##$DC= 2
##$DFILT= <>
##$DTYPP= 0
##$F1P= 15.7292609196834
##$F2P= 12.9074282941183
##$FCOR= 0.5
##$FTSIZE= 0
##$FT_mod= 4
##$GAMMA= 1
##$GB= 0.15
##$INTBC= 1
##$INTSCL= 1
##$ISEN= 128
##$LB= 0.24
##$LEV0= 0
##$LPBIN= 0
##$MAXI= 10000
##$MC2= 0
##$MEAN= 0
##$ME_mod= 0
##$MI= 1.114404
##$NCOEF= 0
##$NC_proc= 0
##$NLEV= 6
##$NOISF1= 3.799351
##$NOISF2= 2.8
##$NSP= 1
##$NTH_PI= 0
##$NZP= 0
##$OFFSET= 15.70392
##$PC= 1
##$PHC0= -23150.76
##$PHC1= 7.852703
##$PH_mod= 1
##$PKNL= yes
##$PPARMOD= 0
##$PSCAL= 0
##$PSIGN= 0
##$REVERSE= no
##$SF= 200.130013532006
##$SI= 16384
##$SIGF1= 3
##$SIGF2= 2
##$SINO= 400
##$SIOLD= 16384
##$SREGLST= <1H.CDCl3>
##$SSB= 0
##$STSI= 0
##$STSR= 0
##$SW_p= 3612.71676300578
##$SYMM= 0
##$S_DEV= 0
##$TDeff= 0
##$TDoff= 0
##$TI= <>
##$TILT= no
##$TM1= 0
##$TM2= 0
##$TOPLEV= 0
##$USERP1= <user>
##$USERP2= <user>
##$USERP3= <user>
##$USERP4= <user>
##$USERP5= <user>
##$WDW= 1
##$XDIM= 8192
##$YMAX_p= 0
##$YMIN_p= 0
$$ End of Bruker specific parameters
$$ ---------------------------------
##NTUPLES= NMR FID
##VAR_NAME=  TIME,          FID/REAL,        FID/IMAG
##SYMBOL=    X,             R,               I
##VAR_TYPE=  INDEPENDENT,   DEPENDENT,       DEPENDENT
##VAR_FORM=  AFFN,          ASDF,            ASDF
##VAR_DIM=   8192,          8192,            8192
##UNITS=     SECONDS,       ARBITRARY UNITS, ARBITRARY UNITS
##FACTOR=    0.0002768,     1,               1
##FIRST=     0,             0,               0
##LAST=      2.2672688,     0,               0
##MIN=       0,             -638534,         0
##MAX=       2.2672688,     632420,          0
$$ Real data points
##PAGE= N=1
##DATA TABLE= (X++(R..R)), XYDATA
$$ [...]
3072a0085o87M440O933O856L525j531n394p428n934j529L085O886O745M392k72
3087A0002m645p062o460k551J892O090P104N357O20l125p258o869l440P01N168
3102d476P198N755K260k773o267o969m752n8M417O524O524L119j830n537o664
3117c529n230j626L193O292O950L935l75m820o955n679k193J735N866O977M843
3132I384N68l781o652o156l628J260N137O577N713J843k925n896o791m274n8M220
3148e459O825N783L092j661n697o712n186r53L196O399O635L603q67m519o607
3163b128n410k562K424N502O729M403P03l919o306o102l014J173N030O715N173
3178H411J276k782n849o367l969J98M099O664N721K189j634n586o321m742r50
$$ y = [-10085, -10772, -6332, 601, 7457, 10982, 9451, 4057, -3371, -9305, -10834, -7749, -863, 5882, 10274, 10002, 5357, -1705, -8165, -10716, -8824, -2734, 4370, 9727, 10347, 7222, -36, -6905, -10345, -9644, -4476, 2722, 8477, 10737, 7964, 1697, -5272, -10024, -10082, -5665, 859, 7383, 10502, 8672, 3135, -3529, -8759, -10385, -7192, -900, 6050, 9985, 9610, 4790, -2165, -7844, -10037, -8302, -2436, 4541, 9384, 9952, 6171, -481, -6637, -10265, -9005, -3868, 2709, 8422, 10265, 7340, 1444, -5347, -9621, -9679, -5459, 1366, 7149, 10241, 8580, 2883, -3829, -9015, -9968, -6772, -373, 6262, 9865, 8998, 4479, -2128, -7538, -10100, -7676, -2174, 4555, 8958, 9661, 5742, -564, -6666, -9680, -8507, -3477, 3238, 8411, 9687, 6905, 1056, -5311, -9280, -9082, -4983, 1681, 7402, 9591, 7957, 2371, -3950, -8692, -9642]
3193i642L303O362O154L277q23m686o438n411j542K361N419O229M357L21m016
3208E225n933n851l134J647N008O281M923J430l148n971o105l924Q45M314O185
3223A792N458K137j822n248o483m339p12L486N769N900L293j228m034o652n160
3238g843j378K618N521N983L719J75l795o074n575k625J610N046N895M600J069
3253H946k833n558o002l352M65M412N905N246J889k097n112o020m240l44L465
3268e230N772N620K803j222m507o058n060j091K709N367N919L693l65l908n811
3283a369n430k262J888N111N811M325N79l051n874n226l229R51M108N875M932
3298G139J576j999n074n964l913j32L328O295N117K325j224m675o035m197j396
$$ y = [-9642, -6339, 23, 6177, 9454, 8631, 3945, -2493, -7904, -9446, -7085, -1666, 4563, 8920, 9241, 5225, -708, -6559, -9693, -8046, -3038, 3243, 8166, 9596, 6448, 477, -5628, -9552, -8707, -4393, 1792, 7250, 9387, 7565, 2317, -4166, -8505, -9217, -5731, 38, 5938, 9231, 8003, 3969, -2683, -7843, -9221, -6603, -1082, 4901, 8620, 8795, 5000, -1074, -6649, -9274, -7664, -2618, 3277, 7877, 8946, 6113, 555, -5447, -8799, -8334, -3922, 1983, 7229, 9118, 7021, 1909, -4111, -8351, -8695, -5230, 542, 6162, 8965, 7743, 3236, -2822, -7882, -8973, -6264, -897, 5022, 8715, 8350, 4442, -1369, -6799, -9061, -7173, -2062, 3749, 8074, 8653, 5602, -272, -5498, -8727, -7776, -3668, 2207, 7139, 8715, 6716, 1642, -4322, -8235, -8367, -5039, 1256, 6373, 8698, 7474, 2799, -3236, -7433, -8829]
3313h829K959N446N726L057n39l934n849m720k003K065M815N767M133K46k989
3328E351n739n406k675J025M235O005M361J378k365n107n505l809L54L468N665
3343A236N185K122j610m729n534m345n78K941N261N303K889m83m175n569m581
3358f667j992K319M893N399L856K99l486n587m849k241P07M427N763M348J070
3373H259k401n369n116l121k1L572N550M974J970j611m922n364l878k89K679N142
3389E4N250K809p60m105n330m603j633K269M778N466L519j15l202n613m517k364
3405h097J177M569N412M178N90k504m814n220k990K12L726N561M526J762k007
3420F081m454n122m018l22L100N238M968K859j306m235n026m775q07J933N067
$$ y = [-8829, -5870, -424, 5302, 8359, 7820, 3886, -1963, -6683, -8686, -6621, -1806, 3961, 8094, 8340, 5351, -388, -5794, -8469, -7444, -3209, 2796, 7157, 8535, 6170, 1063, -4442, -8251, -7897, -4429, 1236, 6421, 8543, 6933, 2204, -3330, -7675, -8253, -5312, -51, 5252, 8141, 7658, 3483, -2086, -6667, -8659, -6340, -1447, 3952, 7808, 8107, 4621, -966, -5815, -8056, -7349, -2922, 2841, 7189, 8259, 5858, 489, -4627, -7748, -7769, -4197, 1353, 6327, 8297, 6686, 1764, -3600, -7478, -7767, -5088, 54, 5304, 8113, 7353, 3248, -2082, -6685, -8318, -6049, -1271, 4195, 7714, 7599, 4397, -1216, -5733, -8097, -6920, -2351, 3061, 7239, 7829, 5325, 511, -4709, -7699, -7487, -3761, 1800, 6326, 8088, 6081, 1627, -3495, -7513, -7835, -4735, 503, 5471, 8330, 7024, 2789, -2237, -7012, -7819, -5886, -819]
3435h19N053L264l32l262n080m605k091J334M422N321L832Q31k829n000n096k355
3451g412L23L852N121M484J443j898m632n102l324r8K834N019M733K364j190l914
3467B603n109m102j009K377M820M701L010p8l765m847m351j886J580M088N473
3482C505L288N30k518n097m720k381O77L839N068M004J052j861m417m881k946
3497f858j78L056M796M538K069j120l911n140l774o75K369M650M788K475l22l736
3513C027m579m384j536J977L877M928L318M00k787m873m382k430R67L936M747
3528B206L936J159k100m564m529k949K92K825M964M539J247j300m049m787l373
3543f483p71K667M614M522K675q80l386m960l604j861K143M116M864L017J91k880
$$ y = [-819, 4234, 7498, 7166, 3904, -1176, -5781, -7872, -6538, -2116, 3205, 7037, 7868, 5039, 39, -5057, -7412, -7089, -3237, 1884, 6368, 7811, 5913, 1281, -3821, -7145, -7243, -4409, 610, 5343, 7707, 6517, 2603, -2506, -6608, -7617, -5240, -420, 4281, 7291, 7213, 3448, -1399, -5750, -7636, -6056, -1968, 3505, 6793, 7323, 4805, -292, -5012, -7393, -6716, -2877, 2191, 6195, 7247, 5386, 969, -3912, -6858, -7036, -3980, 816, 5354, 7423, 6303, 2392, -2748, -6522, -7197, -4828, -178, 4610, 7085, 6763, 3027, -1552, -5936, -7472, -5495, -1618, 3310, 6628, 7028, 4241, -632, -5014, -7444, -6477, -2541, 2206, 6142, 7301, 5201, 637, -3892, -6841, -6549, -3724, 1240, 5779, 7026, 5726, 1677, -3110, -6483, -7254, -4587, 27, 4549, 7224, 6344, 2958, -2002, -5606, -7467, -5324, -1208, 3656, 6673, 6864, 3984]
3559C984m748m104k264J234L465M845L909O49k364m018m711k778N64L033M795
3574A491L719J995j738m010m444l282l52K428M402M276K384m64l750m748l797
3589e890p85J697M061M767K722n9k770m977l791j874J239L786M529L384P25k413
3605D351m334m331k414M37L397M632L825J278j525m163m449l090OK681M402L966
3621D669K230r31l692m407l780j043K326L972M345K639l98k870m179l951j623
3636f693J276L867M476L047O04k364m211m528j661N75L088M433L573J314j655
3651E141m096m569k855K43K295M652L901J962j360l094m615l063j124K139M180
3666b63M042K856o74k959m356l887j222J239L993M358K721L41k469m052m123k239
$$ y = [3984, -764, -4868, -7132, -5898, -2433, 2412, 6321, 6970, 4606, 588, -4123, -6901, -6337, -3304, 1491, 5210, 7205, 5467, 1457, -2987, -6269, -6621, -4193, 209, 4485, 6869, 6405, 2655, -2093, -5890, -6675, -4978, -917, 3850, 6572, 6513, 3743, -1234, -5025, -6899, -5660, -1874, 2655, 6039, 6764, 4351, 17, -4314, -6728, -6291, -2894, 1738, 5563, 6841, 5316, 1153, -3296, -6386, -6380, -3699, 703, 4669, 6899, 5968, 2276, -2131, -5911, -6954, -4628, -656, 3689, 6328, 5930, 3060, -1119, -5070, -6693, -5417, -1550, 2926, 5973, 6577, 4213, 2, -4526, -6187, -5612, -2524, 1909, 5482, 6796, 5141, 1045, -3524, -6379, -6136, -3841, 811, 4712, 6674, 5314, 2220, -2395, -5458, -6582, -4443, -263, 3779, 6635, 5961, 3002, -1354, -5241, -6463, -5224, -1231, 3127, 5848, 6189, 3720, -332, -4455, -6694]
3682f694J092L124M588L421P98j357m374m231k534K74K284M529L744J676r48l775
3698A617m404k855o47K137L911M072K363l87l373m222l328j360J725L701M121
3713C071L075j25k485m118l724k168J243L163M249L250Q82k146l576m146k490
3728f045M65K691M106L474J789j743l329l809l265l53K291L909M051J736p09k892
3744B367m252l131j161J761L622M096K519n2k227m230l580j908R96L497L819L208
3760E344Q77k423l669l827k267L96K567M466L407J000j134l651l785k810k79K320
3776c468L984L630J705p54l194m160k643j188K035L920L242K765k91k841l926
3791a184l386j256J037L241M039K740K83k121l468l732j708J66K944L931L253
$$ y = [-6694, -5602, -2478, 2110, 5531, 6329, 4972, 598, -3633, -6167, -5893, -3609, 920, 4664, 6340, 5392, 1617, -2787, -5642, -6289, -4152, -241, 3831, 6194, 5807, 2434, -1788, -5116, -6476, -4751, -1050, 3071, 6146, 6021, 3536, -582, -4306, -6474, -5231, -2068, 2181, 5431, 6313, 4167, 591, -3555, -6045, -5580, -2889, 1217, 4691, 6480, 4737, 1408, -2401, -5666, -6019, -3728, 181, 4232, 5968, 5259, 2367, -1885, -5016, -6177, -4416, -794, 3302, 5821, 5769, 3542, -688, -4268, -6176, -5180, -1683, 2136, 5344, 6221, 3798, 129, -3698, -5965, -5569, -3002, 1464, 4871, 5871, 4737, 1086, -2699, -5509, -5788, -3468, 516, 4146, 5851, 5097, 1903, -2257, -4900, -6088, -4053, -133, 3109, 5874, 5583, 2742, -1184, -4570, -5826, -4789, -1548, 2491, 5231, 5514, 3393, -75, -3807, -5515, -5349, -2405, 1526, 4779]
3806D779J074j511l640l767k341l77K716L597L544J870j036l182m197k572p20
3821e763K039L341L930J903m2k684m162l164j228J650K888L930K826K20k288l753
3837c57l400j977P13K929L947L199O60j584l527l839k183qK364L906L630J283
3853E756j213k956l814k972m84K102M025L220J950m31k947l657l191j126J200
3868d538L673L839K163R7k227l668l568j308Q36L137L465L206N97j890l488l642
3884c316k020R3K522L934L224J289j076l378l717k874j04K029L585L588J634l46
3900E067k970l846k856j160J562L656L699K074J02k713l237l542j263Q72L012
3915a543L758K639N95j724l723l539k069M35K833L626L252J064j503l119l650
$$ y = [4779, 5853, 4342, 702, -3065, -5406, -5783, -3067, 530, 4074, 5944, 4908, 1726, -2471, -5043, -5763, -3724, -383, 3547, 5450, 5408, 2724, -1438, -4602, -5830, -4180, -1292, 2638, 5464, 5684, 3396, -357, -3757, -5734, -5021, -2092, 1855, 5054, 5714, 4130, 603, -3236, -5419, -5427, -3063, 843, 4473, 5756, 4543, 1587, -2227, -5199, -5683, -3581, 444, 3664, 5614, 5183, 2236, -1421, -4612, -5738, -4538, -865, 2974, 5137, 5234, 3007, -661, -4229, -5537, -4701, -1564, 1901, 5107, 5704, 3814, 326, -3316, -5336, -5243, -2721, 1213, 4437, 5726, 4650, 1272, -2445, -5319, -5423, -3394, 191, 3779, 5413, 5067, 2097, -1749, -4605, -5765, -4203, -547, 3152, 5226, 5328, 2615, -622, -4164, -5427, -4555, -1543, 2215, 4854, 5449, 3725, 2, -3537, -5606, -5171, -2338, 1288, 4540, 5604, 4101, 982, -2668]
3930b668k429j2J837M039L170J836r76l078l477k999o95J656L509L527K019L0
3946E289k621l983l040j123J010L288L524K309M73j843l575l166j654M40K746
3961a926L308K913J207j391l387l309k517J37K213L591L225J428q57l143l615
3976b123k536m09J562L356L326K183m65k658l556k889j186J412L034L140K679
3991D870N52k427l308l315j853R76K706L434K754J040j788l048l480k053P1K150
4007b719L541L028J674j473k717l599k408n03K141L264K875K100n23k588l552
4022a459k868o99J048L117L385K336L24k297l234l484j331Q05K862L284K887N50
4038E226j716l383l466j794K54K479L500K833J154r75l031l323k612o8J653L531
$$ y = [-2668, -5097, -5109, -3272, 767, 3937, 5773, 4797, 1719, -1758, -4757, -5452, -3796, -287, 3240, 5259, 5289, 2668, -1315, -4355, -5478, -4468, -1180, 2344, 4653, 5126, 3283, -292, -3458, -5112, -4672, -1926, 1382, 4295, 5502, 4111, 724, -2585, -5102, -4965, -2752, 839, 4064, 5492, 4635, 1492, -2123, -4659, -5068, -3506, -150, 3176, 5359, 4894, 2236, -1320, -4209, -5395, -3983, -949, 2191, 4870, 5422, 2995, -313, -3628, -5481, -4505, -1799, 1635, 4389, 5429, 3641, 593, -2887, -4940, -4869, -2719, 822, 3850, 5524, 4051, 1334, -2265, -4673, -5176, -3035, 229, 3104, 5204, 4681, 2093, -1459, -4327, -5026, -3978, -861, 2524, 4860, 5184, 2887, -347, -3831, -5162, -4357, -1495, 1789, 4676, 5226, 3510, 127, -3339, -5133, -4879, -2400, 1100, 3933, 5087, 4112, 1081, -2242, -4854, -4922, -3269, 262]
4054B62L329J536q83k445l325k838p46J611L021L403J965j62j925l380l236j108
4070d921N98L250L262K269M38j846k928l431j569L35K567L241K792J039j541k721
4086H34l353k258J63J876L423L055J281q42k377l507k586p50J716L056L300J987
4102E018m19k314l148k898j305J103K841L563K281K24j671l395k931j932N29K557
4118a897L314K872N75j151k928l512j807J00J863L054L081J392p39k762l473k361
4134d379m72J854K678L292J955m92k525l333k346j267J376K958L106J988L43j830
4150B906l356l106j212M05K569L416K566M18j217l040l213j728J44K259L051K928
4166C790R76q74k933l137j993l18J647K960K778J699o4k655l294k491p39J100
$$ y = [262, 3591, 5127, 4244, 1799, -1526, -4364, -5110, -3499, -478, 2925, 4890, 4728, 2803, -577, -3813, -4921, -4323, -1073, 2189, 4458, 4896, 3050, 122, -3309, -4878, -4543, -1976, 1265, 4057, 5096, 3555, 834, -2519, -4777, -4614, -2738, 685, 3740, 5021, 4179, 1802, -1705, -4291, -5041, -3325, -269, 3031, 5018, 4599, 2285, -863, -3761, -5066, -3963, -1122, 2441, 4722, 4946, 3275, -120, -3051, -4983, -4454, -1897, 1417, 4289, 4864, 3713, 785, -2727, -4534, -4434, -2571, 483, 3564, 4956, 4217, 1455, -2018, -4379, -4851, -2997, -319, 2973, 4928, 4436, 1911, -1422, -3768, -5035, -3659, -701, 2405, 4393, 4736, 2906, -450, -3556, -4768, -4363, -1794, 1622, 4188, 4606, 3389, 349, -2864, -4592, -4448, -2189, 862, 3790, 4766, 3892, 959, -2178, -4171, -4489, -2842, 118, 2896, 4595, 4531, 1876, -1418, -3909, -4648, -3548]
4182c548K666L426K190J49k330l120l067r78P63K522L384K101M57j545k865l006
4198b801j895M22K188L119K673P64r30k800k778k459Q6J760K942K821J617p11
4214D018k665k957k191o92J312K772K943J964j38k255l018k548j227R33K616L216
4230B083K082M7j471k730l025j474N14J847L090K724J331j688k577k901k202j31
4246d481J779L243K500J760r34k421k984k417o82J545K921K836J912m28k022l233
4262a106k316j272J141K784K694K174K40j653l178k511j317M04K269K836K622
4277C811O30j111k692l101j840J76K095K909K420J069m04k663l288j960m62J782
4293b629K575L029J246k80k077l069k417r36J443K292L117J821J58j811k690k945
$$ y = [-3548, -882, 2544, 4734, 4883, 2553, -567, -3634, -4612, -3849, -1327, 2057, 4158, 4615, 3070, 205, -2801, -4696, -4274, -2086, 1033, 3706, 4470, 3540, 740, -2038, -4497, -4411, -2651, 291, 3112, 4729, 4018, 1353, -1604, -3795, -4487, -3175, -403, 2540, 4504, 4366, 2111, -907, -3455, -4682, -3749, -1133, 2083, 4165, 4212, 2741, 11, -3014, -4488, -3974, -2127, 963, 3687, 5018, 3330, 753, -2148, -4350, -4481, -2702, 541, 3041, 4801, 3867, 1446, -1538, -3955, -4637, -3092, -171, 2665, 4577, 4149, 2127, -1106, -3422, -4694, -3553, -769, 1925, 4099, 4339, 2686, -492, -3003, -4320, -3916, -1647, 1189, 3811, 4441, 3330, 638, -2463, -4303, -4127, -2032, 877, 3297, 4366, 3962, 1299, -1989, -3949, -4411, -2629, -54, 2975, 4221, 3941, 1864, -1205, -3622, -4558, -3115, -823, 2294, 4115, 4273, 2462, -228, -3173]
4309c173j154L15K458L050K271N01j455k470k789j756R5K136K878K427Q25o79
4325C480k509l146j797m38J914K897K633J278n98j978k804k531o58J240K591K975
4341B549J488m1j836k771k550r27J72K594L119J999P77j887k861k528j344K46
4357c801J819L022K414Q67j177k645k653j857O1J577K654K805J236p23k304k791
4373a496k354l59J271K622K614K032o59j799k601k467j243Q68L058K422J958K07
4389D074j285k705k738j563P90J749K987J979O44p55k453k900j763jJ553L073
4405F86K197J366q23k159k789k110n59J180K985K628J477k43k085k626k480q79
4421d234J192K196K621K084K38k016k380k684j088N26K064K909J849Q51j157k843
$$ y = [-3173, -4327, -4012, -1554, 1496, 3767, 4268, 2813, 343, -2446, -4202, -4107, -1971, 907, 3334, 4159, 3480, 971, -2175, -3972, -4410, -2496, 401, 3034, 4312, 3714, 1736, -1068, -3599, -4257, -3017, -426, 2549, 4037, 3996, 2160, -611, -3161, -4088, -3916, -1322, 1797, 3796, 4573, 2686, -175, -2703, -4047, -3801, -1982, 1040, 3454, 4321, 3144, 499, -2154, -4011, -3950, -2373, 281, 3086, 4322, 3599, 1295, -1496, -3850, -4209, -2938, -316, 2298, 4330, 3671, 1872, -729, -3196, -4439, -3571, -513, 1909, 3867, 4074, 2789, 84, -2654, -4217, -3427, -1678, 1309, 3288, 3932, 3177, 724, -2176, -3939, -3940, -2387, 686, 2883, 4249, 3426, 1267, -1522, -3632, -4191, -3011, -26, 2602, 4079, 3836, 1751, -875, -3355, -4234, -3042, -846, 1775, 3859, 4097, 2081, -299, -2983, -4071, -3545, -1481, 1428, 3277, 4128, 2971, 128]
4437A28k305j750N4K010K687K452R67j195k214k576k058r5J389K600K409J534
4453D037j35k046l137k242n10Q51K641K543J969mj916k635k468q46L89K131K924
4470A546K219L02j352k774k358j276o1K018K568K209J009j027k262k585j621m96
4486c941J681K548K375J556n72k256k622k095l88Q38K616K729J362r6j611k779
4502f55k151j342Q38K321K763J786L32j390k570k459j322L09J938K876J871R14
4518D059j107k348k747j699J15J590K282K649J002n46k104k513j766p90J478K217
4534b28K461J647l38j823k595k312p49J029K400K311J701M01j442k634k622j268
4550d061O95J949K648J994P11j512k002k621j304j34J747K515K164J377j066k141
$$ y = [128, -2177, -3927, -3873, -1863, 824, 3276, 4243, 3048, 834, -1742, -3800, -3895, -2506, 94, 2503, 4037, 3902, 1856, -1281, -3523, -4033, -3182, -541, 2002, 3971, 3967, 2051, -584, -3052, -3898, -3509, -1378, 1546, 3765, 4067, 2715, -59, -2417, -3693, -3754, -1736, 832, 3041, 4050, 3023, 761, -1824, -3445, -3941, -2260, 288, 2663, 4219, 3647, 1391, -1231, -3326, -3714, -2876, -260, 2469, 3831, 3735, 2124, -655, -2806, -4148, -3310, -989, 1774, 3560, 3892, 2502, -68, -2527, -3849, -3540, -1602, 1274, 3145, 4059, 2952, 604, -2143, -3842, -3727, -2137, 145, 2794, 3796, 3250, 1146, -1367, -3133, -3923, -2445, -228, 2233, 3880, 3542, 1719, -876, -3188, -3937, -2908, -508, 1803, 3504, 3905, 2463, -171, -2793, -4061, -3366, -1417, 1231, 3225, 3936, 2424, 422, -2199, -3503, -3637, -1890, 625, 2789, 4166, 3100, 959]
4566I59k668j566n32J322K271K543J585n88j810k801j775q48J237K151K400J799
4582C679j12j594k378k304j009M65J920K569K185N47j296k347k592j361J51J819
4598a658K496K117P53o70k091k627j811j40J538K222K346J140m38j721k480j788
4614b812r99J259K032K464J688k79j326k532k447q06P27K109K296J870K95j195
4630B344k366k281j318j61K193K547K031J016j287k313k243j862K98J323K569
4645D90K325P83n48j792k537j951k30J040K058K312J633j41j359k813k169p06
4661c605R27K096K385J502J73j383k265k140j176L93J755K507J821P82j236k148
4677C88k365j408j30J601K538K071J017o01k061k490j626l19J117K388K412J078
$$ y = [959, -1709, -3275, -3807, -2485, -214, 2329, 3914, 3326, 1516, -1285, -3060, -3908, -2671, -520, 1880, 3679, 3567, 1973, -405, -2709, -3718, -3253, -1333, 1236, 3421, 3968, 2672, 325, -2267, -3628, -3477, -1658, 838, 2955, 3708, 3038, 947, -1680, -3491, -3631, -2093, 129, 2475, 3615, 3177, 1456, -1024, -2812, -3811, -2552, -520, 1944, 3632, 3353, 2027, -505, -2952, -3758, -3031, -922, 1374, 3244, 3539, 2344, -22, -2303, -3621, -3782, -1589, 958, 2989, 4005, 2718, 405, -1838, -3700, -3402, -2079, 490, 2815, 3598, 3050, 1258, -1279, -3230, -3460, -2420, -362, 1950, 3583, 3442, 2083, -730, -2899, -3605, -2678, -582, 1803, 3305, 3478, 2095, -170, -2310, -3486, -3093, -1338, 1169, 2990, 3772, 2536, 388, -1977, -3385, -3515, -1914, 624, 2695, 3712, 3111, 1050, -1440, -3066, -3385, -2268, 120, 2532, 3610]
4693C610n99j641k294j946o68P87J966K417J707J20j302k404k162r86K37K014
4709a144K539J733M07j005k378k135j387o3J798K275K067Q06q24j825k706j458
4725c300k06J492K149K144J096l95j721k451j707o48J141K037K355R90J97j489
4741A684k017k263j019P51K027J959J703N07r63k384k102j298J50J974K073K143
4757B925O93r55k014k329j536m5J263K278K232R09o22j790k029j904m28R18K336
4774i8J884J525j23j536k200j976p96O26K068J897J747J07j176k027k184j137
4790c399L53J846K254J601Q01j078j951k106j469j65J373K270K127Q33n59j705
4806A026k258j845p9Q11J996K425P79J92j533k169j805r47R39J759K454J405J45
$$ y = [3610, 3011, 1370, -924, -2870, -3538, -2751, -785, 1632, 3339, 3459, 2157, -247, -2409, -3395, -3158, -1144, 1395, 3128, 3535, 2530, 152, -1983, -3370, -3433, -1635, 640, 2707, 3513, 2689, 864, -1842, -3300, -3506, -2014, 135, 2279, 3375, 2980, 1259, -1192, -2899, -3547, -2406, -369, 1986, 2976, 3173, 1684, -333, -2596, -3615, -2864, -837, 1122, 2825, 3332, 2369, -15, -2117, -3415, -3265, -1291, 782, 2925, 3618, 2663, 649, -1680, -3216, -3261, -1998, 280, 2512, 3421, 2799, 1009, -1020, -2924, -3352, -2434, -98, 1786, 3311, 3188, 1652, -548, -2524, -3320, -2694, -626, 1271, 3018, 3125, 1949, -78, -2262, -3399, -3046, -1200, 1054, 2655, 3456, 2378, 427, -1679, -3148, -3313, -1940, 330, 2457, 3290, 2731, 1026, -1232, -3077, -3156, -2345, -349, 2076, 2855, 3047, 1514, -655, -2460, -3407, -2468, -709, 1745, 3150, 3295]
4823C295j466k267j736j120K80J793K402J507P88j016k073k260j276O3J373K267
4839E54J959O74l06k158k385j132o15J396K030J977J321k86j445k465j872m87
4855c240J103J871K086J313K58j414k328j832j042M55J606K195J918J99r95j843
4871C10k636j049P15J268K215J533P13m84j845k361j472O7J004K335K043O95m38
4888B613j583k307j389o13J149J816K131J465l64j181k446j513q12P60J509K055
4904A290J476L37j361j725k038j197K13J811K035J721N88r50j664j996j478k4
4920b962J272J727K097J126o74j670k125j771k45J237J802J968J189j10j429j923
4936d91j818p00O51J951K003J055L99j112k203j828r86K87J818J889J856K01r02
$$ y = [3295, 1829, -438, -2174, -3294, -3014, -1221, 1181, 2688, 3476, 2460, 387, -1873, -3149, -3086, -1713, 554, 2513, 3187, 2881, 723, -1662, -2794, -3409, -2013, 17, 1994, 3315, 3029, 1584, -881, -2753, -3240, -2137, -266, 1820, 3133, 3391, 1977, -351, -2183, -3225, -2770, -1164, 1031, 2949, 3148, 2153, 310, -2326, -3375, -2660, -1392, 823, 2356, 3069, 2585, 740, -1621, -3093, -3026, -2022, 313, 2356, 3051, 2613, 1030, -1277, -2666, -3279, -2130, -314, 1817, 3282, 2918, 1737, -709, -2222, -3034, -2274, -765, 1290, 2766, 3103, 1742, 17, -2021, -3218, -3005, -1194, 841, 2562, 3150, 2200, 536, -1460, -2938, -2962, -1690, 37, 2134, 3260, 2586, 916, -1209, -2980, -3225, -1988, -186, 1782, 2971, 2861, 1432, -491, -2309, -3009, -2358, -407, 1596, 2651, 3050, 1938, -265, -2093, -3079, -2792, -974, 915, 2771, 2972, 2070]
4953B070j694k046j053j6J325J854J790Q99n36j844j930j339o35J268J981J670
4969A764J037J21j847k013j573p17R82J932J833J385n8j344j745k032p63N73J577
4986h88J903J472P96j272j945j699j046R8J145J991J562J011p09j593k310j091
5002b575k30J055K203J354J090n34j220j969j653l40N98J872K017J022R9j103
5018A686k098j844o01P18J519J716J497J75j015j592j952j109K61J287K129J725
5034B502P45r00j938j753j399O3J131J966J573J143n28k062j527j757L7Q34J679
5051a91K040Q97j81r60k019j652o25K67J955J926J162nq11j806j907q68L15J538
5069i25J786J624N15j142j662j729j382L88J034J783J930P59p93j405j917j453
$$ y = [2070, 376, -1670, -2723, -2739, -1414, 440, 2230, 3129, 2593, 749, -1181, -2520, -3155, -1887, 94, 1764, 2801, 2922, 1075, -938, -2511, -3228, -2246, -314, 1519, 2904, 2846, 1502, -243, -2275, -3038, -2465, -888, 1015, 2487, 3283, 2011, 66, -1633, -2679, -2581, -1436, 555, 2117, 3128, 2419, 826, -1484, -2575, -2805, -1750, 453, 1807, 2897, 2363, 1143, -826, -2479, -2819, -2221, -349, 1668, 2690, 2789, 1686, -412, -2256, -2857, -2139, -620, 1096, 2593, 2768, 1753, 161, -1791, -2900, -2639, -1352, 777, 2502, 3247, 2347, 409, -1344, -2743, -2680, -1549, 417, 1990, 3133, 2605, 543, -984, -2741, -2704, -1870, -191, 1849, 2746, 2565, 1605, -414, -2066, -2691, -2424, -469, 1457, 2619, 2614, 1803, -3, -1910, -2778, -2463, -925, 861, 2485, 3000, 1858, 196, -1533, -2915, -2527, -1493, 290, 2220, 2979, 2186, 781, -1136, -2589]
5085b589k93R70J838K106R75n26j171j993j634m48P56J508K081J117l1j415j654
5102d03j466p53J46J634J879J196N48q47j960j543j158J63J323J820J429Q42p62
5119B088j424j894j366j42J046J809J677R19j23j558j739j421o63Q55J401K092
5135A557R41p9j087j813j597n26L56J558J797J251L08r57j650j797j011M44J367
5152i38J678J407P05o92j741j835j214j47J305J624J689R41n66j281k008j409
5168b482l76J083J443K034O86j17p94j920j699m12K81J683J769J315J50r05j883
5185a44j584o87K81J125J798J611O1m29j894j472j061K07N41J901J567J020o55
5202B186j548j847j394j89R02J933J808M02J77j222j707j627q09J071J462J787
$$ y = [-2589, -2882, -1912, -74, 2032, 3007, 2481, 1310, -683, -2317, -2765, -2009, -501, 1580, 2697, 2666, 1251, -403, -1869, -2622, -2476, -842, 1037, 2233, 2781, 1934, -26, -1569, -2727, -2564, -1241, 579, 2008, 2850, 2088, 664, -1230, -2596, -2738, -1692, 117, 1794, 2713, 2590, 1032, -707, -2128, -2791, -1936, -535, 1557, 2498, 2419, 1332, -481, -2078, -2604, -2248, -690, 1107, 2358, 2666, 1709, 59, -1738, -2749, -2305, -938, 740, 2147, 2852, 2160, 419, -1416, -2630, -2777, -1472, 152, 1841, 2782, 2216, 935, -1073, -2482, -2858, -1775, -332, 1702, 2388, 2271, 1477, -443, -2142, -2554, -2273, -590, 1179, 2494, 2644, 1739, -144, -1728, -2415, -2134, -1009, 789, 2400, 2461, 2032, 138, -1334, -2395, -2188, -1647, 254, 1821, 2841, 2186, 638, -1209, -2603, -2792, -1890, 43, 1851, 2253, 2430, 1208, -499, -2126, -2935, -1864, -402, 1385]
5218A385P54M62j183j862j571m92L83J512J303J614M1o64j581j540r82n1J136
5235a336J520J864M49o51j252j757j143j59P17K008J527N27n3j384j588j541l29
5252b581Q31J493J536J141K7j208j733j272q99P75J047J781J396R6q64j832j342
5269a608q03L84R36J714J412K29m48j457j492j130n31J537J566J433N64l22j058
5286I26j879j124l04P06J630J739O58Kj321j343j564n30L74J523J684J044K25
5303B446r86j444j648q86L02J345J668J480J18n79j546j800o68j81J092J657J421
5320A791P02m37j422j463j220m97R42J417J699Q57l80q09j754j367m81K73J935
5337b14J660N24L98j154j476j334j013M33J290J595J407L27r52j439j384r85K40
$$ y = [1385, 2139, 2601, 1418, -444, -2015, -2507, -2124, -612, 691, 2305, 2346, 1682, 101, -1439, -2421, -2472, -1336, 184, 2048, 2497, 1846, 594, -1163, -2306, -2465, -1748, 260, 1787, 2314, 2261, 877, -711, -2252, -2581, -1750, -257, 1279, 2420, 2447, 1239, -494, -1766, -2665, -1890, -843, 938, 2334, 2430, 1566, -266, -1608, -2411, -2027, -1091, 623, 2035, 2264, 1816, 359, -1133, -2263, -2794, -1257, 309, 1742, 2306, 1984, 926, -953, -2077, -2381, -1675, -45, 1694, 2352, 2354, 1033, -310, -1874, -2404, -2030, -507, 1177, 2221, 2446, 1460, 16, -1632, -2518, -2216, -871, 797, 2277, 2395, 1816, 270, -1530, -2198, -2379, -1287, 370, 1791, 2493, 2056, 634, -829, -2049, -2546, -1604, -187, 1512, 2369, 1989, 1180, -574, -1941, -2422, -2149, -214, 1446, 1970, 2368, 1214, -262, -1596, -2609, -2176, -886, 709, 2116, 2443, 1491, 52, -1332, -2317, -2077]
5354b077P69J847R53J064p81j601j235j091O2N59J668J460R20m66j266j010j770
5371a995l18R24J023J837M31J45q43j332j567n24L11R01K026J055L14r82j392
5388A4j593o78L89P09J662J188N93o93j376j376q82j00Q23J483J184R44m27q12
5406A052j639j488j24P72J244J496Q42j0r38j640j399m00L94J262J688J195k55
5423B052q44j193j509q45K43J185J634J221M45o89j442j513r38m3J278J155J522
5440A719O36n85j286j211j291j69Q61J093J612N31J35q53j799j083p84O56J444
5457c74J361R59J43r18j200j828k11J37J161J392J282L98q55j405j368j038K80
5474b084J127J465J145O54n40j379j396j101J16O97J579J167M92j09r62j355j473
$$ y = [-2077, -1308, 539, 1492, 2556, 1775, 174, -1061, -2152, -2090, -1531, 137, 1597, 2517, 2051, 785, -225, -1995, -2313, -1389, -366, 1471, 1902, 2047, 1204, -128, -1695, -2219, -1908, -1007, 1019, 2074, 2388, 1406, 14, -1579, -2257, -1868, -1159, 503, 1691, 2284, 1591, 215, -1161, -2043, -2143, -1320, 163, 1347, 2291, 1864, 1052, -587, -2075, -2199, -1427, -183, 1313, 2155, 2145, 1207, -433, -1832, -2232, -1838, -576, 1112, 2307, 2052, 1208, 15, -1494, -2339, -2096, -911, 723, 1944, 2389, 1700, 258, -1255, -2193, -2236, -958, 197, 1719, 2355, 1770, 484, -727, -2018, -2187, -1326, -233, 1379, 1910, 2045, 1192, -607, -1690, -2474, -1818, -374, 987, 1946, 2089, 1171, -29, -1857, -2068, -1931, -770, 622, 1904, 2302, 1447, 42, -1326, -2364, -2084, -957, 508, 1653, 2307, 1767, 388, -1008, -2109, -1993, -1296, 283, 1450, 1942, 1833, 871, -484, -1957]
5491a957j60M40J587J112R63j3q78j490j295n01K04J558J363J001M21q69j093
5508C93j483j018J85J285J044J340K18l64j320j244j110j69J131J225J512L86
5524B011n2j540j200r17l98P36J310J321P64q9j227j023j405m35N69J055J648
5541A128R12j4o45j396j227q94L08R29J399J480l2m34j272j092q97o3P66J565
5559E21J046O71p14r75j389q84j53K55J316J651O67j80r34j519j037m15P35Q30
5577e08J497Q58J32j011j116j296n78L55R98J295R78M04n71j104j659o47JJ033
5595i39J315J085N12m34j053j276q34n4N38J245J268N39p1r58j346j353k62O40
5613a438J254J112J127k50p92j500r91l62L46Q78J331J184N2n02j405j423o40
$$ y = [-1957, -2117, -1677, -90, 1022, 1985, 1972, 1094, -396, -1691, -2192, -1988, -430, 933, 1934, 2355, 1486, 393, -1090, -2108, -1923, -638, 406, 1746, 1964, 1600, 280, -964, -2074, -2243, -1112, 113, 1625, 2011, 1959, 419, -781, -1698, -2096, -1360, -50, 1271, 2035, 1946, 719, -304, -1709, -2144, -1575, -520, 1128, 2040, 2026, 1381, -15, -1242, -2136, -1828, -899, 500, 1980, 1948, 1514, 242, -850, -1747, -1810, -1044, 521, 1567, 2238, 1524, 549, -840, -1724, -1877, -1622, -306, 1345, 2012, 1832, 898, -621, -1658, -2073, -1338, -508, 989, 1847, 1979, 968, -148, -1444, -2022, -1667, -669, 626, 1604, 2008, 1437, 333, -1326, -1973, -1972, -939, 376, 1461, 1973, 1539, 486, -790, -1624, -1678, -1140, 105, 1373, 1912, 1841, 883, -463, -1816, -2078, -1438, -184, 928, 2055, 1805, 1013, -487, -1478, -1840, -1494, -616, 715, 1899, 1951, 1449, 44, -1379, -2019]
5630b019L67Q80J376J180K92o68j108j277p35J3O24J352J027N34o6j183j121j258
5648a790k00P73J217J010Q78j09r73j071j306k51M08J018J153J156m2p50j354
5665b33j104l82J30R28J299R90J89m67j036j259p97p2R02J572P86M07k42j065
5683E46j451p89r6N13J403J135N08j66p59j068j091l29L55J226P14J113J8o94
5701A088j116j337o51L75J034J199R48L38l93j620r00o93l2P21J454J082K96m65
5719A328j045j227q12N8O30J105J322L49J24j269j274p94m50M03J526J029N41
5736A544O9o70j290q63n75K91J080J387Q05j38n07j322r99o21K74O31J361Q95
5754A352L88k72j425r05o29j07O24J122J182M12n38o49j476m92p0J04J357J094
$$ y = [-2019, -1652, -772, 604, 1784, 2076, 1408, 300, -977, -1712, -1699, -1075, 277, 1304, 1838, 1772, 589, -532, -1790, -1990, -1217, 0, 1010, 1888, 1779, 806, -265, -1571, -1822, -1414, -396, 757, 1913, 1871, 1121, -233, -1337, -1719, -1589, -661, 638, 1628, 1817, 1350, 314, -945, -1742, -1814, -912, 660, 1446, 1853, 1611, 546, -905, -1694, -1790, -1277, 126, 1261, 1769, 1603, 844, -224, -1315, -1644, -1289, -63, 651, 1764, 1782, 1088, -28, -1365, -2016, -1641, -607, 592, 1540, 1878, 1485, -135, -1035, -1728, -1760, -1039, 415, 1497, 1793, 1328, 283, -944, -1756, -1698, -1068, 37, 1359, 1708, 1832, 563, -711, -1505, -1955, -1552, -26, 1003, 1544, 1613, 943, -347, -1210, -1785, -1494, -414, 973, 1778, 1640, 1133, -189, -1188, -1809, -1535, -904, 457, 1352, 1740, 1468, 43, -862, -1491, -1598, -974, 148, 1330, 1742, 1204, 555, -921, -1413, -1483, -1379, -22, 1072]
5772A072O42L5p67j176r86n97N01Q09J534M45K03o33j217j174l73J75J099J001
5790E93Q63M63q23q16j108j125L21Q22J098R71O15l52j163j166q99K08K18J497
5808B17R22O19j07r51j256j080k36N46J167P85P37J65o06j038j122l04K33Q94
5826d15R91J012P4n61j137q95n55J33P29J068Q68J63k86r20q00j230K02L42J423
5845B06P62Q12n46o94r53p83m66O47J418M31Q71l08n76j191p59l59L19O84R32
5864D47Q62M34n87j197p23r11L60N97J172Q10K67n26p37r26r45L20M28J262Q76
5883A283K68k69j068r48p79m9N46R57P75R14k39q93p79q72k27O75N51Q44Q31J31
5903A652o09j251p56p16L77R01P89Q60M31r14n66r33r31J89Q63O74R98M32k53
$$ y = [1072, 1714, 1749, 982, -194, -1180, -1777, -1276, -467, 1067, 1512, 1715, 1082, -135, -1309, -1682, -1507, -408, 593, 1456, 1919, 1096, 280, -828, -1953, -1632, -810, 288, 1259, 1874, 1522, 359, -807, -1706, -1498, -1280, 217, 1139, 1758, 1651, 700, -556, -1636, -1872, -1326, -159, 626, 1363, 1528, 922, -116, -1238, -1542, -1309, -415, 576, 1588, 1662, 1101, -36, -931, -1486, -1353, -624, 444, 1312, 1475, 1189, 269, -531, -1761, -1559, -1217, 206, 968, 1780, 1234, 540, -413, -1196, -1662, -1015, 403, 834, 1705, 1397, 821, -370, -1129, -1488, -1169, -485, 447, 1309, 1743, 1156, -41, -764, -1675, -1315, -718, 454, 1264, 1531, 1005, 268, -658, -1603, -1283, -855, 407, 1283, 1551, 1282, 214, -734, -1513, -1562, -1016, -59, 716, 1630, 1391, 498, -281, -1153, -1380, -705, -154, 690, 1521, 1652, 1043, -208, -964, -1680, -1303, -402, 387, 1247, 1678, 764, 198, -735, -1666, -1477, -614, 60, 1058, 1490, 1237]
5922A237r13r83r23K2M32R31J313L63l34m71j140o13m08K49J126P54O65J22n80
5941H49j109o66p48M79O33J127O79J62m69r31r33o44J16P34J156R78N6k96o09
5960E64j134q77m9Q89O65J067M77l44n92r53q00k64L13J043J158J47J52q73r26
5979c37o32j38J49P47P49P32J17n39q35r65m39J87O41O91J164J94n55p69r57p45
5999a540J07O52P74Q38Q42m73p81p44p25l85L51J118R20M16p2o43j071p28k23
6018a367J91Q05J158M93j58m55m79j107l73J7P25J006O38J97n16p33q04n57M3
6037a276P30R19O41K91q9r44r49m16k57M32N65J265N47l09r33o92o50m06P63M45
6057c23J155M52Pn67q21o97m14R4P25J039L04J79k43p91r16o01K92N18R90Q83
$$ y = [1237, 324, -659, -1582, -1560, -1128, -197, 1116, 1479, 1145, 674, -466, -1079, -1487, -1238, -112, 642, 1307, 1429, 849, -260, -926, -1674, -1195, -562, 565, 1244, 1406, 937, 6, -927, -1571, -1455, -721, 435, 1413, 1469, 1173, 564, -570, -1447, -1496, -607, 58, 1125, 1602, 1258, 666, -287, -1087, -1351, -1038, 5, 1163, 1310, 1462, 589, -337, -969, -1107, -958, -211, 538, 1270, 1387, 848, 13, -952, -1391, -1204, -563, 128, 1292, 1486, 931, 162, -795, -1540, -1433, -781, -7, 831, 1673, 1200, 419, -325, -1050, -1435, -1084, 34, 954, 1370, 1298, 655, -416, -1144, -1367, -1176, -371, 787, 1280, 1122, 667, 188, -919, -1292, -1275, -550, 456, 1094, 1291, 775, 42, -762, -1319, -1276, -546, 373, 1014, 1305, 1216, 272, -677, -1093, -1350, -918, -353, 912, 1459, 1150, 217, -475, -1125, -1531, -768, -323, 832, 1284, 1291, 724, -97, -794, -1208, -1114, -389, 650, 954, 1133, 890, 99, -817, -1418, -1126, -608, 382, 1265]
6077A265j38m0o63j100p29M55j0J191O53M71m43o52n97q29k92N82Q86Q74L97j29
6097A152o01p30q11l58O03L45R70M35J71l50j068p44k45K33L66J206P73l76j55
6116H16n53q77l79k68O53O62Q41M05k36q64q08m48m3J32J093O97O04l09p58n40
6136a80j013k07N16O92Q57N51r2m49n98q80m91L28N53Q61M28L58m00p65o65l65
6156i61k83P87O38P73L46k79o77q60p12j7L90O22J051M22k22n08j075o67J82L08
6176g42Q77N41K92K4l46r70l74m52J36Q21N93P90k16k22p43q15m46R7N50R03P46
6197A044O3k35o71r42m20N2N44Q92M86M40m24p16k86q90j07L15Q80P34L83k82
6217H60l92m81q78m68L25Q40P29L95O8k97n82j204M3J94K07O83R48J95o49m68
$$ y = [1265, 1127, 1087, 424, -676, -1405, -950, -960, 231, 884, 1355, 912, 260, -337, -1166, -1458, -876, 10, 884, 1281, 1152, 551, -179, -990, -1348, -745, -400, 570, 1005, 1176, 826, -242, -986, -1231, -998, -632, 574, 1347, 971, 816, 263, -614, -993, -1261, -608, 54, 895, 1300, 1064, 200, -608, -1056, -1099, -967, 126, 823, 1427, 1118, 360, -180, -1193, -1400, -884, -192, 665, 1216, 1124, 675, 77, -803, -1294, -966, -413, 448, 876, 1234, 834, 69, -596, -961, -1244, -457, 181, 954, 1300, 1021, 344, -516, -1228, -1245, -855, -233, 818, 1240, 1018, 510, -565, -1232, -1050, -742, 135, 676, 968, 992, 646, -324, -698, -1150, -1014, -193, 400, 1190, 974, 752, 9, -806, -1252, -1155, -605, 298, 1044, 1107, 872, 201, -741, -1161, -1109, -565, 327, 813, 1253, 829, 113, -173, -1063, -1170, -855, 25, 759, 1142, 860, 468, -13, -891, -1359, -1034, -194, 535, 930, 998, 701, 119, -1085, -1042, -848, -641, 42, 990, 1185, 536, 68]
6237F8o50l67J07N14N93M99L49l2n30r43l83l45J66R60N56Q00l49o65m13r34k45
6258a244N43N35P41M60O6k43j062l35o93M59J93Q26O55N6j01q59p14l95K03N50
6278c59N38M37L82l78k30r77j25k40M33M64Q68J44j47k51q47o84k99L50O24Q98
6298F01K11K28m18r13o27j74K65N68N30N26K93m54p35o44j55K0M78Q84M50N0j08
6319H76p12n91n13L00J44N30Q25J38j21n18o91l60J3J49N92L84O61j41q26k11
6339g2o38j85K15L78O20N45J52m31n58o07l68M9O01O01L86K89k51l43j022l64
6359a003K63L70K88P05M25k82l69r07m54Q8L63L66Q38P2J28o49m77n18J5R3N18
6380a27N07M83j32k6j027l87J07j57O50M24M50J04j99p18m37k62j63M81N93P31
$$ y = [68, -582, -949, -842, -328, 265, 764, 1113, 1081, 551, -392, -775, -1120, -954, 6, 562, 1362, 1013, 348, -65, -999, -1244, -701, -166, 575, 1035, 1101, 858, -204, -539, -1232, -773, -580, 246, 901, 957, 856, -3, -717, -1112, -909, -359, 179, 616, 998, 620, 390, -587, -712, -952, -519, -55, 813, 957, 810, 559, -288, -972, -1271, -921, -297, 601, 812, 1040, 622, -291, -918, -1092, -827, -259, 271, 797, 1090, 636, -99, -743, -898, -878, -400, 484, 934, 984, 876, 164, -427, -940, -640, -496, 34, 859, 997, 876, 358, -333, -693, -680, -531, 61, 445, 1106, 965, 139, -72, -710, -895, -680, -302, 318, 863, 1015, 584, 26, -581, -949, -900, -299, 302, 688, 977, 726, 383, -639, -1003, -740, -370, -82, 623, 1048, 766, 397, -510, -964, -876, -513, -147, 691, 763, 891, 242, -235, -753, -738, -645, -127, 380, 863, 731, 705, -322, -709, -602, -759, -109, 315, 765, 869, 670, -48, -485, -747, -910, -429, 164, 895]
6400H95J14k55m68p61m45M8K21P56N47K12j37l72o16k10l45K38K41R42L50k17
6420G38j18q71j57m67L23J22N25Q12r0j12m41q85l55J01O26L35O66N9k55l14p14
6441d72l85l4M17P27L70K25j16p59j70l89j71P7N97M51O32l74o0q94l98k39L15
6462f50N01L25O14J1k52o64n32j65K1Q19L75K15L68n33l43m76m67j4K63N65O75
6483F56N9J84n48p47m10M4K19K95O91K41L25o54m76n30l32J99N84M81K90J89k27
6504E33o36o18j41L02J74N28K99K61n2n62o87q7K2L63J28O07M41l70o05k32m27
6525g59J57J6O60M35M5P7m30m40o79K42J66K86N56L20J0l02m37m77k06L76K14
6546a70K85O62k00l00k98m93k77J44K10P88N3M68l16l69n55k84o4M86M1P35Kj02
$$ y = [895, 1009, 754, 286, -475, -920, -872, -651, 105, 652, 864, 727, 355, -261, -471, -816, -578, -337, 605, 955, 738, 620, -251, -408, -875, -552, -430, 95, 907, 817, 705, 264, -621, -976, -875, -249, 86, 752, 811, 556, 242, -472, -857, -891, -474, 253, 623, 848, 732, -27, -197, -586, -757, -680, -83, 368, 1000, 626, 566, -328, -726, -965, -650, -149, 176, 790, 801, 549, -115, -647, -812, -791, 28, 403, 618, 986, 453, 110, -366, -833, -847, -584, -19, 656, 715, 899, 351, -396, -806, -762, -543, -248, 443, 684, 1009, 355, -121, -651, -983, -784, -200, 281, 571, 760, 533, -103, -721, -862, -560, -386, 142, 441, 702, 650, 88, -599, -686, -664, -301, -173, 434, 875, 505, -100, -332, -759, -602, -586, 74, 509, 554, 631, 201, -239, -918, -676, -510, -224, 332, 652, 662, 360, -77, -554, -760, -384, -170, 115, 777, 577, 277, -21, -514, -791, -647, -437, 351, 404, 872, 556, 187, -368, -652, -716, -230, -189, 546, 548, 446]
6568D46j91m67k79p9L14L51L77L25k91j97l17n99Q9j54O64J76M97j67k0l09l71
6589b02n67J36K74M83M17L19n81k05l15l79R1J98M42K75L84q3o56k31l50j47L30
6610c67K16N00K05j00k71k50m44o2J89L11M91J10j94n9l48m63k50J95L95M25J53
6631C82J04k75q1m82k05j05K92M42k5M15Q2n25n42k57K04L25M67J56J19ml89j48
6653e0n50J86L9K87L71N17o34R0m85k70j85K46M66K54J27J33k83k91n07p6m6M52
6675b09K08N01j42K03m69l34n06L47J31M60J22K48r0m02m34%k18M57K02J81K78
6696E34k2l15k59m51k83M87n2N88M75l45k77R7m71j04j34N67K77K44o8L2n51k85
6718c16o3p2qN27J35J27J76n64k56k34O2J70M02M61j46p2j2q10J04j30P6J48N05
$$ y = [446, 255, -212, -491, -570, -256, 95, 472, 797, 506, 309, -8, -607, -518, -672, -8, 168, 665, 498, 478, 169, -202, -769, -633, -359, 124, 541, 860, 279, 74, -241, -620, -529, -331, 111, 386, 770, 687, 31, -200, -550, -697, -367, -151, 349, 554, 454, 183, -67, -511, -573, -384, -73, 418, 528, 334, 275, -73, -536, -786, -591, -196, 229, 382, 486, 211, 130, -352, -557, -662, -370, 72, 47, 462, 544, 19, -523, -780, -576, -251, 216, 372, 491, 487, 98, -50, -600, -414, -375, -88, 283, 800, 166, 256, -229, -499, -684, -438, 28, 282, 409, 542, 259, -32, -539, -615, -661, -209, -1, 500, 358, 561, 92, -242, -748, -401, -270, 190, 312, 560, 470, 68, -366, -366, -584, -127, 75, 256, 534, 512, 197, -62, -513, -796, -309, -361, 227, 702, 357, 80, 177, -294, -398, -532, 35, 312, 556, 488, 520, -31, -316, -379, -451, -459, 68, 203, 330, 506, -58, -314, -548, -486, -316, 86, 547, 401, 329, 317, -493, -389, -519, -443, -295, 210]
6741B10M64k9j86n00o70L60j66L4N51M19M2l22k46j65k78j88N29r2N23J18k43
6762A65om36k86j03O07J65L32K34j27l04m09k02j79K28K70J64O41k68k01l32l82
6783d29n3R5J96M34K82j56k21q3l74j61J27K05J26N58j53K3l66k48q6q5K2N02
6805A55j53M36l09j98Rl90N1j73N38J42M65k13j0n48mj36J73J87J43R0L17l22
6827B50j48m33o5K94q0L68J72J74k98m9l24k77J85o6N80q0J45nl59j79M2j99M48
6850I6q8K26L45l44j46r1m30pK93K42J09R1j29J18l85l21j76L62K67J11J10M23
6872F76l13m02j07j05Q6K33m8L71M1k97l33m3j46J11N8L99J87L72l47m39j22l72
6894e40L71J9L88m3J13J8k43j43j88k99Q4L08L83j4L13j25o16j9K4k04J46L97
$$ y = [210, 674, 645, 459, -41, -711, -351, -517, -483, 68, 487, 529, 207, -39, -204, -482, -670, -141, -233, 290, 408, 165, 159, -277, -563, -666, -59, 106, 438, 672, 545, 241, -168, -370, -549, -321, -51, 113, 754, 486, 285, -47, -429, -482, -387, -191, 243, 525, 369, 148, 65, -309, -470, -343, -138, -12, 546, 393, 416, 50, -198, -284, -369, -347, 155, 2, 438, 129, -69, -60, -450, -399, -572, -34, 108, 573, 360, 350, -198, -202, -338, -165, 22, 165, 255, 572, 250, 102, -331, -396, -102, -182, 186, 358, 532, 234, 185, -139, -416, -231, -297, 283, 203, 348, 343, -16, -195, -153, -352, 96, 8, 234, 579, 235, 89, -2, -432, -439, -146, 96, 205, 296, 167, 285, -100, -421, -597, -235, 32, 143, 253, 676, 363, -39, -146, -251, -165, 68, 20, 391, 432, 135, -198, -241, -387, -276, -218, 181, 368, 740, 393, -46, -168, -540, -169, -150, 238, 195, 308, 326, 83, -60, -248, -547, -463, -155, 228, 214, 527, 402, -214, -233, -209, -413, -267, 130]
6916A30l4L7K00k90j07l37J4j14N88J82J25k42J16m65j48K33J2R6L02L8n4m6n00
6939b64J78o2j06J78L33o2R2j88q2l26K7K1K56M6K12l8k31p6l17L4J74K69k01
6962a33L55Q8k71J01m46l4kM8L30K04j89L50n88J25n41K60o3L07Q9K63O1m4l16
6985d6k96M80k44P9J47K50l40lj24j82k88L68QL61j5Q4j03j57j07j91k1J69J97
7008B6J77J91k45k05k46Q4q9J41K52J75k55K22P3l96q7j76lJ65J71K36j96L82
7030C97n88j38J75q6J61j41M70J50k25j48m52M66k25J74J06K80o4k72j6J44m80
7051c12Q4J52K27j37J85Nj65k82Q7Q6p8J89M2J46r8L6l01kj4k11LN30J9N4k97
7076e2M3j25r6L33J4m4m1J81q0k73j76M2J6K02QL55k2k64O8m2k07M3J76j92M41
$$ y = [130, 96, 133, 333, 43, -64, -401, -387, -501, 87, 269, 394, 152, 268, -197, -345, -112, -100, -4, 298, 336, 282, 236, -264, -86, -148, -254, -76, 257, 195, 287, 99, 17, -309, -282, -261, -5, 41, 253, 215, -16, -92, -409, -375, -201, 68, -133, 222, 310, 39, 140, -306, -340, -342, -294, 36, 240, 51, 401, -187, -62, -603, -343, -406, -99, -10, 253, 314, 270, -46, -342, 138, -106, -27, 120, 370, 30, 27, -97, -279, -567, -199, -191, 170, 155, 239, 136, -21, -128, -319, -340, -171, 26, 203, 394, 149, -56, -302, -218, -307, -166, 86, 261, 6, 228, 301, -95, -182, -358, -361, -196, -25, 211, 15, 397, -191, -329, -154, -240, -79, -220, 250, 400, 175, 27, -425, 41, -184, -10, 96, 376, 312, 40, 24, 168, -312, -228, -76, 151, 14, 199, 204, 39, -243, -156, -70, -148, 41, 83, 229, 131, 167, -134, -136, -150, -361, -358, 172, 191, 245, -52, -9, -134, -230, 103, 117, 73, 32, 213, 133, -140, -316, -274, -258, -56, -48, 307, 285, 21, 89, 47, -160, -117, 59, -133, 308]
7101C08k0k60m5Lk14l2j20L13J86J02L6J4l69L8j77J69L5R0QK52l41J10l58M04
7125A32q8j90K63j35jqP8k46K1k5NK99k42L56L1k30l26o1L95o2J44j27L60j7j23
7150B03j57j87k86L92J01Q8k6l23L89J0q6m28J04K48J63j15J89J6k05l51Q0N6
7172a25o6pJ98K15j10Kj85n5q5K93j41M23j30j21R5j92j25L8K54q3J91k98o4l
7196h1r8J72j57J8p2K16k5N8r0n8N7q6J16J16k6K32p3m70J95j22j25M29r1j17
7220h2L94m11K16j83O0m9P8J9J01Q6k56J17j37N4m0o8O4j18L96Q8k28l1q4K3k44
7245b35K42P8j92L08l3k09L6J65k60K47j84L57m7j40j06l94L27k36K42O2P8j50
7267d4mK5K36m29L75j60p1j74M32Kj50mk47L03M8j64P7k45K81K3j8k89qJ78j3
$$ y = [308, 288, 28, -17, -14, -228, -260, -380, -67, 119, 221, 257, 271, -98, -60, -237, -68, -33, 57, 65, 317, -24, 86, -272, 132, 44, -146, 117, -18, -19, -27, 51, -195, -174, -199, -194, 105, -137, 219, 250, 20, -306, -367, 28, -34, 110, -17, 343, 326, 203, 46, -141, -427, -35, 66, 154, 128, -195, 194, 204, 118, -310, -206, 42, 205, 90, 279, 295, 90, -261, -181, -125, -191, -198, 0, 215, 105, 107, -78, -133, -218, 75, -66, 357, 227, 106, 201, 9, -116, -78, 176, 93, 284, -14, -78, -81, -179, -7, -164, -146, -218, -2, -27, 31, -59, -117, -60, -146, -30, 86, 60, 292, 219, -251, -56, -178, -303, 126, 35, -82, 312, -99, 117, -66, -6, -55, 23, 42, 143, 229, -27, 90, -47, 7, -33, -101, -37, -155, 241, 329, 101, 70, -14, 9, -235, 7, 85, -107, 201, 168, -41, -5, 160, -100, 147, -37, 320, 273, 133, 27, -367, -40, -276, -34, 28, 106, -44, -48, -23, 213, -216, 159, -1, -72, -246, 186, 188, 38, 34, -213, 90, 138, -26, 51, -194, 87, 110, 92, -197, -205, -27, -40]
7292d0l0L2j1NJ38m26K71n4P2J56j24mM2J87k85K1J6j3j08K82j99K86l95K33k00
7317a48k54L96K57q5j13pj01K84l31rJ47J68M1J18l46J52k34q0o1l3J88L08k47
7340A0J55m8k47J86l38J38K12j4k22K27m12R1K63l3j35M6K15j52K43l73J18k35
7362c05R3J68J95J43k12J41j42l4J22j34j36J22P2j63K67j76k04R4J84j49k42
7383b96K27L51R4m21K6j7pJ68j35M2O0m46M56j7j92l7L1r7Q7K47j15J2M2j15L7
7408a5m7n4j8J88l2J87j92J79j52k04J17P9N3J54k33O3j16l52L06l02L56J66j78
7431d7L88l12n5N2j34j64K93j6k6K19J00k60j74L2J00j06J39m7J26o7k0j70k57
7454d06J27J88J78N6l6J07j23k01n6L4k33K03M40q6J00k38Q7m47R6P1J8Q4L25
$$ y = [-40, -70, -38, -49, -44, 94, -332, -61, -115, -43, 113, -11, -15, 27, 214, -71, -50, -34, -47, -155, 127, -72, 214, -181, 52, -148, -402, -6, 251, 166, 53, 46, -55, 229, -102, -111, 36, 204, 245, 363, 17, 169, -65, -145, -206, -239, -51, 257, 10, 165, 117, -130, 56, -282, -144, 68, 54, -168, 59, -353, -262, 1, -32, -167, -121, 94, -58, 185, -188, -70, -305, -212, -44, 151, 294, 82, 223, 81, 47, 169, 35, -101, 21, 93, -70, 197, 21, -183, -89, 95, -54, -296, -69, 282, 376, -45, -19, -36, -43, 125, -10, 32, 92, -354, 102, 85, -107, -144, -113, -210, -123, 124, 9, 21, 63, -52, -15, -62, -116, -134, 54, 22, 209, 17, 196, 44, -160, -43, 36, 89, 243, 10, 73, -43, -395, -89, -391, -35, 131, -47, 341, 29, -26, 26, -108, -272, 21, 5, -21, 198, 298, 38, -136, -104, -4, -110, 29, -18, 108, 41, 21, -149, -406, -279, -91, 87, 143, 107, 214, 91, -110, -166, -132, -365, -162, 278, 192, 292, 54, 141, -306, -210, -139, -121, -37, 288]
7477B88k80P8n4L4l02J69J54J68o4k01Q3P9l30m1J71j52K30R2j13K31k13j48m6
7500a67l17K69K91K86n33J48R9l04J04k12L91j16K14MJ2p5j59k02j17L20J08N2
7522I6K1J69o3k42k22LL5J88J4J38k37K12l52J64j29L5J41L03k04p2N9r0J2m1
7546f2p0J34l32M40jk80N15l79K0j06N1K14o1K25j72k0l34M7J07m8r9L83J13k37
7570D8K04k15ok23k77N46Pj63Q6K27l86M5l70J86M53k87J34%J79k30rM1L6o8k0
7595f2J35k61K61Jk63J50K3j4J3J7Q4q1M2L8j99k5J02j48J14J05K27k11k32N3
7619a31m4k8J48J7L01j90K43m29J29m5l59L91J6n4K75J65l67l3m2M0k24J02J69
7642E0K40J33l61J72m98K74k25M1K78K43j76k73j16J43j08j26L9K90J49J10j93
$$ y = [288, 8, 86, 32, 66, -236, -67, 87, 255, 191, -10, 73, 152, -178, -219, -48, -200, 30, 122, 9, 240, 27, -121, -167, -484, -215, 76, 362, -171, -23, 76, -228, -124, -336, 55, -61, 153, 157, 169, 94, -65, -267, -384, -64, 44, 96, 117, 286, 223, -19, -241, -238, -203, -15, -1, 137, -100, 112, -240, -76, -205, -170, -29, 274, 70, -2, 57, -33, -21, -62, -132, 2, -330, 110, 109, -171, 344, -35, -15, -121, -70, 144, 83, 308, 136, 116, -218, -171, -64, -112, -211, 172, 285, 48, 252, 37, 31, -192, -469, 77, 84, -79, 7, 234, -152, -107, -477, -291, 162, -125, 9, 9, 188, -42, -51, -10, 26, -42, -62, 73, -188, 73, 74, -189, -39, -16, -30, -17, 0, 84, 3, 45, 83, -116, -141, -39, -187, -73, 32, 259, 48, -184, -131, -175, -203, -55, -38, 263, 73, 316, -113, 16, -29, -388, 3, 19, -35, 240, 405, 38, 5, -37, 3, -221, -119, 50, 290, 423, 62, 234, -264, 10, -215, -174, 104, 347, 171, -102, -218, -75, -183, -309, -270, 20, 169, 279, 86]
7663H6j57L2Kk12j65N10J06o0p4j5k23j7j71J38M62j66J87k34J60j87l30L16q5
7686i7P3P1J12o1j76J63l80K16J42q7nK52j19K19l85l21J70J7P1J67J01m0%j25
7710b2k47J19k73J46M15p3K42J1j65l37k35K5J02L14K62J36r1l25j42Kj99M3J00
7733a92L22N9J64J48p84J70k57J70k12M29J20O3k90K11j11j22N7p6K46j6J41j0
7755B30o5o0n27J20N9L85j18K51m4j31j52m76J53L26j1K50J96r1qk32k61j05O5
7778b46K22j09N66j76J75m43k66J41j64M15J4N0r3O3p4l10p9K28l86K76L90K12
7800D06j24J16m14r9j76j13L84K4L83o2k88N6k92k5n5M28o2J97q2j32J60n52N6
7823b66P3J50n8K05Q1N1L3k57l93k34L84J71J51K14j01Qm03j57P4N7K52R7J56
$$ y = [86, -71, -39, -37, -249, -414, 96, 202, 142, 68, 53, -170, -187, -358, -220, 242, 76, 263, 29, 189, 2, -328, -12, -97, -24, 47, 159, 98, -78, 85, -295, -79, 63, -24, -29, 223, 104, 323, -62, -383, -213, -196, -125, 42, 143, 103, 103, -22, -269, -150, -423, -277, 138, 65, 307, 318, 153, -184, -419, -394, -292, 22, 284, 420, 329, 4, -138, -136, -335, -292, -192, 130, 189, 353, 501, -283, -113, -370, -200, -412, 17, 137, 200, -90, 121, 10, -112, -55, -131, 115, 99, 240, 230, 165, 105, -422, -302, -243, 142, 24, 275, 231, 100, -52, -528, -375, -49, -60, 190, 386, 295, 287, 55, -206, -311, -246, -24, -133, 433, 257, 432, -11, -277, -136, -300, 115, 129, 179, 86, 149, 75, -235, -314, -86, -472, -196, 194, 406, 282, 398, -16, -115, -291, -404, -20, 4, 387, 325, 37, 93, -199, -224, -279, 149, 87, 284, 202, 70, 230, -322, -266, -193, -43, -101, 104, 185, 236, 269, 12, -381, -615, -231, -60, 91, 305, 204, 212, -191, -348, -274, -217, 35, 132, 288]
7846B88J62j13n06M8m02J97L01M35j1M7k55m48K00k04L8K77j8O8M02m27p7k07
7868b05j44R1Q1M00J17P6j97j38k66j73K80j04K7L53m2J33j75l10J51m22K45J75
7890d7J88K37r4l9k26k22j65q6K42M13J9K38k91k88l7k42Q4J2L57L40J01j98j06
7913A90j97l03J1j9M70L16N6k69j01m25k58L42k18N49J12j14M8j54O5n47M5J42
7935b59p0M55K76R3k82k42m13R9q8K95K09K03K93k94n1m03m42L86L0J24J02N17
7957E38l09R1l76m45K49j03K08N34L6l09j65M0m18k35M26K98J75J58K2l60r2j85
7979b22k78J41N6L62J20Q5p9J29n38j68K42j25K07L33L5rn7l69k81J09J41L43
8001A77nK39l50j39j62l18J14L04o7K92K07O1K1n15o5j77l1L72K56K32J42m55
$$ y = [288, 450, 337, -169, -121, -523, -326, -25, 410, 399, 446, 191, -257, -57, -261, -223, 54, 36, 104, 506, 79, 2, -205, -349, -258, -177, 223, 340, 416, 219, 81, -185, -358, -78, -182, -155, 198, 156, 289, 114, -196, -45, -467, -222, -47, 141, 378, 284, 245, 19, -203, -368, -454, -212, 201, 220, 458, 167, -121, -158, -400, -316, -304, 53, 393, 494, 296, 190, -7, -310, -299, -318, 152, 468, 524, 255, 154, -271, -529, -187, -405, 144, 256, 142, 190, 36, 101, -446, -401, -259, -329, 126, 402, 495, 213, -29, -442, -343, -431, -136, 73, 276, 569, 275, 224, -179, -621, -235, -205, -81, 21, 538, 229, 320, -56, -501, -252, -355, -147, 387, 423, 114, -51, -11, -429, -664, -238, 60, 235, 393, 415, 55, -37, -222, -500, -359, -303, 59, 179, 264, 185, 314, -224, -392, -150, -275, -68, 265, 300, 291, 234, -135, -416, -307, -166, 177, 172, 411, 61, -78, -240, -558, -444, -140, -207, 85, 292, 353, 374, -141, -206, -383, -414, -42, 214, 446, 588, 133]
8023A33L3k16l84J04J12K84L35Q5j61k76j45k88j60K93N52M5J27j38j88k59l99
8044e11l0K71K19J86J36J32q8m44l83q0J63L04L40L66m7k15m48k46j30J77N7K09
8066f2M48K49m18J02p24J20J7J39L05J45J60j16m35k02k50N2j0M51L59l0J41l00
8088A41m44j70J01J38K81J79J90m6m44j68q4j72L02LO14R5o2k61j79o16M69k20
8110c53R7M59K78P4J58m92k53l67J01J67J93M59q5J06n42k07k97J64J96j0N97
8131D43R7j27l08m67J73m6k27O29K88J9K1p6m49k59m7k00L41O84p4p5J74o08k78
8154c72k99K06K76K26N78p7k75O9n33j38k14M42j20N53J7R6j52l46j9m09J31K36
8176a24M01J73N6l39k94q9j88K46R5J58J73q5J9j28l11
$$ y = [133, 166, -50, -434, -330, -218, 66, 401, 486, 325, 49, -96, -384, -544, -251, 301, 346, 473, 335, 147, -112, -511, -541, -270, -51, 135, 271, 403, 315, -129, -512, -592, -429, -125, 215, 581, 534, 319, -129, -375, -505, -328, -271, -62, 386, 635, 217, 319, -405, -285, -268, -129, 176, 321, 481, 365, -70, -272, -522, -470, -480, -29, 330, 300, 441, 141, -303, -473, -372, -234, 47, 226, 416, 370, -74, -242, -326, -498, -196, -193, 421, 516, 454, 193, 14, -602, -133, -353, -256, 203, 481, 555, 713, 221, -32, -399, -298, -131, 62, 521, 436, 542, 0, -207, -504, -340, -144, -154, 443, 540, 413, 105, -362, -189, -235, -462, 167, 455, 474, 495, 419, -30, -289, -336, -536, -195, 489, 415, 340, 514, -94, -372, -671, -465, -189, 37, 615, 538, 263, 332, -201, -339, -553, -111, -231, 322, 339, 435, 283, -63, -82, -491, -360, -124, 277, 450, 506, 167, -127, -216, -404, -158, -63, 95, 268, 183, 202, 74, -237]
8191b37
$$ Imaginary data points
##PAGE= N=2
##DATA TABLE= (X++(I..I)), XYDATA
0@%%%%%%%%%qJ6j6J7k5M0m8N6p2Q1r7J20j39J65j95K34k74L14l68M25m87N59o37
32c39P26q23R29j048J177j324J482j651J840k045K271k518K786l080L401l754
48a970M138m557N021n530O096o725P425q216R111j0134J1314j2697J4352j6360
62h732J8865k2093K6426l2600M2165n9149R8499l63535j68664N51561K90523K59154
74F32420l9990l07190n02226k98657q7752J41819L19728M57603K82988j2248k61338
85C25157l50851l86964k20094R2902L60705L89275K96886R5713j78256l97518
95B6955l80536k05509L2781K51524L81449L27974J32210j20730l11897l67067
105b32846k61613n1277J92656L58506L55043J81361n9255k65803l63475l04839
$$ y = [0, 0, 0, 0, 0, 0, 0, 0, 0, 0, -8, 8, -8, 9, -16, 24, -24, 32, -40, 41, -56, 64, -75, 90, -105, 129, -145, 169, -199, 226, -261, 298, -339, 387, -436, 493, -555, 622, -702, 780, -871, 969, -1076, 1195, -1323, 1463, -1617, 1784, -1970, 2168, -2389, 2632, -2898, 3198, -3527, 3898, -4318, 4793, -5341, 5973, -6724, 7628, -8732, 10133, -11960, 14466, -18134, 24031, -35118, 63381, -300154, -468818, 82743, 373266, 632420, 592430, 285240, -216986, -515643, -603395, -461576, -141848, 315755, 598743, 586495, 325157, -25694, -412658, -632752, -539850, -179145, 210130, 507016, 602729, 424473, 26955, -353581, -559090, -526309, -274785, 106664, 434638, 566848, 446118, 134221, -232846, -494459, -545736, -353080, 5426, 360469, 541830, 482575, 216772, -146703, -451542]
115d51542r2750J63003L20033L28330K19720J3022k24518l48665k90668j30091
125d94126O4867K61268L55390K58911M4799j58017k97639l30092k00724M0645
135d54718K44586L19507K68554J10734j11975k88892l16217k00548j9205J69300
145b78874L01043K95549J42493o3280k28423l04646k52907p5488J40566K81147
155d2820K93799J82369r528k02314l01735k58656j01225R1182K40236K88965K10238
166C90511L1366j55768k66721k66243j53755L6378K11738K85626K32373P9059
176D24564j10326k53021k79149j77461L194J74586K67195K45031J12550p1611
186C35552k17758k63742k01097m9436J28953K48170K53600J50647j9766j84825
$$ y = [-451542, -544292, -381289, -61256, 267074, 486794, 499816, 275298, -73367, -364035, -494126, -429259, -167991, 187399, 446310, 491109, 333092, 35453, -294639, -495363, -454718, -210132, 109375, 377929, 488663, 376688, 87796, -228421, -428969, -448174, -278874, 22169, 317718, 460211, 396931, 168508, -136138, -389045, -464533, -323967, -42820, 250979, 433348, 423820, 221506, -80229, -338885, -440110, -348928, -108692, 180273, 390511, 421877, 266109, -612, -266855, -420610, -384232, -172494, 113132, 345505, 424564, 314238, 61217, -217932, -395393, -392199, -217613, 49582, 294613, 407163, 335552, 117794, -145948, -347045, -396481, -267528, -19358, 234242, 384889, 365123, 180298]
196A80298k65568k25043q5031R2600K26980K57982J74695J4168j50757k45735
206b5411k32130j17876M9149J93464K49919J97200N9776j07751k27633k43083
216b04376j51007O140J63774K47392K17187Q9571p3602k04423k43864j73609k6033
227c52850J30542K26402K23187J23009l2862j74923k37082j93027o7094R0346
237b64352K10699K34620J50350K452j44788k29592k11435r5737O0665J85804K28702
248A27388J72887L8538j13872k12445k14777j25466J8022J57453K26775J90877
258B65380P1116p6135j92996k24622j52770j1205J30397K12995K03509J03084
268C28753m6288j71480k17055j69501m8467R6254J98354K09783J27889p818j40461
$$ y = [180298, -85270, -310313, -395344, -302744, -75764, 182218, 356913, 371081, 220324, -25411, -257541, -375417, -326268, -132804, 117115, 314315, 374091, 266340, 38707, -204376, -355383, -349243, -185469, 61923, 279110, 368681, 295079, 90656, -153208, -326817, -352850, -222308, 4094, 227281, 350290, 317428, 142505, -94577, -287604, -354698, -264352, -53653, 180967, 331317, 333769, 188981, -40611, -252046, -347783, -287118, -101314, 127388, 300275, 338813, 224941, 12496, -202281, -327747, -309725, -152272, 74503, 265380, 336496, 260361, 67365, -157257, -310027, -321232, -190835, 22160, 225669, 328753, 282465, 110985, -106070, -275571, -324038, -227784, -29430, 180353, 308242, 300424, 159963]
279A59963k13306j88791p9287O4352J77008K12709J53608K4425j14356k00343
289d018j96933j07193K9577J53950K08305J69807N6674q0786j81722k03514j33876
300b89729l398J26632J99701J84809Q7546m9111j63560k03640j52665l5431R7219
311b01627J86919J93110J11679j7402j37850j97303j69758o5265O7726J69099
321f0672J95049J35516J4898j12680j88774j80098r2159L6708J48934J94825J52786
332B44333M3056q4372j74471j86784j15368O916J25583J87534J66337P1447n5529
343B28682j57360j88060j35750k2855R9965J77542J76186R5823k6531j36942j85669
354g4969j51044n0325P2663J63662J80350J17147K174j12540j77932j64294p6255
$$ y = [159963, -53343, -242134, -321421, -257069, -80061, 132648, 286256, 310681, 196325, -4018, -200951, -308144, -278567, -124617, 83688, 253495, 310169, 229383, 47661, -155853, -289729, -293127, -166495, 33206, 218015, 305561, 256450, 92890, -110750, -263415, -298846, -201627, -14708, 178402, 290081, 272679, 134829, -62474, -232232, -297497, -229771, -60672, 134377, 269893, 284791, 172111, -16663, -196761, -288920, -252212, -103278, 91547, 244333, 287389, 203017, 28546, -158238, -273606, -266690, -141107, 46427, 212764, 284211, 228682, 71322, -116738, -252488, -275343, -175378, 2164, 178350, 274173, 247642, 110700, -74969, -226013, -276338, -203675, -40013, 140337, 257484, 259658, 147118, -30814, -195108, -271363]
365b71363M5046J44709J80641J36428L1124q8489j67004j70726r9874J5256J24968
376a19284J78321J49591N6321o0279j51166j76136j19861j0335J00637J66795
386A4604J61735Q3340l4376j34233j72319j36586m1137P6086J58406J66655J02251
397B44426m570j11760j70075j50217o2023M9468J38860J69797J23607J9928r0269
408A57172j57348j58549q8849K3389J24220J66133J36461M7934o5333j48898j63148
419a26816j04945l209J00846J62309J48485O7498m0067j29076j63702j25213k7351
430b41241Q0228J49545J54672R3499j4583j15324j59991j34801n3660N4827J40841
441d5988J58440J05910J0916q9933j54759j46754p1915L1014J19644J57403J26138
$$ y = [-271363, -226317, -81608, 99033, 235461, 266585, 178096, 11092, -159634, -259508, -244252, -119284, 59037, 208628, 264949, 204670, 53504, -122632, -242493, -252828, -152191, 14604, 176339, 259679, 225303, 91070, -81249, -217835, -258972, -182886, -24480, 142175, 244426, 239856, 128096, -41979, -192196, -254219, -204751, -65891, 103906, 227513, 247441, 157172, -176, -158725, -247574, -224185, -99965, 66168, 202629, 250563, 185230, 36332, -126816, -231761, -234970, -134124, 28185, 176670, 244168, 204101, 75025, -88677, -213890, -241241, -161013, -11468, 143204, 236703, 222120, 106796, -53195, -187996, -241656, -186829, -45988, 112452, 218362, 229278, 139345, -15414, -162168, -234083, -203069, -83425, 73978, 200116]
452B00116L4897p0781j42079j51151r5874N153J05878J54277J33269N8558m4389
463A87874j30953j54403j07422j8893P8365J46649J45515P7381k1261j08766j52935
474e8849j28026m2009O1175J33231J47799R9622L736r5832j47317j32006o3648
485b22124L3035J20208J50910J09941K5873o6379j36947j46094q3500J3408R9294
496a02375J45606J29342N0362n1885j25799j43662j01315j2985Q3467J41372J32670
507A44798O7752k4474j07904j45681j15117l3231O0036J27703J41806Q9918l962
518B01644r3452j40424j27287n5069M1626J17808J41978J02467J7353p4109j31634
529I01j32622p3857J8521J01023J38426J15726M1782n2833j23869j36941r0903
$$ y = [200116, 235013, 164232, 22153, -128998, -224872, -219719, -113841, 40436, 173705, 232263, 187874, 56921, -97482, -204904, -223797, -145432, 1217, 146732, 224113, 202852, 94086, -58849, -186875, -228884, -167709, -34478, 113321, 212943, 216679, 120847, -26470, -158476, -222124, -189089, -68881, 82029, 191970, 217843, 151464, 14517, -131577, -215077, -201669, -102375, 43231, 172573, 222935, 171050, 45251, -98411, -199726, -212711, -129244, 12128, 144798, 212550, 188076, 80172, -65509, -180626, -213857, -153821, -26118, 115688, 205606, 201644, 108192, -32232, -159519, -214588, -172962, -55154, 86824, 189291, 206644, 132535, 901, -131721, -205578, -187057, -86034, 52392, 168118, 209900, 157067, 33198, -103743, -194646]
540a94646m448Q4506J36471J25847N8664l4057j08931j37180j04925k3856O7330
551a35225J24513J28260P8905q823r4841j34152j14117m7801M2808J17422J35924
562I2873R1696J0484p5355j30300j25313o2506K6381J01189J31247J05246L2150
573A97792n7162j19537j25618q0796j222Q4190J31556J15728N0914l3382j08330
584E4133j33801r5336j6112O7167J22802J22803O7721j7460r2722j26334j05372
595a52511l9007M6234J11645J26067Q3975P910p5170j26208j16799n5550K7053
606a62361R9599J29931R7172K1997n8890j14770j21089p1345Q985Q3577J21447
617C4253J07223M3960l7725j03832j24127q8204j2906O8109J19972J16222N9161
$$ y = [-194646, -199094, -114588, 21883, 147730, 206394, 172337, 63406, -73774, -178699, -202555, -135225, -10712, 117548, 196453, 187630, 92789, -41363, -155480, -203281, -160473, -43051, 92873, 184569, 195053, 119698, -10602, -135915, -198421, -172040, -70851, 60396, 165642, 197792, 140630, 21093, -104525, -185321, -186543, -102353, 29203, 144931, 195845, 162463, 54133, -79668, -175004, -191116, -123949, -1147, 121656, 189377, 171917, 79195, -47139, -152511, -191518, -145284, -33639, 92428, 176403, 184313, 109143, -17065, -133864, -189414, -162361, -62762, 67169, 164341, 186338, 127448, 12678, -108411, -179756, -170771, -87194, 34253, 141476, 185436, 147711, 43879, -80248, -168452, -181358, -113249, 6723, 122945, 182106]
628A82106k1517r2133j24011r7525k7185N0770J06894J19137P4802k935p5775
639I2628j15452j08006m9835L2331R7883J19605Q9622J9094o1971j13859j13574
650a11534o2209J4682Q4779J18464R8074L2469m3718j00051j14346p8709n055
661a67154O8970J11440J06495N4027k4108r1895j17079q9849k3649N4206J07090
672a1506J11092O6003p932p7813j12822r6698l9431L4664R4817J11907P9503J2541
684A64325o0156j07201j06366n7743J8383Q4045J12665R1190K9066m7394j01198
695A9616j07314o8098m00P0010J08647R6573M2934k6413q7150j10420q1692j7364
707a61071N3966J01381J05083O0450j2241p8067j08587r0273l2581L9800R4597
$$ y = [182106, 160589, 68456, -55555, -153080, -180265, -129495, -22601, 96536, 171338, 168403, 92628, -22824, -130830, -180665, -148334, -50451, 69154, 158776, 177870, 115899, 2040, -111534, -173743, -159061, -74282, 44182, 142256, 174725, 131007, 30956, -83390, -162099, -167154, -98184, 13256, 119751, 173778, 149670, 57775, -59304, -149153, -172802, -118596, -11506, 99586, 165589, 157657, 79844, -32978, -129676, -169107, -134443, -39626, 72281, 151784, 164325, 104169, -3032, -109398, -167141, -148758, -64713, 47952, 139142, 168208, 120814, 19616, -87698, -155796, -156196, -86186, 22461, 119034, 161968, 135555, 48405, -62015, -143707, -161071, -107105, -5724, 99359, 159809, 147568, 69501, -39086, -129359, -161940, -122140, -27543]
718b7543J04857O9884N474o2373j03554r6059m7173K0966Q1110J07113Q3087K0885
730A56674m7625r5966j03247o2809P961P2130J02478Q9942L6886l3700q8453j02084
742f7813p0824j0485N5025R8502R5996N0590j6452p4866j02794q4445k6017M2833
754a10750R1801R9365O3735p90o5079j00101q8785l8687K6689P9650J00159P4598
766A31805J4638n0008r1237r4146n6339R363P1846R9174Q1352L1424l3510q7119
778B7243r9071o3911l472N6074R2965R0768M4121k2142p4070r3821p6705k2977
790a44998M4265Q8915R1425N7119j943o3709r6991q3216l3208K8383P8830R6141
802F1013O7776Q717n1437q8425q8090m7879J4104O9486R3196P5818K5358l7221
$$ y = [-27543, 77314, 147198, 152672, 90299, -13255, -109314, -156487, -135521, -54411, 52702, 135789, 156674, 109049, 13083, -90164, -152973, -145012, -72882, 29596, 119538, 156424, 122724, 34271, -67813, -138637, -149122, -94097, 4405, 100401, 150991, 134539, 59673, -43121, -127566, -153583, -110750, -18949, 80416, 144151, 143361, 78282, -21819, -110604, -149291, -122602, -42952, 57207, 131805, 146443, 96435, 5198, -88948, -145287, -135924, -64078, 35096, 116448, 147872, 114362, 27243, -71828, -135739, -139211, -83137, 9828, 100596, 144717, 122575, 48505, -45316, -122021, -144998, -100733, -11818, 79607, 136726, 134783, 71074, -25917, -109133, -142341, -113958, -35128, 61013, 128789, 137506, 86069, -2356, -90446, -138325, -124221, -54735, 38461, 114279, 139637, 102416]
814A02416q2812r1783n9338l44N9035R0749Q2101L8375k3720p5834r2340o6758
826a20253j3596M4322Q5170Q7915M9037j0787o2651q9301p8001k8798L3896P8940
838b4107Q7535O1301N518n3833q8364q0527l9272J7573O8770R0795O8666J6603
850A30658l9831p9348q5548n3146M729N9750Q5746P5950L2883k6583p4479q7114
862e6333o0992r585M6619Q2973Q1474M2809j3670o2971q5668p0463k2943L5408
874i3342P5830Q2816N4724J362n3293q3653p5842l5171K1053O8014Q5212O3186
886A10896J3275m1857p7499q0372m6441Q307N9053Q2539P0125K6601k9004p1637
898B3986q2070n5987n187M7881P9695P5912L7974j6732o3472q2161o3721j7619
$$ y = [102416, 19604, -72179, -131517, -131861, -72826, 17923, 100024, 138399, 114679, 38845, -53495, -120253, -133849, -89527, -4357, 83558, 132595, 121808, 59157, -30144, -108145, -136943, -103047, -24107, 63428, 124729, 130247, 76414, -11950, -92477, -131749, -114176, -45406, 45389, 114055, 130658, 90827, 11479, -74069, -127215, -122486, -62736, 23010, 98960, 131843, 105260, 30781, -56333, -117325, -126910, -80291, 2682, 84156, 126965, 113295, 50324, -35344, -105807, -128750, -93342, -17512, 65304, 120028, 121390, 68097, -15556, -91398, -126569, -105516, -37502, 47710, 110896, 124171, 82314, 4815, -75557, -121998, -113691, -54638, 27901, 98026, 124627, 95623, 23986, -58084, -114071, -119258, -71377, 8318, 84230, 122204, 105472, 42000, -40161, -103882, -121501]
910a21501L6941P4169P8520M8388l911n4104p9613p0398k9409K4623O7365P9809
922E0879N7503Q756m3849p5927p4721m0190J2258N9547P9280O4047K0898l1725
934H6756p0766p7566m9715Q6M9471P6284P0323L2413k0435o3238p7404n8353j3142
947a15286L8908P2999P3456M2052o785n4627p7371o4730k3425K6899O5651P6409
959E4150N1732L923m4517p2708o9964l5902J5238N9604P4997N8800J7311l3315
971G9349o9581p3294m3751K984M8626P4721O6112K6301k2729o0872p3823n4903
983a00860p670M0770O9153O8936L8536j0487n5239p3689n9223j9776K8388O5765
995a5396P2831M5400l05m4409p0901o6380k9600J9658N7175P1597N5236J2461
$$ y = [-121501, -84560, -10391, 68129, 116517, 112606, 58502, -21111, -91509, -120918, -96295, -28930, 50879, 108382, 117138, 73289, -2638, -77359, -117549, -105291, -45744, 33536, 97583, 118481, 86756, 15990, -61576, -111291, -111205, -61734, 14550, 84873, 117286, 96851, 33613, -43791, -102144, -115286, -76378, -3379, 70077, 112129, 105344, 50717, -26654, -91384, -114809, -87910, -22259, 54150, 105882, 109805, 65288, -7420, -77384, -113286, -98048, -38444, 36553, 95353, 112664, 79349, 9768, -63526, -107277, -104293, -55667, 19054, 85166, 111467, 88738, 27866, -45957, -100860, -108530, -67760, 1393, 70329, 108865, 98378, 43139, -30550, -89773, -109549, -81161, -15396, 57435, 102835, 102530, 58121, -12780, -79160, -108760, -89102, -31927, 39670, 94906, 107367]
1007A07367l6856o6855o7831m0480O256N1233P2051N9689K2407k5103o1325p1012
1019e0459m8246k985M1050O7662O5313L2996j5078n4259o9947n5392j5884L2344
1031g2885O4252O6985M2135k910m7287o8916n9955k5484K1105N8145O8871M8660
1043I2716P819l6488o5582o5040l4417J0622M9987O7705N7019J8791k8484o0498
1055A4150o5904m3789j815M3247O6921N9303K7757j5105n4479o8148m9674j0828
1067i8364L1940O1738O4442L7563o328m6619o5932n6191k1997K2698N7472O5600
1079D6022M5003L763l7321o3344o1084l0545J3236N0606O4473N1226J5014k8331
1091F8718n9825o2934l7909J675M1438O4915N7944K2490j9952n2368o4326m7249
$$ y = [107367, 70511, 3656, -64175, -104655, -98399, -47166, 24885, 84574, 106981, 81878, 20553, -50459, -98705, -101690, -60640, 7022, 72335, 105331, 90253, 35994, -33953, -89345, -105229, -72885, -8633, 58352, 100487, 97577, 50290, -18626, -78581, -104065, -82960, -24815, 44056, 92716, 100535, 64047, -1535, -66575, -100992, -90370, -40383, 27322, 84341, 103132, 74648, 14150, -51754, -95543, -97358, -54111, 12810, 72113, 99870, 84765, 30286, -37862, -87536, -98364, -66424, -4686, 59756, 97319, 90991, 44372, -21560, -77751, -99748, -77050, -19578, 46022, 91025, 94788, 57467, -5877, -66961, -97506, -84270, -33664, 30809, 82035, 97049, 68718, 8893, -54041, -91950, -90275, -48837, 16078, 74022, 96512, 76560, 24192, -40134, -87383]
1103h7383o425L5973N9744N8436L3064q632m7843o3474n0716j6716K3990N5872
1115a4110O3257M0409p21l8804o0811n7298k6380J7203N0604O1767M6622J0115
1127I1853l1191n7461n8960l3952O107M2857O0504N2379K0561k1715n3488o0191
1139d2697m1536m715L5810N9783N6222K6945j2016m6226o0521m8386j2245K7366
1151f2216N3316N7472L7355j178m0644n8801n1006k4024J6261N0817O0357M2129
1163G9838O538l0977n5628n6548l0641R559M3134N7154M8534J6980k3343n1411
1175A3189n6723l7708k324L5691N7276N2362K4983j3638m6532n8487m3463r992
1187h5366K8183N3644N4597L1663n020l8975n6843m8691j8038J9298M7491N6262
$$ y = [-87383, -93808, -57835, 1909, 60345, 93409, 84777, 36934, -26540, -77256, -93972, -69982, -14110, 49147, 89556, 88835, 50031, -10780, -68078, -94458, -77255, -26651, 35116, 81738, 91853, 60662, 3201, -55759, -89711, -83604, -40747, 19757, 72136, 92697, 70982, 17494, -42697, -84233, -88948, -53138, 6645, 62867, 89812, 77796, 31570, -28951, -77337, -89582, -62216, -8900, 48572, 85927, 84749, 44105, -14696, -65702, -89726, -73465, -22648, 37709, 79838, 86376, 55399, -229, -56777, -87418, -77859, -34725, 22429, 70963, 87943, 64600, 13189, -43534, -81242, -83566, -47875, 9401, 61763, 86746, 73108, 26576, -31911, -75374, -85366, -57183, -3539, 51058, 82721, 77701, 38726, -18117, -66808, -84846, -65548, -18057, 38205]
1199C8205L9945M548l3170n4741n1504k7278R979M4799N7012M2985J2104k3623
1211E9261n0877n5495l2535L413L5145N3090N0199K1550j7209m5675n3941m0575
1223g3649q140K9641N3498N1241K7340o819l9791n5693m4589j3805K1343M6616
1235a2807N3209L5854O35l3527n1438m8369k4169J2596M3160N3985M0502R777
1247G9408k5295n0104n1804k9558M744L6852N2100M5263J7534j8114m4372n2068
1259c5414l6107m692K9460N0093M8888K5577r081l9817n2388m2386j2286K2911
1271e5242M7151N0205L1503j137l3357n0727m5295j9554J4010M1608N1142L7818
1283F8125O928k6519m7580m8195k7871O277L7749N0547M1783J4735j9377m4844
$$ y = [38205, 78150, 82698, 49528, -5213, -56717, -83995, -74016, -29217, 27795, 70780, 82884, 59261, 8384, -47111, -79646, -76233, -41088, 12002, 62201, 83751, 66542, 20867, -33074, -73649, -81789, -52148, 1350, 52591, 79931, 73112, 33321, -22372, -66961, -80766, -59423, -12807, 40402, 76256, 76891, 43364, -8074, -56443, -80612, -68016, -24856, 29129, 69631, 79408, 54113, 4009, -47795, -77353, -72609, -35757, 16343, 61606, 79140, 61026, 16654, -35414, -71521, -76213, -46753, 3340, 52228, 77805, 68724, 28907, -23481, -65867, -78153, -55242, -8091, 42114, 73617, 72480, 39123, -11604, -56899, -76453, -62443, -20835, 30307, 68125, 75053, 48534, 954, -47241, -75112, -68835, -31086, 19461, 61244, 75979, 56602, 11758]
1295A1758n0134l1559j004L0012M8161M5877K1131j1962l8915m9138l8768r690
1307g4231K4029M6299M7490K8244l557l4270n0060m1904j5317J6387M1734M8561
1319C3405L3730L239k8034m5737m4630k3816Q276L7414M8536L7886J1577j9671
1331E2175m3948m7837k9133J642L1016M6961M2457J8371j3869l9411m6269l4645
1343f2490p233K4179M4679M4798K4699m970l3226m7401l9828j3310J7279M0439
1355a2385M6230L1709J443k8553m4642m1912k0730R746L6690M6049L4942R622
1367F8209k0479m2327m4737k6748K870L0763M4942M0097J5945j4714l8375m5240
1379b9794l1910m410K5374M3223M1767K1823o940l3668m4970l5954j1272J8311
$$ y = [11758, -38376, -69935, -70939, -40927, 7234, 53111, 74242, 62280, 23365, -25773, -64541, -74231, -50202, -3903, 43587, 71831, 68274, 34004, -16056, -57960, -73277, -56890, -15156, 33405, 67135, 70374, 42340, -3397, -48027, -71843, -63567, -26153, 22383, 60269, 71846, 52175, 8227, -39610, -68743, -67101, -36085, 10876, 53333, 71704, 57835, 18424, -27845, -62490, -69723, -45544, -865, 43933, 68632, 63662, 30436, -16965, -56793, -70103, -52824, -12385, 33845, 65554, 66997, 38444, -6198, -48110, -68840, -59094, -22404, 23645, 58587, 68209, 47730, 5403, -39334, -66082, -63212, -32449, 12493, 52590, 68535, 53821, 15446, -29794, -61704, -66114, -40740, 2483, 44250, 66073, 59133, 25465, -19505, -55459, -66731, -48420]
1391d8420L9929M3595K8354o45k8371m3895l9371j7636J2072L6491M4018L2344
1403E8465O252k2464m1109m1837k3242M974L1166M3523L6475J3269j5967l8097
1415A1408m3089k8643k004K5838M2352L9094J9131r307l3659m3159l3244q375
1427f3657J9681L9128M1086K5216k245k8898m1857l6976j5244J2938L5776M2615
1439B7563K9669M425k2765m0250l9403k1027O061L1121M1873L4068J1023j6401
1451D5957l6961m1088k6461m59K5915M0292L7397J7403j0433l2958m1414l1206
1463e4016o833K0242L8257L9017K2889l805k8627m0476l4613j3154J4289L4813
1475a2017M0074K7740K800k3569l8708l6999j8922P568L1105M0274L1610Q809
$$ y = [-48420, -8491, 35104, 63458, 62813, 34442, -9453, -48824, -66460, -54388, -17897, 26121, 58465, 64717, 42253, 1144, -40693, -63935, -58961, -27795, 15728, 52203, 65472, 49505, 11408, -31681, -60324, -62328, -36490, 5862, 44956, 64087, 54780, 21121, -22038, -55282, -63657, -43976, -4848, 36238, 61454, 59209, 30311, -11546, -48522, -63766, -50828, -15052, 27563, 57232, 61657, 38892, -1358, -40761, -61788, -55727, -24606, 17267, 51335, 62358, 45957, 8996, -32092, -58553, -59012, -33097, 7195, 44592, 61995, 51562, 18604, -22810, -54016, -60849, -40607, -2350, 36667, 59556, 55751, 27124, -13352, -47965, -61119, -46830, -12017, 28057, 55797, 58597, 35028, -3680, -40679, -59601, -52033, -20928, 19346, 50956, 59765]
1487E9765j8028l6139l8820k3845J685K6226L9251L4793J4554j1760l3307l8835
1499b4460k8437n171K1511L7486L6605K0070n339k8858l9638l1647j0697J5629
1511d2946L4312L8406K5281M7k4353l7256l4743j6807R783L1068L8214K8947P042
1524E6995j8328l6379l6596k0970K765K6422L8417L2619J1975j2885l2187l7721
1536b5873k6231k768K2000L5664L4864J8284o905k9258l7273k8972r622J5714
1548d0376L4520L6377K2443r22k3845l6767l3021j3725J0486K9932L7107K6996
1560D9205N078j9749l4222l4695j9498M369K7119L6706K9563J0825j3307l2633
1572H761l6189k3125r87K1725L5350L3122J5082q398k8528l6042k7655o224J7425
$$ y = [59765, 41737, 5598, -33222, -57067, -55382, -29156, 10095, 44888, 59442, 47682, 14375, -24460, -52897, -58068, -36557, 929, 37534, 57604, 52265, 23407, -16231, -47878, -58575, -42946, -8634, 29772, 55053, 55100, 30747, -6509, -41252, -58059, -48276, -17208, 21006, 49953, 56995, 38667, 2288, -34308, -55278, -52513, -26091, 12326, 44945, 56920, 44035, 11848, -25873, -52104, -54872, -32872, 2792, 37656, 55940, 49035, 19777, -17496, -46468, -56090, -40376, -5856, 30521, 52964, 52042, 28197, -8570, -41591, -55316, -44830, -14898, 22209, 49205, 54283, 34534, 312, -34383, -53881, -49512, -22393, 14313, 43876, 54701, 41394, 8761, -27428, -50553, -51540, -29815, 5535, 38657, 53739, 45341, 16813, -19229, -46884, -53108, -35683]
1585c5683L2942L4068K0606k654k5165l5486l0135j1797J1453L0755L5601K3859
1597D8364K433j9693l3577l3098j6551O602K6770L4570K8229Q421j5658l1527
1609E285l3488k1367N92K2728L4350L0355J3234r461k8709l4714k5065l987J7410
1622c2837L2136L2594J8486m467k4841l3437k8895j0055J3048K9894L3196K2229
1634D7051J919k0965l3275k9890j4612P012K6800L3584K5699O061j5483l0117
1646C784l2315j9700K109K3238L2361K8354J2451j0863k8640l2638k2564l482
1658d7905J7973L2085L0179J5752n525k3983l2753k6471p855J3884K8705L1697
1670B5783K0200m68k0683l1848k8581j2612Q481K6544L2503K3295M386j6285l0199
$$ y = [-35683, -2741, 31327, 51933, 49279, 24114, -11372, -41507, -53304, -41851, -11096, 24505, 48364, 50797, 31104, -2473, -35571, -52122, -45520, -18750, 15820, 44049, 52470, 36812, 5285, -28203, -49570, -48978, -26250, 8100, 38455, 51689, 42228, 13519, -21195, -46260, -50247, -32837, -701, 31893, 50379, 45912, 21071, -12366, -41261, -51316, -38268, -8374, 24822, 47051, 48970, 28005, -5270, -35160, -49772, -42760, -15960, 17624, 43323, 49384, 33901, 3784, -28531, -48231, -46122, -22884, 9477, 37831, 50282, 39419, 10779, -21859, -44423, -47905, -29932, 2153, 32332, 48084, 42559, 18576, -14177, -40648, -48503, -34619, -5914, 25783, 45983, 45515, 24832, -7016, -35597, -48209, -39728, -13184, 19319, 42614, 47000, 30715, 516]
1683E16k9950j7294M079K2889L1533K6003R610j1168k8407l1203k0358j273J8578
1696b6445L0752K8992J3403p261k4661l0933k4142o199J4956K8582K9789J7751
1708D4584j902k1110l0684k6274j0868R981K5991L0637K1670K445j6602k9551
1720a683k8700j4685N401K2980K9981K4652P413j2461k7321k9158j8976j02J9365
1733b3294K9318K6734J1760p212k4307l0741k2083m006J4854K7868K8714J5953
1745D3558l508k1516k9076k4457r449J1076K5842K8479J9838J714j7398k8867
1757c764k6501j3070N927K2587K9676K2860N368j3269k6739k8236j6847K065J9805
1770b0138K8281K4580J0804r506k4492k8287j9943l406J5965K7806K6589J3928
$$ y = [516, -29434, -46728, -42649, -19760, 11773, 37776, 47386, 36218, 7811, -23392, -43750, -45023, -26445, 4307, 33299, 46702, 39441, 14780, -16153, -40295, -46494, -31538, -2956, 26833, 44584, 42682, 21572, -9112, -35386, -46254, -36273, -10282, 20355, 42025, 44470, 27868, -1683, -30383, -45068, -39667, -16687, 13294, 37946, 45359, 32898, 5577, -23581, -42557, -42659, -23294, 6024, 32758, 44518, 37306, 12999, -17742, -39825, -43831, -28977, -1109, 27605, 43558, 40050, 18534, -10542, -34999, -44448, -33372, -7530, 20949, 40787, 42501, 25103, -3764, -30265, -43335, -37408, -14821, 14855, 37715, 43083, 29814, 3075, -25161, -42008, -39943, -20138, 8143, 32723, 43527, 34021, 9529, -18758, -38701, -42107, -26142, 1664, 28253, 42181]
1782D2181m692k1377k8762k2711p068J2172K5148K7628J7750o14j8384k7145k4966
1795c0840j1236P425K3303K7799K0517M463j4559k6158k6612j5123L671J9798
1807a7552K7546K3337Q242j0221k4255k7042j8002j385J5941K6607K5459J2227
1819D0902n884k1169k7438k1727n273J2263K5118K6085J6309j424j8590k6965
1831g793k2784r508P752K2997K6837J8669K771j4250k5473k5107j3769M301J9827
1844a5530K6637K1948P067j1052k3964k5703j6703o2J6849K5722K3216J0801o804
1857C2422k1297k6112j9354m176J2955K4417K5136J4254k890j8620k6036k1994
1869c1295p518R511K2593K5640J6739J232j5361k4728k3457j1366N264K0053K5776
$$ y = [42181, 37489, 16112, -12650, -35361, -42429, -30257, -5109, 22519, 40269, 39655, 21271, -5874, -30840, -42076, -34651, -11348, 16451, 36968, 41431, 26872, 714, -25898, -41021, -37350, -17552, 9994, 33331, 41573, 31352, 7097, -19945, -37947, -39332, -23391, 3216, 28675, 40902, 35018, 13849, -13589, -35316, -40589, -28326, -3208, 22877, 39186, 37762, 19172, -7793, -30577, -40085, -32333, -9336, 17501, 36170, 38941, 24691, -782, -25889, -39658, -35357, -15530, 11107, 33055, 40122, 29070, 5106, -20597, -37300, -37362, -20513, 5209, 28425, 39226, 32422, 11125, -14987, -34341, -38517, -25562, -1145, 23991, 38245, 35355, 16735, -9301, -31295, -38813, -29302, -6709, 18931, 35670, 36902, 21541, -3187, -26644, -38010, -32746, -12693, 13083]
1882A3083J9693N253j1994k3113k4927j4891J540J7528K4637K2088R038q006k1461
1895H468k4790j7774k328J3695K3675K3583J2578m291j8681k4480k0346o901J0464
1908b7128K2296K4378J5209K94j5709k4307k1905j0032O439J9915K4630J8355
1920C2435L622j2425k2493k3025j3493K393J7438K3936K0484P378q446k0923k4243
1933a7362j5946j365J4023K3246K2036J0979n032j8437k4019j8533m825J0577
1945b4658K1522K3091J4160j172j5758k3514k0525q607P492J9721K3345J6487
1957C1584K707j2989k2321k1672j1605L910J6912K3344J8945N669r459k0359k2379
1970a7713j4825j14J4558K2404K0454R717o090j8970k2447j7019l340J1154K1124
$$ y = [13083, 32776, 38029, 26035, 2922, -22005, -36896, -35356, -17828, 6809, 28897, 37935, 29929, 8468, -16322, -34096, -36424, -22729, 946, 24529, 37107, 32816, 14135, -10345, -30691, -37592, -27128, -4832, 19546, 34755, 35049, 19340, -4967, -26872, -36904, -30465, -10550, 14080, 32435, 36057, 23632, 1139, -21886, -35379, -32986, -15548, 8388, 28872, 36250, 27804, 6881, -17362, -33308, -34673, -20650, 2596, 24632, 35611, 30579, 12142, -11877, -30410, -35235, -24658, -3136, 19955, 34115, 32943, 17185, -6329, -26854, -35461, -27969, -8248, 15097, 31584, 34291, 21302, -1019, -22691, -34296, -30386, -13474, 9870, 28815, 34484, 25025, 4666, -17713, -32538, -32652, -18094, 4310, 24764, 34481, 28391, 9421, -13026, -30045, -33385, -22231, -1107]
1983a107K1983J2066k372j5948k2312j9134p084Q124J9601K2092J5266J271j3374
1996A9072k1535k0701r895M579J6961K2512J7412M332r612k0161k1215j3330Q20
2009c0761J4900K1578J9116Q312o818j8287k1929j5672k030J1456K0438K0581
2021B0884J1036l214j5832k1571j7710n977Q434J9561K0799J3847L51j3171k0929
2034c492j9779q611N251J6803K1831J6349L098j0373j9742k0607j1592J886J5092
2047a3886K0747J8058O722p338j8076k1007j4021j502J2127K0115J9519R574m031
2060B7001j5909k1175j6596m153Q952J9041K0355J2228q20j3603k0468j8011q006
2073c1164O371J7080K0533J4850K033j0517j9766j8721j0674K925J4854K0578
$$ y = [-1107, 20876, 32942, 30570, 14622, -7690, -26824, -33908, -25784, -6183, 15909, 31175, 32446, 19072, -2463, -23164, -33059, -28480, -11519, 10993, 28405, 32737, 23125, 2964, -18251, -31581, -30761, -15861, 5717, 24833, 33145, 26327, 8040, -13889, -29561, -31591, -20135, 303, 20884, 31920, 28706, 12874, -8697, -26407, -32384, -23950, -4389, 16410, 30257, 30608, 17437, -3492, -23271, -31882, -26631, -9828, 12003, 28352, 31450, 21077, 1335, -19272, -30864, -28978, -13886, 6861, 24919, 31641, 24303, 6227, -14780, -28801, -30303, -18176, 1939, 21458, 31032, 27001, 11092, -10083, -26679, -30832, -21880, -2839, 17516, 29744, 28924, 15321, -5147, -23158, -31164, -24793, -7713, 12820, 27670, 29703, 19186, -580, -19301, -29975, -27050, -12196, 8382]
2085H382J6337N579q015j7485k0193j3356r9J2601J9401J8194Q683m767j6228
2098I034j9990j4709m106R504J8749J8981J1201j505j3478j9681j7241o301O527
2111b3015J6616J9314J3991J802j1316j8515j8306r466L241J5023J9508J5646
2123B4523M560q241j7428j9238j2187P00J2605J8943J7154P722n682j6006j9082
2136a1657j4059k564R833J8399J7924J0205k164j3887j9302j5637n579P235J6488
2149d765J8971J2220P15j1673j8385j6862q312M260J4775J8899J4568L596r383
2162A8624j7108j7836j0663J039J2918J8927J5665N930n771j5648j8509j3079
2174b5511j258J0585J7303J7372Q904l202j4173j8303j4586m637P984J6491J7649
$$ y = [8382, 24719, 30298, 22283, 4798, -15395, -28751, -28850, -16249, 3152, 21346, 30029, 25262, 9034, -10956, -25665, -29771, -20267, -1518, 17463, 28664, 27159, 13681, -6000, -23241, -29542, -23015, -6399, 12915, 26906, 28708, 17392, -1123, -19429, -28895, -25654, -10631, 8877, 24523, 29083, 20842, 3414, -15824, -28011, -27311, -14706, 4237, 21391, 29113, 23431, 7425, -11657, -25716, -28280, -18447, -48, 17876, 28081, 25917, 12030, -7272, -22909, -28488, -21253, -4765, 14206, 26426, 27141, 15468, -2917, -19779, -28091, -23831, -9056, 9843, 24411, 28007, 18624, 1516, -16320, -26983, -25944, -13026, 5901, 21566, 27496, 21725, 6077, -12432, -25511, -26769, -16184, 1119, 18491, 27395, 24193, 10020, -8283, -22869, -27506, -19522, -3031, 14618]
2187A4618J1114j36j1593j7924j6386o966M954J4822J8296J3087K792r510j6638
2200E30j7124r944K236J2867J7897J5245N218o710j5784j7469j1671q46J0789
2213a4766J7320J5941Q060m117j3845j7814j3551l378Q145J6342J6917J0148j203
2226B4199j1538j7683j4999o201N542J4675J7281J2698J196r428j6613j6095q735
2239b5701L026J3318J6815J3694M666p176j5615j6571j0619J00J0889J6560J5335
2252A8721O579m388j3815j6720j2820k511Q703J5874J5546R527j929j2404j6260
2265e897j4150m973O035J4226J6632J1227P95r888j6068j5010p863L677J3060
2278h197J6824J2494L494p574j5158j6025r262O53J1091J6048J4260N967m956
$$ y = [14618, 25732, 25596, 14003, -3921, -20307, -27273, -22319, -7497, 10799, 23886, 26678, 17168, 530, -16594, -26538, -24302, -11435, 6462, 21707, 26925, 20215, 4431, -13038, -24709, -25555, -14766, 2554, 18495, 26555, 22438, 8593, -9221, -22772, -26150, -18005, -1663, 15254, 25402, 24199, 12661, -5022, -20021, -26222, -20680, -6005, 11276, 23974, 25170, 15742, -871, -16966, -25701, -22675, -9357, 7458, 21152, 25818, 18642, 3027, -13544, -24163, -24063, -13174, 3386, 18721, 25300, 20912, 7097, -9623, -22443, -24954, -16251, -377, 15169, 24696, 22767, 10363, -5897, -20047, -25020, -18985, -4759, 11873, 23100, 23895, 14007, -2061, -17071, -24934, -21257, -8197, 8627, 21121, 24615, 17041, 1883, -14142, -23404, -22751, -11660, 4388, 18648, 24615, 19659]
2291A9659j3834j6317j1650j666Q937J5481J5267P974k543j1973j6069j3294m370
2304b4398P107J3966J5675J0183K45j0075j5725j4130o718L874J3121J5968J2010
2317B1103K266p904j4736j5245q666J676J1380J5479J3382M783n279j3903j5514
2330a1178j0325j151R090J5571J4274O637k957j2240j5390j1886l520O924J4223
2343a928J5067Q983o60j0558j4978j3236n502M485J2637J5208J1197J604q315
2356A4004j4187j4154p913J822J1434J5562J1848L944n772j3186j5118r541R9
2369b1158R020J4961J3401O267l821j2253j4617j1254k801P315J4066J4431Q047
2382B1604j470j0333j4705j2746m318N066J2648J4472R849J359q670j4114j3342
$$ y = [19659, 5825, -10492, -22142, -23808, -14871, 610, 15877, 23851, 21308, 9335, -6734, -20028, -24398, -17291, -3325, 12350, 22533, 22778, 12703, -3022, -17152, -23870, -19996, -6875, 9093, 21103, 23369, 15465, 729, -14516, -23182, -21506, -10126, 5353, 18735, 23518, 18239, 4336, -11178, -21503, -22654, -13564, 2007, 16281, 22918, 19961, 7721, -7669, -19555, -23075, -16151, -1928, 13139, 22122, 21462, 10904, -4074, -17310, -22812, -18327, -5690, 9518, 20715, 22319, 14004, -183, -14337, -22250, -20428, -8994, 6568, 18416, 22360, 16588, 3402, -11716, -21257, -21158, -12138, 2823, 16224, 22491, 18670, 6417, -8200, -19454, -22255, -14940, -874, 13557, 21604, 20134, 9801, -4904, -17650, -21968, -16902, -4254, 10218, 20067, 21426, 12756, -1358, -14700]
2395a4700o817K610J1306J4586J1270L492o405j3276j4183q643K55J0021J4086
2408C602J2678N240l949j2089j4223j0571j610P424J3535J3435P638k075j0323
2421H712j4222j1608m100N458J2612J3720R362J45q295j3887j3010n907L800J0586
2435f634J3895J0763K737o682j3078j3271p742R24R756J3925J1745M305m113j2219
2449D311j3950r295q57P902J3033J2880O355k630j0498j3561j0626l347N721J2526
2463b036J3142Q223m35q680j3194j2124m900L413J1442J3518R461J929p358j2375
2477B6j2622p070J925R584J3163J1403L546n358j1741j2832q715%P860J3222J1677
2492A4068N396l055j0317j3096j0091k381O522J2143J2275P435j060q783j2857
$$ y = [-14700, -21517, -18907, -7601, 6985, 18255, 21747, 15342, 2066, -12117, -20760, -20505, -10484, 3602, 16280, 21520, 17571, 5482, -8741, -19312, -20922, -13498, 37, 13472, 21110, 19035, 8712, -5510, -17118, -21218, -15760, -3148, 10572, 19934, 20079, 11784, -2103, -15113, -21020, -17220, -6634, 7261, 18024, 20761, 14079, 1001, -12270, -20012, -19088, -9332, 4593, 16338, 20643, 16530, 4311, -9639, -18934, -19791, -11889, 1144, 14024, 20379, 17749, 7251, -6310, -16936, -20283, -14562, -2036, 11106, 19329, 18894, 10214, -2980, -15104, -20004, -16591, -5149, 8369, 17830, 19759, 12401, 26, -12596, -19666, -17741, -8157, 5006, 16409, 19955, 14597, 2856, -9976, -18691, -18691, -10831, 2391, 14068, 19464, 16409, 6092, -7004, -17095, -19476, -12954, -811, 11464, 18899, 17839, 9056, -3801]
2505c801j1161m451M553J0875J2451R086J208p338j2525j1672o130K188R695J2875
2519E853R950L193n416j1453j2182q154M31Q130J2443J1294M858l437j0699j2396
2533g585r175j681O269J1982J2008O096j052r124j2384j0689l366M772J1071J1797
2547H939Q380N56p602j2032j1143n380K512R812J2511R168K523n516j1612j1750
2561a0634p147J089Q509J1711J0405M142m038j0187j1822q581j217O850J1496
2574E76J1402N707j875r108j2295r401k989N006J0775J1640P585l35p452j1570
2588b334j0844m810L470R661J1671Q784J872o217j0687j1375o121J162Q148J1822
2602D202R568L554m044j0221j1300p768q48O790J1525J0586N252k750q720j1481
$$ y = [-3801, -14962, -19413, -14860, -3985, 8466, 17552, 18760, 11422, -1103, -12775, -18905, -16717, -7022, 5853, 15803, 18996, 13580, 2127, -10055, -18209, -17778, -9648, 2795, 14089, 18947, 15510, 4811, -7585, -16760, -18441, -12172, -190, 11818, 17914, 16862, 7738, -4646, -15335, -18701, -13929, -2858, 8939, 17319, 17875, 10273, -1759, -12902, -18282, -15770, -5958, 6553, 15721, 18244, 12728, 1116, -10634, -17781, -16692, -8183, 3528, 13933, 18075, 14037, 3850, -7972, -16553, -17770, -10920, 576, 11978, 17685, 15810, 6702, -5593, -14994, -17983, -12977, -2202, 9438, 17023, 16688, 9236, -2334, -13178, -17988, -14518, -4857, 6814, 15598, 17470, 11253, 566, -10809, -16930, -15768, -7620, 4202, 13770, 17324, 13280, 3059, -8241, -16009, -16857, -10067, 1458, 12044, 17296, 14546, 5826, -5655]
2616e655r036k427N083J0552J1092O988q37p740j1193r775m055L407R889J0817
2630G110P939J332o016j0781j0272n779J743Q101J1237R097K832m361r872j0907
2644h597o959l99P209J1068R647M673k728r033j1141q177j848N447J0237J0567
2658I966O073j004p712j0849r232l454L637R229J0889P393P41o461j0416r645
2672a0845n154K430P823J0918Q515K398n177r305j0630o313N10O857J0674R176
2686A1877M096l239q733j0675p647j363N979J0051R746N405j344p631j0554r109
2700a3141k543L964R297J0503O416K54o387j0201r422m379L054P614J0348P956
2714A3333K011n108r608r600o178J349O963J0169Q672L352l456q924r845p457
$$ y = [-5655, -14691, -17118, -12035, -1483, 9609, 16597, 15760, 8020, -3173, -12948, -17003, -13596, -3707, 7110, 15049, 16381, 10365, -416, -10688, -16467, -14724, -6623, 4614, 13711, 16543, 12182, 2310, -8597, -15556, -15955, -8746, 2322, 11969, 16642, 13914, 4881, -6260, -14437, -16285, -10838, -601, 9966, 16039, 15035, 7323, -3526, -12758, -16212, -12575, -3346, 7543, 14936, 15677, 9216, -1200, -10845, -15999, -13569, -5746, 5172, 13687, 16085, 10908, 1603, -9027, -15340, -14830, -7973, 2701, 11877, 15973, 12734, 4001, -6674, -14321, -15684, -9705, 346, 10092, 15497, 14153, 6522, -4032, -13141, -15684, -11720, -2423, 8080, 14496, 14750, 8363, -1838, -11260, -15639, -12585, -4971, 5377, 13333, 15344, 10236, 628, -8972, -15150, -13801, -6838, 3331, 12003, 15355, 11899, 2975, -6870, -14327]
2728a4327o23O213R427R582M719j884p719j0325p814k439M547R331R670N946k53
2743A4051o302j0297q735l779K835Q485R862P019J545n375r477r358n320J467
2757a3379P312R955P958K809l670q766r488o533l98O108R802Q880M114k215q006
2772D483r654p594j857M682R183R125N389l72o757r645q147l254L129Q325R671
2787F707O126J432n760r166r041m427J769P415R116P607K669m224q580r412n663
2802a3432jO335R314Q184L770k437p971r313o916j226N001Q731Q713N011j293
2817A2470o701r078p815k945L556Q210R194N881M16n360r131q463l699J830O995
2832d640R483P177J554m384q252q570n746P05O352Q957P894L181k932p801r065
$$ y = [-14327, -14950, -8737, 690, 10272, 14991, 13107, 5388, -4937, -12751, -15190, -10643, -1312, 8358, 14304, 14051, 7749, -2548, -11283, -15062, -12227, -3742, 6120, 13139, 14684, 9309, -168, -9526, -14846, -13379, -6067, 3888, 11846, 14655, 10985, 2219, -7269, -13802, -14200, -8092, 1710, 10590, 14704, 12489, 4483, -5171, -12765, -14622, -9940, -757, 8368, 13757, 13385, 6628, -3017, -11164, -14418, -11289, -2964, 6707, 12833, 14265, 8505, -661, -9702, -14129, -12360, -4945, 4171, 11778, 14447, 10223, 1643, -7769, -13432, -13433, -7098, 2216, 10400, 14170, 11733, 3762, -5551, -12467, -13693, -8692, 39, 8752, 13763, 12470, 5769, -3309, -11124, -14069, -10513, -2303, 6891, 12772, 13188, 7828, -1303, -9766, -13465, -11635, -4640, 4843, 12020, 13574, 9190, 938, -7632, -13378, -12673, -6321, 2636, 10530, 13711, 10779, 2978, -6087]
2847f087o004j254N305Q412Q568M434j433o764r089p298k309L805Q067Q765N573
2862A2691L1n953q499p995l650K251P307Q931O495J473m518q161q475m728O85
2877a2115O466Q781P352K950l186p941q319o042n08N148Q165P963M019j507o785
2892D441r130o500j648L837P825Q441N233m63n717q500p432l256K562P099Q349
2907E141O348J002m708q127p796m302J156O015Q612P002K405l354p612q507n344
2922a2069N0N103Q368P660L454j912o789q465o366j387L910P769P930M943o78
2937A1521n806q169p318k818K798P285Q327N425Q18m829p765p772l877J370O188
2952d622Q525O696J604l593p239q017n225M44N275P919P140L211k346o721p920
$$ y = [-6087, -12091, -13345, -8040, 372, 8940, 13374, 11941, 5177, -3912, -11210, -13519, -9714, -1647, 7118, 12691, 12722, 6769, -1730, -9725, -13375, -11124, -3817, 5114, 11609, 13082, 8564, 403, -8072, -12800, -12115, -5649, 3132, 10484, 13434, 10248, 2307, -6012, -12054, -12562, -7414, 751, 8714, 12733, 11226, 4441, -4689, -11189, -12837, -9000, -1175, 7266, 12499, 12036, 6319, -2181, -9613, -12869, -10307, -3208, 5141, 11489, 12491, 7783, -344, -8140, -12442, -11286, -5271, 3341, 10343, 12748, 9394, 1782, -6725, -12069, -12019, -6916, 1452, 9112, 12566, 10654, 3865, -4600, -10966, -12353, -8443, -674, 7256, 12199, 11521, 5715, -2454, -9772, -12590, -9792, -2507, 5820, 11245, 12063, 7234, -531, -8303, -12180, -10810, -4622, 3903, 10599, 12203, 8610, 1371, -6646, -11871, -11427, -6152, 1767, 8907, 12118, 9772, 3051, -4869]
2967d869n879j262M433P520P429M411r32n884q222o396k427L021P001P981N285
2982A1210K4m604p878p080l454J741O164P991N837J808l504p491p515m490K65
2997a0976N575P583O611L012k320o725p668n820o40M199P318P494L925j365n768
3012D435p523o234k295L103O878P841M712j99m540p606o993l271K181O282P465
3027D236N867J472m122p245o961m489P64N084P900O745K108k577o530p455n454
3042a0657k49M363P349O784L559j606n626p305o152j712L539O630P204M559m45
3057A0235m854p056o688k757K246O015P169N552J110m040p341o369m158J047N546
3072d343P254O061J945k733o569o917n075k07M578P060O537L063j319o040p451
$$ y = [-4869, -10748, -12010, -7577, -57, 7372, 11783, 10851, 4967, -3255, -9651, -12078, -9057, -2056, 5925, 11210, 11234, 6630, -1248, -8328, -11782, -10041, -3877, 4114, 9951, 11759, 8255, 764, -6751, -11241, -10976, -5401, 2182, 8793, 11805, 9485, 2760, -4908, -10728, -11368, -7169, 149, 7643, 11568, 10203, 4435, -3088, -9322, -11617, -8514, -1636, 6205, 10917, 10718, 6178, -1428, -8421, -11692, -9511, -3229, 4236, 10103, 11575, 7453, 208, -6753, -11242, -10478, -5394, 2506, 9251, 11359, 8782, 2252, -5203, -10657, -10906, -6543, 806, 7590, 11149, 9543, 3917, -3388, -9540, -11252, -7713, -1083, 6121, 10680, 10235, 5381, -1675, -8363, -11120, -8874, -2859, 4310, 9862, 10972, 6932, -409, -6778, -10936, -9889, -4343, 2911, 8972, 10917, 8184, 1615, -5302, -10377, -10584, -6006, 1054, 7591, 10654, 9335, 3295, -4156]
3087d156n282j262L283O823O857M145p17m849p345n878k449K504O032P196M710
3102I612P05m077o837o329l558J397N319O809N959J604l194o011p233l788j72
3117i794M613O575O481K567j849n703p016n204p89L324O555O792L590p50m987
3132D405o756o183j720K433N841O983M690L21m161o277o322l466J646N201O868
3147C503N137J344k643o570o673l759Q4M517O465O204K385j939n503o572n011
3162i031q59L597O359O169L464r91m574o768n277j907K258O149O547M136J80l882
3178E570o714n808k992J468N449O617N026Q40l019o024o067l749O55M264O356
3193A872N778K046j898n780o232m570o73L897N959N870L267j159m603o444n497
$$ y = [-4156, -9438, -10700, -7417, -594, 6263, 10408, 9691, 4842, -2503, -8381, -10830, -8326, -2294, 4902, 9612, 10317, 6240, -597, -6926, -10484, -9087, -3768, 3041, 9000, 10604, 7410, 1399, -5834, -9622, -9794, -5181, 1394, 7875, 10442, 8593, 2890, -4126, -9330, -10119, -6795, -240, 6552, 10142, 9392, 4405, -2351, -8534, -10254, -7821, -1980, 5003, 9693, 10014, 5853, -424, -6746, -10212, -8566, -3365, 3503, 8640, 9984, 7341, 771, -5902, -9661, -9577, -5060, 1405, 7609, 9994, 8055, 2552, -4020, -9031, -9890, -6293, 66, 6235, 9699, 8708, 4134, -2634, -7911, -9818, -7560, -1411, 5136, 9272, 9452, 5570, -1144, -6952, -9944, -8476, -3027, 3590, 8616, 9456, 6437, 413, -5654, -9403, -8748, -4484, 1872, 7650, 9696, 7798, 2018, -4214, -8784, -9457, -5560, 399, 6269, 9536, 8377, 3774, -2670, -8167]
3208h167j348K777N498O148M055J92m487o017n860k503J985N031O551M637J175
3223I667l849n871n773l525J130M308O203N169J858k242n474o022m078l06L535
3238e270O029N909K597j261m852n921n389q63K642N382O282L667k48m257n927
3253a480n394k135J639N149O280M394N16l254n749n886l040J054M289N998M991
3268G372J883k461n430o146l853j6L783N912N200K725j341m886n954m783j094
3283i089L137N711N508L501q54l814n961n232j629J585N324N941M214J47l334
3298E155n772n500k624J064M705N608M786J220k635m958n921l232l7L722N856
3313A437N162K044j518m805n889m081p96L141N248N482L062n33m478n774m501
$$ y = [-8167, -9515, -6738, -1240, 4908, 8963, 9155, 4668, -1349, -7209, -9712, -7727, -2696, 3855, 8492, 9667, 5818, -53, -5826, -9351, -8221, -3913, 2290, 7459, 9317, 7075, 1601, -4421, -8499, -8805, -5270, 759, 6668, 9265, 8004, 3152, -2769, -8158, -9021, -6379, -997, 5285, 8952, 8704, 4447, -1480, -6874, -9009, -7370, -2221, 4059, 8453, 8969, 5715, -34, -5920, -8960, -7906, -3617, 2381, 7372, 9255, 6794, 1364, -4782, -8635, -8651, -4868, 1044, 6244, 8969, 7628, 2742, -3212, -7995, -9089, -5952, -241, 5267, 8768, 7914, 4100, -1861, -7093, -8722, -7137, -1813, 4128, 8342, 8489, 5155, -617, -6117, -8741, -7677, -2972, 2636, 7422, 8642, 6007, 1049, -4872, -8104, -8141, -4419, 1437, 6599, 8643, 7125, 2320, -3569, -7650, -8446, -5305, -57, 5425, 8487, 7954, 3476, -2298, -6799]
3328f799j961K266M983N819L732L34l588n365n470k581J128M636N590M441J601
3343H766k934n390n406l434M96L994N493M864J934j455m968n754m092j52K908
3358e130N455N206K780p88m345n439m807j243K308M877N402L873k27l415n560
3373a053m914k328J256M514N690M194R69k993n145n261k984O13L719N859M144
3388F280J927j931m565n415m094P3L141N170N071K538j225m071n710l914j344
3403h069K414M810N345L179m2l433n402m871k073J686M502N120M195M48k854n173
3419b18m823k607O71L609N595M495J286j929m669n094l588l15L600M786M735K260
3435G794r64m331n310m097p89K176N123N043K679l37l449n284m314j884J728M589
$$ y = [-6799, -8760, -6494, -1511, 4308, 8040, 8374, 4786, -579, -6049, -8630, -7502, -2866, 2724, 7165, 8766, 5832, 442, -4964, -8398, -7902, -3908, 1585, 6449, 8383, 6928, 1960, -3794, -7886, -8038, -5130, 325, 5531, 8311, 7523, 3178, -2261, -7068, -8311, -6003, -1126, 4276, 8149, 7922, 4507, -1053, -5967, -8295, -7039, -2525, 3165, 7359, 8328, 5335, 190, -5071, -8055, -7442, -3723, 2136, 6280, 8207, 6276, 1711, -3704, -7798, -7725, -4584, 586, 5657, 8195, 6970, 2899, -2811, -6725, -8069, -5655, -845, 4500, 7679, 7637, 4204, -1198, -6069, -8142, -6456, -1954, 3166, 7361, 7809, 4955, -218, -5041, -7648, -6977, -3368, 2227, 6722, 8008, 6079, 1410, -3684, -7272, -7587, -3987, 799, 5534, 7794, 6830, 2499, -2811, -6908, -7697, -5521, -398, 4645, 7324, 6987, 3538, -1746, -6060, -7944, -6216, -1627]
3451a627N251L498K70k791m921m966k300R62L785M976M415J076j981m804n069
3466d226l372M11L120N128M478J997j337m260m744m035p14K418M996M671K574
3481G105l38l486n004m239j340J784M231M710L747M4l119m525m546k365O88M181
3497b472N079L667J194k340m525m793l185P43K889N137M339J685j448m002n148
3512c180l254q55K662M642M732K418o22l415n013m169j203J787M323N007K955
3527F815L0k863m640m514k101J039L974N033L346R69k249m587m503k625J83L439
3543c254M652M225J510j594m007m621l459k90K738M430M571K153p17l776m725
3558b164l852j007J874M565M273K980J34l183m463m342j899J285M061M566L636
$$ y = [-1627, 3624, 7122, 7392, 4601, -320, -5286, -7586, -6624, -2839, 2137, 6552, 7628, 5647, 843, -4226, -7598, -7187, -4067, 1061, 5539, 7536, 6199, 1939, -2805, -6840, -7554, -5136, -140, 4531, 7105, 6767, 3281, -1723, -5962, -7302, -5518, -1287, 3423, 7170, 7214, 4095, -430, -4976, -7341, -6653, -2472, 2607, 6274, 7468, 5128, 603, -4190, -7375, -6632, -3743, 1394, 5733, 7418, 5970, 1968, -3180, -6434, -7289, -4627, 15, 4747, 7165, 6543, 3128, -1885, -6054, -7257, -5470, -1147, 3860, 6815, 6845, 3982, -658, -5172, -7273, -6234, -2260, 2773, 6119, 7088, 4839, 252, -4251, -6876, -6693, -3254, 1398, 5623, 7133, 5539, 1532, -3089, -6548, -6838, -4100, 330, 4901, 7054, 6337, 2561, -2164, -6016, -7023, -5149, -584, 3689, 6669, 6803, 3620, -843, -5185, -7084, -5799, -1738, 2828, 6464]
3573F464L11k529m220m431k271L01L502M558L819J617j831m209m476l230jK832
3589c794M285M469K095j304l577m804l061j216K161M297M486K769n96k742m615
3604a147m081j916J504M050M305L559M09k605m177m301k356L57L920M575L421
3619E517J317k001l774m518k742k23K925M229M160K014j339l447m750l101r35
3634f668K310M027M580K235l77l264m423l676j464J564L790M491K959M46k740
3649C790m166m242j997J021L127M589L568P65j830m232m063k673K87K836M120
3664I00M055J652j186l773m291l057n13J930L946M270K448l90l442m184l686j196
3680f517J572L737M519K778N8k684m074m085j680J049L439M019L544O85j842m056
$$ y = [6464, 6775, 4246, 26, -4405, -6676, -6375, -2873, 1685, 5504, 7121, 5290, 1081, -3395, -6625, -6626, -3794, 491, 4960, 7055, 5751, 2174, -2630, -5691, -6907, -4746, -449, 4037, 6806, 6210, 3468, -1147, -5228, -7144, -5640, -1590, 2715, 6274, 6683, 4078, -99, -4400, -6756, -6399, -2479, 2096, 5517, 6834, 4833, 1059, -3459, -6201, -6424, -3499, 730, 4890, 6904, 5565, 2118, -2632, -5733, -6668, -4358, -331, 4249, 6484, 6107, 2843, -1580, -5256, -6720, -5156, -1366, 3125, 6084, 6530, 3790, -376, -4618, -6615, -5594, -2467, 2122, 5690, 6455, 4625, 393, -3670, -6343, -6056, -3220, 900, 4955, 6607, 5421, 1648, -2643, -5700, -6213, -4283, -337, 3933, 6381, 5991, 2549, -1635, -5321, -6517, -4945, -1208, 3311, 6089, 6147, 3463, -611, -4696, -6376, -5327, -1888, 2131, 5675, 6360, 4518, 462]
3696D62m302k509N68K814M280L822J274j487l317m603k890j83K256M130L870K158
3712F343n75l196m331l582j183K044L789M014K515O1k937l989l495j894J253L444
3728a719M158L077N42k106l790m072k018L18K979M184L392J358j763l200m536
3743c196k597m3K579L888L757J720j045l124m016l271o94J920L842L821K571m04
3759E708k796l849l670j777J324L788L779K873K76j900m081l592k000N69K876
3774b472M307K877J036j233l803l965k435M8K583L648L786J673j223l042m179
$$ y = [462, -3840, -6349, -5781, -2967, 1313, 5135, 6409, 4922, 1605, -2998, -5888, -6071, -3815, 315, 4185, 6343, 5768, 2572, -1759, -5341, -6524, -4480, -691, 3323, 5838, 5899, 2962, -1027, -4522, -6416, -5163, -1719, 2439, 5516, 6058, 3952, 162, -3910, -5928, -5610, -2631, 1553, 4945, 6303, 4540, 1340, -3196, -5793, -5836, -3257, 631, 4388, 6108, 5063, 1939, -2077, -5348, -6042, -4122, -280, 3541, 6112, 5708, 2912, -937, -4607, -6384, -5060, -1272, 2507, 5380, 5656, 3756, -325, -3917, -5917, -5348, -2472, 1835, 4712, 5748, 4515, 712, -3253, -5688, -5640, -3057, 591, 4377, 6050, 4827, 1785, -2394]
$$ [...]
8191e30
##END NTUPLES=NMR FID
##END=
