##TITLE=1H_AP2712
 CDCl3
 8 sc, 
 28.12.2024
##JCAMPDX= 6.0         $$ Bruker NMR JCAMP-DX V2.0
##DATA TYPE= NMR FID
##DATA CLASS= NTUPLES
##ORIGIN= UXNMR, Bruker Analytische Messtechnik GmbH
##OWNER= root
$$ XWIN-NMR		Version 3.5
$$ Sat Dec 28 13:50:46 2024 Russian Standard Time (UT+4h)  she@DPX200
##.OBSERVE FREQUENCY= 200.1315
##.OBSERVE NUCLEUS= ^1H
##.DELAY= (6, 6)
##.ACQUISITION MODE= SIMULTANEOUS
##.ACQUISITION SCHEME= undefined
##.AVERAGES= 8
##.DIGITISER RES= 18
##SPECTROMETER/DATA SYSTEM= spect
##.PULSE SEQUENCE= zg30
##.SOLVENT NAME= D2O
##.SHIFT REFERENCE= (INTERNAL, D2O, 0, 15.7039)
##AUDIT TRAIL= $$ (NUMBER, WHEN, WHO, WHERE, WHAT)
$$ ##TITLE= Audit trail, XWIN-NMR		Version 3.5
$$ ##JCAMPDX= 5.01
$$ ##ORIGIN= Bruker BioSpin GmbH
$$ ##OWNER= she
$$ F:/spectra/data/she/nmr/H-F/1/audita.txt
$$ ##AUDIT TRAIL=  $$ (NUMBER, WHEN, WHO, WHERE, WHAT)
(   1,<2024-12-28 13:49:30.10 +0400>,<she>,<DPX200>,
      <created by zg, POWCHK disabled, PULCHK disabled
       configuration hash MD5:
       00 E9 B6 7A A2 85 ED C7 34 08 36 98 17 FE 4E 26
       data hash MD5: 16K
       0C 7B FC 22 D6 EC 58 F1 D5 6F 7F 91 0D 34 16 99>)
$$ ##END=
$$ 
$$ hash MD5
$$ 7B C3 E4 3B 4A 0B 2A 11 28 2B FD 38 9B 5A 01 DB
##$RELAX= 
##$RELAX= 
##$RELAX= 
##$RELAX= 
##$RELAX= 
##$RELAX= 
$$ Bruker specific parameters
$$ --------------------------
##$DU= <F:/spectra>
##$EXPNO= 1
##$NAME= <H-F>
##$PROCNO= 1
##$TYPE= <nmr>
##$USER= <she>
##$AMP= (0..31)
100 100 100 100 100 100 100 100 100 100 100 100 100 100 100 100 100 100 
100 100 100 100 100 100 100 100 100 100 100 100 100 100 
##$AQSEQ= 0
##$AQ_mod= 1
##$AUNM= <au_zg>
##$AUTOPOS= <>
##$BF1= 200.13
##$BF2= 200.13
##$BF3= 200.13
##$BF4= 200.13
##$BF5= 200.13
##$BF6= 200.13
##$BF7= 200.13
##$BF8= 200.13
##$BYTORDA= 1
##$CFDGTYP= 0
##$CFRGTYP= 5
##$CHEMSTR= <none>
##$CNST= (0..31)
1 1 145 1 1 1 1 1 1 1 1 1 1 1 1 1 1 1 1 1 1 1 1 1 1 1 1 1 1 1 1 1 
##$CPDPRG= <>
##$CPDPRG1= <>
##$CPDPRG2= <>
##$CPDPRG3= <>
##$CPDPRG4= <mlev>
##$CPDPRG5= <mlev>
##$CPDPRG6= <mlev>
##$CPDPRG7= <mlev>
##$CPDPRG8= <mlev>
##$CPDPRGB= <>
##$CPDPRGT= <>
##$D= (0..31)
0 1.2 0 0 0 0 0 0 0 0.06 0 0.03 0 0 0 0 0.0002 0 0 0 0 0 0 0 0 0 0 0 0 
0 0 0 
##$DATE= 1735379369
##$DBL= (0..7)
120 120 120 120 120 120 120 120 
##$DBP= (0..7)
150 150 150 150 150 150 150 150 
##$DBP07= 0
##$DBPNAM0= <>
##$DBPNAM1= <>
##$DBPNAM2= <>
##$DBPNAM3= <>
##$DBPNAM4= <>
##$DBPNAM5= <>
##$DBPNAM6= <>
##$DBPNAM7= <>
##$DBPOAL= (0..7)
0.5 0.5 0.5 0.5 0.5 0.5 0.5 0.5 
##$DBPOFFS= (0..7)
0 0 0 0 0 0 0 0 
##$DE= 6
##$DECBNUC= <off>
##$DECIM= 24
##$DECNUC= <off>
##$DECSTAT= 4
##$DIGMOD= 1
##$DIGTYP= 9
##$DL= (0..7)
0 120 120 120 120 120 120 120 
##$DP= (0..7)
150 150 150 150 150 150 150 150 
##$DP07= 0
##$DPNAME0= <>
##$DPNAME1= <>
##$DPNAME2= <>
##$DPNAME3= <>
##$DPNAME4= <>
##$DPNAME5= <>
##$DPNAME6= <>
##$DPNAME7= <>
##$DPOAL= (0..7)
0.5 0.5 0.5 0.5 0.5 0.5 0.5 0.5 
##$DPOFFS= (0..7)
0 0 0 0 0 0 0 0 
##$DQDMODE= 0
##$DR= 18
##$DS= 0
##$DSLIST= <SSSSSSSSSSSSSSS>
##$DSPFIRM= 0
$$ [...]
##$SUBNAM2= <"">
##$SUBNAM3= <"">
##$SUBNAM4= <"">
##$SUBNAM5= <"">
##$SUBNAM6= <"">
##$SUBNAM7= <"">
##$SUBNAM8= <"">
##$SUBNAM9= <"">
##$SW= 24.0689530833862
##$SWIBOX= (0..15)
0 0 2 0 0 0 0 0 0 0 0 0 0 0 0 0 
##$SW_h= 4816.95568400771
##$TD= 16384
##$TD0= 1
##$TE= 0
##$TE2= 300
##$TE3= 300
##$TEG= 300
##$TL= (0..7)
0 120 120 120 120 120 120 120 
##$TP= (0..7)
150 150 150 150 150 150 150 150 
##$TP07= 0
##$TPNAME0= <>
##$TPNAME1= <>
##$TPNAME2= <>
##$TPNAME3= <>
##$TPNAME4= <>
##$TPNAME5= <>
##$TPNAME6= <>
##$TPNAME7= <>
##$TPOAL= (0..7)
0.5 0.5 0.5 0.5 0.5 0.5 0.5 0.5 
##$TPOFFS= (0..7)
0 0 0 0 0 0 0 0 
##$TUNHIN= 0
##$TUNHOUT= 0
##$TUNXOUT= 0
##$USERA1= <user>
##$USERA2= <user>
##$USERA3= <user>
##$USERA4= <user>
##$USERA5= <user>
##$V9= 5
##$VALIST= <valist>
##$VCLIST= <CCCCCCCCCCCCCCC>
##$VD= 0
##$VDLIST= <DDDDDDDDDDDDDDD>
##$VPLIST= <PPPPPPPPPPPPPPP>
##$VTLIST= <TTTTTTTTTTTTTTT>
##$WBST= 1024
##$WBSW= 4
##$XGAIN= (0..3)
0 0 0 0 
##$XL= 0
##$YL= 0
##$YMAX_a= 738198
##$YMIN_a= -872476
##$ZGOPTNS= <>
##$ZL1= 120
##$ZL2= 120
##$ZL3= 120
##$ZL4= 120
##$ABSF1= 10
##$ABSF2= 0
##$ABSG= 5
##$ABSL= 3
##$ALPHA= 0
##$AQORDER= 0
##$ASSFAC= 0
##$ASSFACI= 0
##$ASSFACX= 0
##$ASSWID= 0
##$AUNMP= <proc_1d>
##$AZFE= 0.1
##$AZFW= 0.1
##$BCFW= 1
##$BC_mod= 2
##$BYTORDP= 1
##$COROFFS= 0
##$CY= 11.3945322036743
##$DATMOD= 1
##$DC= 2
##$DFILT= <>
##$DTYPP= 0
##$F1P= 15.6554695791079
##$F2P= 12.8336369535428
##$FCOR= 0.5
##$FTSIZE= 0
##$FT_mod= 4
##$GAMMA= 1
##$GB= 0.15
##$INTBC= 1
##$INTSCL= 1
##$ISEN= 128
##$LB= 0.24
##$LEV0= 0
##$LPBIN= 0
##$MAXI= 10000
##$MC2= 0
##$MEAN= 0
##$ME_mod= 0
##$MI= 1.114404
##$NCOEF= 0
##$NC_proc= 0
##$NLEV= 6
##$NOISF1= 3.799351
##$NOISF2= 2.8
##$NSP= 1
##$NTH_PI= 0
##$NZP= 0
##$OFFSET= 15.70392
##$PC= 1
##$PHC0= -26577.32
##$PHC1= 18.78744
##$PH_mod= 1
##$PKNL= yes
##$PPARMOD= 0
##$PSCAL= 0
##$PSIGN= 0
##$REVERSE= no
##$SF= 200.130013532006
##$SI= 16384
##$SIGF1= 3
##$SIGF2= 2
##$SINO= 400
##$SIOLD= 16384
##$SREGLST= <1H.CDCl3>
##$SSB= 0
##$STSI= 0
##$STSR= 0
##$SW_p= 3612.71676300578
##$SYMM= 0
##$S_DEV= 0
##$TDeff= 0
##$TDoff= 0
##$TI= <>
##$TILT= no
##$TM1= 0
##$TM2= 0
##$TOPLEV= 0
##$USERP1= <user>
##$USERP2= <user>
##$USERP3= <user>
##$USERP4= <user>
##$USERP5= <user>
##$WDW= 1
##$XDIM= 8192
##$YMAX_p= 0
##$YMIN_p= 0
$$ End of Bruker specific parameters
$$ ---------------------------------
##NTUPLES= NMR FID
##VAR_NAME=  TIME,          FID/REAL,        FID/IMAG
##SYMBOL=    X,             R,               I
##VAR_TYPE=  INDEPENDENT,   DEPENDENT,       DEPENDENT
##VAR_FORM=  AFFN,          ASDF,            ASDF
##VAR_DIM=   8192,          8192,            8192
##UNITS=     SECONDS,       ARBITRARY UNITS, ARBITRARY UNITS
##FACTOR=    0.0002076,     1,               1
##FIRST=     0,             0,               0
##LAST=      1.7004516,     0,               0
##MIN=       0,             -872476,         0
##MAX=       1.7004516,     738198,          0
$$ Real data points
##PAGE= N=1
##DATA TABLE= (X++(R..R)), XYDATA
0@%%%NpKqJ6j6J6j6K4l7L7m0N6o8P6r0J07j25J45j63J88k19K45k76L17l55L98
30B12m50N03n63O28o98P79q65R54j058J174j295J433j588J757j948K162k408K696
48A425l022L406l874M441n150O072p314R080j1772J6319k5372M9734k28425o78024
62h72476O56508P20006l37315l66865L60776L3655o53746p5570Q49625L59309
72F73907o56001n05128K60315K70219p3868P5135K40847j61603m74866r8507M24787
83b4763L80801p3148l55880k20572P0398J68413J02630J06227N2434k44181l71752
94d09393O8658M99892K17989l03127k59228M6217L392m2152K63581K91072k55077
105A21824m86714K2166L84289J30520p0360K6765j02667l18625j0263M34271K29773
$$ plain form
0 0 0 0 0 5 -2 0 -8 8 -8 8 -8 16 -21 16 -24 32 -36 40 -50 57 -68 77 -86 102 -117 128 -148 169 -186 212
30 212 -238 265 -298 330 -368 411 -454 500 -558 616 -679 754 -834 923 -1025 1137 -1271 1425
48 1425 -1597 1809 -2065 2376 -2774 3298 -4016 5064 -6708 9611 -15761 33973 -194452 -872476
62 -872476 -215968 504038 166723 -200142 160634 194289 -459457 -535027 314598 673907
72 673907 17906 -487222 -226907 43312 -30556 44579 285426 123823 -351043 -449550 -24763
83 -24763 356038 282890 -72990 -293562 -223164 -54751 47879 154106 206540 -37641 -409393
94 -409393 -340735 159157 377146 74019 -185209 -138992 -135600 -177752 85829 376901 121824
105 121824 -364890 -342724 41565 172085 101725 128490 25823 -292802 -303065 131206 360979
116C60979k55407k39047J5153j5501n87K81913K31375k79142m03646P0992L08221
127G5303O0282l4459P3182j15701l34087m402M23896K18952k43011k39162J9254
138i9953K9754k96J77131J89039j54395l35628n5648K38782J86009O51q2430j21602
150b8586j18723J4109J73420J67097o348j86618j94364Q885K04933J51643m3572
161A41876j15458p4541o7538j505J83335J94843j03244k85500o2756J75013R5703
172H0228j3977M6466j3059k10806j18089K17131K37064p8113j90842l0906J7142
183e7761k9499Q7572J75043l7618k40637q8441J42831J10354k7R737l4700j47521
195a10667o1580J50921J41878m5205r9526m3374m1531L033J30963J10229r1488
$$ plain form
116 360979 105572 -133475 -118322 -133823 -134410 147503 378878 99736 -303910 -232918 75303
127 75303 135585 101126 174308 58607 -275480 -279882 144014 362966 119955 -119207 -99953
138 -99953 -70199 -70495 106636 295675 141280 -194348 -249996 -11214 174795 175446 93016 -28586
150 -28586 -147309 -133200 40220 207317 200969 14351 -180013 -171128 33805 185448 141876
161 141876 26418 -48123 -115661 -117166 66169 261012 157768 -127732 -190488 -15475 80228
172 80228 66251 112717 99658 -111148 -229237 -12106 224958 146845 -43997 -74903 -57761
183 -57761 -87260 312 175355 137737 -102900 -191341 -48510 61844 61817 71554 36854 -110667
195 -110667 -172247 -21326 120552 75347 -24179 -67553 -109084 -106051 24912 135141 43653
206D3653j53335l173P6815K1535L1677O4641n7955j61834j3210J62049P9243p0766
218A9340m6672K918m7347k2764J06278R7318o9566j25903p603O8966L3581J1641
230B0187K0470k4219p4619k5678O8109P7200J137o5612n5747R908M8593J9433
242A9162m871J6985p469p2972k7982J00390P7570p7362q4235N1602N0806o3279
254b1655j8535J06692K3476j39749m4551J41915N6055j21842l3031J18501K133
265F9409j34877J1647J51060p501j49843L644J38297p813j25339K0754J23627
276I3065k6925j22785K7885J15699l1535j10975L3429J09228k8473j07219J6710
287c1896R8254j0882q6638J5420Q4267k6955j03509J9727J16566L18j13221j7094
$$ plain form
206 43653 -109682 -112855 -36040 -14505 17172 81813 23858 -137976 -151186 10863 90106 19340
218 19340 -27332 -24414 -71761 -94525 11753 109071 39505 -86398 -94001 -25035 8546 20187
230 20187 40657 16438 -58181 -83859 -15750 61450 62587 -3025 -58772 -48864 -271 19162
242 19162 14291 31276 23807 -49165 -77147 23243 100813 23451 -60784 -9182 41624 -21655
254 -21655 -40190 66502 89978 -49771 -94322 47593 103648 -18194 -51225 67276 69409
265 69409 -65468 -53821 97239 89738 -60105 -56461 81836 74023 -51316 -30562 93065
276 93065 66140 -56645 -28760 86939 55404 -55571 -22142 87086 58613 -48606 -31896
287 -31896 66358 55476 -31162 -15742 68525 41570 -61939 -42212 74354 74672 -38549 -55643
299e5643Q9041N775p8291K0056R6832l2785j32241R249J38039J5878j12446j1425
311d7961Q0671l2983q7796O9415J28552o2248j56328J9923J30633l518q1606L8305
323d941O1734r4358r9691J07879J47009o3412j41425J7436Q0414l1323l0680R1980
335D0622M6507j32925j08421J01997J39070l5749r3168J6508K2841p0755j0514
346h3987J38713P2072j37935j34873O8101J22367r730m4875L7847j455j19414
357i3169l7332J61599J21910j09684j46870K8650Q0101j5367N271R4952m362j71621
369h5922p7200J59880J47370o8158j12252J2030J2802o0289L9451J62750K1588
380A52050j94425j16066J17733J32673j8371m0792J7274n1348j14690L6561J94444
$$ plain form
299 -55643 33398 39173 -39118 -19062 77770 44985 -87256 -78007 60032 75910 -36536 -47961
311 -47961 32710 -273 -88069 -18654 109898 47650 -108678 -88755 41878 38360 -43246 -4941
323 -4941 56793 -37565 -137256 -29377 117632 54220 -87205 -69769 10645 -20678 -51358 40622
335 40622 87129 -45796 -154217 -52220 86850 51101 -42067 -25559 -2718 -73473 -83987
346 -83987 54726 126798 -11137 -146010 -77909 44458 34728 -10147 27700 26245 -93169
357 -93169 -130501 31098 153008 43324 -103546 -74896 5205 -10162 -4891 90061 85699 -85922
369 -85922 -163122 -3242 144128 75970 -36282 -24252 -11450 -71739 -32288 130462 152050
380 152050 -42375 -158441 -40708 91965 73594 32802 50076 -1272 -115962 -79401 115043
391A15043O6994j57504j31381M5082P5832J1344L9219N6527p8122j65607o335
402a28908J82542J10730q4973j10726j3357M87o135Q7520J19572n1528j91014
413h5790o6541J30182J20513r805m4564l2113p6282n9458R8158J70743K012j71244
425b4189j02874N4513P7870L7969M4817m03j25475j25441O4057J83565O1764j02964
437D3209j03163k6088M728M9431J15448N4768j18614j62041k205J35521R8635
448H9629l059n6121q2698p7765K0268J41742J10876n9896j53236p1065N0644R3549
460B868P5431J8181p9236j28897m1332J04798J38108K8571r1521j11545m4352
471a28926M8718J10920Q4650l0766j26204r3978K8230J13512R6282R60r5770j11986
$$ plain form
391 115043 182037 24533 -106848 -61766 14066 25410 64629 121156 43034 -122573 -128908
402 -128908 53634 164364 79391 -31335 -44692 -44205 -50340 37180 156752 105224 -85790
413 -85790 -152331 -22149 98364 88559 43995 11882 -64400 -123858 -25700 145043 147055 -24189
425 -24189 -127063 -72550 5320 43289 88106 87703 -37772 -163213 -99156 84409 146173 43209
437 43209 -59954 -86042 -81314 -31883 83565 138333 19719 -142322 -144527 -9006 89629
448 89629 86570 30449 -52249 -130014 -109746 31996 142872 82976 -70260 -141325 -90681 2868
460 2868 78299 96480 17244 -111653 -152985 -48187 89921 118492 26971 -84574 -128926
471 -128926 -80208 30712 115362 84596 -41608 -135586 -107356 6156 102438 103398 7628 -104358
483a04358k3120R1101J19674L7459p3777j15365n7244N1180J22512Q3877m2095
494H9844j26711q2102L3003J01769Q6442J1817q2578j22486l8472J02184J38003
505A10713K5340r6552j03591l0615M0539R0830R2001q195j36014j17534M3627
516h9451J38918P2452l1117o8683p5691n0507N3678J46940O9819j08539j47452
527h9633j3119Q5315O7660L9575J1983q0519j33116r316J51724J17580n0978j14784
539a7628m8568J655K4631Q4803R1115m7970j63146o7016J05788J15664O666m2518
551D3476m2000o9205m4370Q4416J45472Q559j45125j00298M3699P7169L1262K9922
563F2977P353r7215j16332M4322J65527N7747j00571q8135J215P100R335Q9051
$$ plain form
483 -104358 -127478 -36377 83297 120756 46979 -68386 -125630 -74450 48062 131939 89844
494 89844 -36867 -118969 -85966 15803 102245 114062 31484 -91002 -129474 -27290 110713
505 110713 136053 39501 -64090 -94705 -54166 36664 128665 120470 -15544 -133078 -89451
516 -89451 49467 121919 90802 22119 -53572 -104079 -50401 96539 166358 57819 -89633
527 -89633 -102752 -17437 50223 89798 101781 21262 -111854 -121170 30554 148134 97156 -17628
539 -17628 -66196 -64541 -39910 44893 136008 88038 -75108 -142124 -36336 79328 85994 43476
551 43476 1476 -67729 -112099 -27683 117789 126348 -18777 -119075 -75376 1793 33055 62977
563 62977 70330 -26885 -143217 -98895 66632 124379 23808 -64327 -63112 -56012 -46677 42374
575D2374Q0575r0088j67360m88J50052O9225n5209l1686l234o7853m5387J13759
587e320J41251n6080j69154l1967R9873M3462j6845L7036J7679j12480r7001R9611
599d9935J58416j7245j26461l0954M3087j1625m331R5541N5956j20479j30478
610a38508O4331J40750M683p2325o93R100o7816j9539J21587Q8662r4642j26742
622i1152K5867R0056N446j8850L8867l520j01189m1517J11408R6473n5293r2153
634c5557M651L4648j5134Q726P2067J3479j04625o9514P6206R4335k2729n8893
646b340Q426Q231m8308j995R3422M4802r2737q3121N0564P1325k2531k6495M1926
659D1169j343q7333j7938J05603N2738q1649n9226M5004K5476m2107Q255O9702
$$ plain form
575 42374 122949 32861 -134499 -134987 15065 84290 29081 -2605 -5839 -73692 -119079 -5320
587 -5320 135931 79851 -89303 -121270 -21397 22065 5220 42256 59935 -52545 -149546 -49935
599 -49935 108481 91236 -35225 -66179 -23092 -34717 -39048 56493 112449 -8030 -138508
610 -138508 -74177 66573 71256 -1069 -1762 7338 -60478 -80017 41570 130232 35590 -91152
622 -91152 -65285 24771 30217 11367 50234 46714 -54475 -95992 15416 111889 56596 -35557
634 -35557 -30906 3742 -11392 -2666 69401 82880 -21745 -91259 -15053 79282 56553 -2340
646 -2340 6086 14317 -33991 -35986 57436 102238 9501 -73620 -23056 48269 25738 -757 41169
659 41169 39826 -47507 -65445 40158 92896 11247 -47979 -2975 22501 -19606 -11351 58351
671E8351j0331r5550j6294Q4441L1808n2714j7518L1923j3634m3770K4877O2677
683D4266r793o4585j3701M1768J6061k1901qK0113j2993l7013N528M6023J2696
696B6461l8488k3838K2707J8652j8607r271K6820P609l7837j5730M0574K1431
708B0483l5011j8480L1459J1386l3241n857L6187M679l6144k246L6265J85l6185
721b6520J712L4798n60k7679L028K0000j0018j4667J7408J8387j3884j9332K942
734a4385J1224N498N642K355j3307j3764O202J5771P782Q80n956j9234j0790K1669
748d13K8277m882k0971o515j423n427J7147L2393m105m3855k0383K7380K7319
761B4542m73l210k432k4792k3767K5301M8754L944m0171k6053M785J2473J7663
$$ plain form
671 58351 48020 -47530 -63824 20617 52425 -289 -17807 14116 482 -43288 -18411 44266
683 44266 34473 -30112 -43813 -2045 14016 -7885 -7893 12220 -773 -37786 -32258 13765 26461
696 26461 -12027 -35865 -13158 5494 -13113 -22384 4436 12045 -25792 -41522 -948 20483
708 20483 -14528 -33008 -1549 9837 -23404 -29261 6926 11605 -24539 -26785 9480 9665 -26520
721 -26520 -24808 9990 9430 -18249 -15221 4779 -5239 -19906 -2498 15889 2005 -17327 -14385
734 -14385 -3161 2337 7979 10334 -2973 -16737 -10535 5236 13018 13898 7942 -11292 -22082 -413
748 -413 27864 22982 2011 -4504 -5927 -11354 5793 38186 34081 -9774 -30157 -2777 24542
761 24542 24069 20859 18427 -6365 -30132 -4831 43923 47867 7696 -18357 -13572 -1099 16564
774A6564K4040j112l9839l5690J4757M5010K4111j4711k9974k2970m771K0116
786d469L6810J9824k5884n1712k1772L5172N0451P789k9716k5219j6709j0322
798c5757K7191N8642J0225o8026n5683K7170N1436R292m234N565l3903o1700J4500
811e5282R3694L5761o9156n5241J6794J4783l965M0067M6458m8658r6615J290
823h0070R1104M2044l5927k7024o644l2317j4056O6043P1418l4743r3767k5623
835g9562N1278M3046R639K922j6509n5861l7604M9728Q9610J3501p5305n9357
847f4474J3735L6339K2091K7833J5191n3095q1498R059J01809N4824n1432n8183
859b7801m920j684k104N9019O8756m4884j15553j7517Q9211N2574k0473j1104
$$ plain form
774 16564 40604 39492 -347 -36037 -21280 23730 47841 33130 3156 -19814 -24585 -4469
786 -4469 32341 52165 26281 -25431 -47203 -12031 38420 46209 16493 -8726 -25435 -35757
798 -35757 -8566 50076 60301 -7725 -63408 -36238 15198 24490 20256 25821 -8082 -69782 -55282
811 -55282 38412 74173 5017 -50224 -33430 -18647 -22612 17455 63913 15255 -81360 -80070
823 -80070 11034 53078 17151 -9873 -16517 -48834 -62890 3153 74571 39828 -53939 -79562
835 -79562 -28284 14762 24401 27323 10814 -45047 -82651 -32923 56687 70188 -5117 -64474
847 -64474 -50739 -14400 7691 35524 50715 -2380 -83878 -74819 26990 81814 30382 -27801
859 -27801 -32721 -34405 -36509 22510 91266 46382 -69171 -86688 2523 55097 34624 23520
871B3520n659n8860m0241P8353J05576k5186j08083l3178M3999K6476J3636M2216
883F2569K181q9234o8564N8953J04649J2845o2892m0023r155p940K6438P5584
895F5411L0076q0906r2605J5123Q5849M2662j7197k4803l1486m6923j90Q6006
907C1017P4002m6968j04086k4962N4240M0487J4851J8419k1445q4957m3893P9070
919a4225J00270j2264q2151l5153Q928K242L0583P1445O771j01723p6933N2721
931d9489R0639J3816l2377j9394l2016m4864K6858R8615L8348q1015q3985J0636
943f4228N2506K6396J9243J0963m8233p8546J081R3194O3183l7459o7927k3163
955e2990O859J7160M6912M6985k9379r2102l7233O3278P3189N701l5073l1780
$$ plain form
871 23520 17861 -40999 -81240 -2887 102689 77503 -30580 -63758 -19759 6717 20353 62569
883 62569 64750 -24484 -93048 -34095 70554 83399 20507 -19516 -28671 -36611 -10173 65411
895 65411 95487 14581 -78024 -62901 22948 65610 48413 23610 -7876 -54799 -54989 31017
907 31017 105019 58051 -46035 -70997 -16757 23730 38581 57000 35555 -49402 -93295 -14225
919 -14225 86045 73781 -8370 -43523 -34595 -32353 -1770 69675 76446 -25277 -102210 -49489
931 -49489 41150 54966 22589 3195 -28821 -73685 -46827 51788 90136 9121 -74864 -64228
943 -64228 -11722 14674 33917 44880 -3353 -81899 -80818 12376 75559 38100 -29827 -52990
955 -52990 -46131 -28971 17941 64926 35547 -56555 -93788 -30510 42679 48380 13307 -18473
967a8473l0725j3676M6918P6906O383q1377o2866K3573N6223K8033P863j0020
979B8762n1645n2271K5976Q6344L8440m9903o0881j2249J7985K7756M1601K2466
991F2381m6128p2337o944O4270N3103n036l4734l4294k3264J0887N3618M6071
1003F7593j9480o4917l5751K4052M7368K9461j000l2107m5600j5948L8175N5159
1015D7005J5321l8196m9399j6728K6921M3966K5392j4804m3981l4447P543M2139
1027A0732L8942J004m1572m4472l204L8766L8994O427k5358l6133k3003J4135
1039b4742M5582L1629j8877m9825k4947J7945L1252K1832N311k2889m3592j7001
1051d8322L7756M7291P22l4811k6923m781O852K3279L1568m59m5904l6626J8872
$$ plain form
967 -18473 -49198 -62874 -15956 60950 67333 -14044 -76910 -53337 2886 30919 38782 28762
979 28762 -22883 -75154 -49178 37166 75606 25703 -35178 -47427 -29442 -1686 39915 62381
991 62381 16253 -56084 -63028 1242 54345 49309 14575 -19719 -42983 -32096 21522 67593
1003 67593 48113 -16804 -52555 -28503 18865 48326 47326 15219 -30381 -46329 -8154 47005
1015 47005 62326 24130 -25269 -41997 -15076 28890 54282 39478 -4503 -38950 -31407 10732
1027 10732 49674 50678 9106 -35366 -38570 196 39190 45617 20259 -15874 -38877 -24742
1039 -24742 20840 52469 33592 -16233 -41180 -23235 8017 29849 35160 12271 -31321 -48322
1051 -48322 -10566 36725 37447 2636 -24287 -29068 -22216 1063 32631 32172 -13732 -50358 -31486
1064c1486M2359J2570j2212j2262j8101k0049J1611M5040K0269l5720l9967M602
1076c3346K5032Q706N059J1492j4096m2075p638M7823L3955k4816l3180L296Q457
1089a1331r060J0420L6374j363n3069k2868M3885L3504k1102j7750J5760m040
1101f40l2812Q858N3413Q712n3304k4222L7178K1001k3430k396L1006q544m7429
1114c2609K394N5127J2903m4448j5371L0937M720k8258Q114L9802p637m8897j878
1127b5101M7645Q559l6872l088L1018n931l5627J0666M2696n273m4251m12L9397
1140B3426J55l3787M525L4206r192l7448R397L9230q772l6729Q295L5032j0653
1153A7685l4900J1708L3922j2585l3614J3771L2416j7599l3992J8627L5931j7052
$$ plain form
1064 -31486 10873 23443 11231 -1031 -19132 -39181 -27570 17470 37739 2019 -37948 -33346
1076 -33346 -8314 392 5451 16943 2847 -39228 -46866 957 34912 10096 -23084 -19788 -11331
1089 -11331 -20391 -9971 26403 25040 -28029 -50897 -7012 26492 5390 -12360 3400 -640
1101 -640 -33452 -24594 28819 37531 -15773 -39995 -2817 18184 -5246 -7642 23364 14820 -32609
1114 -32609 -30215 24912 37815 -6633 -22004 8933 13653 -14605 -6491 33311 25674 -23223 -25101
1127 -25101 22544 31103 -5769 -8857 22161 16230 -19397 -8731 33965 28692 -15559 -15971 23426
1140 23426 23581 -10206 -5681 28525 19333 -18115 -8718 30512 21740 -14989 -6694 28338 17685
1153 17685 -17215 -5507 28415 15830 -17784 -4013 28403 10804 -23188 -4561 31370 14318
1165A4318l5953J4006L0006j6315k6795K2055K7625k5871l4866K1897L6185j5617
1177A0675l0141J4234K0448k3858k0162L2621K8120l1608l5847K0196L0362j3515
1189A525j8140J9950J0662l3960j9118L8672L2148k8204l3769J3769J9171j4488
1201a1782m478K9484O893m1616k3469L5322L3634j6956k3606Q234L790k0811M014
1214b1347L9736J1549m1525k9824K2407K9213l169p429P424q806k9237Q73M3394
1227A3259K3209k9275l2521L707J5956N346R594J4951j2959l7566r526L6998L2013
1240C3186r212k5627j0035k427N63J9923K8869m547l9800k4426K0288L2163J0366
1253B9284q019j3354j9865j3740J9321L9030J0097l0321l0903k399J6697K1168
$$ plain form
1165 14318 -21635 -7629 22377 6062 -20733 1322 28947 3076 -31790 -9893 26292 10675
1177 10675 -19466 -5232 15216 -8642 -28804 3817 31937 329 -35518 -15322 15040 1525
1189 1525 -16615 3335 13997 -19963 -39081 -409 31739 3535 -30234 -16465 2706 -11782
1201 -11782 -16260 13224 20117 -21499 -44968 -9646 23988 7032 -16574 -8340 -4550 -25361 -21347
1214 -21347 18389 29938 -11587 -41411 -19004 10209 7040 -389 7035 -1771 -31008 -30135 13259
1227 13259 36468 7193 -25328 -21621 -5665 -319 9275 24226 11267 -26299 -35825 1173 33186
1240 33186 23974 -1653 -11688 -14115 -13552 6371 35240 30693 -9107 -33533 -13245 18918 29284
1253 29284 21265 7911 -11954 -25694 -6373 32657 42754 12433 -18470 -20869 -4172 16996
1265A6996J7025l790l0950k8551Q519L5965K3230q041k5493k4025n478K1543L3082
1278C0032J0015k3950l3144j2319J6820L2559K0257j4420l5926k2322J1095K9961
1290H658K4056k14k7353l4843o635L1639L6192L411k6610k9137j3331J2462L4654
1303A2949K6324j4516m2926k4678J5054L3723K3427l840k6432l1841q619K6533
1315a4842L9611J2004k9020m0879j1071K4771L3142J4069j0816k8550k9621o02
1327d1804L8745M0641p496m4493k5787Q815K0148K1762K0537j0537m8390k9481
1339e7340L2921N0998O986k7470k1042j2692q288K3279M7972R566n0711m3279
1351d9100J4697L7912J7462L296o842k9686l3101J3355N4373K8664l0703m2966
$$ plain form
1265 16996 34021 30231 -719 -29270 -20751 15214 38444 30403 4910 -19115 -24593 -3050 30032
1278 30032 40047 16097 -17047 -29366 -12546 20013 40270 25850 -10076 -32398 -21303 8658
1290 8658 32714 32500 5147 -29696 -36331 -4692 31500 34911 8301 -20836 -34167 -21705 12949
1303 12949 39273 24757 -18169 -42847 -27793 5930 29357 25517 -915 -32756 -41375 -14842
1315 -14842 24769 36773 7753 -33126 -44197 -19426 13716 27785 16969 -11581 -41202 -41804
1327 -41804 -3059 37582 30086 -14407 -40194 -31379 -11231 10531 31068 20531 -27859 -57340
1339 -57340 -24419 26579 33565 6095 -14947 -27639 -35927 -12648 35324 44890 -5821 -49100
1351 -49100 -34403 3509 20971 24267 17425 -12261 -45362 -32007 22366 51030 20327 -22639
1363b2639r630J4953J9611K3696J3774k5146m7863j1724M3883M4023m570l3186
1375E182k0725n802L056K6692L8477k920n4216l5734K7067M3434R015j0695q926
1388A3905k3437k6979J8301N8097J8504m7367m2671J0112K4314P730J5045J4982
1400D0536k9514n2635L023N9135L1024k8103l2017l974k956j631L0900L7231k1548
1413B9471o0855j4859M3693L1779p179j0314o648k5748j9682L2526N2094l509
1425D0769n4688k6777K2035K1416L546J2227N468l5117l9099J8730N6157J4137
1437C8804l5859k6379K637J791L447K8054K4464k9808n1868Q23M6569K2329j6123
1450H881j2083k976j9158j2430L4604M2643j5879n2841j2014L1388J6061m275
$$ plain form
1363 -22639 -32269 -17316 2295 25991 39765 14619 -33244 -44968 -1085 42938 38368 5182
1375 5182 -15543 -21345 -18289 8403 46880 43960 -10256 -45990 -18923 24511 33526 22831 13905
1388 13905 -9532 -36511 -18210 39887 58391 11024 -31647 -21535 2779 10509 25554 40536
1400 40536 11022 -41613 -38590 20545 51569 23466 -8551 -12525 -15481 -17112 13788 51019 29471
1413 29471 -31384 -46243 -2550 29229 22050 11736 5088 -20660 -40342 -7816 44278 40769
1425 40769 -13919 -40696 -18661 2755 6301 18528 23996 -11121 -50220 -31490 24667 38804
1437 38804 2945 -23434 -20797 -19006 -15559 12495 36959 7151 -44717 -43894 2675 25004 8881
1450 8881 -3202 -6178 -25336 -37766 -3162 39481 23602 -29239 -41253 -9865 6196 1921
1462A921R506M408l4163k9367L0404M9502m256l9607j0923J1884j742J484K9867
1475A8918J3822l8284l7231K0447M0954K886j8224k437l383j8927J310L6599K1395
1488C7845k7844l5131N025K3937O906l88O916p591k7338p619L1276K7435j2374
1501B1055k7233n037R211J817N893J7478J271k9907k0145K1355K8477l238j6228
1514D769j935j496j1334M615K6749R075k6286k1711J1362J7535j397j438O712
1527A5220q308k1679J523K7420J0629j7465j4103K747L527j959Q684J1269q698
1540H807k0680k283J7124Q456n237m891j945o584k701J0304J0812m688j2646m656
1554a0808M995N171J883J630j861q767m523O177Q829L5n782m485j258J522L692
$$ plain form
1462 1921 11427 15835 -18328 -47695 -17291 32211 27955 -11652 -22575 -10691 -12433 -10949 18918
1475 18918 32740 -5544 -42775 -22328 18626 21512 3288 851 -2532 -21459 -20149 16450 37845
1488 37845 10001 -25130 -20105 3832 10738 10350 17266 9675 -17663 -25282 5994 33429 21055
1501 21055 -6178 -11215 -2004 -187 5706 23184 24455 -5452 -25597 -4242 24235 20997 4769
1514 4769 2834 1338 -9996 -5381 21368 30443 4157 -17554 -6192 11343 9946 8508 15220
1527 15220 6912 -14767 -13244 14176 24805 7340 -6763 -4016 -489 -2448 6236 17505 8807
1540 8807 -11873 -14156 2968 11424 6187 1296 -649 -7233 -9934 370 11182 6494 -6152 -10808
1554 -10808 -5813 -642 1241 2871 1010 -7757 -12280 -6103 2726 2761 -3021 -7506 -8764 -7242 -3550
1569c550L722q03n463l166J536L356J999j58r87l921j836L798L996j829k927J571
1585d662J164k601k28M296J138n086j348N987J714o561j171P562J517o486p03
1600e468O905j097p453K926J0652j611j1780j62J0811J031p472K486Q636o452
1614A952j2042P622J6323l421j4729O87R734l163o230J0369R761j3081j6369R445
1628c142J9018k271j3383K240N946j0238n886J7537J4783j6070k1139P326J6934
1641A1655j479p619P533L203j8705j0318K2066K0561j4177k1744M527J0998o275
1654B26k016J7736M680k6802j7222K1433K4057r234j7143M026L065j4472M29K7478
1668A6241R911k9038k3166J6106K0813n046o050Q252n102k4376r47L3351J5579
$$ plain form
1569 -3550 172 -631 -6094 -9260 -7724 -4368 -2369 -2527 -3514 -7435 -9271 -5473 -1477 -3306 -6233 -4662
1585 -4662 -3498 -6099 -6327 -2031 -893 -5979 -7327 -1340 374 -6187 -7358 204 1721 -4765 -5468
1600 -5468 1437 340 -7113 -4187 6465 4854 -6926 -7088 3723 4754 -2718 -232 8404 1952
1614 1952 -10090 -2468 13855 10434 -4295 -3608 6126 2963 -3267 7102 16863 3782 -12587 -3142
1628 -3142 15876 13605 222 2462 8408 -1830 -7716 9821 24604 8534 -12605 -5279 11655
1641 11655 10176 2557 10090 13293 -5412 -15730 6336 26897 12720 -9024 -4497 6501 226
1654 226 -1790 15946 20626 -6176 -23398 -1965 22092 12858 -4285 -259 2806 -11666 -11237 16241
1668 16241 26152 -2886 -26052 -9946 10867 5821 -229 8023 2921 -21455 -22402 10949 26528
1681B6528k5180k2047Q882J0039m845N640J8015q307l3031p429L2032K0414j5920
1694D791j5391L241k770j0512J3473K8626l897l6363j3488K2878J8116n147k105
1707A452L750j5163k1382J4181L6877M751l1558j6726J1863P600n71J3217J2535
1720B0826k0604l2681P434L6743J2116j9327j2474K161o911l806K4042K4460j8137
1733A3842l7246k618K7460J4026m979p70k522k0514j2801K5611L3692p431l3682
1746g932j0988J3590Q395M092J3306K182k7621k4334J8074L5831N187k2204j3223
1759e645n58k874N309K4825J3162k5845l2331M555K9131J2584o128o174q616j7582
1773a6187j654K8709K4012j4778l1661q186J3719J1974P650P568q693k7235j2323
$$ plain form
1681 26528 1348 -20699 -11817 -1778 -6623 -983 17032 8725 -24306 -31735 297 20711 4791
1694 4791 -10600 -7359 -10129 -20641 -7168 21458 17561 -18802 -32290 -9412 8704 3557 1452
1707 1452 5202 -9961 -31343 -17162 19715 24466 -7092 -23818 -11955 -4355 -4926 8291 20826
1720 20826 222 -32459 -25025 11718 23834 4507 -7967 -5806 -12717 -16523 7519 31979 13842
1733 13842 -23404 -26022 1438 15464 10485 9715 7193 -13321 -26122 -511 33181 25750 -7932
1746 -7932 -18920 -5330 3065 7157 20463 22645 -4976 -29310 -11236 24595 29782 7578 -5645
1759 -5645 -6203 -9077 -3768 21057 34219 8374 -23957 -19402 9729 22313 16185 10011 1395 -16187
1773 -16187 -17841 10868 34880 20102 -11559 -19745 -6026 5948 13598 21166 12473 -14762 -27085
1786b7085K2626K8151N00k0940j4646l603L313J4330J9200r40k6971k1380Q929
1799a8516K4120J2157m412j2943j5760p873J1232K5035R827j7033k4137o402J2584
1812a2121J6527J1059l369j7597j9740Q85K2779J9321l481j9196j5367j418J0817
1825a0901J8351J0880j0929k4248j0847J3113K0941R050o624j5550j4727l15J8227
1838c579J9921J21j8762j6762j672J3045J7316Q378r572k0540j0836J0077J9514
1851F649J1422n217j6805j4235J151J7679J6879K2j5258j5267l339J0753J7842
1864A2276R344r770k0769q666J0455J7332Q452m015j3340j4109p42J6026J7959
1877B0433O79j6881j5634N06J1231J2428O523n126j6919j3111P522K0735J0170
$$ plain form
1786 -27085 -4459 23692 24192 3252 -11394 -14997 -11684 2646 21846 20906 -6065 -27445 -18516
1799 -18516 5604 17761 13349 406 -15354 -23227 -11995 13040 22867 5834 -18303 -24705 -12121
1812 -12121 4406 15465 12096 -5501 -25241 -24356 -1577 17744 14263 -4933 -20300 -21718 -10901
1825 -10901 7450 18330 7401 -16847 -27694 -14581 6360 15410 8786 -6764 -21491 -21806 -3579
1838 -3579 16342 16463 -2299 -19061 -20733 -7688 9628 18006 8434 -12106 -22942 -12865 6649
1851 6649 18071 12854 -3951 -18186 -17035 644 17523 17545 2287 -12980 -16319 -5566 12276
1864 12276 21620 11850 -8919 -17585 -7130 10202 18654 14639 1299 -12810 -13552 2474 20433
1877 20433 21112 4231 -11403 -10897 334 12762 19285 14159 -2760 -15871 -8349 12386 22556
1890B2556r444j4566o762R93P303J4308P534j3559k0706k018J6884J2561j763
1903A3321n523p767j0155k002J6548J6856o281k1352p420Q613P889L673N083k490
1917H993j6982j1521J2759K0618L29j4822q078J388l08L011J3381N538j6242j8352
1931b0288O284J8760M066q506k330j569r423k300J7640J3604j3227j9947K440
1944a4796J3806J200l747O942P25j7304q307J8226J6914r152j5729J798O739m466
1958g151j02J3585L998j8460j2452J3910J5263m701r270L431J925r743j324J6805
1972E714Q318j5537j3628R193J2039m765m977Q402K392j4680m914J6998J0933
1985A5488j3173j1366Q647P274q556k140J3303K589j6434o505J6296Q689j2210
$$ plain form
1890 22556 13112 -1454 -8216 -7223 80 14388 21922 8363 -12343 -14361 2523 15084 13321
1903 13321 7798 31 -10124 -12126 4422 21278 14997 -6355 -13775 -5162 2727 6400 11483 8993
1917 8993 -7989 -19510 -6751 13867 14196 -626 -8704 -7316 -7624 -4613 8768 14306 -1936 -20288
1931 -20288 -14004 4756 8822 316 -2014 -3583 -13006 -15306 2334 15938 2711 -17236 -14796
1944 -14796 -990 210 -3537 3405 4130 -13174 -21481 -3255 13659 4507 -11222 -9424 -2685 -7151
1958 -7151 -7253 6332 10330 -8130 -20582 -6672 8591 3890 -5380 -1949 -24 -9767 -11091 5714
1972 5714 14032 -1505 -15133 -5940 6099 1334 -3643 4759 7151 -7529 -12443 4555 15488
1985 15488 2315 -9051 -404 6870 -1686 -3826 9477 12066 -4368 -10873 5423 14112 1902
1998A902n835J0409J429j1826k34J5533K461j6150m468J3248M628j0902j793J1214
2012I616m97j3137J3J4101J186j2830k203J1221J205j0628m01J1240m89j2193
2026c796L66J1798o72j2019M75J1884p31j1963N43J0670j400j0460K432J0653
2040G780l415j2273K698J1772j419j0454J342Q020l791q676N691J0030m934j1842
2054i471J793R391o8p079L138N019o999p699P529J0579l650j0593K41O373j897
2069c393k571O224L899r235q691O507J1202j681p241Q00J424m993n06J0302N148
2084G195r630r831M333Q014J473j788J458k134p988o06J0957P398n808q713j348
2099g018K707K912M853L175l454r328l368P663R382O88n250n784k825J459O845
$$ plain form
1998 1902 -3933 6476 7905 -3921 -4155 11378 13839 -2311 -6779 6469 11097 195 -1598 9616
2012 9616 9119 -4018 -4005 10096 11282 -1548 -3751 7470 8675 -1953 -2354 8886 8397 -3796
2026 -3796 -3430 8368 7696 -4323 -3848 8036 7305 -4658 -4115 6555 5155 -5305 -2873 7780
2040 7780 4365 -7908 -5210 6562 5143 -5311 -3969 4051 260 -8416 -2725 7305 2371 -9471
2054 -9471 -7678 1713 1645 -5434 -2296 2723 -4276 -11975 -4446 6133 2483 -8110 -7869 -1496 -3393
2069 -3393 -5964 260 4159 -5076 -13767 -7260 3942 2261 -4980 -4180 -2756 -7749 -8255 2047 7195
2084 7195 -2435 -12266 -7933 81 1554 -234 1224 -910 -8898 -9504 1453 8851 3043 -5670 -7018
2099 -7018 -4311 -1399 3454 6629 3175 -6153 -9521 -1858 7524 8212 2962 -2822 -5647 -4188 2657
2114B657P407l91r537p155K213Q020O288K83n202p925l321N654R927L730n626
2129G022q004n041K339R632Q026k513j0770p214K334P581P032K318n787j1448
2143d493n176Q696J2690K105q131p863l640N04Q314J0685p70j3830j0672M491
2157g090J1294N167l02m481r264p919N850J5916N675j0984j2157j504M546N793
2171E40P369L135j0835j5086R4J5315J0693m260r073n566l535J186J1778J1300
2185A3055o201j7957p396J0881J1207K406k379m065j0808o265J0624J8040J027
2198A2169j6829j0466L597O682M740O942J921j4463j5126O538K0571O534j0724
2211B086q474j626k908K179J5259J0153j3233j9982O45J6027P935k063j204m224
$$ plain form
2114 2657 10064 9673 136 -7019 -4806 3214 9502 9785 4583 -3342 -6663 -1009 8918 12648 7022
2129 7022 -982 -6023 -3684 5948 13974 11461 691 -6523 -4189 3392 10424 12742 6955 -4493
2143 -4493 -9669 -973 11717 13822 5691 -2172 -5812 -5308 3006 13691 12921 -909 -11581 -7090
2157 -7090 4204 9371 9069 4588 -4676 -12595 -6745 9171 14846 3862 -8295 -9799 -5253 540
2171 540 7909 11044 209 -14877 -14783 532 11225 6965 -2108 -7674 -11209 -10023 1755 13055
2185 13055 6854 -11103 -18499 -7618 3589 5995 3616 -449 -11257 -17522 -6898 11142 12169
2198 12169 -4660 -15126 -11529 -4847 -107 6835 8756 -5707 -20833 -14295 6276 12810 2086
2211 2086 -6388 -8014 -10922 -8743 6516 16669 3436 -16546 -15901 126 8061 5998 4794 570
2225E70j2535l694J7533J7371p753j9498m083P994M429M429Q301j825j8359j1022
2239a8142J3919J9567q3j2315o297o28k460M884J6192M789j7273j7270O258J6668
2253G809N017m021j700o355j0825J007J8881J2679j2516j8196n12Q948M552L367
2267H135N982n454j8498n540J7367J6086n225j3531l887J01r17P153J4263j269
2281A4766k0026j1580J1316J4800O39n101k373o610r068N846J8826N526j6324
2294F37j4034L329Q941K906L769L183q867j5497P22J7681J0265q307j1336k166
2308h774P94P33Q888R720n978j7731n461J2921J1261j529n003l017n938m573Q720
2323d967J4475R0j5052r306N831P791K936K088k9q984r840N036J5581M943r587
$$ plain form
2225 570 -11965 -15659 1874 19245 11492 -8006 -12089 -4095 334 4763 13064 11239 -7120 -18142
2239 -18142 -4223 15344 15261 2946 -3351 -3979 -6439 -1555 14637 19426 2153 -15117 -8859 7809
2253 7809 12826 8805 7105 750 -10075 -9068 9813 22492 9976 -8220 -8732 216 4768 8135
2267 8135 14117 8663 -9835 -15375 1992 18078 12853 -678 -4565 -4464 -5381 1772 16035 14766
2281 14766 -5260 -16840 -5524 9276 9915 4814 2441 -4169 -13237 -7391 11435 16961 637
2294 637 -13397 -10068 -1127 1779 5548 8731 -136 -15633 -14911 2770 13035 4728 -6608 -8774
2308 -8774 -7980 -7247 1641 11361 5383 -12348 -17809 -4888 6373 4844 -159 -3176 -9114 -13687 -4967
2323 -4967 9508 9598 -5454 -14760 -8929 -1138 1798 3886 3857 -5127 -14967 -9931 5650 10593 1006
2338A006q526m87K229L099P499M537p976j2596r1J1820P463k384m879l730l678
2353f694K85Q812Q775l511j1819m386N538O476K985N40k951p823l869O676R940
2368H974J250p059o465J23K773L937N157K39p308p349K213Q297M420k317m483
2383B402l899j415K598O557L912m801p390j641M066M715J755j153m130m538J04
2398b858N036M900o76n173l576k97K875L720J418k475m763j998J873L864K717
2413D587j177m849l389J403M142J792p18j650k708k225J782M463J434l489m129
2428d731P99J918O15R93J169k256m001l13M709K147k244k645O54N42j250M11L228
2445b55N43m626j443L483K350k265j293K143Kk864j41M138J491m449j420L878
$$ plain form
2338 1006 -7520 -8007 -5778 -2679 4820 9357 1381 -11215 -11306 514 7977 5593 714 -3016 -6694
2353 -6694 -6409 2403 11178 7667 -4152 -8538 -3000 3476 6461 7001 4050 -3773 -7642 -966 8974
2368 8974 10224 3165 -3300 -3177 -404 3533 8690 8929 1621 -5728 -3515 4782 9202 6885 2402
2383 2402 -1497 -2912 -314 6243 10155 5354 -2036 -3677 389 5104 6859 5706 1576 -2962 -2858
2398 -2858 2178 7078 6402 1229 -2347 -2644 231 3951 5369 2894 -1869 -3867 -1994 1870 4587
2413 4587 3410 -1439 -4828 -3425 717 2509 1791 141 -2567 -4792 -3010 1453 2887 -602 -4731
2428 -4731 -3932 -2014 -1399 -406 763 -1493 -5494 -5807 -1098 1049 -1195 -3840 -3186 -2644 -3894 -3483 -255
2445 -255 288 -4338 -5781 -2298 52 -2213 -3506 -1363 -1361 -4225 -4366 -228 1263 -3186 -4606 -728
2461g28J407l764n63M017J008m276p18M819O52m734m56N705N17n399r07N395R83
2478B958m538J55N271q99o368J365O590R41o307j196N147j58m042J791O256k304
2494D662p683N41P904J231n808m65M335j927n662L798Q633k349r898p24P733J178
2510E499m761J628M411m634p610M570J0132j317r311j073N227n01l308M625N395
2525H972o709j0038M095J0423l5p179n90K584m156k918P904P629p382j0995J867
2540f528Q764P08l333K003Q40p945m950R493R749m833j0474j05M641r40N33O321
2556C944J331j0637q215Q205J0941j173p426j047K91l672J470R838M315j0567
2570b402j0190M471Q886J649k040N68k947p947o76J2279Q314p563j0170J55M805
$$ plain form
2461 -728 679 -3085 -3648 369 1377 -2899 -3617 1202 1854 -2880 -3336 2369 2886 -2513 -3420 1975 2958
2478 2958 -1580 -1425 3846 2947 -3421 -2056 4534 5475 -832 -2028 3119 2961 -1081 710 6966 4662
2494 4662 -3021 -2480 5424 6655 847 382 4717 2790 -2872 926 9559 7210 -2688 -3412 4321 5499
2510 5499 738 2366 6777 2143 -5467 -897 9235 7918 -1393 -2466 2761 2260 -1048 3577 8972
2525 8972 2263 -7775 -3680 6743 6708 -471 -1061 1523 -2633 -5551 2353 9982 2600 -8395 -6528
2540 -6528 2236 2944 -389 1614 2454 -5491 -10441 -948 8801 3968 -6506 -6611 -1970 -2910 -2377 3944
2556 3944 5275 -5362 -13577 -5372 5569 4396 -3030 -4077 -3786 -7458 -5988 3850 8165 -2402
2570 -2402 -12592 -8121 765 2414 374 942 -2005 -9952 -10628 1651 9965 2402 -7768 -7613 -2808
2585b808J003L073N506l212j1803m218J1389R692l173p096j393j200j918N723
2599d35J0531j244j3001o668P507Q082Q13o27j162o451o428N682J2888L054j0345
2614B196p908J052M020L716N482J437q467r977J608J1694O595k937p696m021j054
2629d260K485Q284N904m780j2253m081P192R037J830k644n459o201k064P876J0653
2644A1519l99j0312p885J287N655N967L356k648r980o417M170J1139M747m338
2658E861q271n436P32O731Q183R77q374r140r24O737Q460K719n753q473m664M108
2674f527R214N082l091q453o555P61Q260Q133k92q024q017q00N812P893L748m357
2690B787r788n525N024J0162M218l610p373n290k35O426R545J869r040j0067M30
$$ plain form
2585 -2808 -1805 1268 6774 3562 -8241 -12459 -1070 8622 5449 -1647 -3040 -4240 -6158 -435
2599 -435 10096 8852 -4149 -10817 -3310 4772 5585 4958 3796 -2655 -9083 -3401 9487 12541 2196
2614 2196 -5712 -4660 -640 3076 8558 9995 1528 -8449 -6841 4853 11448 8511 815 -3206 -4260
2629 -4260 -1775 6509 12413 7633 -4620 -8701 -1509 7528 9358 6714 1255 -4946 -7010 866 11519
2644 11519 11120 808 -7077 -5790 -135 5832 9188 6540 -3440 -9857 -5687 5452 10199 5861
2658 5861 -2410 -7846 -7114 -383 7800 8777 403 -8737 -9661 -2924 5536 8255 2502 -5971 -10635 -6527
2674 -6527 2687 7769 4678 -3775 -10330 -9569 -1309 6824 6532 -1492 -9509 -10309 -4497 3396 7144 2787
2690 2787 -7001 -12526 -7502 2660 6878 3268 -4105 -9395 -9630 -3204 6341 8210 -830 -10897 -10467
2705a0467Q105O746J647l253p039o448K494J0977P128m729j0002l886K734N556
2719d37N795K844m787j0951l481R512J0101K73o826n341k027O02O249Q875q31
2734I570j1072p995M837R691K889j941k521n644n367L481J2858M656r476r632
2748e666R13N183K726L831K849o263j1307J85J2121P254n103o558j573j560M2
2763b926O592Q381m126j3063l962Q549O940o56j417j642n791n076O651J1454q9
2778I819j0890o184L520M321J119K755J897p434r558L541J2075L559p690n131
2792d281P25m28m54O300O823o631j1724l45J0472M327m282j273N6n015l751Q002
2808a479R311l749j1139j993O804K184j208L020J309p865o715O530J0679j262
$$ plain form
2705 -10467 -2362 4384 6031 2778 -4261 -10709 -8215 2762 9890 5161 -4841 -8727 -5993 -437
2719 -437 5358 8202 3415 -7536 -11017 -1505 8596 8869 2043 -3298 -5325 -4723 1526 10401 9570
2734 9570 -1502 -9497 -4660 5031 7920 5979 3458 -2186 -7553 -4072 8786 13442 3966 -5666
2748 -5666 -4753 430 3156 6987 9836 3573 -7734 -7549 4572 11826 6723 165 -1408 -2968 -2926
2763 -2926 3666 12047 7921 -5142 -9104 -555 6385 5729 4312 2670 -3121 -8197 -1546 9908 9819
2778 9819 -1071 -7255 -3735 586 1705 4460 6357 -1077 -10635 -7094 4981 8540 850 -4281
2792 -4281 -3556 -3984 -4438 1862 8685 2054 -9670 -10015 457 4784 502 -771 -715 -5730 -9481 -1479
2808 -1479 7832 4083 -7056 -9049 -2245 -61 -1269 1751 3060 -4805 -11520 -4990 5689 4427
2822D427q113j503K481j053m86O390L947p513q144L750Q538M91m109l48R39l998
2838d304j461O696O365n006q410J326O273O50k675K773J530o240m159O645O973
2853F976l179o257R78L300j836j360N475K400o465m992M619O317k251l864K128
2868A989J056m013o58N691K996n525l962L076M093k575j780K920L76m098j431
2883a845M812K601m025k361K376J461k471o59L428L70l952j863L897J668k983
2898D54j460K576P30k576q47K193J288l071j052K882Q38l143j480K985J648k955
2914i90j326K410J66k514R3K750L84l323j240K205J311j154j86R33r99k218O36
2931c062L392O92k839j662N23P39P72J009Q94k186k470K84K519K465o30j946k029
$$ plain form
2822 4427 -3686 -5189 -2708 -3761 -4247 2143 6090 -1423 -9567 -5817 2721 3212 -897 -1245 -306 -4304
2838 -4304 -5765 931 7296 2290 -6120 -4794 1479 2129 -546 2227 3757 -2483 -6642 3 6976
2853 6976 3797 -2460 -1482 1818 -18 -1378 4097 6497 32 -4960 -341 5976 3725 -139 1989
2868 1989 3045 -968 -1626 4065 7061 1536 -2426 650 4743 2168 388 3308 3684 -414 -1845
2883 -1845 2967 5568 1543 -818 1558 3019 548 -111 3317 3687 -265 -2128 1769 3437 454
2898 454 -1006 1570 2300 -276 -1123 1070 2358 -713 -1765 1117 1955 -1188 -2668 317 1965 -990
2914 -990 -2316 94 260 -2254 -2161 589 973 -2350 -3590 -1385 -74 -1228 -1414 -481 -1480 -3698 -3062
2931 -3062 330 1022 -1817 -3479 -2956 -2217 -1445 -436 458 -1728 -4198 -3914 -1395 1070 440 -1506 -3535
2948c535o11J944K658R14j345k338k052J103L421K524j380l453j962J240K858
2963a4J797R73j875l779j709K866M947R47k956l031j044Q46L051L762k27m456
2979I8m779J852M809L296j379k516k257k141J248O255L258m083o195j427M585
2994F24L172R88L5k090n790j896O283P165j496o670k850Q13J643K673M771q69
3010F506q129n603N088Q180P51l979k430k456k581K726R020K753q509q296K085
3025d874O313K186O53N95m770p612K24J0301O618n107r165j007K465J424M035
3040B279M866l273j1353l672R244Q626j869n943k111j805k694N217J0064k68j2093
3055d785p188O238P915M20o43n5n664p842L955J3250M093j0539p647K358L081
$$ plain form
2948 -3535 -4146 -2202 456 1370 25 -2313 -4365 -3262 159 2683 1303 -2150 -4112 -2872 -14
2963 -14 1783 2756 881 -2898 -4607 -1741 3206 4153 1197 -1834 -2878 -2032 1019 4781 4554 98
2979 98 -4681 -2829 1980 5276 3897 1381 -876 -3017 -1769 4486 7744 3661 -2534 -3961 624
2994 624 3796 4784 4819 2729 -3061 -4957 1326 8491 6995 325 -2525 -1712 -69 2604 7375 6506
3010 6506 -1623 -7226 -2138 6042 6793 2814 384 -2072 -4653 -1927 7093 9846 1337 -6959 -4874
3025 -4874 1439 3625 4278 4873 103 -7509 -7285 3016 9634 4527 -4638 -5645 -3180 -1756 2279
3040 2279 7145 3872 -7481 -11153 -1909 6717 4848 -1095 -3206 -5011 -7705 -2488 7576 7308 -4785
3055 -4785 -11973 -5735 2180 2600 1957 1902 -3762 -11604 -7649 5601 9694 -845 -8492 -6134 -3053
3070c053J492M400M251o611j1874N83J2836O684o003n238o52k621r11Q425R112
3085A0820m801j3796l408R362O533k67r08j723p007m993P929J2656k17j1531o363
3100g714L571M064K299M800J471r275j0304N044J3188L936p428n445n39j800J314
3115b818R076O661q636j2760Q59J0379N014j644j374k760p464k074J0625J0253
3129A3337m887j2266k748M896L171K753M277k027j0872o077Q459J1563m27p901
3143A251m336q43k38L893Q945R12j0334r360L737R239L107j259l376m169n242
3158h073K200J0685N277o453j0463j241N102L992L096J597m933r617j013R141
3172g03Q157j862p236m402n57K211N649N898l187r281n183N133P692K465k192
$$ plain form
3070 -3053 -1561 2839 7090 479 -11395 -10812 2024 8708 2705 -2533 -3185 -5806 -6717 1708 10820
3085 10820 6019 -7777 -11185 -1823 4710 4443 3535 1812 -5195 -10188 -2259 10397 10180 -1351 -7714
3100 -7714 -4143 -79 2220 7020 8491 -784 -11088 -6044 7144 11080 3652 -1793 -2332 -4132 -2818
3115 -2818 6258 12919 4283 -8477 -7618 2761 7775 6131 4757 1997 -5467 -7541 3084 13337
3129 13337 8450 -3816 -6564 -1668 1503 4256 8533 6506 -4366 -10443 -1984 9579 9152 1251
3143 1251 -3085 -3928 -4166 -273 8672 9584 -750 -10110 -6373 2866 5973 4714 1338 -2831 -8073
3158 -8073 -5873 4812 10089 3636 -6827 -8068 -2966 1026 4122 5719 786 -8831 -9844 -703
3172 -703 7454 5592 -1644 -6046 -6603 -4392 1257 7155 3968 -5313 -10496 -5363 2329 4794 2602
3187B602m215n057j714N445P901J251p289o621M68M553M508L085j795o470n399
3202h747K950P505M715k895n617m254M09M453O320J394n244o081j349M428N427
3217C414K700k726n976l462K422O112L796j066n302m541K67M710N673N47m615
3232A953n064j187L517M622K758k071n668l384K090N927L112j738m780k827K81
3247b459L057M637J142l268o554l93M558M165L9k258k201k820o38M854N028j699
3263E190o716k320L492K046K37J460L88n376l941M267O426j006m689j089R32j629
3279b328Q41M773J940o206m948L003N006l40k178N09m40l900l13N824L224m354
3295A13n238J714L272n29j156K537N06m646k578M954M417l263m198J693K348k205
$$ plain form
3187 2602 -1613 -6670 -8384 -2939 4962 6213 -1076 -7697 -7229 -2676 1832 4917 3122 -3348 -8747
3202 -8747 -5797 1708 6423 3528 -2089 -6343 -5934 -1481 4839 6233 989 -5092 -6441 -2013 3414
3217 3414 6114 3388 -2588 -6050 -3628 2484 6280 5214 -88 -4629 -4362 348 6021 6568 1953
3232 1953 -3111 -4298 -781 3841 6599 4528 -1140 -4524 -2434 3493 6605 4867 87 -2740 -2459
3247 -2459 598 5235 6377 3109 -3445 -3838 720 4885 4924 2666 465 -2355 -2993 1861 6889 5190
3263 5190 -1526 -3846 -354 1692 1929 3389 3777 -1599 -5540 -1273 5153 4147 -542 -1631 -699 -2328
3279 -2328 -1487 3286 5226 -980 -5928 -2925 2081 1741 -437 72 -368 -4268 -4581 1243 4467 113
3295 113 -5125 -3411 -139 -668 -1824 713 1219 -3427 -6005 -1051 3366 103 -4095 -2402 -54 -2259
3311b259j328M208J924n159l715M849M374l611l221L462J597m366j196N654K308
3326C521n742k936M938K836m461j554M555J436n434j077N656J150n085j028N169
3341A944J207n027j115N112J020m937o88N495K44n520J16N358R55n258q99M426
3357B433N32m767M93N753j08o491p07O236J370m786p89M309j091m942K086O117
3373E648p14o659j365N738R19l793P12M064k685n955K522P370l15o372j356L823
3389A582m19k490K778M184l802p225J856P173O88m534n84J475k565j921M606N165
3405E967l493p528k78N763J643j754P11K06m861l258N723O788k222o915j233K699
3421b042O07N36L597P31o415n095L669P715M69m460j674m35k072J332O476K669
$$ plain form
3311 -2259 -3587 621 2545 -2614 -6329 -1480 2894 -717 -3938 -476 1121 -3245 -4441 1213 3521
3326 3521 -2221 -5157 -219 2617 -1844 -3398 1157 2593 -2841 -3918 1738 2888 -2197 -3225 1944
3341 1944 3151 -1876 -2991 2121 3141 -1796 -2484 3011 3255 -2265 -2149 3209 4164 -1094 -1993 2433
3357 2433 2965 -1802 -1309 4444 4336 -2155 -2862 3374 4744 -42 -831 3478 2387 -2555 -469 5648
3373 5648 4934 -1725 -3090 2648 3567 -226 486 4550 1865 -4090 -1568 5802 5487 -885 -2241 1582
3389 1582 1163 -1327 1451 5635 1833 -5392 -3536 3637 4325 -209 -793 682 -1883 -3804 802 5967
3405 5967 2474 -5054 -5332 431 2074 320 1031 1237 -3624 -6882 -1159 5629 3407 -3508 -4741 -2042
3421 -2042 -1435 -899 2698 3429 -2986 -8081 -4412 3303 3772 -688 -2362 -2797 -4869 -3537 2939 5608
3437E608o112o997J598N696K450o80p07k165m994j91P983N215m356o735p43K570
3453b560J926K576K676k642p450j853O420O404l83m753l130j342L35M966N597
3468F787q46p532n104K664O275L526p33l578n008k009L582P256K792m645o847
3483c420k062L224N803L521j287n642n237K77O914N640j142n473m845j116M184
3498f61O336K343m064o577l539L260O820L983k140o831m900J158O878N048n98
3513F516n086o016j716M442P662K417n490p002k297L370N764M159o40p175o690
3528g782J426P909N282j944n435n127j422L223P535M214m991r189k799N747O473
3543C120K128k036m854n965p78P509Q098o07r071n533J487M077M752L585k536
$$ plain form
3437 5608 -504 -7501 -5903 -207 2243 1563 856 -1309 -6303 -6494 1489 6704 2348 -4387 -5130 -2560
3453 -2560 -634 1942 4618 1976 -5474 -7327 -907 5497 5114 361 -2769 -4111 -3776 1190 6787
3468 6787 5941 -1591 -6695 -4031 2244 5770 5037 1459 -3549 -5558 -1976 5280 8072 3427 -3420
3483 -3420 -5482 -2258 3545 7066 5779 137 -5100 -4823 2091 7731 6589 1116 -3729 -4845 -661
3498 -661 5675 8018 3954 -2623 -6162 -2902 3918 7901 5761 -1070 -5970 -4812 2066 7114 6516
3513 6516 1430 -4586 -6302 -1860 5802 8219 2729 -4273 -6570 -3200 2564 6723 6083 -1092 -7782
3528 -7782 -6356 1553 6835 4891 -544 -5671 -7093 -3870 3665 7879 2888 -6301 -9100 -3353 3120
3543 3120 5248 3212 -1642 -7607 -8385 -876 7222 6615 -2456 -7989 -6502 -2425 2327 5912 3376
3558C376q292n995N072J0062K899n159n477k608m44M430P506L021q555r304J464
3573h004Q198M534q63k020l882n864P86R531P639n671r523k075M200L506L245
3588C737K911k975r492m066R164R380j615o866l114m89n01M395Q094J22j0719
3603b034p344N572R252Q24k346j355l897n373K730J0944M204q690q457J555N381
3618I66J507K277K056m210r401q98J1164O959n525o727q31O53m66M372P410k982
3634F324j1390l479P829P136j660k988p69l750m030N266R584j34r718n852M382
3649c249M390j25J908J605n632p409L026J0195K737p287m347J140L71m17N192
3664B098M947n545r716P96Q302L296k985k061p6l662k196O348P051l093q871j849
$$ plain form
3558 3376 -4916 -10911 -5839 4223 7122 1963 -3514 -6122 -6566 -2136 5370 8391 -164 -9468 -8004
3573 -8004 194 4728 3865 1845 -2037 -7901 -7115 2416 10055 4384 -5139 -7214 -3014 492 3737
3588 3737 6648 3673 -5819 -9885 -721 8659 7044 178 -2936 -3425 -3926 469 8563 8685 -2034
3603 -2034 -9378 -3806 5446 6270 3924 2569 -1328 -6701 -3971 6973 11177 2487 -5970 -4415 966
3618 966 2473 4750 6806 2596 -6805 -7703 3461 10420 4895 -1832 -2663 -2010 -2476 1896 9306 6324
3634 6324 -5066 -8545 -716 6420 4760 1772 1003 -2747 -6777 -1511 8073 7939 -1779 -7631 -3249
3649 -3249 1141 1016 2924 4529 -1103 -8512 -5486 4709 7446 159 -4188 -3048 -2677 -3094 2098
3664 2098 7045 1500 -8216 -7420 882 4178 1193 -868 -944 -4606 -6802 -454 6597 3504 -5367 -7216
3680g216N681K092m07J908M03o120m388N026Q162q71o298k303K220o9L08M371
3696B499K744o399o039L112O700Q38l199p94l26k459J02N502L599m572n836J255
3712c273M064J001o27J144j057l649j724N285L680k183l844k17J311l8Q56K642
3728C371L61m758k412L663L164m92k024m65N8j115M35L457N61l241k409J777J766
3745A697Q0l94N86p20k127k3L291Q15j823j707Q7Q55o9J52R14k38k142K14J022
3764D70J123j065m68j18j50k23O32P06o22m46k72K22K60j84O2m15k44Q02m09l75
3784g14j57O8O97m06l19M65k61j393J123R25n3j528o77J029Q03k11K42N80j415
3803a202j807Q92K810L76j981j413R73j34j52J371J961j743l766O99L622J044
$$ plain form
3680 -7216 -1535 557 150 2058 2461 -3659 -8047 -3021 5141 4270 -2028 -4331 -2111 -2180 -1872 2499
3696 2499 5243 -1156 -7195 -4083 2617 3455 256 -538 -864 -3323 -3221 2281 5880 1308 -4528 -3273
3712 -3273 791 1792 1165 2309 1252 -2397 -4121 1164 4844 2661 -1183 -1400 -89 -127 729 3371
3728 3371 3732 -1026 -3438 225 3389 2897 873 408 466 -649 -214 3243 3804 563 -1846 -69 1697
3745 1697 1777 1383 1969 1249 -878 -901 2390 3205 1382 -325 -238 617 548 700 1614 1376 -766 -552 470
3764 470 1593 528 60 -58 -208 -431 201 907 285 -161 -433 -211 49 -135 -73 -488 -732 70 -339 -714
3784 -714 -871 -803 -106 -512 -831 -366 -627 -2020 -897 28 -25 -1553 -2230 -1201 -398 -609 -367 213 -1202
3803 -1202 -3009 -2117 693 1069 -912 -2325 -1352 -1486 -1638 -267 1694 -49 -3815 -3116 506 1550
3819A550j772q04P04j669j144L031L918j959m829l24L560O09l18R04M37l795k493
3836d394L748N061j036m422j329J839N18K52L050J224n242m442L332N805L58l318
3852A004p91k79k119K76N876K804n006o157J588M849J284j074P98j262n437q43
3868d489O710N393l430o513l41K635M20J379L617o06p637l932O757O540j939m487
3884G7l92j178j998K290P475M83q482n318M190N663j1o29K35l020o162J658R394
3901D275L591p117o298J353K906Q42K571L113m263q574o23R125N503l671n346
3916b613k56j017p76M643O870k240j0094m052O821O114n88j634q61m228m475M842
3932c544R850N52r013n321K677L700J403L243J267o346q097L337R811L660n449
$$ plain form
3819 1550 -222 -1026 -322 -1991 -3135 -104 3814 1855 -2974 -3298 262 871 553 1457 1894 -1901 -4394
3836 -4394 -646 4415 3379 -1043 -2372 -533 -15 237 3287 4511 -731 -5173 -1841 3964 4322 1004
3852 1004 213 -66 -2185 -1909 3967 6771 1765 -4392 -2804 2045 3329 2255 3053 1791 -3646 -4489
3868 -4489 2221 7614 4184 -2329 -2670 -35 385 1764 5381 4775 -2862 -6794 -37 6503 4564 77
3884 77 -315 -1493 -3491 -1201 6274 6757 -1725 -7043 -2853 2810 2799 2170 2405 -615 -6777 -5119 4275
3901 4275 7866 749 -5549 -4196 -1290 -448 2123 5236 973 -7601 -8224 901 6404 2733 -2613
3916 -2613 -2869 -3886 -4662 -19 6851 4611 -5483 -9535 -2714 3400 2812 1178 317 -3911 -8386 -3544
3932 -3544 6306 6858 -2155 -7476 -4799 -1099 304 3547 4814 -1532 -9629 -6292 3519 7179 1730
3947A730m588q31n18J406O381M368n192r623r23P790N293j297k125j665n372j290
3963f456P766P961k840r535l393L630M309J857K709j872p475m905N974R324J023
3978H077o550m292o51R13K981O098J627p530q185K311Q119L684j357l522l215
3993a492m172J736Q307N430n935q010j728M231M318K645L01m012p034j732P682
4008E35O907r11o379m270n02K072M815M910k482p979m607M056O714L264k665m495
4024a017m058q85M536O450J329n701o353j021M415N341K057k672n283m104J712
4039e254O505M563j874o130m148Q60M398M982R68m241n894k007M372N760K129
4054D989l101n397l117K172N211L967p62n379m427M93M170N480J061m745n410
$$ plain form
3947 1730 -2858 -3689 -4207 -2801 3580 7948 2756 -6867 -7790 0 5293 3996 1871 206 -5166 -6456
3963 -6456 1310 9271 6431 -3104 -6497 -2867 1442 3299 6008 4136 -3339 -8244 -2270 7054 8077
3978 8077 1527 -2765 -3416 -2503 478 6576 8203 673 -7512 -5201 2918 6602 5245 1723 -1492
3993 -1492 -5664 -3928 4379 9809 3874 -4136 -5864 -1633 2685 5330 5631 1619 -5415 -7147 535
4008 535 7442 6531 152 -4118 -4620 -2548 2267 7177 4695 -3284 -7891 -3835 2879 6143 3478 -1017
4024 -1017 -5075 -5960 -1424 5026 6355 654 -5699 -6720 -2305 3036 5093 2421 -2862 -6966 -5254
4039 -5254 1251 5814 3940 -2190 -6338 -5478 -1080 3902 4870 629 -5265 -7272 -2900 2860 4989
4054 4989 1888 -3509 -6626 -4454 757 4724 3962 -1417 -5844 -5351 -1181 4299 5360 615 -4795
4069d795j004L928M335K102j784m619m207J822O032M124k524m847k910P29L026
4084e92M234K375l814o539j241N279M414K75k148k900k857l00N214M994j315o167
4100a088l122K456K911K012J255j215m973l118L323O612Q11m492k945m37N15J607
4116A12L961J511m690n529J357N779J871j973j642m54k725p46N408M511l751o511
4132c511J20L689J497n01J129p9n029k878N534N475k169n004k62J556j088L78
4148a143M125J162o121m041M092N230j943k310O65J48l271j43N281K929n228m315
4164d883K499L427j198j074K295J16m808j496N732L420m308l382K179J925j804
4179a360j027M063M12m712k221M763K988l282k406L140N95l633k45M792J164m889
$$ plain form
4069 -4795 -5799 -1871 2464 4566 2782 -1837 -6044 -4222 1810 5934 3410 -1437 -4347 -3618 -592
4084 -592 3642 6017 2203 -4336 -5577 -298 4116 4391 2243 -657 -3514 -3814 1400 6394 5079 -1088
4100 -1088 -4210 -1754 1157 3169 4424 3209 -1764 -4882 -1559 5053 5864 1372 -1573 -2010 -1495 112
4116 112 4073 5584 894 -4635 -3278 2501 4372 2399 757 303 -2422 -3168 2240 6751 3000 -3511
4132 -3511 -3391 298 1795 1294 2423 2344 -2685 -5563 -29 5446 3277 -1727 -1989 -433 -1521 -1143
4148 -1143 2982 4144 -1977 -6018 -1926 3304 1361 -949 -284 -136 -3407 -3550 1731 4660 -568 -4883
4164 -4883 -2384 1043 -155 -1229 1066 1182 -3626 -5122 610 4030 -278 -3660 -1481 444 -1360
4179 -1360 -2387 1676 2088 -2624 -4845 -82 2906 -376 -2782 358 953 -2680 -2925 1867 3031 -1858
4195a858k019M634J677l982l95L826P7m451LM865N23m368r38M785j73l930m0M421
4213B657p3m543O99L967l92m141Q88L845k24l825k23L762m81l201R26L226n54
4230B313m323R39M233j15l404j10K563q57l081J855L922j583m489J51M106J64
4246B284k574M98K067j917k771J673M504j332l775l05K539m81j069K009J281k936
4262c05l368K025M583k05l099n47N35j294p2L374K010l668l609Q55L342R45j107
4279C95N2q79k576n63M184K833k192l704j038J543J143J641J132j650l545j612
4295d836L184L720K49k438k252r41J008J946L298m38m297k558J134L786J812l52
4311B025k299k370j540K000M167J691k733l675j411J780L455K551q45l874l072
$$ plain form
4195 -1858 -3877 757 2434 -1548 -1943 1883 1960 -2491 -2488 2377 2900 -1468 -2406 2379 2206 -1724 -1764 2657
4213 2657 2584 -1959 -1260 2707 2315 -1826 -938 2907 2683 -1142 -1365 2397 1916 -1285 -359 2867 2313
4230 2313 -2010 -1071 3162 3047 -357 -467 2096 1239 -1842 13 3935 2352 -2137 -1986 2120 2284
4246 2284 -290 208 2275 358 -2413 -740 3764 2432 -1343 -1648 891 410 -659 1350 2631 -305
4262 -305 -3673 -1648 2935 2730 -369 -916 -381 -1675 -1747 1627 3637 -31 -3640 -2785 557 1502 395
4279 395 447 -432 -3008 -3571 613 3446 1254 -2450 -3488 -1945 -802 839 1971 321 -3224 -4836
4295 -4836 -1652 2068 2317 -121 -2373 -3314 -2306 -360 2938 2500 -1797 -4355 -3221 565 2377 2025
4311 2025 -274 -2644 -4184 -2184 1983 3674 941 -2734 -4145 -2365 1090 3641 2796 -1078 -4150
4326d150R47L699L019q3k960l756q87L496L940J236k729l920j454J345L862L461
4342E066j120m882l327J334M014L476k41k604m067k095L431N857J226l882m787
4357b601p36K182K912L000J04m578m841P24N795L886j675l629k867p06J485M936
4373C391K559k871o282j927L691M298J393j313k399m346j026M563O233k52o752
4388a040l883J462K675K423K373n5o249m894L606P241J975m260l686j405k51J750
4404b218O235K459o002p321O84O244L033k15j504k537m383q29P345O068l815p601
4420d357j569L152K372J945K249j718o965k988N601P740o47n748k455m6k94L012
4436g16N392P52p083o220L536O946J525k014j735k241l802J805P606L974n862
$$ plain form
4326 -4150 -3203 496 3515 3432 472 -3284 -4171 -675 3265 4501 1772 -2148 -3602 -2257 1605 5066
4342 5066 3946 -936 -4263 -2929 1085 4561 4320 1716 -2351 -4446 -1015 4842 6068 2186 -2601
4357 -2601 -3337 -1155 1757 4757 4861 283 -4558 -3834 1961 5847 4172 543 -2324 -3030 -1545 3391
4373 3391 5950 3079 -3203 -5130 -1439 2859 4252 2939 540 -3806 -4832 -269 5964 5712 -1040
4388 -1040 -4923 -3461 -786 1637 4010 3955 -2294 -7188 -3582 3659 5634 1374 -2312 -3717 -3968 -2218
4404 -2218 4017 6476 474 -6847 -6163 81 3114 2899 1395 -1142 -5525 -6354 991 7059 3244 -4357
4420 -4357 -5926 -2774 -402 1543 3792 2074 -4891 -7879 -2278 5462 4815 -933 -3388 -3434 -3728 -716
4436 -716 4676 5428 -1655 -7875 -4339 2607 4132 2118 383 -1858 -5660 -3855 3751 7725 1863
4451A863p243P42M454J770J340J562l014o806j318Q323N775l271n723j398R23
4466b021K86L094N308j825q090l706N662O180l05k794j096k721k751L653P450
4481F324J000p511n320K785M257J071J256j30l634n776J414Q264L220m855m739
4496b374J23N48P57L642L553l895p246o22O135M148j592k990q35k070j361M522
4512D43N714j492p532k566L836L022L36Q04p52m116l880L716O602O12n335l260
4528c848J014Q89J093L444J436m568n577J618O097J933k463k220n67j962L49M804
4544A472L110k952n766l63L236J982O89oj345l491q00L853L678m65m418j726R98
4561b314J318J198K336N0m339k576K311L896R44j736j994q17l17J381K720J255
$$ plain form
4451 1863 -5380 -4638 -184 1586 2926 4488 1474 -5332 -6650 1673 7448 4177 -1546 -2944 -2021
4466 -2021 -1735 1359 6667 4842 -3248 -6954 -1292 4888 4583 1789 693 -2028 -4779 -1126 6324
4481 6324 7324 -187 -5507 -2722 1535 2606 3862 3732 98 -5678 -4264 4000 7220 2365 -2374
4496 -2374 -2251 -1703 -946 2696 6249 2354 -4892 -5514 621 4769 3177 187 -648 -2718 -4079 443
4512 443 6157 4665 -2867 -5433 -1597 1425 1761 2565 1813 -2303 -6183 -2467 4135 4747 -588 -3848
4528 -3848 -2834 -1945 -852 2592 4028 -540 -6117 -4499 1598 3531 1068 -1152 -1719 -3681 -3332 1472
4544 1472 4582 1630 -4136 -4499 -1263 719 1408 1402 57 -3434 -4234 -381 3297 2832 -1586 -3312 -2314
4561 -2314 -996 202 2538 2588 -1751 -4327 -2016 1880 2824 1088 -906 -1723 -2040 -659 2061 3316
4577C316l008l278Q22K442J308M35l86k110j544N54L220J226j536j737q27L09
4593g94J113J642N90j374k163m88J681J746O55r86j736r61O24J742J187p40j236
4610E02j261j61J335J216O90j616j170j91J239M07L72l45q73p98k37J997M39q20
4628G25j130L52M91k78l25J245J14k407j65J745Q46j301n77J038j35j440J79J665
4646F42m2j441m45J583J25j742Q2J381K34k021J59K007n76k115O27K191j52k256
4664a759l52K409J35j808p5K320q88k646J096K758k90k325m05K183m80j521J064
4681e84K408j950k921J170L264j91k279J03J600j306j698K472K776k151l528P58
4697b057L103K38k027J641P39k461j914K621L718j435l889M99K018n68p51K329
$$ plain form
4577 3316 308 -2970 -2148 294 1602 2037 1651 -459 -2003 -1449 1771 2997 1461 -276 -1103 -794
4593 -794 319 1961 2551 1177 -986 -1474 207 1953 2608 1622 -114 -1075 -451 1291 2478 1738 502
4610 502 -759 -920 415 1631 2321 705 -465 -656 583 990 1362 1017 144 -654 -891 1106 1545 725
4628 725 -405 -53 438 160 -165 1080 1194 -1213 -1378 367 1213 -88 -665 373 238 -1202 -1023 642
4646 642 600 -841 -1286 297 422 -1320 -1238 143 377 -1644 -1485 522 -54 -2169 -1542 649 497 -1759
4664 -1759 -2111 298 433 -1375 -1450 870 -18 -2664 -1568 1190 900 -1425 -1830 353 -127 -1648 -584
4681 -584 1824 -126 -3047 -1877 1387 1196 -1083 -980 620 -686 -2384 88 2864 713 -2815 -2057
4697 -2057 1046 1284 -743 898 1637 -824 -2738 -117 3601 2166 -1723 -1224 794 226 -525 1804
4713A804J604m077k986L052M429j263k740J07P32j903p1L970K096m061m322K052
4729a577L973k48j465J188l83l857o67N273L182l761m318P21L036r37M85K932
4745C577q08n390j991M724M407k222l444P68k48j466J418M569K70o018l078L559
4761a373L556m52r78M48j777l771J631N532J839m569m070J388K146K62J371J748
4777B931k538n154R9N743L147k915l253m47k33N9K928L814j919o165j475M135
4793a243L731q72r36j122j938k455L721N374l28n549k758J307K684J608J150%
4809B374l871l912K079O027J537k804l476o40J93J866L586J543l605n538N26M480
4825C65K831j90j562k434k840Q67M476L792k131n012j965J996K823K216Q96k351
$$ plain form
4713 1804 3408 -669 -3655 -603 3826 2563 -177 -70 662 -1241 -1312 2658 4754 693 -3629 -1577
4729 -1577 2396 2148 683 1871 1488 -2369 -3036 2237 5419 1658 -2660 -1939 1097 160 645 3577
4745 3577 2769 -2621 -4612 112 4519 2297 -1147 -379 -627 -2093 -675 3894 4164 -1854 -4932 -1373
4761 -1373 2183 1731 753 1201 -576 -4347 -2716 2816 4655 86 -3984 -2596 -450 -188 1183 2931
4777 2931 393 -4761 -4662 1081 4228 1313 -1940 -2387 -2620 -2561 367 4181 2262 -3903 -5378 -1243
4793 -1243 2488 1616 680 -442 -2380 -4835 -1114 4260 3932 -1617 -4375 -3068 -384 1224 2374 2374
4809 2374 -1497 -5409 -3330 2697 4234 1430 -2046 -2686 -2493 -627 2959 4502 897 -4641 -4115 365
4825 365 3196 3006 1444 -990 -3830 -2963 1513 5305 3174 -1838 -3803 -1807 1016 3232 4128 1777
4841A777m223j863L675M879N98l660l159q96J274L368K928m63m599l576J337L976
4857A373K971q34k920l046j359L170M123J210k621m679j225K316L677K148j218
4872C086l678k966K00L822L398j61l251l617n66K984L815J183l167l283j810J647
4888b364L803K313r29m179l079J216L577K552k27k959k873j058K356M074J702
4903C925l308l576j345K311K744K037m2l606l408k57N087K895p71l516k427N3
4919c204J194L232K499j925m828j741K727L724J235j716j932k096p20K867M711
4934D027j95m772l297J161L055J318J133l00l171l487J775N378J534k864k954
4949a659k01J49J415K498J863k550m780j12M143K382r81j171q44j989p62L773
$$ plain form
4841 1777 -2446 -4309 -634 4245 4843 1183 -1976 -2872 -1598 1770 4698 4235 -364 -3940 -2603 1373
4857 1373 4344 3510 590 -2456 -3815 -645 3478 4688 2067 -2612 -3837 -1521 2156 4304 3086
4872 3086 -592 -3558 -3358 464 3862 3701 450 -3167 -3733 -749 3066 4249 1082 -2201 -4011 -2364
4888 -2364 1439 3752 2823 -1356 -4435 -3219 358 2910 2683 -276 -3149 -4207 -1851 2223 3925
4903 3925 617 -2959 -4304 -1993 751 2788 2746 -860 -4268 -4525 562 3457 2686 -830 -3257 -3204
4919 -3204 -2010 1222 3721 1796 -3032 -4773 -2046 1678 2913 1197 -735 -2831 -3551 -684 4027
4934 4027 3832 -940 -4237 -3076 -21 1297 2430 2130 -1041 -4528 -2753 2625 4159 1295 -1659
4949 -1659 -1860 -1711 -296 2202 4065 1515 -3265 -3377 766 3148 2167 996 152 -1837 -2599 1174
4965A174L573j118n194j314K719J610K19M50L18l372k663K955M626n1m041j388
4981a497R58K92L27K442J114l142m115J494M416L04j711p25j31j685o24L661K853
4998D231k798l932K17L029M56n54R51l85l275j239L670L190k054l407L10J381
5014b09n79J10K392P02l984k089K516L320r60k161M16K55j681k09L383J406l264
5031f36k693J730K091o53o01J426l7k846m81L157K002k570k424J713J377j529
5047i74j87K398j29l084q33K921J654j736j359J397M03j996N7K868K40l005p61
5064b126K535P11j604m5J455l0k244K51K373L02k360l26J916J46j563K51K018
5081A660m43j881r3K073k6j471l4J533m4j810K15J543k7j603M42J878p80j406
$$ plain form
4965 1174 4747 3629 -1565 -2879 -160 1450 1669 2119 2437 -935 -3598 -643 3983 3932 -109 -1497
4981 -1497 -539 -247 80 2522 3636 494 -3621 -2127 2289 2593 882 157 26 -1659 -2283 1378 4231
4998 4231 1433 -2499 -2282 747 1203 649 1600 1215 -2060 -3299 371 3561 1507 -1900 -1590 -209
5014 -209 -788 -678 1714 2416 -1568 -3657 -1141 2179 1219 -942 -526 -271 -1952 -2161 1222 2628 -636
5031 -636 -3329 -1599 492 -161 -762 664 627 -2219 -2700 457 2459 -111 -2535 -822 555 -974
5047 -974 -1161 1237 1108 -1976 -2809 112 1766 30 -1329 68 471 -1525 -1468 1400 1640 -1365 -2126
5064 -2126 409 1120 -484 -529 926 896 -1348 -1097 1276 1578 -782 -1108 808 954 -609 -358 1660
5081 1660 1217 -664 -757 1316 1290 -181 -215 1318 1274 -536 -321 1222 1195 -408 34 1912 1132 -274
5099b74J09J621n70j078K54N44M7j099Q72J336p21j911J35J812r6o60K84L64j051
5118h2q19J084J569m15j939o14J384L3k20R34Q7j284j373J063J704J85j420n34
5136f57n86M91L44J261K94j323j811N80J029P51K75p55j160n69R38J059Q66n36
5154D91j556p33L93J069J082L1j575j085K13R74J154P70q06k146p84J429J902
5171H23Q30j364j538o06L52R54J906L93j997k143L15J957J100L4n15j190j712
5188b401M27L351J218j352k344q17R64J003J396P07j265l057o64L052K346k45
5204B319k028r46q10j46J986K611l59l362k146J995K589J06J4q58j968j423J545
5221h81L870P62l222k145K16J596O32J541M73k374l108J68M069J831j631k198
$$ plain form
5099 -274 -165 1456 886 -192 62 606 653 -446 426 1762 1041 -870 -735 1077 981 321 605 969 -82
5118 -82 -901 183 1752 1337 -602 -1216 168 201 -19 915 1002 -282 -1655 -592 1112 1297 -123 -657
5136 -657 -1243 -752 -408 853 1147 -176 -1987 -1407 -378 373 648 -107 -1267 -1836 -898 161 1027 491
5154 491 -1065 -1798 -1405 -336 746 777 -798 -1883 -1670 -696 458 1228 422 -1724 -2508 -1079 823
5171 823 1653 289 -1249 -1855 -1503 -549 1357 1750 -247 -2390 -2075 -118 982 1016 501 -689 -2401
5188 -2401 -1974 1377 2595 1243 -1101 -1918 -954 49 1445 2152 887 -2170 -2834 218 2564 2319
5204 2319 291 -655 -1465 -1611 375 2986 2627 -735 -2881 -886 1703 1809 1823 965 -1003 -2426 -881
5221 -881 2989 3751 529 -1616 -1400 196 828 2369 2842 468 -2640 -2472 1597 3428 1797 -401
5237d01n38m73J0K958K591k357m137r60L090K257k07p89o54k551r28K968L938
5254C817q86l906k235J476J922M85J235M36l210l877K385M772Q54k980j871l73
5270a956l18J039K929J893l050m864N18L716K129r08p31j198k277m45M049L413
5286C939k267m565m16K131J219R84J022o38m004k040L612M174l55l537j094K00
5302a635j53J282L505l1m115k926J655L733R43p47j061j612j973J014M446J746
5318D071l100l866K73K355J577L07R24j869l163n66L444L336j209l355r00L38
5334a403M90J787K643r65m123k242L136L089M15j515j053j213j094J724L734L57
5350C767l750k590R09K483M28J117n53j882k594O98L352K608k473k321r26N01
$$ plain form
5237 -401 -939 -1412 -1402 1556 4147 1790 -2347 -3307 -217 2040 1833 1044 390 -2161 -3089 -121 3817
5254 3817 2931 -975 -3210 -1734 188 673 1908 2344 -866 -4743 -2358 2414 3268 288 -1583 -1956
5270 -1956 -2274 -1235 1694 3587 537 -4327 -3809 -93 2036 1128 397 -801 -3078 -3523 526 3939
5286 3939 1672 -2893 -3309 -1178 41 1025 2047 1409 -2595 -4635 -1023 3151 2796 -741 -1835 -1635
5302 -1635 -1788 -506 2999 2968 -1147 -4073 -2418 1315 2258 1511 450 -1162 -3135 -2121 2325 4071
5318 4071 971 -2895 -2622 -267 1310 1617 2541 672 -2491 -3057 387 3723 2514 -841 -1741 -1403
5334 -1403 -913 874 3517 2552 -1571 -3813 -677 2412 2827 1312 259 -954 -2048 -324 3410 3767
5350 3767 17 -2573 -1664 819 1247 2364 1811 -71 -2665 -1967 1385 3993 1520 -801 -1727 -1226
5366a226J010K004J190j706l575q19L258K191l3j260j575j437q7K392K264o33
5382A958k903k163J646J919J155k86o57k217j346J695K725N12k144j597m18O87
5398a434J375J450j15j964k070N64K144J486n47j011j474p89R94K185J175j439
5414E30k062o08O90J741R36j0k021j078K8J534J458M57j611j305n82P91K198N84
5432A670j162j446n24J00J610J129J57j594j727O44J411R33K32p37j372n95O50
5449f21J537R10o05j715o56O93J338N04k01q10j484L58J194J451l03j400k99J92
5467H3r8R26N33j16j570r90J152J152N7n74l13O1p30J12J246O24j165j755Q82
5486d83J105j53l15L90o9j184m00J880O54j055j450Q23O19p23J97J144k28j378
$$ plain form
5366 -1226 -216 1788 2978 1272 -2303 -3122 136 2327 2294 1034 -541 -1978 -2065 327 2591 1958
5382 1958 -945 -3108 -1462 457 1612 1326 669 -1548 -2894 -1199 1526 2038 -106 -1703 -2121 -1434
5398 -1434 -59 1391 1276 -688 -2758 -2194 -50 1436 889 -122 -1596 -2385 -1391 794 1969 530
5414 530 -1532 -2140 -1450 291 1227 1217 -804 -1882 -1854 -320 1138 1595 -16 -1321 -1903 -1112 1086 1670
5432 1670 508 -938 -1462 -1362 248 1377 1534 -60 -1787 -1143 268 1201 1433 696 -676 -1271 -621
5449 -621 916 1826 1221 -494 -1150 -457 881 1385 1184 374 -1110 -752 442 1893 1590 190 -109 83
5467 83 -15 911 1444 1328 -242 -1232 -80 1072 1129 555 242 303 -427 -315 931 1555 390 -1365 -483
5486 -483 622 469 154 544 475 -709 -1109 771 1425 370 -1080 -257 362 -361 -164 980 752 -626
5504f26n41J602L70j167m64M67R41j822M12J200M88j676l85J475Q4j464J24J217
5522B35K58j365k25J652k48j400J82J349j58j354J40J152R0j355J70J414r7j546
5540a106J74J488J56j439j73J191k90j047Q33J139n93j608J18J724N62k067L96
5557e42R52o19j133J162J808r13j912j51K320n87r32K65J139j059j215J358J600
5574A541j74k255M00J164m59m1P93O02j332j786J203K251l74j637k08N39p85j78
5592g36J918P67j355k174M05K343m3p64M01J65j667m60K142J346r26k270J01J270
5610D63R2l22J068L27k480j034J774K045j059j030k6j29n65O23J607K99k327j415
5628b089R88J761L59l31k66j039j349Q39K336Q59j799j674l95R60Q84L99Q06j231
$$ plain form
5504 -626 -1167 435 805 -362 -826 -359 582 -1240 -828 372 860 -816 -1201 274 358 -1106 -982 235
5522 235 493 -872 -1097 555 307 -1093 -911 438 280 -1074 -934 218 308 -1047 -877 537 440 -1106
5540 -1106 -932 556 712 -727 -900 291 1 -1046 -213 926 333 -1275 -1157 567 1129 -938 -542
5557 -542 410 -209 -1342 -180 1628 715 -1197 -1348 972 385 -547 -282 857 -202 -1417 -59 1541
5574 1541 1367 -888 -488 676 217 176 969 1571 239 -1547 -344 1907 1533 -104 -312 227 -558 -736
5592 -736 1182 1949 594 -1580 -1175 1168 1125 361 762 927 -740 -1200 942 2288 1362 -908 -807 463
5610 463 555 233 1301 1628 -852 -1886 -112 1933 874 -156 -182 -311 -876 -253 1354 1653 -674 -2089
5628 -2089 -1101 660 1019 688 422 -617 -1966 -1127 1209 2068 269 -1405 -1800 -840 44 443 1249 18
5646A8k034j70K064J689n01j700n29j46J65J540J372r03k336q68J273J662N07
5663A103k88j031j155n78J488K030L29k169j357n0R98J168O87l67j569j431O03
5680a589K393J240p37j666j191J29J301J567L50j533j410q14J687J752N57r46
5696A090j817j072P06J873J261m55j889j083l58J913J659L23j324k013k07J165
5712b28J933N55q93j929r40L68K403R82l29j877j182j46J227J955M24j674j997
5729a348n47J453K203K62j161j086j705O02K044J880j120k027j039K33J428J199
5745A271P63j308j858j320J483K801J22j646j217m12l01J712J714j29k136k014
5761b475L29K103J012J27q02j284j102K76K615J171j394k397J72R73P63J009L79
$$ plain form
5646 18 -2016 -2186 -122 1567 1066 -634 -1163 -1309 -1144 396 1768 865 -1471 -2339 -1066 596 1103
5663 1103 815 -216 -1371 -1949 -461 1569 1898 -271 -1628 -1678 -680 488 1175 808 -761 -2192 -1589
5680 -1589 804 2044 1307 -359 -1550 -1421 -120 1447 1797 264 -1146 -1960 -273 1479 2036 1090
5696 1090 -727 -1799 -1093 780 2041 1586 -303 -1386 -1744 169 1828 2151 827 -1186 -1393 -228
5712 -228 1705 2260 1367 -562 -1502 -1134 1269 2251 1922 45 -1137 -1283 -56 1899 2323 649 -1348
5729 -1348 -1895 -442 1761 2023 862 -224 -1929 -1327 717 2597 1477 -550 -1589 -1356 72 1271
5745 1271 2034 726 -1132 -2452 -969 1832 1954 308 -909 -1321 -1622 90 1804 1675 -461 -2475
5761 -2475 -2146 -43 969 1096 294 -990 -2092 -1816 799 1970 576 -1821 -1649 -676 87 1096 1475
5778A475j411k244m13K390K028o34j702r62J30PJ539J653m26k701j265J686J842
5795I92J1o34l78j153q18P42K659P69k107j643M66R97Q73K24M45j371k151K42
5813a835K764J293j367j208m74j33K87J308J359q58k716l00J955J662p53l65k84
5830C35j189n74J389K664q97k132j055J060P48M47K54L49j404j797Q07K416N94
5847B015j837n11K01j45J52J337P87j498j889J68J923O44q67j08p23m00l88J381
5865B42J855j206k036j17J200N73j12L40lj357j031R49K038k14j661k7K21J05
5883b41l04J164O43j860q24N35J672j63j099J94J32o26j74J098R67j099j325J09
5901a201R76K49j92J86K03j135m30J133O74p3j080JR26l44l34J057q0q84p75R77
$$ plain form
5778 1475 64 -2180 -2593 -203 1825 1191 -511 -1473 -1343 -1336 203 1856 1430 -1271 -2536 -850 992
5795 992 1003 369 -9 -1162 -1980 -1238 1421 2190 83 -1560 -1094 -97 776 1000 1445 74 -2077 -1835
5813 -1835 929 2222 855 -353 -827 -960 -673 635 1994 1136 -1580 -1880 75 1737 984 619 335
5830 335 -854 -1428 -39 2625 1728 -404 -1459 -399 349 796 1050 1399 -5 -1802 -995 1421 2015
5847 2015 178 -333 -132 -277 -125 1212 1999 501 -1388 -1220 703 1347 480 372 -351 -751 -1139 242
5865 242 2097 891 -1145 -1262 -62 511 399 739 736 -621 -1652 -703 1335 1121 -540 -567 -346 -241
5883 -241 -545 619 1262 -598 -1422 -887 785 622 -477 -283 -151 -777 -951 147 1114 15 -1310 -1201
5901 -1201 -225 24 -168 18 221 -914 -1344 -211 463 390 -690 -689 237 -107 -441 616 536 -348 -1123 -146
5921a46O06l37k32OJ6m27J07J042L00j278m40O66K65J59l22M39j94l83k40P28
5941C35N52n65o91K92K94m0Q4N1J91m98M4K89L40m56O2J37j69Q9m95Q07l6m85
5963A32J60Jj30J99j73J86jq8j42j11o0K38J54r7J1O9P6m32J21Q5l2q7o2J39J65
5988C21o3P5K30m45m76J5L63N62o82k18Q7N7k90P52R7o86l13p0Q01L36n35J20
6010C8n54k07R0L36J146o79q98k77M06O90k78M04M0r44l47P20R68j95q88m50M27
6031d52K06n2M53N26r19j128P71J042O8m36o45L2l69K45J135O35r47j348O1J005
6051a17L70L9n8j28r03l32J258P34k8j320j78M13M81L45O97l11j196j132J121
6070b45J479l83n91m34J42l91Q3J533L75j484j305L28J372L59k40J36m91p82j75
$$ plain form
5921 -146 460 123 -109 -103 -87 -514 -407 635 935 -343 -783 -117 148 307 -15 424 230 -153 -393 335
5941 335 887 322 -369 -77 217 177 261 312 503 5 49 338 678 222 284 421 252 341 -154 653 617 132
5963 132 292 293 163 362 189 375 374 286 144 33 -27 211 365 268 279 348 424 -8 113 198 166 79 17 156 321
5988 321 258 333 563 118 -358 -343 20 582 -100 -318 -231 -174 -464 288 385 -301 -614 -684 117 453 -82 38
6010 38 -516 -723 -633 -297 849 170 -728 -1005 -599 91 -187 217 257 -687 -1034 -314 654 459 -429 -879 -452
6031 -452 -246 -298 155 681 -238 -1366 -595 447 515 79 -566 -534 -903 -658 477 1112 165 -1183 -1122 -117
6051 -117 253 292 234 106 -797 -1129 129 863 835 -485 -663 -250 231 576 1273 962 -234 -1366 -245
6070 -245 1234 851 260 -174 -32 -423 -340 1193 1568 84 -1221 -893 479 838 598 734 243 -539 -714
6089g14J846O76j100j456L95L25L26K93R29o99j946l27J711J337n39j131m6o3
6107a83p63J097J351k56k340l86J104R55k7o7Q5j051j233Q58J928M88j400j435
6125a275K72P04K24O86N59j127j626lJ826J183q29q65p45k31J68J487J157j192
6143C73k109L6J233J481k96l17l42q85j114J489K141m74j899o78P27M86M70O65
6161I87j57j473j295P80K274K91j242q81J7j99L60J335M08j003j834L04J420Q64
6179I56l83j41q13j220N94J530J175p96j313o03O39J034K85P4l65j343n04Q06
6197c88J990k59j035r05n9k27J500J006k43j273j246K39J003J400k56j009r36
6214f98l69O91J456O06j102j146p2M32Q48P07l23p47j331k30J660Q50j25j203
$$ plain form
6089 -714 1132 1808 708 -748 -353 -28 298 591 1520 821 -1125 -1452 259 1596 1057 -74 -120 -183
6107 -183 -946 151 1502 1246 -1094 -1480 -376 579 552 485 570 -481 -1714 -856 1072 1560 160 -1275
6125 -1275 -1003 -299 -75 611 1170 43 -1583 -1586 240 1423 594 -271 -1016 -1247 -1079 408 1565 373
6143 373 -1736 -1700 -467 1014 718 401 59 -826 -1940 -451 1690 1216 -683 -1361 -634 -148 322 987
6161 987 830 -643 -1938 -1158 1116 1407 165 -716 -699 -898 -538 797 1205 202 -1632 -1328 92 956
6179 956 573 432 -381 -1601 -1007 523 1698 902 -411 -1014 -375 659 944 1018 653 -690 -1194 -388
6197 -388 1602 1343 308 -597 -656 -883 617 1623 1380 107 -1139 -900 103 1503 1247 238 -698
6214 -698 -1067 -376 1080 1686 584 -562 -634 -202 646 1353 1030 283 -1048 -1278 382 1232 1107 -96
6232i6o86J70M89P91O15n38j348o51Q83R75N01l49r61p98qJ020N27K42p38j025
6252i85j84P03J041K19p80o17m96L25J163M13k39j069q29J51R81J086n05n56m27
6271f05m92J62J165M96Mj375o31P67N46N71m29l46o90l48J029J160l57r09q98
6290a180K88O39M58L74m33l35q39M11J095N35r28j82m53n8N79M06O59r93p48J04
6310f01R77L24j65j74l95m83j04O01J163k14j203m39P32K64L7L08O4q63o88Q97
6330C8Q52J1o39m63M10j18p8N77L32o65j329O65J310k37m13j86j0l57nM21Q48
6351I64n05q58j68P18K67m80M49r8m0j323Q28P44j58o51K26K35l87l16P82K60
6371D89p05o34M34R43r14N8M73J44o26j38M27N46q01l56M54P69r25l70Q35O1n20
$$ plain form
6232 -96 -782 -612 -123 668 1283 745 -603 -1254 -371 604 1105 756 -205 -1003 -1011 9 536 778 40 -985
6252 -985 -1169 -466 575 794 14 -603 -1099 -774 389 802 563 -506 -1335 -1184 -203 883 378 -178 -605
6271 -605 -1097 -935 230 726 730 -645 -1276 -509 37 608 179 -167 -857 -1205 -176 984 627 -282 -1180
6290 -1180 -892 -253 205 579 146 -189 -1028 -617 478 1013 85 -97 -550 -608 -29 377 1036 43 -705 -601
6310 -601 376 700 535 361 -34 -517 -621 -20 1143 929 -274 -713 19 283 320 628 692 -171 -859 38
6330 38 890 901 262 -201 209 91 13 590 922 257 -1072 -407 903 666 253 67 57 -300 -305 116 964
6351 964 459 -399 -567 151 418 -62 387 289 249 -1074 -246 498 340 -311 -85 150 -237 -553 229 489
6371 489 -216 -850 -416 527 -387 -329 144 288 -338 -476 -49 497 -304 -660 -206 563 -362 -732 103 164 -356
6392c56m46O91O01p14m44Q92r6n16LN90K4m78l83Q51P1o76q0Q15K46p18q98J333
6414C12j3m48k85Q05n0m75k73Q48K78m59k85j01L89n91L34L59J15q32J01M62K78
6435D69l47j58L07N9m42k51R60J11p05k43K51R1q2L22L45l67q91J66J233k08k6
6456E94m00k06K09k90J56L23R5p81k32R10J63l08L64k49o30j62N60Q66m57l96
6476A29o06O42m15K52P61p5q22o39M67R05Qm13m77J47n79M08M26M78n19o95LO39
6498B5L62k70j17l59m22J99O41Q79o89l73p45L14L75M60K52n20n45l94O15P96
6518D84L4m57l62o78%R35P52k12r37p42L45O65N66K0n53o51qJ95J039K27m57o90
6540d85k35L56M82N23J7q34p31J25P83M59M66o37j060j22P24R63J5m62o28m62
$$ plain form
6392 -356 -802 -111 490 -224 -668 224 128 -388 -385 205 229 -249 -632 219 290 -386 -466 349 595 -123 -1021 312
6414 312 299 -149 -434 371 321 -154 -427 421 699 240 -45 -146 243 -348 -14 345 460 -372 -271 191 469
6435 469 122 -36 271 330 -112 -363 597 708 3 -240 11 102 20 342 687 320 -571 -405 828 620 594
6456 594 194 -12 197 -93 63 386 481 -300 -532 378 541 233 597 348 -282 -444 116 982 525 129
6476 129 -477 165 -250 2 763 688 -134 -773 -306 599 607 194 -283 -136 -715 -307 119 597 78 -617 -614 25
6498 25 387 117 0 -359 -781 -582 59 938 249 -124 -869 -555 -180 280 532 12 -533 -927 -312 484
6518 484 518 61 -301 -979 -979 -44 708 496 -441 -1183 -838 -173 393 413 -140 -791 -799 -604 435 662 205 -485
6540 -485 -720 -364 118 641 658 -176 -907 -782 1 460 926 289 -771 -893 -169 794 809 347 -281 -743
6560g43J15J094P81k04j242o48L21R40O38n14k86k95o20M31R23M14p23o04m42
6579f64L03O02O43j56l83r06m87J549O62n58l69k35j97j34Q76O45m35j298m43
6598i85Q32L50N12j52l96o06m18M81J282l0j068o19J88L90M14N44J87p63j420
6617a277Q9J434O26p97k82k69l16J50J288L44n15j537M9N67R85r4j78k79q81o9
6637i62J021J181q26j032k74L45M66O2N08l5j484l87M80J878k18o70m59k73M48
6656b31l15J124O7o05j586Q87P28L41K06m84n54l45k46J451R07r45j169P8N60
6675a31J37N48J90m41o33o28P73J363n61p04J63j42l76P97M87Jj051n99M05J109
6695G07J6m06k54n80R5K01R90K18n15j129K20O49K81j58K97j69j207Q7J248N88
$$ plain form
6560 -743 -628 466 1247 1043 -199 -847 -526 414 1052 538 252 -43 -663 -232 691 1105 382 -222 -664
6579 -664 -361 241 884 728 345 -561 -1048 501 1163 605 236 1 -196 -330 546 1191 756 -542 -985
6598 -985 -153 197 709 557 161 -445 -863 -382 900 870 -198 -817 -629 -239 175 719 906 143 -1277
6617 -1277 -1188 246 872 75 -207 -476 -792 -642 646 990 475 -1062 -1013 -446 539 445 267 -12 -893 -962
6637 -962 59 1240 414 -618 -892 -547 -81 -19 489 454 -1030 -1417 -937 941 723 53 -406 -679 -231
6656 -231 -546 578 645 40 -1546 -659 69 410 616 132 -422 -767 -1013 438 1345 400 -769 -691 -131
6675 -131 6 554 744 303 -330 -958 -185 1178 617 -87 76 -66 -442 355 842 843 -208 -807 -402 707
6695 707 723 317 63 -517 -422 -221 769 987 472 -657 -437 212 493 335 632 463 -744 -657 591 1179
6715A179p74n86n9o3K32N21K40j40r81j74N56M67J93k94k79r7n88M92R53j12o87
6736ao89L04M91q7L16k62p6r76M11R06L9k96o93M0P28l19K27L10n36m67j39Q22
6758E3K71k83j85k44j21J17L02N38m25m18k39K06M74r9L55o12p0k33K44N58j35
6779E4N5k90k3m39O00J87J30l14m58N5L57L4M19o71j1O7O4M95j2j52m05J98J63
6802A03K9J50m4j43l85K62J93k06M95j80n3k12k24P19k35l41J00j18K05K6q5o9
6824a3J03m9J00n4M75m33M5N6n72K43Q6M61j97k86K4L43j69m42P07K36m97k43
6846g6pK98l70OJ78K49k75l49M61j1l64j63O19k00k90N5L64p2m8j28J44J1N9n86
6870d95O02J87p51j56O34Q2j34m79N64k42k05L43O2L37n77k75J17N18l91M6L07
$$ plain form
6715 1179 405 -181 -240 -303 -71 450 690 550 -431 -605 -49 418 611 317 38 -59 -647 -155 798 686 -1
6736 -1 -690 -386 105 18 334 72 -4 -980 -569 337 376 80 -613 -573 155 -164 63 373 -163 -630 -769 53
6758 53 324 41 -144 -388 -509 -392 -90 448 23 -395 -634 -428 46 -53 302 -310 -380 -613 -369 189 54
6779 54 109 -181 -204 -643 -43 144 274 -40 -498 -443 -86 -52 367 -304 -315 -248 -184 311 299 147 -258 -60 103
6802 103 132 282 238 95 -290 -28 165 -41 454 274 221 9 -215 504 269 -72 28 -90 115 141 56 -13
6824 -13 90 41 141 87 562 129 174 230 -342 -99 -13 448 251 -35 -11 332 163 -279 428 664 167 -76
6846 -76 -83 215 -155 -149 29 278 3 -346 115 104 -260 -423 196 -4 -294 -239 125 53 5 -123 21 32 91 -495
6870 -495 107 294 -457 -613 21 103 -31 -510 54 -188 -393 -50 12 349 -228 -503 -386 132 -259 -213 94
6891I4l10m73K36M70L76o33j90K3J01K13o7M31k55p08L02N61L5l43K74j46k39
6912b48r7M20O05l83m57l21M54P27l50l43K44j18l63J98O80J28q28j73L46j10
6932A1L36l9J72o30n55L70O12L05p55L27j37k01q0O24M64l63r16N3O58j2mNj09
6955A36k40k01N18Q36o68n69j81K16K19nL10J24p87m06M65P29r7k57j81k40o2
6976c41O38L5L35q26m39n0Q26L59m35L5j78n55l96J204L62m59o53K53j46L7N85
6997A91M77m19p22k38P28M19J84o41n53J76l12M96J152p33m36p20K62O14L05J65
7017C95j65m99m22K82Q35N59r51m54k85P20K6L61Ll73m98q3O69M16l84m11j96
7038d55l19L67O55O03j089K8j84J04O26j17K80l00n81j30N53P75k74p14l91K25
$$ plain form
6891 94 -216 -689 -453 17 393 -240 -430 -407 -306 -93 -160 271 16 -692 -390 171 206 -137 137 -9 -248
6912 -248 -345 75 680 297 -160 -481 -27 700 350 7 251 133 -230 -32 648 776 -52 -225 121 11
6932 11 347 308 480 -150 -705 -335 277 582 -173 154 17 -184 -264 360 824 461 -455 -402 256 244 240 245 136
6955 136 -104 -305 213 1049 381 -188 -369 -153 66 61 371 495 -292 -698 -233 496 399 142 -39 -279 -341
6976 -341 297 332 667 -159 -598 -648 178 537 102 137 -41 -596 -992 212 574 115 -538 -285 -431 -394 191
6997 191 668 249 -473 -711 17 436 620 -21 -574 -398 -710 -214 938 205 -231 -951 -689 -75 230 395
7017 395 230 -269 -691 -409 426 985 34 -420 -705 15 41 402 405 32 -466 -549 120 536 152 -259 -455
7038 -455 -774 -407 248 851 -238 -210 -394 -290 336 219 499 199 -382 -512 41 816 542 -172 -563 -338
7058c38K47M47O05q68l65l42J99L05N40N9m98n40J23P22M52j48l12p14N3J21P02
7079D50L13k14n46p23N33L77N78J42q51m19J4K48N51N3l99o38R8L78K49M72j20
7100E46o90n06K91N10L17j63o58P4j00K15O00J39n40p00r0M15N68L45k70m15o93
7121h05L2Q58N04k08p55J37j0n1M68J87p3m07p89P21N80p9l44mk37j12J19P59
7143D91L7q97m50J44O73J90r6L77o15m10L54M57N61p01o17K96L07m3M0J84j55
7164A27l91o41P17R70n37n21M18k67J73L69n6J15o75l11K45N81Q2k99K3K15p35
7185c98K47R30l67J03n04q1K31k33N67p8k33q74K57P56L61p22J45K49m02k45N27
7206B36J29O8n25k49M17K97k22Q4Nm97j70L71O96l36k84l87K20P69n80K49M4n04
$$ plain form
7058 -338 -91 356 961 93 -272 -614 -415 -110 430 489 -9 -549 -426 296 748 600 288 -426 -373 -252 450
7079 450 763 549 3 -720 -187 190 768 910 59 -360 -346 -98 453 506 107 -531 -433 -55 194 666 546
7100 546 -144 -650 -359 151 468 305 -353 -279 -379 -164 436 575 35 -665 -755 -340 228 573 303 -112 -805
7121 -805 -773 85 589 381 -374 -237 -247 -298 170 357 284 -123 -912 -191 389 310 -34 -38 -275 -387 -268 491
7143 491 528 -369 -819 -675 -2 188 92 469 -146 -556 -202 255 816 115 -502 -206 101 58 98 282 127
7164 127 -264 -905 -188 782 245 -276 142 -125 48 417 361 476 -199 -510 -265 316 398 99 122 337 -398
7185 -398 -151 779 412 515 11 -70 161 -72 495 417 184 -690 -433 323 684 -38 107 356 -46 -291 236
7206 236 365 433 -92 -341 76 373 151 235 240 -257 -427 -56 640 304 20 -367 -147 622 42 291 335 -169
7228a69k39L1R43k49n77J07N0j58K33O9L00l65n60N08K11k05j18k11L21M3l84
7249d19R5P16k82j51k49O81n83L65l72K87k63n42P23L30l96l45K46j5J81l04N64
7270B67l0k43j79j24L61J15n11K28L42k79O4n3K27M8l61L5K10l38Q7P8N26n70
7292a00j06M92j66p6m08P38j74Q2m15R0K65j32l38M47j0k57K34K24m91Q4k13O58
7314D28k87l53L21M04n13Q8K2QQ6ok2k13J81k97J11l2K0L8kK16j8j04K63l40k
7339cp2JJ01K05j76k80p7L16j55K38K07l07k29N4K94oJ70m45l62J72P2J54K91
7362A63K09q62K25j0M36j13L10l57n81k91J111J63k75M9n62nJ14N54k27o7l64
7383c80O9O4J31L93j26j77k40q7K77L63j32K18m39q0j96J76M50j74k43l05K92
$$ plain form
7228 -169 -408 -377 566 317 -260 -153 -103 -261 -28 41 341 -24 -584 -76 135 -70 -188 -399 -78 -35 -419
7249 -419 -324 392 110 -41 -290 391 -192 173 -199 88 -175 -717 6 336 -60 -405 -159 -174 7 -297 267
7270 267 237 -6 -185 -309 52 167 -344 -116 226 -53 11 -42 185 233 -128 -93 117 -221 -134 -56 470 -100
7292 -100 -206 286 120 44 -364 374 200 282 -133 -43 222 90 -248 199 189 -68 166 390 -101 -17 -230 428
7314 428 141 -212 109 513 0 88 110 118 204 198 176 -37 144 -153 -42 -74 -54 -16 -18 198 180 76 339 -1 -3
7339 -3 -75 -74 27 232 56 -224 -301 15 -140 98 305 -2 -231 -177 117 111 281 -164 -526 -354 -282 -128 163
7362 163 372 -490 -265 -275 161 48 358 1 -580 -871 240 403 128 177 -385 -390 -276 278 51 -16 -380
7383 -380 -311 -247 -116 277 151 -26 -266 -353 -76 287 155 373 -66 -146 -342 -166 284 110 -133 -438 -146
7404a46K79J77J39m14m03k68P18L14R8k70q77L92K51J05L99j13m94l01J58Q26
7424E70j65k35k34j70r7M31Q8O17l99o06j08L21K78l4N7j07l91l46P15P34l19
7445F00m84l44N8K39K14O73l39j061j0P11J21J50m60j13q6k11L42O17q3o06o35
7466g07J72K59M00K80k00j76q31L01O61M39l98m18l65K06M25K46K12n32n39k21
7486g86M94P01J47n55l56n3q5O40K40K64j066k01J92M56l2L07j53m28n76P23N77
7507D50K06r33n16L77M15P1L45L0p64J15m50J060k3J13m30l33m30L82P14J38j02
7528D35q54j69M65J76M34j16j98o33q7O24O31k25q06J00lM14J58P8q6n17o41N15
7550c05J056p3o57J13nk24j25R80J41q19m22o7P76j30J51l30k03m29L28M48N18
$$ plain form
7404 -146 133 310 449 35 -368 -636 82 396 494 224 -653 -261 -10 95 494 381 -113 -414 -256 570
7424 570 405 170 -64 -234 -331 100 188 805 406 -200 -308 13 291 257 314 207 -184 -530 185 919 600
7445 600 116 -228 -170 69 283 956 617 -444 -454 257 378 528 68 -45 -131 -342 0 617 534 -72 -707
7466 -707 -535 -276 124 404 204 28 -803 -502 159 598 200 -218 -583 -377 48 294 506 -26 -565 -786
7486 -786 -292 409 556 1 -355 -408 -493 147 387 651 -415 -616 -424 32 0 307 154 -274 -850 -127 450
7507 450 656 -277 -793 -416 -1 70 415 445 -319 -204 -654 406 383 496 66 -267 -697 -315 399 537 435
7528 435 -419 -588 -123 53 487 371 173 -460 -547 77 708 483 -323 -223 -226 188 346 424 338 -179 -820 -305
7550 -305 751 678 21 134 129 -95 -220 760 901 82 -340 -407 369 239 390 60 -143 -572 -244 204 722
7571G22k42q98k4O85k91K92J92m42n15k60M32O95Qj79m27N1P9M1L97n4l56o59
7593g53N78K27J9j50O7k17mK28K69O8k1r81J64L53K25J94O6m75k80j18O19K77
7615C55l32j41M0m07N85o3K01l68k23p2K25L55J36N3n39j74m5M20J76R7p29K33
7637b17J49J58kJ37j05l40K59m80O66J51m00K07o75N43J12J60j3n7j14k30j92
7658b83M76J97q2k49o92O12J48K90l48K31k06P8J04k53K61m56J10j72p8L69J02
7679A59J41p4l53J14N01j49k7j75Q8j95R2k12J48j0l05j51O87n00K02K0Q0OnJ02
7703A84j91q9j51J4M32J54n75J31K48j12P9j84J87Q2m04K02J28n57J93j03L38
7724Fl24n3M03J19j18l26K04J55O7l35J62l0l9J4L72P9n56J7K1K50K6j90R7j89
$$ plain form
7571 722 480 -418 -442 243 -48 244 436 -6 -521 -781 -349 346 354 175 -252 -201 -122 -81 316 262 -94 -753
7593 -753 -175 52 71 -79 -12 -229 -233 -5 264 332 311 -670 -506 -153 72 266 332 -143 -423 -541 78 355
7615 355 23 -118 -78 -485 100 37 238 -130 -353 -425 -200 155 291 344 -195 -369 -414 6 182 279 -450 -217
7637 -217 -68 90 88 225 120 -220 39 -441 225 376 -24 183 -492 51 163 323 310 253 139 -91 -283
7658 -283 193 390 308 59 -633 -21 127 417 69 300 94 172 276 23 284 -172 -62 -234 -312 57 159
7679 159 300 226 -127 -13 488 339 312 137 225 30 122 -90 58 48 -257 -408 279 -221 -19 1 81 87 82 184
7703 184 -7 -96 -247 -233 199 353 -222 -91 157 45 124 -60 127 209 -195 7 135 -422 -229 -332 6
7724 6 -318 -371 32 151 33 -293 -89 66 133 -202 -40 -70 -109 -95 277 356 -200 -183 -162 88 114 -76 21 -168
7748a68m9M5k6P79o37n24N90l8m1L40j83J64m33Q0L53L48o53k72L89j6j56M4K15
7771A51L39q01j41M40K50o2%j27J79o81K31O14L5n18o23O99j49M68L8k68K19p11
7793d18J39M36M43n86j68K76m60J56J2Q07l81n80q8M42L90k19M9k31k38l24P05
7814A62L99l41l34o43N61K97K6L1K74o46m02J99M66Q16q65Q2j86L4j30L89M50
7835F39l86p02J90J23P39k79k64k7n03J74M64N08k89p80k85M37N58j03K4l21m86
7856e69j53N66M45l8l40o62L21j1N20L29k69k02m79l1P49L27k99m0m92j88N42
7877B6K81N25o23m60k16K54O69k82jl63m16r5P17M54L01n08r58L86KQ56o4n79
7899i4j11n24L00M53O24m11l09N9p59N92P04j67j05m51k48M93O91j35K1j078j8
$$ plain form
7748 -168 -217 -172 -198 581 -56 -580 10 -28 -69 271 88 252 -181 -101 252 600 -53 -325 64 48 -108 -64 151
7771 151 490 -311 -452 -12 238 176 176 49 228 -453 -222 392 427 -91 -714 -15 -164 304 342 74 293 -418
7793 -418 -279 157 600 14 -154 122 -338 -182 -170 637 256 -324 -412 30 420 201 250 19 -219 -543 162
7814 162 561 220 -114 -757 -196 101 127 158 432 -214 -616 -417 49 865 0 82 -104 -70 -200 189 639
7835 639 253 -449 -259 -136 603 324 60 33 -470 -296 168 676 387 -393 -678 -241 317 214 238 -83 -569
7856 -569 -722 -156 289 251 -89 -751 -430 -441 79 408 139 -63 -542 -573 176 503 204 164 -328 -516 26
7877 26 307 832 209 -251 -467 -213 456 174 173 -190 -606 -701 16 470 771 263 -695 -309 -307 549 485 -94
7899 -94 -205 -729 -429 24 648 237 -72 -13 -772 -180 524 357 252 -199 -447 46 737 602 623 -455 -473
7920d73N20K50N49j86r12Kl5M97L01n9n66j45n82M06J200J02n69o01n19N24J073
7941G77l49K88p05n44O1M95O66k59k91n19k08O88K78N8k28m53n94M98N24O24l03
7962E04r01j44l1O54L45k64k34m90l08R50L54l4k16k95n97P2O90M01k53m90m18
7983g05J28N70O0L48m86l70k46M79N95Ql92m86K09j30N87J59J01l06r76J86O92
8004B5O08k69m12l03n5J61N09R85q86p89j39O21K15j21J50k52l37k73N89Q33j55
8025G05j141K78j05K24K43M47l50o6p17J43R38J06m74j43m51K1M83O08n2m03m05
8046a11j89N83J42k30J01m07k57K81J01N55l67m43j34K07L60j88M55k68n93k58
8066f60N55R51n31l84j93qMl8R74o05l09n20L60Q18k40j39l5L9m33p4P10J83o90
$$ plain form
7920 -473 47 297 846 660 -252 -250 -285 212 513 454 -112 -257 -839 -433 767 869 300 -301 -820 -296 777
7941 777 428 716 11 -533 -472 23 689 430 139 -380 -588 100 378 436 208 -245 -839 -341 183 807 504
7962 504 -397 -541 -572 82 427 163 -71 -561 -869 81 435 401 185 -110 -707 -635 55 456 203 -287 -705
7983 -705 -577 -7 53 401 -85 -455 -701 -222 373 381 -11 -497 -288 -418 169 328 429 123 -853 -667 25
8004 25 633 364 -48 -351 -406 -245 264 1249 363 -426 -565 56 271 150 300 48 -289 -562 27 860 705
8025 705 -436 -158 -263 -39 204 651 301 235 -482 -339 599 705 231 88 -363 -342 141 749 697 294 -111
8046 -111 -300 283 425 195 296 -111 -368 -87 14 569 202 -241 -375 -168 192 4 459 191 -402 -660
8066 -660 -105 846 315 -69 -262 -270 -266 -304 670 65 -244 -764 -404 414 174 35 0 39 -394 -468 242 425 -265
8089b65n8L22J12L9k24N02k00l50l32K32N25m78J24o7K62m88K07N12j90o2p88
8110f65O68K11k57Npo6k73J51N91k91l44j89L7M49k8J01j65j18JM2O75k96r4r6
8134D2P3J50l16K39J79k27k09J52j71J69n3J3J24j42r2o2L75l8n20N61k32OJ68
8157A89j95Q5J7k46J64nPK7K15N2k11q9j88L44l9l8l6J46j58j98J78J05j47j05
8181a26M77n82LO92j78l38k81lJ40R8
$$ plain form
8089 -265 -323 -1 111 150 -74 428 228 -122 -454 -222 303 -175 -51 -118 144 -344 -137 375 185 123 -665
8110 -665 3 214 -43 -38 -45 -111 -384 -233 358 67 -277 -466 -429 20 -8 93 -72 -190 -189 -147 528 232 138 42
8134 42 115 265 -51 188 367 140 -69 83 -88 81 28 41 165 23 -69 -131 244 206 -314 247 15 21 189
8157 189 -6 79 96 -150 14 9 16 43 258 310 99 10 -178 166 127 89 53 199 41 -157 21 126 -21 -126
8181 -126 351 -231 -228 464 286 -52 -333 -336 -196 -98
8191i8
$$ Imaginary data points
##PAGE= N=2
##DATA TABLE= (X++(I..I)), XYDATA
0@%%%Qj8J8k4M0n6P2q8J04j30J64j95K35k91L48m10M85n69O68p77Q94j031J185
26F32j351J539j749J977k230K511k819L157l526L931m381M869n400N994o642P349
42C861q138R011r981J1068j2285J3663j5244J7067j9198K1737k4815K8642l3552
55a8164M0110m9382O3588q8319J43457m74241J82494R38655n64789n00317K50570
66g6338K09989n25956K5680P67342K31388q18545m56241M44229M43785j30921
76A14412p1934J16459j56265l82030P0723M92674K69954k72662m08499j09908
86c37076K29879K38347N6699l8923o0372k12301k11184J90946M80300Q4352m31003
97a0336k83470J58554J55086j933J51404J51062k99929m16437J50319M77130Q5845
$$ plain form
0 0 0 0 0 8 -10 8 -16 24 -32 40 -48 56 -74 90 -105 130 -161 187 -223 262 -307 361 -416 478 -553 632
26 632 -719 820 -929 1048 -1182 1329 -1490 1667 -1859 2072 -2309 2560 -2840 3154 -3488 3861
42 3861 -4277 4734 -5247 5821 -6464 7199 -8045 9022 -10176 11561 -13254 15388 -18164
55 -18164 21946 -27436 36152 -52167 91290 -382951 -200457 738198 173409 -326908 -76338
66 -76338 133651 -392305 -366625 400717 632105 -186440 -642681 -198452 245333 114412
76 114412 42478 158937 2672 -379358 -308635 184039 453993 181331 -227168 -337076
86 -337076 -107197 131150 187849 148926 88554 -123747 -334931 -143985 336315 420667 -10336
97 -10336 -293806 -135252 19834 17901 169305 320367 20438 -395999 -245680 231450 317295
108C17295k32817q8026n1420j76860P8046M13987J28702l73633k72328J21956
118a35098J35068L1159J70149J01368l18587l44608J84684L91377K2257j76340
128F1429k5487p2415k07032Q5585M14718J20442l58838k64142J16588J52174K2959
139D5981R1712Q0725k00495k86634N6511L18184J45505j21984j61812r1009k3348
150a46664R1469J74117Q2350j12054k08753j08501J10553K27943Q8115j34580
160F3995j62429l4845K9152O0748J46034R5705j67452k65597J5573K49850J04380
171A35114q7886m0201k2604j40047m0497K38285J92116j56938k37810P047J08018
182d5403K2159N3647J02340q0070k27178k7366K09785J19905o4952o3169l7334
$$ plain form
108 317295 84478 -3548 -54968 -231828 -153782 260205 388907 15274 -257054 -135098
118 -135098 -30 31129 201278 302646 -15941 -360549 -175865 215512 237769 61429
128 61429 35942 -36473 -243505 -157920 256798 377240 18402 -245740 -129152 23022 45981
139 45981 137693 218418 17923 -268711 -212200 105984 251489 129505 -32307 -123316 -146664
150 -146664 -55195 118922 201272 89218 -119535 -228036 -117483 110460 198575 63995
160 63995 -98434 -133279 -104127 -43379 102655 198360 30908 -234689 -219116 30734 135114
171 135114 47228 7027 -15577 -155624 -196121 42164 234280 77342 -160468 -153421 -45403
182 -45403 -23244 30403 132743 52673 -174505 -201871 7914 127819 62867 -302 -37636
193c7636q7720m448J69330J13419j04706j37965j1441L4177M0179J01833N3776
204A28798j25386j47003M2421J27804K7529j8009J2505n8149j19386L0773J78223
215H0120N5794j19691p5321K8281K340j138Q7940O0502r8439j21409L0956J07016
227C6951L2839k4072j1541k7341n2339N315Q1670N6592l6741p9136l4366L9312
239a2857O1156J2881k6803p887p823m6121n577R2875N4665r3611q8290O0472O9951
252F3031n2601l1975Q3338J6114j27402l3696J43894N3553j33259m8941J16155
263D8211J5776j26310P018J43977j1481j53566M069J44939n309j31906J3294J22770
275G1482k5735j24547K6945J18682k9863j12707L2255J09842l2619j09283K3061
$$ plain form
193 -37636 -125356 -129804 39526 152945 48239 -89726 -101167 -66990 -26811 75022 128798
204 128798 3412 -143591 -101170 26634 54163 36154 48659 -9490 -128876 -98103 80120
215 80120 135914 16223 -59098 -30817 -28477 -29615 58325 118827 20388 -101021 -70065 36951
227 36951 69790 45718 34177 6836 -45503 -40188 41482 98074 61333 -17803 -52169 -12857
239 -12857 48299 61180 34377 26490 18667 -27454 -33031 59844 114509 20898 -67392 -6920 63031
252 63031 10430 -21545 61793 77907 -49495 -83191 60703 114256 -19003 -67944 48211
263 48211 63987 -62323 -55305 88672 77191 -76375 -72306 72633 67324 -64582 -51288 71482
275 71482 45747 -78800 -51855 66827 36964 -75743 -43488 66354 33735 -75548 -52487
286e2487J03477j3575r2367J0889Q2645k2657r3056K5745J11627j1056j17981
297f8796j1198J01239J5000q1284O585Q3628l0929j15432K3940J39838N408j28509
309f0510j8985R4163p737p8486N5435J06811p2663j47323M2084J49604n041j05793
321d8441J4948O5404o6947p3890J09995J27145r0352j52050L6738J15097j4827
332B2820m8752O0168L0659j18709p5275J27670J33012o7563j23277J7352N5792
343A3897l5638n794J09784L5594j48961j08591J08721J39942l0164q5941J2941
354E790J2447p6680p336J51438Q1014j45665j46882O6392J22686r007l1826M7885
366G0256j8485j40551l1455J79911J21136j18086j44187K8806O3611k3552K6330
$$ plain form
286 -52487 50990 37415 -54952 -44063 38582 15925 -77131 -51386 60241 49185 -68796
297 -68796 -79994 21245 36245 -45039 -38454 45174 14245 -101187 -77247 62591 67999 -60510
309 -60510 -79495 14668 6931 -71555 -16120 90691 18028 -129295 -87211 62393 57352 -48441
321 -48441 -33493 31911 -35036 -108926 1069 128214 37862 -114188 -77450 37647 22820
332 22820 -25932 34236 64895 -53814 -129089 -1419 131593 64030 -59247 -41895 13897
343 13897 -21741 -27535 82249 117843 -31118 -139709 -30988 108954 78790 -7151 5790
354 5790 18237 -58443 -65779 85659 166673 21008 -125874 -59482 63204 54197 22371 70256
366 70256 51771 -88780 -120235 59676 180812 62726 -81461 -52655 10956 -12596 13734
377A3734J12880k1164j93633p2051J66095J39086o2194r6036J248j4338o0221
388h6594N9773J64914J0555j91720j12614J02291J17647l054j7542Q352p5281
399b3273j16260M6785J90796O4954j43889j28978K6016O1860K0363N4697N8150
410A11221q7232j69656o678J75308J08968o9028r7549k8737k0576j590J04673
421A9124J22211n7803j89756o3029J20256J08466M143k1260l7226r9679o0399
432a54952J12031J71353Q46j58322j00280L3415O7885N6969O3337p538j36273
443e1529j18565O6700J68712O3978p3216r5818n5246q379O9833J27762M7282j16132
455B5382j50210r723J16176J02283K1302m8239r6534q3725K7369J37006J03893
$$ plain form
377 13734 126614 105450 -88183 -160234 5861 144947 82753 -13283 -12035 -26373 -86594
388 -86594 -26821 138093 148648 -43072 -155686 -53395 64252 61198 43656 52008 -23273
399 -23273 -139533 -92748 98048 163002 19113 -109865 -83849 -21989 -1626 53071 111221
410 111221 23989 -145667 -152345 22963 131931 62903 -34646 -63383 -83959 -85549 19124
421 19124 141335 83532 -106224 -169253 -48997 59469 63612 42352 5126 -94553 -154952
432 -154952 -42921 128432 129278 -29044 -129324 -95909 -28024 28945 92282 84744 -51529
443 -51529 -170094 -103394 65318 129296 56080 -39738 -94984 -103363 -33530 94232 141514 25382
455 25382 -124828 -134551 -18375 83908 105210 56971 -39563 -123288 -95919 41087 144980
466A44980m2577j33768q5165K5629R8638R5040K0485q5907j23452l6314R0577
477c1834J24136M2374o6225j15937o7156M4454J21795Q4636l1464j14541r2089
488a01851R806J00494J07129J8622r7752j24354k5145R2971J10889L5109n5184
499G0734j04836p7829K9626J30926J01750m3791j36054q0794L4444Q9083P7048
510I0307K6674o4946j33403n9952J02522J46416K1092r5557r0277l3400J5799
521g4725Q3038J10738L304j45943j24369M8082J32166N6792k1652m2724p7573
532e2866p7917M6372J60216P0552j11192j34821r045O4733N3483N3639K9042q3050
544I146j41596q477J49073J06608m7799r2179m0688j7953R935R3452J02197m6880
$$ plain form
466 144980 102403 -31365 -116530 -90901 7737 102777 123262 37355 -86097 -122411 -31834
477 -31834 92302 134676 68451 -47486 -114642 -70188 51607 136243 104779 -9762 -101851
488 -101851 -92045 8449 115578 134200 36448 -87906 -113051 -20080 90809 125918 70734
499 70734 -34102 -111931 -82305 48621 150371 106580 -29474 -110268 -75824 13259 90307
510 90307 116981 52035 -81368 -141320 -38798 107618 128710 33153 -57124 -90524 -74725
521 -74725 8313 119051 122355 -23588 -147957 -99875 32291 89083 67431 24707 -52866
532 -52866 -130783 -84411 75805 146357 35165 -99656 -108701 -43968 9515 63154 92196 9146
544 9146 -132450 -140927 8146 114754 66955 -25224 -65912 -83865 -73930 19522 121719 74839
556G4839j61584o3530J00582J04443N554k6808k6865p6116o1343Q5069J55789
567A10030Q645j44536q7818M7281N7768K0169M7981K8124j03863j32444N1054
578i7609J73889M5896j06118o2881J4422j6855q142J04555R5289r5307j68071
589a20932Q417J44143N2039n2520r416M512q1962n1997J19196J37760o0656j54204
601f5620j6885Q5577K0598j1742N5131K0980j19333r6260R9977J47386k4855j12102
613a7148j3975L4144k9475l580J02180N2340j18617j16369O0506J16969q53n3187
625A2935R212k499p3541j2822J15548P2801q8227j04227K3931O6378j350p030
637A1109M1184n855r6170m2062R7182Q8824m8871q2514P214L0064k3831J282P4518
$$ plain form
556 74839 -86745 -150275 -49693 54750 60304 33496 6631 -69485 -130828 -45759 110030
567 110030 118675 -25861 -113679 -66398 -8630 11539 59520 87644 -16219 -148663 -97609
578 -97609 76280 122176 16058 -46823 -32401 -49256 -57398 47157 142446 47139 -120932
589 -120932 -112515 31628 83667 31147 21731 26243 -55719 -107716 11480 149240 88584 -65620
601 -65620 -82505 3072 23670 11928 67059 88039 -31294 -127554 -27577 119809 94954 -17148
613 -17148 -31123 3021 -26454 -30034 72146 124486 5869 -110500 -49994 66975 66122 12935
625 12935 22147 19648 -53893 -66715 48833 121634 33407 -70820 -46889 19489 18139 11109
637 11109 52293 46438 -49732 -91794 5388 94212 45341 -37173 -29959 105 -23726 -22444 52074
650E2074J9731j01384o8629P2928Q3328l1351n0406K4779O957o5036l325J01624
662D1290L5755r7785o1974O1351M5126l8481o024N3203j4486q5600j775R4257
674B4857K7879o9224k9098L9038J742l4902K3479N3744j9345o7120l024N5563
686C589J7826k9423r087J8153q205k7207J2017M3912L946m3441k0119L0477K3078
699A5516j7964j2793K2051P232l2788j0161M1177J9410l7810k0788L3307J5331
711B1720l1313p811L5553N670l6285l081L6223J482l5300J256L6445j055l1537
724h033J465K4088o164j6047J4627J6433j6847j9876R255J6902K503k538l066
737A2702j1583q058J1568J7376Q47q890r354j1324j584K3058K1655j4479k7992
$$ plain form
650 52074 71805 -29579 -98208 -25280 58048 26697 -23709 1070 8027 -57009 -60334 41290
662 41290 77045 -20740 -82714 -21363 23763 -14718 -20742 32461 17975 -67625 -69400 24857
674 24857 52736 -16488 -45586 -6548 -4806 -39708 -16229 37515 18170 -48950 -51974 3589
686 3589 21415 -8008 -17095 1058 -7147 -34354 -22337 21575 25521 -17920 -38039 -7562 15516
699 15516 -2448 -15241 6810 14042 -18746 -28907 12270 31680 -6130 -26918 6389 21720
711 21720 -9593 -17404 18149 23819 -12466 -15547 20676 22158 -13142 -11886 24559 23504 -8033
724 -8033 -6568 17520 11356 -4691 9936 26369 9522 -10354 -1099 15803 18306 15768 12702
737 12702 1119 -6939 4629 22005 22852 13962 4608 -6716 -8300 14758 36413 21934 -6058
750f058l456J0420L381J2024J8318j4173m1783q857L8306K7003j2586j8759n750
763a970j2832q760K9100L8804j3155m9903j8434K3393K3272J0765M818j4853l7489
$$ plain form
750 -6058 -9514 906 4287 16311 34629 20456 -21327 -30184 8122 35125 22539 3780 -1970
763 -1970 -14802 -23562 5538 44342 31187 -18716 -37150 -13757 9515 20280 25098 10245 -27244
$$ [...]
8191G3
##END NTUPLES=NMR FID
##END=
