##TITLE=1H_AP2712-2
 CDCl3
 8 sc, 
 13.1.2025
##JCAMPDX= 6.0         $$ Bruker NMR JCAMP-DX V2.0
##DATA TYPE= NMR FID
##DATA CLASS= NTUPLES
##ORIGIN= UXNMR, Bruker Analytische Messtechnik GmbH
##OWNER= root
$$ XWIN-NMR		Version 3.5
$$ Mon Jan 13 14:04:27 2025 Russian Standard Time (UT+4h)  she@DPX200
##.OBSERVE FREQUENCY= 200.1315
##.OBSERVE NUCLEUS= ^1H
##.DELAY= (6, 6)
##.ACQUISITION MODE= SIMULTANEOUS
##.ACQUISITION SCHEME= undefined
##.AVERAGES= 8
##.DIGITISER RES= 18
##SPECTROMETER/DATA SYSTEM= spect
##.PULSE SEQUENCE= zg30
##.SOLVENT NAME= CDCl3
##.SHIFT REFERENCE= (INTERNAL, CDCl3, 0, 15.7039)
##AUDIT TRAIL= $$ (NUMBER, WHEN, WHO, WHERE, WHAT)
$$ ##TITLE= Audit trail, XWIN-NMR		Version 3.5
$$ ##JCAMPDX= 5.01
$$ ##ORIGIN= Bruker BioSpin GmbH
$$ ##OWNER= she
$$ F:/spectra/data/she/nmr/H-F/1/audita.txt
$$ ##AUDIT TRAIL=  $$ (NUMBER, WHEN, WHO, WHERE, WHAT)
(   1,<2025-01-13 14:03:10.17 +0400>,<she>,<DPX200>,
      <created by zg, POWCHK disabled, PULCHK disabled
       configuration hash MD5:
       00 E9 B6 7A A2 85 ED C7 34 08 36 98 17 FE 4E 26
       data hash MD5: 16K
       45 9D 07 D4 C2 17 02 1F 5B 65 C9 28 D5 8C 74 E0>)
$$ ##END=
$$ 
$$ hash MD5
$$ B4 80 81 17 C1 52 92 B1 9B 4C C3 75 1C 7C 53 B9
##$RELAX= 
##$RELAX= 
##$RELAX= 
##$RELAX= 
##$RELAX= 
##$RELAX= 
$$ Bruker specific parameters
$$ --------------------------
##$DU= <F:/spectra>
##$EXPNO= 1
##$NAME= <H-F>
##$PROCNO= 1
##$TYPE= <nmr>
##$USER= <she>
##$AMP= (0..31)
100 100 100 100 100 100 100 100 100 100 100 100 100 100 100 100 100 100 
100 100 100 100 100 100 100 100 100 100 100 100 100 100 
##$AQSEQ= 0
##$AQ_mod= 1
##$AUNM= <au_zg>
##$AUTOPOS= <>
##$BF1= 200.13
##$BF2= 200.13
##$BF3= 200.13
##$BF4= 200.13
##$BF5= 200.13
##$BF6= 200.13
##$BF7= 200.13
##$BF8= 200.13
##$BYTORDA= 1
##$CFDGTYP= 0
##$CFRGTYP= 5
##$CHEMSTR= <none>
##$CNST= (0..31)
1 1 145 1 1 1 1 1 1 1 1 1 1 1 1 1 1 1 1 1 1 1 1 1 1 1 1 1 1 1 1 1 
##$CPDPRG= <>
##$CPDPRG1= <>
##$CPDPRG2= <>
##$CPDPRG3= <>
##$CPDPRG4= <mlev>
##$CPDPRG5= <mlev>
##$CPDPRG6= <mlev>
##$CPDPRG7= <mlev>
##$CPDPRG8= <mlev>
##$CPDPRGB= <>
##$CPDPRGT= <>
##$D= (0..31)
0 1.2 0 0 0 0 0 0 0 0.06 0 0.03 0 0 0 0 0.0002 0 0 0 0 0 0 0 0 0 0 0 0 
0 0 0 
##$DATE= 1736762589
##$DBL= (0..7)
120 120 120 120 120 120 120 120 
##$DBP= (0..7)
150 150 150 150 150 150 150 150 
##$DBP07= 0
##$DBPNAM0= <>
##$DBPNAM1= <>
##$DBPNAM2= <>
##$DBPNAM3= <>
##$DBPNAM4= <>
##$DBPNAM5= <>
##$DBPNAM6= <>
##$DBPNAM7= <>
##$DBPOAL= (0..7)
0.5 0.5 0.5 0.5 0.5 0.5 0.5 0.5 
##$DBPOFFS= (0..7)
0 0 0 0 0 0 0 0 
##$DE= 6
##$DECBNUC= <off>
##$DECIM= 24
##$DECNUC= <off>
##$DECSTAT= 4
##$DIGMOD= 1
##$DIGTYP= 9
##$DL= (0..7)
0 120 120 120 120 120 120 120 
##$DP= (0..7)
150 150 150 150 150 150 150 150 
##$DP07= 0
##$DPNAME0= <>
##$DPNAME1= <>
##$DPNAME2= <>
##$DPNAME3= <>
##$DPNAME4= <>
##$DPNAME5= <>
##$DPNAME6= <>
##$DPNAME7= <>
##$DPOAL= (0..7)
0.5 0.5 0.5 0.5 0.5 0.5 0.5 0.5 
##$DPOFFS= (0..7)
0 0 0 0 0 0 0 0 
##$DQDMODE= 0
##$DR= 18
##$DS= 0
##$DSLIST= <SSSSSSSSSSSSSSS>
$$ [...]
##$SUBNAM2= <"">
##$SUBNAM3= <"">
##$SUBNAM4= <"">
##$SUBNAM5= <"">
##$SUBNAM6= <"">
##$SUBNAM7= <"">
##$SUBNAM8= <"">
##$SUBNAM9= <"">
##$SW= 24.0689530833862
##$SWIBOX= (0..15)
0 0 2 0 0 0 0 0 0 0 0 0 0 0 0 0 
##$SW_h= 4816.95568400771
##$TD= 16384
##$TD0= 1
##$TE= 0
##$TE2= 300
##$TE3= 300
##$TEG= 300
##$TL= (0..7)
0 120 120 120 120 120 120 120 
##$TP= (0..7)
150 150 150 150 150 150 150 150 
##$TP07= 0
##$TPNAME0= <>
##$TPNAME1= <>
##$TPNAME2= <>
##$TPNAME3= <>
##$TPNAME4= <>
##$TPNAME5= <>
##$TPNAME6= <>
##$TPNAME7= <>
##$TPOAL= (0..7)
0.5 0.5 0.5 0.5 0.5 0.5 0.5 0.5 
##$TPOFFS= (0..7)
0 0 0 0 0 0 0 0 
##$TUNHIN= 0
##$TUNHOUT= 0
##$TUNXOUT= 0
##$USERA1= <user>
##$USERA2= <user>
##$USERA3= <user>
##$USERA4= <user>
##$USERA5= <user>
##$V9= 5
##$VALIST= <valist>
##$VCLIST= <CCCCCCCCCCCCCCC>
##$VD= 0
##$VDLIST= <DDDDDDDDDDDDDDD>
##$VPLIST= <PPPPPPPPPPPPPPP>
##$VTLIST= <TTTTTTTTTTTTTTT>
##$WBST= 1024
##$WBSW= 4
##$XGAIN= (0..3)
0 0 0 0 
##$XL= 0
##$YL= 0
##$YMAX_a= 664558
##$YMIN_a= -742569
##$ZGOPTNS= <>
##$ZL1= 120
##$ZL2= 120
##$ZL3= 120
##$ZL4= 120
##$ABSF1= 10
##$ABSF2= 0
##$ABSG= 5
##$ABSL= 3
##$ALPHA= 0
##$AQORDER= 0
##$ASSFAC= 0
##$ASSFACI= 0
##$ASSFACX= 0
##$ASSWID= 0
##$AUNMP= <proc_1d>
##$AZFE= 0.1
##$AZFW= 0.1
##$BCFW= 1
##$BC_mod= 2
##$BYTORDP= 1
##$COROFFS= 0
##$CY= 11.3945322036743
##$DATMOD= 1
##$DC= 2
##$DFILT= <>
##$DTYPP= 0
##$F1P= 15.6554695791079
##$F2P= 12.8336369535428
##$FCOR= 0.5
##$FTSIZE= 0
##$FT_mod= 4
##$GAMMA= 1
##$GB= 0.15
##$INTBC= 1
##$INTSCL= 1
##$ISEN= 128
##$LB= 0.24
##$LEV0= 0
##$LPBIN= 0
##$MAXI= 10000
##$MC2= 0
##$MEAN= 0
##$ME_mod= 0
##$MI= 1.114404
##$NCOEF= 0
##$NC_proc= 0
##$NLEV= 6
##$NOISF1= 3.799351
##$NOISF2= 2.8
##$NSP= 1
##$NTH_PI= 0
##$NZP= 0
##$OFFSET= 15.70392
##$PC= 1
##$PHC0= -26570.72
##$PHC1= 10.58744
##$PH_mod= 1
##$PKNL= yes
##$PPARMOD= 0
##$PSCAL= 0
##$PSIGN= 0
##$REVERSE= no
##$SF= 200.130013532006
##$SI= 16384
##$SIGF1= 3
##$SIGF2= 2
##$SINO= 400
##$SIOLD= 16384
##$SREGLST= <1H.CDCl3>
##$SSB= 0
##$STSI= 0
##$STSR= 0
##$SW_p= 3612.71676300578
##$SYMM= 0
##$S_DEV= 0
##$TDeff= 0
##$TDoff= 0
##$TI= <>
##$TILT= no
##$TM1= 0
##$TM2= 0
##$TOPLEV= 0
##$USERP1= <user>
##$USERP2= <user>
##$USERP3= <user>
##$USERP4= <user>
##$USERP5= <user>
##$WDW= 1
##$XDIM= 8192
##$YMAX_p= 0
##$YMIN_p= 0
$$ End of Bruker specific parameters
$$ ---------------------------------
##NTUPLES= NMR FID
##VAR_NAME=  TIME,          FID/REAL,        FID/IMAG
##SYMBOL=    X,             R,               I
##VAR_TYPE=  INDEPENDENT,   DEPENDENT,       DEPENDENT
##VAR_FORM=  AFFN,          ASDF,            ASDF
##VAR_DIM=   8192,          8192,            8192
##UNITS=     SECONDS,       ARBITRARY UNITS, ARBITRARY UNITS
##FACTOR=    0.0002076,     1,               1
##FIRST=     0,             0,               0
##LAST=      1.7004516,     0,               0
##MIN=       0,             -742569,         0
##MAX=       1.7004516,     664558,          0
$$ Real data points
##PAGE= N=1
##DATA TABLE= (X++(R..R)), XYDATA
$$ plain form
0 0 0 0 0 8 -8 0 0 8 -8 8 -16 17 -21 21 -24 37 -40 46 -53 63 -71 80 -93 114 -125 139 -155 180 -201 224
30 224 -252 283 -312 343 -383 428 -474 520 -577 638 -704 777 -862 959 -1063 1179 -1319 1483
48 1483 -1675 1901 -2181 2535 -2990 3591 -4433 5684 -7667 11192 -18619 39995 -211356 -742569
62 -742569 316789 432655 -225882 -209478 -66259 308488 182817 -533835 20913 561053
72 561053 -279052 -342502 281157 154273 -49679 -260299 -98490 551892 -23433 -692693
82 -692693 263180 544754 -333199 -306075 159073 237950 46345 -375441 -32950 500471
92 500471 -176065 -411575 313755 193331 -216277 -116834 28180 291761 4547 -518051
102 -518051 172515 543903 -354137 -365344 314143 213078 -107070 -264806 3158 416868
$$ packed form
0@%%%Qj6Q%Qj6J6k4L3l8M2m5O1p7Q6r9J16j34J51j73K07k39K64k94L35l81M25
30B24m76N35n95O55p26Q11r02R94j097J215j342J481j639J821k022K242k498K802
48A483l158L576m082M716n525O581q024J0117j3351J8859k9811N8614k51351n31213
62g42569J059358J15866o58537J6404J43219L74747j25671p16652N54748N40140
72E61053q40105o3450O23659j26884k03952k10620J61809O50382n75325o69260
82f92693R55873K81574q77953K7124M65148P8877j91605m21786L42491N33421
92E00471o76536k35510P25330j20424m09608R9443J45014K63581k87214n22598
102e18051O90566L71388q98040j1207O79487j01065l20148j57736K67964M13710
$$ plain form
112 416868 -121871 -424508 290113 244508 -293348 -84515 142392 130476 -37884 -321456
122 -321456 123405 432201 -304789 -353794 360088 214403 -236478 -195868 102816 299783
132 299783 -114605 -365278 230663 280314 -295435 -116445 223527 48709 -101541 -142578
142 -142578 87082 267687 -208133 -283414 315834 198308 -292584 -137446 188587 179294
152 179294 -133208 -262620 179747 260863 -253074 -149722 242776 46915 -152979 -51021
162 -51021 97288 122845 -141582 -167623 225658 145982 -259234 -101937 223323 105207 -175671
173 -175671 -157932 175728 184183 -209217 -140538 215219 73715 -174848 -38827 128637 42574
184 42574 -120846 -61430 151146 67808 -181257 -56713 188440 59577 -183475 -82850
$$ packed form
112D16868n38739l02637P14621m5605n37856K08833K26907j1916j68360k83572
122c21456M44861L08796p36990m9005P13882j45685m50881M0610K98684J96967
132B99783m14388k50673N95941M9651n75749J78990L39972j74818j50250m1037
142a42578K29660J80605m75820p5281N99248j17526m90892J55138L26033r293
152A79294l12502j29412M42367Q1116n13937J03352L92498j95861j99894J01958
162e1021J48309K5557k64427k6041L93281p9676m05216J57297L25260j18116k80878
173a75671J7739L33660Q455l93400O8679L55757j41504k48563J36021J67464q6063
184D2574j63420N9416K12576q3338k49065J24544K45153j28863k43052J00625
$$ plain form
194 -82850 185719 93885 -185459 -81280 170814 65977 -147847 -54148 131298 33311 -125384
205 -125384 -6550 118788 -12144 -100503 6157 94871 28336 -126315 -52114 170144 33703
216 33703 -174436 -6381 135129 16154 -96483 -50273 94832 57295 -120456 -12464
226 -12464 119626 -49011 -65656 61438 13720 -9244 -34285 -39944 107231 23553 -151655
237 -151655 31304 122500 -47890 -56831 -6869 31683 69546 -80602 -55997 125242 -30899
248 -30899 -79582 92493 -18885 -56551 56479 -29706 8525 53146 -103282 17398 117729
259 117729 -89040 -34928 57151 -34614 50407 -6894 -100027 99543 27593 -105530 80068
270 80068 -1300 -91720 106792 -6289 -91846 86981 -23495 -41001 96812 -73220 -36488
$$ packed form
194h2850K68569r1834k79344J04179K52094j04837k13824R3699J85446r7987j58695
205a25384J18834J25338j30932q8359J06660Q8714o6535j54651P4201K22258j36441
216C3703k08139J68055J41510j18975j12637M6210J45105l7537j77751J07992
226a2464J32090j68637j6645J27094m7718k2964k5041n659J47175q3678j75208
237a51655J82959R1196j70390q941M9962L8552L7863j50148K4605J81239j56141
248c0899m8683J72075j11378l7666J13030q6185L8231M4621j56428J20680J00331
259A17729k06769N4112R2079r1765Q5021n7301r3133J99570p1950j33123J85598
270H0068q1368r0420J98512j13081q5557J78827j10476j7506J37813j70032L6732
$$ plain form
281 -36488 100926 -70429 102 77068 -110069 28717 100454 -106797 17240 49003 -95520
292 -95520 91737 31180 -156416 92808 72604 -112324 47322 3662 -49403 92203 -61174
303 -61174 -52896 133991 -81320 -66580 152330 -62212 -71761 88325 -52245 32375 53905
314 53905 -159378 69659 146035 -158856 -23056 103776 -47795 25192 -24448 -67059 142695
325 142695 -37660 -144174 164022 16501 -153251 84464 27874 -34677 41987 -106446
335 -106446 33800 171228 -162195 -88586 185888 -26230 -75019 18648 -31464 101454 -5537
346 -5537 -172722 140067 96593 -201765 39343 120061 -76709 -7308 -27286 9923 142311
357 142311 -130678 -127129 222974 10849 -172633 45448 49155 32029 -11227 -140745 104515
$$ packed form
281c6488J37414j71355P0531P6966j87137J38786P1737k07251J24037L1763j44523
292i5520J87257o0557j87596K49224k0204j84928J59646m3660n3065J41606j53377
303f1174Q278J86887k15311J4740K18910k14542r549J60086j40570Q4620K1530
314E3905k13283K29037P6376l04891J35800J26832j51571P2987m9640m2611K09754
325A42695j80355j06514L08196j47521j69752K37715n6590o2551P6664j48433
335a06446J40246J37428l33423P3609K74474k12118m8789R3667n0112J32918j06991
346e537j67185L12789m3474k98358K41108Q0718j96770O9401j9978L7209J32388
357A42311k72989L549L50103k12125j83482K18081L707j7126m3256j29518K45260
$$ plain form
368 104515 142409 -209616 -27583 197130 -72923 -89124 41244 28225 73625 -96241 -118469
379 -118469 210336 43839 -231722 44108 143231 -31007 -60601 -66493 88418 128530 -189035
390 -189035 -72225 232570 -39494 -166056 74341 79769 -3135 -82096 -67954 169953 49489
401 49489 -236776 30950 205778 -69446 -121636 15369 95950 66571 -159168 -71504 224271
412 224271 -7579 -209492 73361 137494 -57439 -95750 -2522 134497 22195 -205171
422 -205171 27370 220908 -83437 -168023 74738 124171 -12656 -145444 -24113 197986
432 197986 -6338 -216936 63899 180528 -83708 -130844 55106 127877 -28499 -170586
442 -170586 46116 199787 -88768 -183835 105603 153876 -81897 -149768 47944 172202
$$ packed form
368A04515L7894l52025J82033K24713k70053j6201J30368j3019M5400j69866k2228
379a18469L28805j66497k75561K75830R9123j74238k9594n892J54911M0112l17565
390a89035J16810L04795k72064j26562K40397N428q2904p8961J4142K37907j20464
401D9489k86265K67726J74828k75224n2190J37005Q0581k9379k25739Q7664K95775
412B24271k31850k01913K82853O4133j94933l8311R3228J37019j12302k27366
422b05171K32541J93538l04345q4586K42761M9433j36827j32788J21331K22099
432A97986k04324k10598K80835J16629k64236m7136J85950P2771j56376j42087
442a70586K16702J53671k88555r5067K89438M8273k35773o7871J97712J24258
$$ plain form
452 172202 -43959 -194275 69543 187455 -90410 -158034 87533 141901 -78722 -150156
462 -150156 85124 160085 -101901 -157693 114283 152309 -113604 -151308 103876 155553 -99701
473 -99701 -159389 101492 156205 -96905 -150359 94639 150770 -105780 -147124 123415 130998
484 130998 -128587 -115697 122267 119267 -118152 -137965 128009 147562 -148218 -133683 152578
495 152578 112439 -125192 -112072 99854 137243 -111890 -151923 148530 127549 -168125 -84078
506 -84078 151374 68444 -120516 -98467 121942 134445 -165966 -125404 199832 80171 -174633
517 -174633 -56215 120639 86942 -103940 -134576 144686 133958 -193355 -74193 188745
527 188745 21119 -132983 -38863 100702 98226 -142489 -116124 208498 67121 -214486 -9251
$$ packed form
452A72202k16161j50316K63818J17912k77865o7624K45567N4368k20623p1434
462a50156K35280P4961k61986n5792K71976L8026k65913l7704K55184N1677k55254
473i9701n9688K60881N4713k53110n3454K44998N6131k56550m1344K70539P583
484A30998k59585J2890K37964l000k37419j9813K65974J9553k95780J4535K86261
495A52578m0139k37631J3120K11926L7389k49133m0033L00453k0981k95674Q4047
506h4078K35452q2930j88960K2049K20409J2503l00411M0562L25236j19661k54804
517a74633J18418J76854l3697j90882l0636K79262j0728l27313J19162K62938
527A88745j67626j54102R4120J39565k476k40715K6365L24622j41377k81607K05235
$$ plain form
538 -9251 151511 15860 -95743 -84536 113828 127226 -183997 -82466 214075 604 -161230
549 -161230 19495 91733 38016 -97101 -94523 173728 73575 -228192 6346 191429 -47721
560 -47721 -107317 -7905 80783 91196 -145571 -92585 216503 8454 -199038 58901 110286
571 110286 -31431 -60708 -51460 116081 79104 -208284 -4506 218828 -82263 -134442 69133
582 69133 61279 26284 -89614 -82187 180980 31387 -216017 63931 143781 -87359 -50475
593 -50475 11467 53667 62833 -144635 -31896 205679 -68695 -160958 113528 65755 -50379
604 -50379 -36786 -41557 110137 48971 -189867 37045 168236 -106499 -68182 71169 14935
615 14935 20871 -68575 -47987 156366 -27982 -167858 114673 85133 -105734 -10985 15100
$$ packed form
538i251J60762j35651j11603J1207J98364J3398l11223J01531K96541k13471j61834
549a61230J80725P2238n3717j35117K578K68251j00153l01767K34538J85083k39150
560d7721n9596R9412Q8688J0413k36767N2986L09088k08049k07492K57939N1385
571A10286j41717k9277R248J67541l6977k87388K03778K23334l01091n2179K03575
582F9133p854l4995j15898P427K63167j49593k47404K79948P9850k31140L6884
593e0475O1942M2200R166k07468J12739K37575k74374r2263K74486m7773j16134
604e0379J3593m771J51694o1166k38838K26912J31191k74735L8317J39351n6234
615A4935N936q9446K0588K04353j84348j39876K82531k9540j90867R4749K6085
$$ plain form
626 15100 40254 42324 -132828 3913 164870 -91683 -95980 107727 11413 -32832 -10218
637 -10218 -36672 88323 10603 -144887 79453 102524 -122410 -14153 67362 -8159 12699
648 12699 -59224 -18833 127096 -53227 -109851 109365 27475 -75554 20867 -7701 22086
659 22086 33239 -96721 29219 101822 -98798 -29907 90971 -27464 -20392 3207 -24314
670 -24314 68160 -10649 -94944 77829 43962 -85386 20069 23279 -19498 28624 -38481 -11162
682 -11162 74401 -47839 -42537 76408 -16550 -41582 32678 -11771 10559 15895 -55296 30813
694 30813 45856 -62721 2889 38707 -29886 10371 6021 -29054 35929 172 -39628 38532
706 38532 42 -35745 32664 -3379 -20616 26369 -14639 -6730 28280 -23055 -6607 24357
$$ packed form
626A5100K5154K070j75152J36741J60957k56553m297K03707r6314m4245K2614
637a0218k6454J24995p7720j55490K24340K3071k24934J08257Q1515p5521K0858
648A2699p1923M0391J45929j80323n6624K19216q1890j03029R6421k8568K9787
659B2086J1153j29960J25940P2603k00620O8891J20878j18435P072K3599k7521
670b4314R2474p8809q4295J72773l3867j29348J05455L210m2777M8122o7105K7319
682a1162Q5563j22240N302J18945r2958k5032P4260m4449K2330N336p1191Q6109
694C0813J5043j08577O5610L5818o8593M0257m350l5075O4983l5757l9800P8160
706C8532l8490l5787O8409l6043j7237M6985m1008P909L5010n1335J6448L0964
$$ plain form
718 24357 -21913 3558 20197 -29752 6574 26011 -19556 -3022 4568 -3494 15780 -12604
730 -12604 -19224 27254 7370 -24945 3479 14597 -1214 -10246 -8888 17570 10001 -27909 -2234
743 -2234 31395 -823 -31028 -1221 33951 1057 -37131 185 35500 2275 -33248 -6258
755 -6258 35689 8286 -43750 -4113 47938 -7446 -41754 12326 33922 -1550 -39149 -7560
767 -7560 56935 -1448 -68718 18607 60434 -24469 -42515 10610 39357 9226 -60586 -7843
779 -7843 80644 -19645 -71608 38955 44529 -24688 -35410 -2295 59021 4986 -91083 25160
791 25160 93067 -54501 -58898 46067 33933 -6768 -55286 -11202 96291 -18523 -104289
802 -104289 61032 69119 -63019 -31904 22766 40967 6865 -90756 16896 118730 -70085
$$ packed form
718B4357m6270K5471J6639m9949L6326J9437m5567J6534P590q062J9274k8384
730a2604o620M6478j9884l2315K8424J1118j5811r032J358K6458p569l7910K5675
743b234L3629l2218l0205K9807L5172l2894l8188L7316L5315l3225l5523K6990
755f258M1947k7403n2036L9637N2051n5384l4308N4080K1596l5472l7599L1589
767g560O4495n8383o7270Q7325M1827q4903j8046N3125K8747l0131o9812N2743
779g843Q8487j00289n1963J10563N574o9217j0722L3115O1316n4035r6069J16243
791B5160O7907j47568m397J04965j2134m0701m8518M4084J07493j14814q5766
802a04289J65321Q087j32138L1115N4670J8201l4102r7621J07652J01834j88815
$$ plain form
813 -70085 -86143 87325 36151 -46144 -34950 676 84037 -10544 -122675 67001 101940
824 101940 -100707 -43429 69056 20815 -14260 -65967 9882 121102 -65995 -114501 115624
835 115624 55982 -99694 -18958 39124 49627 -12170 -111312 57019 126213 -118886 -71329
846 -71329 119460 14191 -60631 -28467 18316 92885 -48452 -125044 117553 83080 -142277
857 -142277 -18302 90915 11281 -30703 -72798 42642 124084 -112092 -96836 150535 23910
868 23910 -111893 3072 44869 46988 -34761 -109038 99113 101833 -158807 -31761 138172
879 138172 -13626 -67519 -21882 40228 91557 -89976 -105650 155176 45019 -155649 15798
890 15798 90541 -1633 -42542 -65856 75470 97354 -147693 -50982 168289 -16141 -115495
$$ packed form
813g0085j6058J73468n1174q2295J1194L5626Q3361r4581j12131J89676L4939
824A01940k02647N7278J12485m8241l5075n1707P5849J11220j87097m8506K30125
835A15624n9642j55676Q0736N8082J0503o1797r9142J68331O9194k45099M7557
846g1329J90789j05269p4822L2164M6783P4569j41337p6592K42597l4473k25357
857a42277J23975J09217p9634m1984m2095J15440Q1442k36176J5256K47371j26625
868B3910j35803J14965M1797K119q1749p4277K08151K720k60640J27046J69933
879A38172j51798n3893M5637O2110N1329j81533j5674K60826j10157k00668J71447
890A5798P4743r2174m0909k3314J41326K1884k45047R6711K19271j84430r9354
$$ plain form
901 -115495 22798 59629 36808 -70780 -85687 136423 58784 -174653 10684 136119 -35367
912 -35367 -70408 -10817 61758 65855 -118582 -58012 167919 -4314 -149664 46929 88602
923 88602 -17204 -61902 -43261 103978 54480 -160328 -1805 158915 -46710 -102177 34708
934 34708 62895 18443 -87188 -44757 141953 7319 -156771 48455 113675 -53358 -68926
945 -68926 5999 77952 27551 -128159 -5763 154813 -43760 -125477 62798 77660 -29498
956 -29498 -70273 -11605 109331 4417 -142201 41885 126862 -69401 -84452 49571 66938
967 66938 -12870 -93913 6902 129709 -39102 -128017 70728 92116 -63221 -67568 29263
978 29263 81503 -15363 -110150 37572 116057 -66632 -91776 69305 65638 -46861 -69234
$$ packed form
901a15495J38293L6831k2821j07588j4907K22110p7639k33437J85337J25435j71486
912c5367l5041N9591P2575M097j84437O0570K25931j72233j45350J96593M1673
923H8602j05806m4698J8641J47239m9498k14808J58523J60720k05625n5467J36885
934C4708K8187m4452j05631M2431J86710j34634j64090K05226O5220j67033j5568
945f8926P4925P1953n0401j55710J22396J60576j98573q1717J88275J4862j07158
956b9498m0775N8668J20936j04914j46618J84086Q4977j96263j5051J34023J7367
967F6938p9808q1043J00815J22807j68811q8915J98745K1388j55337m347R6831
978B9263N2240r6866r4787J47722P8485j82689k5144J61081l667j12499k2373
$$ plain form
989 -69234 30056 94162 -40936 -104752 65211 89042 -71529 -68564 55996 65620 -40559
1000 -40559 -77868 43589 88529 -59294 -81477 68248 64159 -62200 -58365 52288 66118
1011 66118 -52235 -71833 60778 69102 -66554 -62999 64877 58586 -60618 -58050 59941
1022 59941 58913 -61993 -56130 61274 52452 -60093 -53439 63941 52447 -68156 -44475 67081
1034 67081 38750 -61049 -41761 57240 49102 -62648 -49837 72656 39388 -72724 -26706
1045 -26706 58158 27439 -46704 -41488 54893 47439 -71084 -32779 75053 12866 -59972 -11209
1057 -11209 41585 29767 -44591 -45192 67648 34759 -80578 -7628 61766 -2290 -34390 -17638
1069 -17638 31154 41489 -55080 -35813 76862 3762 -66889 16719 33032 275 -18716 -32854
$$ packed form
989f9234R9290O4106j35098o3816J69963K3831j60571K965J24560R624j06179
1000d0559l7309J21457M4940j47823k2183J49725m089j26359L835J10653J3830
1011F6118j18353j9598J32611Q324j35656L555J27876o291j19204K568J17991
1022E9941j028j20906N863J17404q822j12545O654J17380j1494j20603K3681J11556
1034F7081k8331r9799J9288R9001q138j11750J2811J22493l3268j12112M6018
1045b6706Q4864l0719p4143N216R6381p454j18523L8305J07832o2187p2838M8763
1057a1209N2794j1818p4358o01J12840l2889j15337P2950O9394o4056l2100J6752
1069a7638M8792J0335r6569J9267J12675p3100p0651Q3608J6313l2757j8991j4138
$$ plain form
1081 -32854 44480 37747 -76179 -6320 71334 -23687 -34626 14263 9009 24110 -25776 -41209
1093 -41209 65092 11322 -74221 29644 36753 -29991 689 -9598 9337 39069 -53243 -19678
1105 -19678 74934 -27035 -44505 41834 -2754 -3290 8919 -38932 33999 29477 -68784 19635
1117 19635 48029 -47117 4139 19671 -23376 29321 -13121 -37894 59069 -8001 -53613 49387
1129 49387 2037 -31675 32222 -21790 -6795 43492 -44112 -7999 53888 -40909 -7380 41871
1141 41871 -38496 8315 27387 -45884 25310 21690 -50960 32597 16070 -46472 36269 3500
1153 3500 -42214 43801 -5971 -37727 45075 -15022 -23013 45893 -33519 -13387 54108 -40808
1165 -40808 -14971 48079 -32861 -994 28265 -39913 24572 22641 -59668 32544 31941 -57542
$$ packed form
1081c2854P7334o733j13926O9859P7654r5021j0939M8889n254J5101m9886j5433
1093d1209J06301n3770q5543J03865P109o6744L0680j0287J8935K9732r2312L3565
1105a9678R4612j01969j7470Q6339m4588n36J2209m7851P2931m522r8261Q8419
1117A9635K8394r5146N1256J5532m3047N2697m2442k4773R6963o7070m5612J03000
1129D9387m7350l3712O3897n4012J4995N0287q7604L6113O1887r4797L3529M9251
1141D1871q0367M6811J9072p3271P1194l620p2650Q3557j6527o2542Q2741l2769
1153C500m5714Q6015m9772l1756Q2802o0097p991O8906p9412K0132O7495r4916
1165d0808K5837O3050q0940L1867K9259o8178O4485j931q2309R2212o03q9483
$$ plain form
1177 -57542 21299 20875 -30181 27421 -15802 -24713 58742 -25807 -47680 60892 -2521 -38179
1189 -38179 28155 -12120 5430 25325 -54796 16139 56319 -60027 -11156 52845 -22123 -7042
1201 -7042 4066 -17496 43290 -10947 -61361 57788 27707 -64912 14068 26239 -8964 6746
1213 6746 -33902 7939 58696 -51520 -36997 70868 -3645 -43802 13050 7544 19893 -10679
1225 -10679 -52615 49093 42983 -74725 -5142 58907 -11577 -25208 -11217 16443 42338 -43754
1237 -43754 -43771 73725 13454 -69211 10529 39099 965 -25036 -30469 43681 39282 -71474
1249 -71474 -17747 76486 -6425 -54928 4338 34575 19165 -43625 -33204 69198 19633 -77983
1261 -77983 3032 62362 -7882 -45916 -7997 48054 21518 -65605 -15464 77797 -2379 -71096
$$ packed form
1177e7542P8841m24n1056N7602m3223q911Q3455q4549k1873J08572o3413l5658
1189c8179O6334m0275J7550J9895q0121P0935M0180j16346M8871O4001p4968J5081
1201g042J1108k1562O0786n4237n0414J19149l0081r2619P8980J2171l5203J5710
1213F746m0648M1841N0757j10216J4523J07865p4513m0157N6852n506J2349l0572
1225a0679m1936J01708o110j17708O9583O4049p0484j3631J3991K7660K5895q6092
1237d3754j7J17496o0271q2665P9740K8570l8134k6001n433P4150m399j10756
1249g1474N3727R4233q2911m8503N9266L0237j5410o2790J0421J02402m9565r7616
1261g7983Q1015N9330p0244l8034L7919N6051k6536q7123N0141R3261q0176o8717
$$ plain form
1273 -71096 9282 56656 -399 -55354 -9798 66928 8306 -74856 2055 72435 -9466 -65521
1285 -65521 7990 62290 -2509 -66260 2669 72662 -8347 -73514 12504 70924 -12955 -70209
1297 -70209 13396 71172 -13679 -70655 14329 70697 -15183 -72005 16212 73614 -19165 -74027
1309 -74027 25001 69911 -26778 -65158 20669 67496 -17626 -76276 24550 80050 -34395
1320 -34395 -72238 37295 60808 -28724 -60956 18416 74305 -23466 -83260 41527 73929
1331 73929 -50151 -56165 37764 52685 -22558 -68539 26150 84338 -46240 -77823 60693
1342 60693 54945 -51016 -44981 28918 60764 -25003 -82008 47631 79721 -69011 -55699 63619
1354 63619 37404 -39913 -46904 27881 74195 -45303 -82811 74461 58817 -78565 -31981
$$ packed form
1273g1096Q0378M7374n7055n4955M5556P6726n8622q3162P6911P0380q1901n6055
1285f5521P3511N4300o4799o3751O8929O9993q1009o5167Q6018N8420q3879n7254
1297g0209Q3605N7776q4851n6976Q4984N6368q5880n6822Q8217N7402r2779n4862
1309g4027R9028M4910r6689l8380Q5827M6827q5122n8650J00826N5500j14445
1320c4395l7843J09533K3513q9532l2232P9372N5889r7771n9794J24787L2402
1331G3929j24080o014R3929J4921p5243m5981R4689N8188j30578l1583J38516
1342F0693n748j05961O035P3899L1846q5767n7005J29639L2090j48732J3312J19318
1354F3619k6215p7317o991P4785M6314j19498l7508J57272j5644j37382M6584
$$ plain form
1365 -31981 52099 35325 -29751 -63792 41269 81188 -74008 -63191 87834 28525 -64985
1376 -64985 -20031 33782 49825 -36198 -77046 71414 64672 -95254 -27605 77172 11035
1387 11035 -40356 -34884 31982 69045 -64001 -68152 96182 29469 -87098 -813 48367 18173
1399 18173 -29596 -56314 55619 65906 -94601 -33660 98215 -2815 -61255 -1457 30786
1410 30786 41320 -46439 -64008 88270 37532 -102838 5259 72144 -12530 -34189 -22045
1421 -22045 37193 53903 -78843 -40173 105898 -4265 -83283 24052 40566 5291 -32231
1432 -32231 -43683 67088 41282 -100632 -274 90445 -29264 -47725 11723 25691 28842
1443 28842 -52256 -39300 92001 5458 -93789 31312 56370 -25971 -26211 -12848 39721 35806
$$ packed form
1365c1981Q4080j6774o5076l4041J05061L9919j55196J0817J51025n9309r3510
1376f4985M4954N3813J6043q6023m0848J48460o742j59926O7649J04777o6137
1387A1035n1391N472O6866L7063j33046m151J64334o6713j16567Q6285M9180l0194
1399A8173m7769k6718J11933J0287j60507O0941J31875j01030n8440N9798L2243
1410C0786J0534q7759j7569J52278n0738j40370J08097O6885q4674k1659J2144
1421b2045N9238J6710j32746L8670J46071j10163p9018J07335J6514l5275l7522
1432c2231j1452J10771k5806j41914J00358R0719j19709j8461N9448J3968L151
1443B8842q1098J2956J31301q6543r9247J25101K5058q2341k40J3363N2569l915
$$ plain form
1455 35806 -79016 -12389 94174 -28327 -63127 35357 24802 -1914 -27567 -27839 65049 14952
1467 14952 -88475 25595 68088 -43573 -29568 17192 20172 18389 -51342 -16224 81896 -19834
1479 -19834 -70700 43772 32670 -28381 -15054 -5890 36638 14622 -67990 13692 68948 -44003
1491 -44003 -37907 38168 13810 -6542 -25252 -9241 55617 -8093 -64706 36525 41513 -41492
1503 -41492 -14413 16870 14585 5809 -39864 3302 56052 -30852 -41466 41747 14711 -24323
1515 -24323 -8649 2017 28283 -1663 -47173 23079 40514 -38764 -16676 27997 5364 -5390
1527 -5390 -17896 946 35162 -16901 -34426 32094 16998 -28573 -3532 12459 9662 -3068
1539 -3068 -25340 11851 28593 -26146 -16884 26000 5265 -13904 -5444 4968 14727 -8474 -20189
$$ packed form
1455C5806j14822O6627J06563j22501l4800R8484j0555k6716k5653k72R2888n0097
1467A4952j03427J14070M2493j11661J4005M6760K980j783o9731L5118R8120j01730
1479a9834n0866J14472j1102o1051J3327R164M2528k2016q2612Q1682N5256j12951
1491d4003O096P6075k4358k0352j8710J6011O4858o3710n6613J01231M988q3005
1503d1492K7079L1283k285q776m5673M3166N2750q6904j0614Q3213k7036l9034
1515b4323J5674J0666K6266k9946m5510P0252J7435p9278K2088M4673k2633j0754
1527e390j2506J8842L4216n2063j7525O6520j5096m5571K5041J5991k797j2730
1539c068k2272L7191J6742n4739R262M2884k0735j9169Q460J0412R759k3201j1715
$$ plain form
1552 -20189 17324 13729 -21192 -3661 14719 1597 -7026 -7914 7240 11658 -12703 -9814 14630
1565 14630 5178 -11364 -2399 7406 3689 -5583 -5670 6377 4272 -6282 -2184 4747 2688 -5392
1579 -5392 -2413 6262 -792 -4436 2344 366 618 1744 -4553 1547 4530 -5368 1417 3005 -7116
1594 -7116 6169 4244 -11082 4899 5680 -7074 3094 -2235 -2658 11436 -8268 -8932 18023 -3333
1608 -3333 -13882 11160 379 -3167 3105 -11236 10345 12847 -25452 2106 23844 -14565 -8539
1621 -8539 8422 -1405 9989 -8691 -17251 29197 2797 -33462 16952 15352 -16261 645 -4143
1634 -4143 7043 17813 -30258 -6039 41697 -17808 -27391 23713 4746 -3666 -4378 -17421 29746
1647 29746 11469 -48008 14869 36162 -29614 -10454 13359 2667 12334 -24104 -13972 50034
$$ packed form
1552b0189L7513l595l4921J7531J8380j3122q623q88J5154M418k4361K889K4444
1565A4630r452j6542Q965R805l717r272q7J2047k105j0554M098O931k059q080
1579e392K979Q675p054l644O780j978K52J126o297O100K983r898O785J588j0121
1594g116J3285j925j5326J5981P81j2754J0168n329m23J4094j9704o64K6955k1356
1608c333j0549K5042j0781l546O272j4341K1581K502l8299K7558K1738l8409O026
1621h539J6961r827J1394j8680q560M6448k6400l6259N0414j600l1613J6906m788
1634d143J1186J0770m8071K4219M7736n9505r583N1104j8967q412p12j3043M7167
1647B9746j8277n9477O2877K1293o5776J9160K3813j0692R667l6438J0132O4006
$$ plain form
1659 50034 -12526 -47472 34894 19083 -24927 -2823 -3983 20430 14672 -49648 7748 54804
1671 54804 -35926 -29070 35330 4518 -6456 -12856 -12539 45015 -4764 -59848 37490 38221 -45423
1684 -45423 -8515 20115 8818 6012 -39284 1309 61661 -34799 -47953 52801 14144 -32311
1696 -32311 -4252 1427 30175 -708 -58922 31357 53564 -56555 -21297 46401 2370 -12995
1708 -12995 -21395 1041 54272 -27098 -58773 57922 29564 -55039 -3212 24156 12537 -5030
1720 -5030 -45194 21729 59169 -55585 -36300 64346 5103 -37852 -5612 11678 35273 -20573
1732 -20573 -55975 52482 42322 -68775 -10117 50138 -401 -21109 -23288 19063 49506 -47825
1744 -47825 -43455 70871 13648 -60232 3297 31987 11735 -22340 -39291 43956 43508 -70177
$$ packed form
1659E0034o2560l4946Q2366j5811m4010K2104j160K4413n758o4320N7396M7056
1671E4804r0730O856O4400l0812j0974o400L17N7554m9779n5084R7338P31q3644
1684d5423L6908K8630j1297k806m5296M0593O0352r6460j3154J00754l8657m6455
1696c2311K8059N679K8748l0883n8214R0279K2207j10119L5258O7698m4031j5365
1708a2995q400K2436N3231q1370l1675J16695k8358q4603N1827K7368j1619j7567
1720e030m0164O6923L7440j14754J9285J00646n9243m2955L2240J7290K3595n5846
1732b0573l5402J08457j0160j11097N8658O0255n0539k0708k179M2351L0443r7331
1744d7825M370J14326n7223p3880O3529K8690k0252l4075j6951Q3247m48j13685
$$ plain form
1756 -70177 -18455 68415 -4717 -42582 -3108 25733 29352 -39493 -39056 65831 20422 -72152
1768 -72152 4251 51305 -5479 -31039 -17066 37315 33695 -61714 -21942 73686 -2411 -58663
1780 -58663 9027 37350 7799 -36008 -25065 55667 20972 -70943 321 63081 -12881 -43223
1792 -43223 2683 37430 15160 -51591 -15997 66911 -61 -65742 13257 50146 -9742 -40047
1804 -40047 -4758 47599 10384 -61816 844 63945 -15020 -52789 15720 43036 -5172 -45153
1816 -45153 -1387 56240 -4337 -62077 15751 55571 -19320 -44994 12743 44784 -5963 -51999
1828 -51999 8277 56167 -16103 -52592 20249 46807 -17650 -44065 13784 47148 -14606 -50800
1840 -50800 18269 48976 -20642 -45782 20025 45135 -19562 -45871 19837 44200 -20588 -43448
$$ packed form
1756g0177N1722Q6870p3132l7865L9474K8841L619o8845M37J04887m5409r2574
1768g2152P6403M7054n6784k5560J3973N4381l620r5409L9772R5628p6097n6252
1780e8663O7690K8323k9551m3807J0943Q0732l4695r1915P1264O2760p5962l0342
1792d3223M5906L4747k2270o6751L5594Q2908o6972o5681P8999L6889n9888l0305
1804d0047L5289N2357l7215p2200O2660O3101p8965l7769O8509K7316m8208l9981
1816d5153M3766N7627o0577n7740P7828L9820p4891k5674N7737L2041n0747m6036
1828e1999O0276M7890p2270l6489P2841K6558o4457k6415N7849L3364o1754l6194
1840e0800O9069L0707o9618k5140O5807K5110o4697k6309O5708K4363o4788k2860
$$ plain form
1852 -43448 20693 43632 -21087 -43974 23271 42977 -26087 -40092 25862 37075 -22253 -38724
1864 -38724 21700 43106 -26377 -42440 31385 36258 -30680 -30837 25025 32139 -20638 -38655 25236
1877 25236 41203 -34695 -34026 37286 23925 -28717 -23368 21272 33307 -24145 -40080 35660
1889 35660 33841 -41832 -20426 33805 15887 -20191 -25938 19980 37116 -33999 -32766 44350
1901 44350 17184 -37323 -8345 22027 17449 -17000 -32578 29568 33640 -44928 -16833 42317
1913 42317 3085 -23597 -8760 13092 26608 -23603 -33088 42009 17952 -45111 1523 27922
1925 27922 -1312 -10956 -18237 16576 31321 -38517 -19812 47963 -2582 -32131 8442 10536
1937 10536 9085 -9631 -28134 30864 22616 -46883 2740 36099 -15755 -11505 344 3804 21933
$$ packed form
1852d3448O4141K2939o4719k2887O7245J9706o9064j4005O5954J1213n9328j6471
1864c8724O0424K1406o9483j6063P3825M873o6938j57N5862P114n2777j8017O3891
1877B5236J5967p5898O69P1312j3361n2642N349M4640J2035n7452j5935P5740
1889C5660j819p5673K1406N4231j7918l6078n747M5918J7136p1115J233P7116
1901D4350k7166n4507K8978L0372m578l4449j5578O2146M072p8568K8095N9150
1913D2317l9232k6682J4837K1852J3516n0211r485P5097k4057o3063M6634K6399
1925B7922k9234r644p281L4813J4745o9838J8705O7775n0545k9549M0573K094
1937A0536j451j8716j8503N8998q248o9499M9623L3359n1854M250J1849L460J8129
$$ plain form
1950 21933 -23070 -23085 43849 815 -39391 17831 14616 -9674 199 -15575 13228 24617 -37285
1963 -37285 -5127 40390 -18079 -17866 16625 -2698 6403 -3433 -22636 28676 10634 -40293 15565
1976 15565 22112 -22595 3031 1141 -4274 20761 -18786 -15044 36466 -10612 -25040 24399 -2341
1989 -2341 -8986 11474 -16045 8847 18090 -31079 5933 26367 -24722 -779 14716 -13823
2001 -13823 10703 708 -20015 23449 1767 -26502 20852 3639 -19204 16308 -4798 -9480
2013 -9480 19988 -14082 -7801 23422 -15918 -7965 21071 -14690 -1431 16212 -18573 5158
2025 5158 14045 -20574 8089 9953 -18825 13062 5343 -20256 15806 4312 -18032 13854 -865
2038 -865 -10664 15914 -10026 -8067 22199 -12615 -10788 19848 -7966 -6726 9842 -9524 6397
$$ packed form
1950B1933m5003j5O6934m3034m0206N7222l215k4290R873j5774K8803J1389o1902
1963c7285L2158M5517n8469K13L4491j9323R101r836j9203N1312j8042n0927N5858
1976A5565O547m4707K5626j890n415K5035l9547L742N1510m7078j4428M9439k6740
1989b341o645K0460k7519K4892R243m9169L7012K0434n1089K3943J5495k8539
2001a3823K4526r995k0723M3464k1682k8269M7354j7213k2843L5512k1106m682
2013i480K9468l4070O281L1223l9340P953K9036l5761J3259J7643l4785K3731
2025E158Q887l4619K8663J864k8778L1887p719k5599L6062j1494k2344L1886j4719
2038h65r799K6578k5940J959L0266l4814J827L0636k7814J240J6568j9366J5921
$$ plain form
2051 6397 8385 -21070 9577 16904 -21591 39 12930 -7585 3322 -4145 -5901 19342 -7415
2064 -7415 -19137 20291 5499 -18046 4726 4471 1554 2422 -15535 7412 19954 -20913 -9949
2077 -9949 21982 -990 -11124 -1533 3688 12788 -7805 -19068 19222 12787 -23773 -2540 17124
2090 17124 1562 -8948 -9113 10986 15535 -19527 -12920 24197 5680 -21505 -2891 15970 7223
2103 7223 -14575 -12510 19738 12192 -24367 -7665 23706 4719 -20233 -5619 19598 8170
2115 8170 -21986 -8998 24480 7284 -25632 -5094 24905 5409 -24569 -6043 25525 5209
2127 5209 -25871 -4645 25485 5591 -26583 -5157 28701 3114 -29171 -518 27429 221
2139 221 -25498 -2815 27482 4629 -32131 -1654 34288 -4237 -30351 4986 25364 715
$$ packed form
2051F397J988k9455L0647P327l8495K1630J2891k0515J0907p467j756K5243k6757
2064g415j1722L9428j4792k3545K2772k55k917Q68j7957K2947J2542m0867J0964
2077i949L1931k2972j0134R591N221R100k0593j1263L8290o435l6560K1233J9664
2090A7124j5562j0510j65K0099M549l5062O607L7117j8517k7185J8614J8861q747
2103G223k1798K065L2248p546l6559J6702L1371j8987k4952J4614K5217j1428
2115H170l0156J2988L3478j7196l2916K0538K9999j9496k9978J8526L1568k0316
2127E209l1080K1226L0130j9894l2174K1426L3858k5587l2285K8653K7947k7208
2139B21k5719K2683L0297k2853l6760L0477L5942l8525k6114L5337K0378k4649
$$ plain form
2151 715 -26938 -4479 33365 964 -37486 6626 33244 -10284 -25507 5043 24871 3042
2163 3042 -33383 -946 40616 -9442 -37344 15354 27135 -10001 -23420 33 31108 1750
2175 1750 -41829 8441 41008 -19525 -28946 16690 21017 -4684 -27578 -873 40476 -9147
2187 -9147 -44197 22519 33336 -24037 -20392 11478 22832 -879 -38270 7906 45839 -24080
2199 -24080 -35743 30353 20507 -18409 -18358 4756 32420 -7482 -45108 25026 39499 -35578 -21251
2212 -21251 26489 14116 -9463 -27269 6994 43187 -23118 -41452 38306 23510 -33688 -10964
2224 -10964 14986 19614 -7193 -38522 20833 42732 -39227 -25819 40064 9801 -22168 -13968
2236 -13968 8882 32449 -17704 -42356 38292 29950 -44409 -9618 28475 7379 -11750 -25005
$$ packed form
2151G15k7653K2459L7844l2401l8450M4112K6618m3528j5223L0550J9828k1829
2163C042l6425L2437M1562n0058k7902N2698J1781l7136j3419K3453L1075k9358
2175A750m3579N0270L2567o0533r421M5636M327k5701k2894K6705M1349m9623
2187i147l5050O6716J0817n7373L645L1870J1354k3711l7391M6176L7933o9919
2199b4080j1663O6096r846l8916N1K3114K7664l9902l7626P0134J4473p5077J4327
2212b1251M7740j2373k3579j7806L4263L6193o6305j8334P9758j4796n7198K2724
2224a0964K5950M628k6807l1329N9355K1899q1959J3408O5883l0263l1969Q200
2236a3968K2850K3567n0153k4652Q0648q342p4359L4791L8093k1096j9129j3255
$$ plain form
2248 -25005 15276 39355 -34889 -31056 47011 10659 -36473 -2352 16409 16329 -13653 -34253 31617
2261 31617 32725 -47798 -12639 41962 -965 -22352 -8425 13276 27231 -26758 -31447 45876
2273 45876 14577 -46863 2833 28492 670 -14642 -19158 23508 28680 -42714 -16248 48231
2285 48231 -2789 -33703 5046 16663 11340 -18842 -24852 37576 17109 -48351 1960 37521
2297 37521 -9118 -19682 -3547 17238 19301 -32165 -17622 46064 215 -40515 11369 23029
2309 23029 -2910 -15445 -13089 26615 15627 -41710 -1833 41032 -11745 -26546 9327 15644
2321 15644 5334 -22194 -12590 36609 2677 -40710 11573 29172 -12512 -16582 869 18367
2333 18367 7843 -30505 -2997 37371 -10348 -30016 15344 17819 -7187 -15452 -3211 25332
$$ packed form
2248b5005M0281K4079p4244L833P8067l6352m7132L4121J8761q0k9982k0600O5870
2261C1617J108q0523L5159N4601m2927k1387J3927K1701J3955n3989m689P7323
2273D5876l1299o1440M9696K5659k7822j5312m516M2666N172p1394K6466O4479
2285D8231n1020l0914L8749J1617n323l0182o010O2428k0467o5460N0311L5561
2297C7521m6639j0564J6135K0785K063n1466J4543O3686m5849m0730N1884J1660
2309B3029k5939j2535K356L9704j0988n7337L9877M2865n2777j4801L5873O317
2321A5644j0310k7528R604M9199l3932m3387N2283J7599m1684m070J7451J7498
2333A8367j0524l8348K7508M0368m7719j9668M5360K475k5006q265J2241K8543
$$ plain form
2345 25332 1615 -33311 8911 29999 -15416 -19183 10829 14201 -1416 -20024 -707 28430
2357 28430 -7189 -27661 14806 19257 -12547 -13333 5224 16266 -2180 -23088 6675 24721
2369 24721 -12636 -18865 13746 13112 -8335 -13841 4353 18509 -6423 -20004 11263 17093 -12349
2382 -12349 -12847 9795 11502 -7124 -13950 7535 15896 -9771 -14186 11223 11767 -10018 -11138 8740
2396 8740 11248 -8454 -11169 9183 10706 -8894 -10285 8820 10072 -9467 -9203 10253 7203 -9408
2410 -9408 -6068 6784 7410 -6394 -10017 8744 8652 -11162 -4793 9573 2457 -5085 -4237 2973 7996
2425 7996 -6234 -8753 10775 3865 -10275 1172 4381 547 -143 -6420 2886 8981 -9323 -4176
2439 -4176 11234 -3022 -4286 3558 -3074 3391 1726 -9369 6958 5324 -10370 4019 4935 -7473
$$ packed form
2345B5332k3717l4926M2222K1088m5415l767L0012L372j5617j8608J9317K9137
2357B8430l5619k0472M2467M451l1804p86J8557J1042j8446k0908K9763J8046
2369B4721l7357o229L2611o34k1447n506J8194J4156k4932j3581L1267N830k9442
2382a2349m98K2642J707j8626o826K1485Q361k5667m415K5409N44k1785j120J9878
2396H740K508j9702k715K0352J523j9600j391J9105J252j9539K64J9456l050j6611
2410i408L340J2852O26j3804l623J8761r2j9814O369J4366p116p542Q48P210N023
2425G996j4230k519J9528o910j4140J1447L209l834o90o277R306O095j8304N147
2439d176J5410j4256j264P844o632O465j665j1095J6327j634j5694J4389R16j2408
$$ plain form
2453 -7473 4508 -97 -6048 8777 -2701 -7178 10254 -3334 -5879 9614 -5804 -3656 10464
2466 10464 -7767 -2442 9304 -7814 1097 6791 -11013 5221 7779 -14270 5383 8097 -11174
2479 -11174 4878 2084 -7606 10172 -4366 -10577 16270 -2372 -13613 12442 254 -6510 6945
2492 6945 -7946 2293 12484 -17076 -1065 18494 -12140 -5073 10042 -5404 4008 -791 -12849
2505 -12849 16103 4636 -22193 11488 11738 -13985 2373 441 -800 11406 -14724 -6666 24627
2518 24627 -9254 -16973 16731 1745 -6109 1788 -8745 11848 8286 -25392 7547 22038 -18682
2531 -18682 -6168 11736 -1528 3844 -8750 -8109 24347 -4692 -26161 19331 11322 -17295 320
2544 320 1589 6008 6796 -21854 2667 27755 -18511 -16501 20767 2373 -8162 -3626 -3843 18534
$$ packed form
2453g473J1981m605n951J4825j1478m477J7432j3588k545J5493j5418K148J4120
2466A0464j8231N325J1746j7118Q911N694j7804J6234K558k2049J9653K714j9271
2479a1174J6052k794r690J7778j4538o211K6847j8642j1241K6055j2188o764J3455
2492F945j4891J0239J0191k9560J6011J9559l0634P067J5115j5446R412m799j2058
2505a2849K8952j1467k6829L3681K50k5723J6358j932j241J2206k6130Q058L1293
2518B4627l3881p719L3704j4986p854P897j0533K0593l562l3678L2939J4491m0720
2531a8682J2514J7904j3264N372j2594O41L2456k9039k1469M5492q009k8617J7615
2544C20J269M419P88k8650K4521K5088m6266K010L7268j8394j0535M536k17K2377
$$ plain form
2558 18534 -911 -28411 16859 20813 -23581 -5783 13923 2729 -673 -14381 888 26692
2570 26692 -14520 -23870 25184 9440 -19527 -1848 5784 10853 -1979 -24116 13441 24885
2582 24885 -25608 -12809 24076 2850 -11436 -7135 4335 20252 -11874 -24789 24860 14836
2594 14836 -26895 -3599 16725 4720 -8131 -15181 12108 22393 -24073 -16439 29128 5601
2606 5601 -22030 -2325 12152 11230 -12856 -19216 22553 16322 -29382 -6755 25626 1916 -16253
2619 -16253 -6979 14069 15405 -21382 -15743 29199 8139 -27853 -1556 20839 4333 -16844
2631 -16844 -11613 20501 13394 -27762 -8389 29107 2106 -23572 -2176 18851 7361 -21335
2643 -21335 -10143 26600 6784 -28831 -1811 25976 499 -22081 -3533 22064 6165 -25727
$$ packed form
2558A8534j9445k7500M5270L954m4394J7798J9706j1194l402j3708J5269K5804
2570B6692m1212r350M9054j5744k8967J7679P632N069j2832k2137L7557J1444
2582B4885n0493J2799L6885k1226j4286M301J1470J5917l2126j2915M9649j0024
2594A4836m1731K3296K0324j2005j2851p050K7289J0285m6466P634M5567k3527
2606E601k7631J9705J4477r22k4086o360M1769o231m5704K2627L2381k3710j8169
2619a6253R274K1048J336l6787N639M4942k1060l5992K6297K2395j6506k1177
2631a6844N231L2114p107m1156J9373L7496k7001k5678K1396K1027j1490k8696
2643b1335J1192L6743j9816l5615K7020K7787k5477k2580J8548K5597j5899l1892
$$ plain form
2655 -25727 -4727 28072 975 -26109 864 24133 462 -23772 -1622 24860 1394 -26215
2667 -26215 653 26198 -2318 -25175 1781 24242 -1627 -25000 2499 25165 -3072 -24486
2679 -24486 2671 25095 -3122 -25700 4573 25250 -5940 -23727 5581 22898 -4040 -23939
2691 -23939 3867 26053 -6138 -26629 9154 23268 -8918 -20320 5426 21700 -3788 -25769
2703 -25769 6800 26817 -11558 -22914 12777 18440 -8501 -18833 4762 23918 -7300 -27195
2715 -27195 13561 23438 -16060 -16950 11710 15697 -6190 -20528 6803 25858 -13798 -23595 19359
2728 19359 15639 -15735 -11662 7922 16998 -6208 -24484 13569 24191 -20925 -15663 19097 9057
2741 9057 -10499 -12225 5419 21860 -11951 -24112 21550 15891 -22363 -6920 13295 8046 -5701
$$ packed form
2655b5727K1000L2799k7097k7084K6973K3269k3671k4234K2150K6482k3466k7609
2667b6215K6868K5545k8516k2857K6956K2461k5869k3373K7499K2666k8237k1414
2679b4486K7157K2424k8217k2578L0273K0677l1190j7787K9308J7317k6938j9899
2691b3939K7806K2186l2191k0491L5783J4114l2186j1402K5746J6274k5488k1981
2703b5769L2569K0017l8375j1356L5691N663k6941j0332K3595J9156l1218j9895
2715b7195M0756R877l9498q90K8660L987k1887j4338K7331J9055l9656r797M2954
2728A9359l720l1374M073J9584R076k3206j8276L8053J0622m5116N262L4760j0040
2741I057j9556j726J7644J6441l3811j2161M5662n659l8254J5443K0215n249j3747
$$ plain form
2754 -5701 -17961 9830 23746 -20646 -17030 24921 5683 -16630 -4006 6278 13525 -7485
2766 -7485 -21858 18476 18097 -25757 -6131 19741 273 -8276 -7995 5714 19266 -15497 -18351
2779 -18351 25650 6707 -22940 2068 10426 2914 -3958 -14721 11560 18265 -23934 -8087 24659
2792 24659 -3984 -13071 2216 3518 10312 -8131 -16738 20643 9039 -25709 3571 15886 -5905
2805 -5905 -4397 -4984 4537 14861 -17164 -10525 24468 -2806 -17417 8241 5157 134 -1947 -11547
2819 -11547 12378 11179 -22736 690 19679 -9347 -6364 3916 496 8205 -8187 -11609 19346
2832 19346 1554 -19788 9476 8358 -7423 1038 -4286 3406 10940 -15887 -3449 19153 -8445
2845 -8445 -9828 9847 -425 91 -315 -8933 10835 5309 -17381 6068 11326 -10606 317 3208
$$ packed form
2754e701j2260K7791J3916m4392L616M1951j9238k2313J2624J0284P247k1010
2766g485j4373M0334l79m3854J9626K5872j9468q549K81J3709J3552l4763k854
2779a8351M4001j8943k9647K5008Q358p512o872j0763K6281O705m2199J5847L2746
2792B4659k8643r087J5287J302O794j8443q607L7381j1604l4748K9280J2315k1791
2805e905J508n87R521J0324l2025O639L4993k7274j4611K5658l084n023k081r600
2819a1547K3925j199l3915K3426J8989k9026K983J0280l420P709j6392l422L0955
2832A9346j7792k1342K9264j118j5781Q461n324P692P534k6827J2438K2602k7598
2845h445j383J9675j0272N16m06q618J9768n526k2690K3449N258k1932J0923K891
$$ plain form
2859 3208 -2461 6564 -6172 -6167 14308 -3247 -11142 10256 1153 -5876 4022 -4171 1515 6915 -10460
2874 -10460 916 11060 -8550 -2094 6868 -4612 1530 1424 -6441 6662 1873 -9266 6241
2887 6241 2743 -7268 4622 31 -3774 5997 -3505 -3233 6861 -3645 -2993 5565 -3919 -1172
2901 -1172 5236 -4883 48 4733 -4444 999 2644 -4176 3316 1151 -5873 3774 2492 -5095 1678
2916 1678 1738 -1759 1420 -2382 -503 5328 -3704 -4144 5616 687 -3605 -278 1061 2398 -1389 -4793
2932 -4793 3730 4672 -5686 -2778 5300 1641 -3560 -2746 3322 4052 -4705 -4017 5975 3479 -5677 -3274
2948 -3274 5965 3488 -6285 -3542 6335 3322 -6371 -3561 6477 4128 -7134 -4729 8545 3504
2962 3504 -8848 -1999 7454 2864 -6870 -4694 8161 5323 -10711 -3673 11575 1440 -9172
$$ packed form
2859C208n669R025j2736NK0475j7555p895K1398r103p029R898q193N686N400j7375
2874a0460J1376J0144j9610O456Q962j1480O142j06p865J3103m789j1139J5507
2887F241l498j0011J1890m591l805R771r502K72J0094j0506O52Q558r484K747
2901a172O408j0119M931M685r177N443J645o820P492k165p024R647j282p587O773
2916A678O0l497L179l802J879N831r032m40R760m929m292L327J339J337l787l404
2932d793Q523R42j0358K908Q078l659n201Q14O068P30q757O88R992k496r156K403
2948c274R239k477r773K743R877l013r693K810J0038k349j1262K405J3274n041
2962C504j2352O849R453m590r734K176J2855k838j6034P038J5248j0135j0612
$$ plain form
2975 -9172 -857 6815 3776 -8296 -6216 12237 4192 -14089 36 11579 -1242 -7931 -2788
2988 -2788 8064 5812 -12916 -4856 16549 -343 -14344 3614 9298 138 -7709 -5307 12820
3001 12820 5384 -17756 511 17341 -5056 -11259 3249 7577 3510 -11740 -6026 18807 38
3014 38 -20121 6467 13729 -5930 -8049 -1041 10660 5610 -18411 -1002 22077 -7097 -16512
3027 -16512 9212 8769 -2426 -9113 -4529 17395 1849 -23218 7098 19099 -11489 -10506 6372
3040 6372 7763 2205 -15179 -2328 23592 -6802 -21730 13808 11914 -10528 -6906 1417 12581
3053 12581 1882 -21957 6037 23279 -15197 -14399 14384 6432 -4602 -9858 -690 20172 -4985
3066 -4985 -23779 15093 16615 -17713 -7356 9237 7212 -1070 -16700 3962 23717 -14813 -18560
$$ packed form
2975i172Q315P672l039j2072K080J8453q045j8281J4125J1543j2821o689N143
2988b788J0852k252j8728Q060K1405j6892j4001J7958N684r160p847K402J8127
3001A2820p436k3140J8267J6830k2397o203J4508M328m067j5250N714K4833j8769
3014C8k0159K6588P262j9659k119P008J1701n050k4021J7409K3079k9174r415
3027a6512K5724m43j1195o687M584K1924j5546k5067L0316J2001l0588R83J6878
3040F372J391n558j7384J2851K5920l0394j4928L5538j894k2442L622Q323J1164
3053A2581j0699k3839K7994J7242l8476P98K8783p952j1034n256R168K0862k5157
3066d985j8794L8872J522l4328J0357J6593k025q282j5630K0662J9755l8530l747
$$ plain form
3079 -18560 19846 8214 -12970 -5545 3906 13671 -3597 -22526 13221 20429 -21169 -9921 17129
3092 17129 3953 -6809 -9845 3685 19935 -11832 -20934 21076 11468 -20411 -3540 10807
3104 10807 6669 -5020 -16750 10375 20374 -20727 -12655 22441 3327 -14223 -3644 6757
3116 6757 12272 -9539 -18259 19287 13348 -23812 -3562 17748 878 -8984 -8495 9047 15341
3129 15341 -17384 -13545 23664 4517 -20155 537 11811 4600 -8873 -12412 15525 13063 -23032
3142 -23032 -5010 21900 -1162 -14020 -1467 9672 8763 -14268 -11385 21330 5971 -22560
3154 -22560 1245 16230 -962 -10825 -5715 12519 9235 -19254 -5638 21934 -626 -18012
3166 -18012 2563 12120 1912 -11807 -6484 17253 5411 -20780 542 18666 -3868 -13467
$$ packed form
3079a8560L8406j1632k1184P425R451R765j7268j8929L5747P208m1598J1248K7050
3092A7129j3176j0762l036J3530J6250l1767r102M2010r608l1879J6871J4347
3104A0807m138j1689j1730K7125R999m1101Q072L5096j9114j7550J0579J0401
3116F757N515k1811q720L7546n939l7160K0250K1310j6870r862M89J7542O294
3129A5341l2725L839L7209j9147k4672K0692J1274p211j3473l539K7937k462l6095
3142b3032J8022K6910k3062j2858J2553J1139r09k3031K883L2715j5359k8531
3154b2560K3805J4985j7192r863N110J8234l284k8489J3616K7572k2560j7386
3166a8012K0575R557j0208j3719N323K3737j1842k6191K1322J8124k2534r599
$$ plain form
3178 -13467 1028 11507 3536 -15174 -3693 19177 -791 -18133 4517 13827 -3091 -11249
3190 -11249 -622 13533 1732 -16943 1489 17056 -4568 -13955 4378 11742 -1860 -12073
3202 -12073 448 14666 -1826 -15556 4315 13493 -4891 -11624 3227 11865 -2520 -12731
3214 -12731 3390 13415 -4097 -12934 4821 11778 -4466 -11365 4067 11611 -4359 -11353 4719
3227 4719 10764 -4708 -11118 4637 10964 -5494 -10492 5980 9277 -5548 -8881 4577 9449
3240 9449 -4348 -10381 5617 10232 -7234 -7687 6487 5992 -4252 -7218 3688 9477 -5580 -9274
3254 -9274 8024 6620 -7860 -4151 4643 4822 -2389 -8266 4572 9305 -8321 -6014 8767 2145
3268 2145 -5173 -2692 1778 6425 -2901 -8844 7674 6482 -9638 -1148 5745 -154 -1064 -4360 1402
$$ packed form
3178a3467J4495J0479p971j8710J1481K2870j9968j7342K2650R310j6918q158
3190a1249J0627J4155j1801j8675J8432J5567k1624r387J8333P364j3602j0213
3202a2073J2521J4218j6492j3730J9871R178j8384o733J4851Q638j4385j0211
3214a2731J6121J0025j7512q837J7755O957j6244o899J5432P544j5970o994J6072
3227D719O045j5472o410J5755O327j6458m998J6472L297j4825l333J3458M872
3240I449j3797o033J5998M615j7466m53J4174m95j0244k966J0906N789j5057l694
3254i274J7298j404j4480L709Q794J79p211n877J2838M733j7626K307J4781o622
3268B145p318K481M470M647r326n943J6518j192j6120Q490O893n899r10l296N762
$$ plain form
3283 1402 8545 -6254 -6676 9354 900 -7101 1793 913 1406 627 -7241 3978 6977 -9078 -1234
3298 -1234 7944 -3957 -1289 1232 -2224 5400 -1334 -7695 8358 2406 -8925 4684 1980 -3688
3312 -3688 3847 -3683 -1458 7655 -6020 -3307 8608 -4335 -2996 5594 -3939 667 4202 -7089
3326 -7089 3186 4925 -8215 3340 3996 -6861 4020 1631 -6379 5929 -18 -6362 6702
3339 6702 -1548 -4900 7498 -3634 -4001 8310 -4499 -3232 7203 -4546 -684 5550 -6560
3352 -6560 2292 5649 -9214 2736 6135 -7581 2053 2986 -4930 5484 -1773 -6556 9468 -872
3366 -872 -8855 7375 1061 -4997 3940 -2886 307 6525 -8425 -761 10855 -7260 -4178 7492
3380 7492 -2489 273 450 -5666 7696 2288 -11920 5806 7368 -8338 590 2514 -983 4136
$$ packed form
3283A402P143j4799m22J6030q454q001Q894q80M93p79p868J1219K999j6055P844
3298a234R178j1901K668K521l456P624o734o361J6053n952j1331J3609k704n668
3312c688P535p530K225R113j3675K713J1915j2943J339Q590r533M606L535j1291
3326g089J0275J739j3140J1555O56j0857J0881k389q010J2308n947o344J3064
3339F702q250l352J2398j1132l67J2311j2809J267J0435j1749L862O234j2110
3352f560Q852L357j4863J1950L399j3716R634R33p916J0414p257m783J6024j0340
3366h72p983J6230o314o058Q937o826L193O218j4950P664J1616j8115L082J1670
3380G492r981K762J77o116J3362n408j4208J7726J562j5706Q928J924l497N119
$$ plain form
3394 4136 -6381 -2978 11913 -4991 -9606 9227 2101 -5227 766 -1739 4802 2948 -11833 3803
3408 3803 11155 -9383 -4593 7434 238 -690 -3767 -1980 10317 -3012 -11975 9391 6586 -9663
3422 -9663 -1440 3925 3054 37 -9037 2581 12056 -9034 -8360 10702 2973 -6523 -2878 2006 7571
3437 7571 -2995 -11472 8442 9324 -11469 -4042 8727 2186 -4346 -6150 4054 9904 -8045 -9373
3451 -9373 11796 5480 -10502 -2683 6606 4478 -5363 -8209 8345 9051 -11722 -5676 11642 3148
3465 3148 -9077 -3812 7094 6697 -8664 -7653 11649 6066 -12313 -3286 10424 3457 -9148
3478 -9148 -5179 9833 6189 -11366 -5513 12499 3863 -11872 -2907 10623 3525 -10746 -4483
3491 -4483 12111 4076 -12471 -3089 12358 2880 -12247 -2674 12055 2877 -12211 -2604 12437
$$ packed form
3394D136j0517L403J4891j6904m615J8833p126p328N993k505O541j854j4781J5636
3408C803P352k0538M790J2027p196r28l077J787J2297j3329q963K1366k805j6249
3422i663Q223N365q71l017r074J1618R475k1090O74J9062p729r496L645M884N565
3437G571j0566q477J9914Q82k0793P427J2769o541o532j804J0204N850j7949j328
3451i373K1169o316j5982P819R289k128r841k846J6554P06k0773O046J7318q494
3465C148j2225N265J0906l97j5361J011J9302n583j8379R027J3710o967j2605
3478i148L969J5012l644j7555N853J8012q636j5735Q965J3530p098j4271O263
3491d483J6594q035j6547R382J5447r478j5127R573J4729r178j5088R607J5041
$$ plain form
3504 12437 2243 -12453 -2406 12699 2209 -13283 -1285 13086 584 -12202 -848 11992
3516 11992 1784 -13052 -1793 14411 132 -13854 1570 12633 -1295 -11418 -760 12531
3528 12531 1347 -14856 675 15268 -3194 -12889 2945 10706 -819 -11735 -1027 14659
3540 14659 -890 -16246 4183 13752 -5156 -10473 2610 10524 204 -13978 913 16563
3552 16563 -4951 -14930 7222 10360 -4949 -8850 946 12507 -819 -16577 5080 15526 -8998
3565 -8998 -10865 7322 7844 -2680 -10528 905 15341 -4382 -16036 9898 10996 -9890 -6557
3578 -6557 4796 7909 -1395 -13640 4463 15919 -10438 -11763 11579 6061 -7000 -6014 2155
3591 2155 11610 -3552 -15492 10129 12325 -13423 -5730 9217 4010 -3243 -9053 3128 14341
$$ packed form
3504A2437j0194j4696J0047J5105j0490j5492J1998J4371j2502j2786J1354J2840
3516A1992j0208j4836J1259J6204j4279j3986J5424J1063j3928j0123J0658J3291
3528A2531j1184j6203J5531J4593j8462r695J5834P761j1525j0916J0708J5686
3540A4659j5549j5356K0429R569j8908n317J3083P914j0320j4182J4891J5650
3552A6563k1514r979K2152L138j5309l901R796J1561j3326j5758K1657J0446k4524
3565h998j867J8187N22j0524p848J1433J4436j9723j1654K5934J098k0886L333
3578f557J1353L113r304j2245J8103J1456k6357j325K3342n518j3061R86Q169
3591B155R455j5162j1940K5621K196k5748P693J4947n207p253n810J2181J1213
$$ plain form
3604 14341 -9248 -13088 14023 6539 -11824 -2308 5117 6068 -2807 -12757 7579 13318 -13946 -7179
3618 -7179 13522 1727 -7077 -3407 3016 9885 -6307 -12959 13405 7635 -14898 -1112 9223
3631 9223 1046 -3587 -7440 4986 11605 -11845 -8652 15161 1159 -10776 1204 3882 4332 -3859
3645 -3859 -10203 10243 8556 -14962 -1605 12508 -2442 -5262 -1539 2855 7892 -8078 -8460 14023
3659 14023 2208 -13203 3051 6550 -1153 -2648 -5299 6194 7759 -12529 -3073 13575 -2861
3672 -2861 -8155 2685 2679 3030 -4363 -6711 10409 3795 -13074 2206 9023 -4257 -3387 -374 2786
3687 2786 5190 -7987 -4003 12205 -1777 -9374 4795 4042 -1675 -1976 -3233 5575 3853 -10320
3701 -10320 544 9549 -4666 -4504 3029 1438 1680 -3742 -3436 8030 14 -8807 4235 4778 -4023
$$ packed form
3604A4341k3589l840K7111p484j8363R516P425R51q875r950K0336N739k7264O767
3618g179K0701j1795q804L670O423O869j6192o652K6364n770k2533J3786J0335
3631I223q177m633l853J2426O619k3450L193K3813j4002j1935J1980K678M50q191
3645c859o344K0446j687k3518J3357J4113j4950k820L723M394N037j5970l82K2483
3659A4023j1815j5411J6254L499p703j495k651J1493J565k0288R456J6648j6436
3672b861n294J0840oL51p393k348J7120o614j6869J5280O817j3280Q70L013L160
3687B786K404j3177L984J6208j3982p597J4169p53n717l01j257Q808j722j4173
3701a0320J0864R005j4215J62P533j591K42n422L06J1466q016q821J3042N43q801
$$ plain form
3716 -4023 -1394 -81 2165 2556 -6085 -737 7670 -3684 -4694 4146 1344 -1421 -1079 -1378 4157
3731 4157 991 -6019 2538 4594 -4010 -1370 2119 552 466 -2408 -884 4430 -1236 -3829 2890
3746 2890 1542 -2041 -208 85 1006 689 -2543 643 2797 -2063 -1050 1708 66 -305 -671 -288
3762 -288 1439 -159 -1590 931 652 -940 192 503 -59 511 -492 -161 233 -90 174 -184 9 548
3780 548 -67 50 -575 290 1064 -807 -990 1478 499 -1173 70 872 553 -230 -1709 1231 2339 -2698
3798 -2698 -1014 2649 -317 -1278 -123 291 1858 -1241 -3135 3426 1782 -4321 419 2581 -387
3813 -387 -655 -1813 1482 3644 -3951 -2864 5867 -79 -4497 1270 1222 983 -1088 -3981 4405 3809
3829 3809 -6940 -175 5991 -2088 -2573 101 1158 3419 -4005 -4392 7905 1226 -8103 2545 4141
$$ packed form
3716d023K629J313K246L91q641N348Q407j1354j010Q840k802k765L42k99N535
3731D157l166p010Q557K056q604K640L489j567q6k874J524N314n666k593O719
3746B890j348l583J833K93R21l17l232L186K154m860J013K758j642l71l66L83
3762b88J727j598j431K521k79j592J132L11n62N70j003L31L94l23K64l58J93N39
3780E48o15J17o25Q65P74j871j83K468r79j672J243Q02l19p83j479K940J108n037
3798b698J684L663k966r61J155M14J567l099j894O561j644o103M740K162k968
3813c87k68j158L295K162p595J087Q731n946m418N767m8k39k071k893Q386n96
3829C809j0749O765O166q079m85K674J057K261p424l87J2297o679r329J0648J596
$$ plain form
3844 4141 -1403 -1405 -2857 3419 4827 -7815 -1847 9409 -2520 -5988 2961 2006 1388 -2924 -4600
3859 -4600 8050 2565 -10793 2563 7926 -4224 -2874 713 2707 3879 -7282 -3237 11638
3872 11638 -1869 -9922 5322 4797 -2492 -2707 -2693 6647 3841 -11796 1393 11439 -5911 -6282
3886 -6282 4672 2848 873 -5606 -3186 11225 -841 -12727 6132 8051 -6660 -3297 1445
3899 1445 4558 2246 -10133 101 13058 -5908 -9713 8186 3916 -3776 -3322 -1130 8765 259
3913 259 -12922 5568 11142 -9403 -5132 6191 2946 -786 -6784 -149 12654 -5157 -12039 9824
3927 9824 6546 -8299 -2943 3077 5533 -679 -11235 4140 12562 -9679 -7893 10220 2960 -5263
3941 -5263 -4134 1448 9531 -3903 -12251 9224 8638 -11028 -3806 7386 3027 -3095 -7589 3849
$$ packed form
3844D141n544kj452O276J408j2642N968J1256j1929l468Q949r55o18m312j676
3859d600J2650n485j3358J3356N363j2150J350L587J994J172j1161M045J4875
3872A1638j3507q053J5244n25p289k15J4R340k806j5637J3189J0046j7350l71
3886f282J0954j824j975o479K420J4411j2066j1886J8859J919j4711L363M742
3899A445L113k312j2379J0234J2957j8966l805J7899m270p692M54K192R895q506
3913B59j3181J8490N574k0545M271J1323l245l732n998O635J2803j7811o882K1863
3927I824l278j4845N356O020K456o212j0556J5375Q422k2241J786J8113p260q223
3941e263J129N582Q083j3434q348K1475n86j9666P222J1192m359o122m494J1438
$$ plain form
3955 3849 11348 -8897 -9179 11622 4248 -9097 -2215 4673 5651 -4320 -9745 8154 9246 -11745
3969 -11745 -4591 10907 1478 -6388 -3791 4346 8016 -7658 -8597 11727 5229 -11725 -1498 8197
3983 8197 2190 -5513 -5899 7131 7626 -10798 -5331 11846 1710 -9561 -1200 6804 4306 -7292
3997 -7292 -6241 10097 5069 -12182 -1958 10856 662 -7695 -2530 7188 4737 -9645 -4461
4010 -4461 11425 1678 -10930 -167 8706 1112 -7697 -3017 9179 3292 -11018 -1516 10875
4023 10875 -197 -9136 -258 8231 1520 -8513 -1936 9770 814 -10359 191 9427 -554
4036 -554 -8444 -75 8456 405 -9426 15 9631 -1041 -9243 1307 8634 -759 -8917 924 8779
4051 8779 -1035 -8568 1320 8177 -1155 -8424 1368 8881 -2001 -8389 2214 7724 -1772 -7400
$$ packed form
3955C849P499k0245k82K0801p374j3345O882O888R78r971n425J7899J092k0991
3969a1745P154J5498r429p866K597Q137L670j5674r39K0324o498j6954J0227R695
3983H197o007p703l86J3030M95j8424N467J7177j0136j1271Q361Q004k498j1598
3997g292J051J6338n028j7251J0224J2814j0194q357N165R718k451j4382N184
4010d461J5886r747j2608J0763Q873p594q809M680J2196n887j4310R502J2391
4023A0875j1072q939Q878Q489o711j0033O577J1706q956j1173J0550R236r981
4036e54p890Q369Q531q051r831R441R616j0672q202J0550P327r393q158R841P855
4051H779r814p533R888O857r332p269R792P513j0882o388J0603N510r496n628
$$ plain form
4065 -7400 1326 8033 -1692 -8918 2289 8456 -3646 -7071 2920 6402 -1753 -7267 1629 8568
4079 8568 -3008 -8412 4471 6386 -4016 -5409 2220 6013 -1383 -8095 2723 7914 -5098 -6035
4093 -6035 5221 3993 -3024 -4540 1356 6946 -2383 -7849 5127 6044 -5938 -3018 3705 3108 -1375
4108 -1375 -5508 1985 7500 -5066 -5984 6877 2586 -4560 -1654 1434 4029 -1186 -6832 4246
4122 4246 6253 -7084 -2622 5827 416 -2088 -2269 642 5926 -3403 -6434 6916 2960 -6475 441
4137 441 2765 497 98 -4467 1869 6239 -6248 -3091 7135 -963 -3396 1070 -218 2851 -493
4152 -493 -5938 4796 3933 -7248 711 4379 -2476 318 -1423 -811 4767 -3478 -4322 6736 -264
4167 -264 -4958 3057 221 -814 1753 -3914 1532 4734 -5755 -395 5441 -3273 -670 2096 -2461
$$ packed form
4065g400Q726O707r725p226J1207O167j2102l425R991L482q155n514Q896O939
4079H568j1576n404J2883J915j0402j393P629L793p396o712J0818N191j3012r37
4093f035J1256j228p017j516N896N590r329n466J2976R17j1982K920O723n97m483
4108a375m133P493N515j2566r18J2861m291p146K906L088K595n215n646J1078
4122D246K007j3337M462Q449n411k504j81K911N284r329l031J3350l956r435O916
4137D41K324k268l99m565O336M370j2487L157J0226q098k433M466j288L069l344
4152d93n445J0734q63j1181P959L668o855K794j741O12N578q245q44J1058p000
4167b64m694Q015k836j035K567n667N446L202j0489N360N836q714K603K766m557
$$ plain form
4182 -2461 2338 -2 -4635 4385 1272 -5486 3147 1317 -3285 2583 -1221 -1660 4203 -2917 -2097
4197 -2097 5115 -2674 -1858 4255 -2819 -295 3114 -3908 1190 3237 -4451 1499 2437 -4316 2148
4212 2148 1600 -4056 3105 1079 -3933 2987 -322 -2842 3651 -1714 -2660 4684 -2265 -2470 3838 -1878
4228 -1878 -1243 2649 -2820 964 2637 -4762 1020 3947 -3810 -100 2368 -2132 1640 -556 -2651
4243 -2651 4443 -494 -4840 3798 1454 -3118 981 -289 171 2194 -4115 -267 5470 -3176 -2738
4258 -2738 3929 -157 -1076 -438 -1327 3752 161 -5324 2915 3917 -4538 -1196 2409 858 35 -3006
4274 -3006 98 5144 -2797 -4663 4537 2194 -3480 -1138 1215 2627 -727 -4566 2477 4478 -4513
4289 -4513 -2912 4293 1647 -2575 -2388 1819 4300 -2830 -4458 4632 3297 -4868 -2188 3687 2365
$$ packed form
4182b461M799k340m633R020l113o758Q633j830m602N868l804m39N863p120Q20
4197b097P212p789Q16O113p074K524L409p022N098K047p688N950R38o753O464
4212B148n48n656P161k026n012O920l309k520O493n365r46P344o949k05O308n716
4228a878O35L892n469L784J673p399N782K927p757L710K468m500L772k196k095
4243b651P094m937m346Q638k344m572M099j270M60K023o309L848N737q646M38
4258b738O667m086r19O38q89N079l591n485Q239J002q455L342L605j551q23l041
4274c006L104N046p941j866R200k343n674K342K353J412l354l839P043K001q991
4289d513J601P205k646m222J87M207K481p130j628R090j335q165K680N875j322
$$ plain form
4304 2365 -2801 -3419 3468 4106 -4714 -3576 4815 2532 -4775 -2677 4016 3067 -4299 -3607 4738 3395
4320 3395 -5377 -3009 4901 2561 -4913 -2873 5319 2808 -5304 -2842 5187 2791 -5639 -2750 5748
4335 5748 2769 -6074 -2415 6090 1728 -5970 -2374 5501 2803 -6098 -2536 7180 1630 -6862 -931
4350 -931 5678 1586 -5632 -2627 6453 2670 -7544 -1665 8111 -87 -6714 -141 5394 1746 -6000
4365 -6000 -2436 7892 1240 -8549 889 7172 -1197 -5414 -650 5605 2251 -7746 -1682 9559
4379 9559 -1132 -8039 2234 5654 -184 -5260 -1787 7429 1655 -9825 1039 9140 -3137 -6095
4393 -6095 1963 5085 824 -6930 -1481 9706 -1093 -9715 4045 6854 -3337 -4678 527 6055
4407 6055 1175 -9489 1078 10433 -4491 -7473 4855 4860 -1987 -5007 -671 8425 -771 -10341 4654
$$ packed form
4304B365n166o18O887O38q820J138Q391k283p307K098O693r49p366O92Q345j343
4320C395q772K368P910k340p474K040Q192k511q112K462Q029k396q430K889Q498
4335E748k979q843L659Q505m362p698L596P875k698q901L562R716n550q492N931
4350i31O609m092p218L005R080l783j0214N879R776q198o627O573N535l648p746
4365f000L564J0328o652r789R438O283q369m217M764O255l354r997O064J1241
4379I559j0691o907J0273L420n838n076L473R216n774j1480J0864Q101j2277k958
4393f095Q058L122m261p754N449J1187j0799q622J3760K809j0191j341N205N528
4407F055m880j0664J0567R355j4924k982J2328No847l020M336R096r196r570J4995
$$ plain form
4422 4654 8466 -6050 -4695 3481 3980 -65 -7164 531 10223 -4416 -8848 6886 5005 -5007
4436 -5007 -3030 1279 5538 -243 -9305 3763 9608 -7290 -5697 6638 2619 -2635 -4521 564
4450 564 8205 -3266 -9539 7292 6384 -7718 -2589 4075 3015 -1079 -6694 2622 9160 -6834
4464 -6834 -6536 8507 2846 -5457 -1808 1959 5357 -2521 -8500 6438 6919 -8966 -2888 6771 988
4479 988 -2978 -3573 2202 6989 -5495 -7209 8816 3511 -8001 -685 4063 2030 -2399 -5851 4598
4494 4598 6654 -8159 -3592 8535 167 -5301 -556 2413 4134 -3565 -6133 7313 3941 -8691
4508 -8691 -342 5870 -275 -3042 -2608 3162 5024 -6154 -4082 8726 562 -6821 756 3364 1330
4523 1330 -2896 -4248 5489 3764 -7882 -792 7162 -1406 -4268 235 2704 2727 -4347 -3125 6853
$$ packed form
4422D654L812j4516J355Q176M99m045p099P695R692j4639m432J5734j881j0012
4436e007J977M309M259n781r062J3068N845j6898J593J2335m019n254j886N085
4450E64P641j1471o273J6831r08j4102N129O664j060m094n615R316O538j5994
4464f834K98J5043n661q303L649L767L398p878n979J4938M81j5885O078R659n783
4479I88l966n95N775M787j2484j714J6025n305j1512P316M748k033m429l452J0449
4494D598K056j4813M567J2127q368n468M745K969J721p699k568J3446l372j2632
4508h691Q349O212o145k767M34N770J862j1178K072J2808q164p383P577K608k034
4523A330m226j352R737j725j1646P090P954q568k862M503K469K3p074J222R978
$$ plain form
4538 6853 994 -7205 1382 4720 -991 -2888 -1272 3616 2449 -5835 -1188 6361 -1088 -5062 1851
4553 1851 3013 165 -2824 -1488 4934 797 -6053 886 4962 -1672 -3225 422 2356 745 -3792
4568 -3792 -663 4654 -599 -4436 1801 3093 -906 -2437 159 2946 38 -4297 540 4121 -1244
4583 -1244 -3070 1234 2445 -426 -2646 186 3142 -488 -3220 1215 2535 -1260 -2053 636 2280
4598 2280 -949 -2385 669 2134 -796 -2097 1002 2145 -674 -2146 1027 1798 -1046 -1320 912
4613 912 1162 -427 -1638 690 1996 -1024 -1392 1390 653 -808 -162 62 1002 77 -1731 1114 1506
4630 1506 -1493 -15 906 -203 498 -173 -602 1638 -297 -1191 1607 119 -1340 1382 -660 -360
4646 -360 1314 -1329 -507 1643 -1324 78 1245 -1566 780 1171 -2181 609 1670 -1654 881 465
$$ packed form
4538F853n859q199Q587L338n711j897J616M888j167q284M647P549p449l974O913
4553A851J162k848k989J336O422m137o850O939M076o634j553L647J934j611m537
4568c792L129N317n253l837O237J292l999j531K596K787k908m335M837L581n365
4583a244j826M304J211k871k220K832K956l630k732M435J320l795p93K689J644
4598B280l229j436L054J465k930j301L099J143k819j472L173P71k844k74K232
4613I12K50j589j211K328J306l020l68K782p37j461O46K24R40r25j808K845L92
4630A506k999J478R21j109P01o71m29K240j935q94K798j488j459K722k042L00
4646c60J674k643Q22K150k967J402J167k811K346L91l352K790J061l324K535m16
$$ plain form
4662 465 -1187 2082 -315 -2141 2340 176 -2342 1543 15 -947 1199 -1620 165 3022 -3100
4677 -3100 -1162 3503 -1304 -1116 1187 -1273 1377 172 -3183 2769 1896 -4480 936 2689 -2051
4692 -2051 464 -503 -254 3266 -2657 -2609 4832 -709 -3600 1978 346 -210 405 -2824 2273 3016 -5384
4709 -5384 -200 4995 -2058 -1823 1474 26 1891 -1841 -3253 5265 744 -5857 2404 3098 -2223
4724 -2223 -408 -967 1663 3107 -5262 -1308 6844 -2308 -4198 3143 1239 -236 -1174 -2704 4228
4739 4228 1863 -7065 1996 5782 -3629 -2193 1622 1138 1477 -3855 -1900 6795 -1221 -6585 4138
4754 4138 3219 -2682 -936 -620 3123 1810 -6587 879 7143 -3852 -4521 3634 1696 -582 -2713
4769 -2713 -1092 5864 -549 -7303 3760 5180 -4515 -2243 1929 2587 358 -5268 383 7153 -3436
$$ packed form
4662D65j652L269k397j826M481k164k518L885j528r62K146k819J785K857o122
4677c100J938M665m807J88K303k460K650j205l355N952q73o376N416J753m740
4692b051K515r67K49L520n923M8P441n541k891N578j632n56O15l229N097P43q400
4709e384N184N195p053K35L297j448J865l732j412Q518m521o601Q261O94n321
4724b223J815n59K630J444q369L954Q152r152j890P341j904j475r38j530O932
4739D228k365q928R061L786r411J436L815m84L39n332J955Q695q016n364J0723
4754D138r19n901J746L16L743j313q397P466O264j0995o69Q155j938k278k131
4769b713J621O956o413o754J1063J420r695K272M172O58k229n626N651O770j0589
$$ plain form
4784 -3436 -6028 5204 3227 -3607 -1995 522 4323 -726 -6982 3529 6193 -5593 -3585 4578
4798 4578 2048 -2243 -3637 1085 5994 -3165 -6617 5153 4322 -5572 -2133 3125 2873 -1625 -5026
4813 -5026 3030 5883 -5155 -4880 5835 2397 -4193 -2252 2614 4270 -3007 -5663 5187 4631 -6282
4828 -6282 -2796 4916 2182 -3444 -3525 3578 4659 -5015 -4691 5889 2807 -5729 -1869 4397 2855
4843 2855 -3942 -3767 5017 3990 -5928 -3020 6154 2033 -4996 -2281 4524 3234 -5302 -3258 6275
4858 6275 2621 -6209 -1850 5772 1843 -5193 -2391 5333 2407 -5953 -2053 6157 1691 -5616 -1670
4873 -1670 5710 1638 -5909 -1641 6003 1540 -5606 -1320 5743 1015 -5995 -1248 5962 709 -6004
4888 -6004 -440 5575 1027 -5453 -909 5868 914 -6352 107 6072 -356 -5127 -122 5206 485
$$ packed form
4784c436k592J1232j977o834J612K517L801n049o256J0511K664j1786K008Q163
4798D578k530m291j394M722M909r159l452J1770q31r894L439N258k52m498l401
4813e026Q056K853j1038K75J0715l438o590J941M866J656p277k656J0850n56j0913
4828f282L486P712k734n626q1P103J081r674L24J0580l082q536L860O266j542
4843B855o797J75Q784j027r918K908R174m121p029K715O805j290q536K044R533
4858F275l654q830M359P622l929p036K802P724k926q360L900Q210m466p307L946
4873a670P380m072p547M268P644m463p146M286P063m728p010M747P210n253o713
4888f004N564O015m548o480M544O777m954p266O459N965o428m771N005N328m721
$$ plain form
4903 485 -5849 -699 6585 -324 -6561 1140 5249 -914 -4619 -269 5328 728 -6148 420 6625
4918 6625 -1853 -5292 1853 4204 -547 -4606 -464 6147 -550 -6723 2320 5493 -2643 -3781 1260
4933 1260 3837 45 -5422 178 6553 -2451 -5667 3681 3597 -2254 -2942 168 4493 -295 -6026 2228
4949 2228 5603 -3790 -3288 3290 2222 -953 -3376 52 5525 -1833 -5930 4142 3617 -3896 -1599
4964 -1599 1491 2295 195 -4937 1294 6047 -3895 -4083 4603 1340 -2421 -1365 112 4027 -824
4979 -824 -5502 3690 4338 -5056 -1325 3325 439 -338 -2421 536 5370 -2867 -4414 5290 1560 -3996
4995 -3996 280 952 1514 201 -4352 2264 4424 -4820 -1829 4296 -529 -1411 -185 -215 3313 -1347
5011 -1347 -4103 4249 1964 -4603 611 2396 -735 123 -1953 541 4008 -3398 -2116 4720 -842
$$ packed form
4903D85o334N150P284o909o237P701M109o163l705M350N597m600o876O568O205
4918F625q478l439P145K351m751m059M142O611o697o173R043L173q136j138N041
4933A260K577l792n467N600O375r004l216R348q4n851o88L110M325m788n731Q254
4949B228L375r393N02O578j068l175k423L428N473p358m097J0072n25p513K297
4964a599L090Q04k100n132O231M753r942j88Q686l263l761J056J477L915m851
4979h24m678R192O48r394L731M650k886p77k083K957M834q237j547R704l730n556
4995c996M276O72N62j313m553O616K160r244K991O125m825q82J226l0L528m660
5011a347k756Q352k285o567N214J785l131Q58k076K494L467p406J282O836n562
$$ plain form
5026 -842 -2851 1299 2 945 211 -3283 2311 2722 -4254 331 3183 -1714 -4 351 -629 2528
5042 2528 -1222 -3126 3858 102 -3445 1873 754 -1008 1118 -1679 617 2726 -3146 -672 3457
5057 3457 -1774 -870 1676 -1106 764 226 -2337 1979 1216 -3081 1379 1320 -1899 1312 185 -1240
5073 -1240 1848 -822 -1201 2411 -832 -1219 2082 -1078 -623 1580 -1484 -301 1433 -1829 18 1361
5089 1361 -1811 738 923 -1712 917 903 -1656 636 152 -795 1250 -620 -1196 2050 -463 -1558
5105 -1558 1689 217 -631 379 -534 627 913 -1770 11 1919 -1339 -1070 1029 99 -34 -669 -478
5122 -478 1662 -315 -2457 1088 1544 -1237 -837 667 974 -193 -1659 452 2226 -986 -1821 1554
5138 1554 1490 -1158 -1391 760 1842 -952 -2165 1357 1931 -1564 -1747 1539 1645 -1499 -1735 1240 2057
$$ packed form
5026h42k009M150j297R43p34l494N594M11o976M585K852m897J710L55r80L157
5042B528l750j904O984l756l547N318j119j762K126k797K296K109n872K474M129
5057C457n231R04K546k782J870n38k563M316p63m297M460n9l219L211j127j425
5073a240L088k670l79L612l243l87L301l160M55K203l064J183J734l262J847J343
5089A361l172K549J85k635K629j4k559K292m84r47K045j870n76L246k513j095
5105a558L247j472q48J010r13J161K86k683J781J908l258K69K099r30j33o35J91
5122d78K140j977k142L545M56k781M00J504L07j167j466K111J774l212q35L375
5138A554o4k648k33K151J082k794j213L522N74l495j83L286J06l144k36K975Q17
$$ plain form
5155 2057 -1758 -1845 1486 1932 -1612 -2183 1816 2354 -2255 -1739 2277 1727 -1854 -2292 1794 2387 -2381
5172 -2381 -2342 2953 1680 -2673 -1615 2302 1820 -1990 -2413 2589 2671 -3527 -1878 3644 1138 -2493
5188 -2493 -1437 1774 2289 -2541 -3005 3918 1981 -4222 -896 3241 910 -2236 -1938 2620 2912 -4106
5204 -4106 -2562 4755 827 -4041 -235 2756 1417 -2406 -2817 3797 2541 -5209 -702 4564 -373
5219 -373 -3167 -618 2324 2465 -3761 -2583 5481 874 -5733 715 3570 -365 -2354 -1349 3310
5234 3310 2519 -5611 -1057 6262 -908 -4744 1315 2462 790 -3192 -2488 5322 1420 -6702 1265
5249 1265 5437 -2079 -3404 396 3020 1732 -5024 -1534 7038 -1007 -6153 2414 3627 -1601 -2585
5264 -2585 -1402 4234 1927 -6684 557 6671 -3043 -4300 2391 2782 169 -3801 -1105 6230 -465
$$ packed form
5155B057l815q7L331M46l544n71L999N38m609N16M016n50l581m38M086N93m768
5172b381L9N295j273m353J058L917m82l810m23N002Q2o198J649N522k506l631
5188b493J056L211N15m830m64O923j937o203L326M137k331l146K98M558K92p018
5204d106J544P317l928m868L806K991j339l823m11O614j256p750M507N266m937
5219c73k794K549K942J41o226J178Q064m607o607O448K855l935j989J005M659
5234C310p91q130M554P319p170l836O059J147j672l982P04P810l902q122P967
5249A265M172p516j325L800K624j288o756L490Q572q045n146Q567J213n228r84
5264b585J183N636k307q611P241O114r714j257O691L91k613l970K696P335o695
$$ plain form
5279 -465 -6820 2795 4841 -3437 -2515 1092 3151 825 -5711 256 7180 -3291 -5663 4023 2758
5294 2758 -1821 -2534 -171 4831 -361 -6799 2630 5713 -4369 -3203 3193 1981 -519 -3912 331
5309 331 6219 -2407 -6250 4848 3728 -4165 -2062 1890 3032 -494 -5493 2276 6152 -4426 -4444
5324 -4444 4684 2059 -2591 -2120 1046 4613 -1871 -5620 4423 4307 -5368 -1774 3451 1789 -1322
5339 -1322 -3581 1668 5309 -3972 -4339 5154 2189 -4204 -1288 2141 2672 -1790 -4541 3682 4073 -5055
5355 -5055 -2069 4731 898 -2947 -1803 1780 3501 -3041 -4062 4897 2266 -5005 -998 3604 985
5370 985 -2412 -2540 2922 3274 -4661 -2253 4981 980 -3936 -586 2690 1853 -3216 -2358 3896 2125
5386 2125 -4685 -728 4165 561 -3140 -1253 2940 1654 -3717 -1834 4434 911 -4186 -317 3119
$$ packed form
5279d65o355R615K046q278R22L607K059k326o536N967O924j0471k372R686j265
5294B758m579p13K363N002n192o438R429L083j0082J166O396j212k500l393M243
5309C31N888q626l843J1098j120p893K103L952J142l526m999P769L876j0578j8
5324d444R128k625m650M71L166L567o484l749J0043j16r675L594N225j662l111
5339a322k259N249L641r281l67R493k965o393K916L429N31m462k751Q223L91r128
5355e055K986O800l833l845J144L583J721o542j021Q959k631p271M007M602k619
5370I85l397j28N462L52p935K408P234m001m916L350L276q37n069Q58O254j771
5386B125o810L957M893l604l701J887M193j286n371J883O268l523n097L869L436
$$ plain form
5401 3119 361 -2611 -1252 3481 1129 -3818 -523 3600 -92 -3647 -184 2959 755 -3161 -802
5416 -802 3285 271 -3436 -118 3236 -167 -3019 -93 3042 228 -3282 -59 2897 -23 -2916
5431 -2916 1 2946 -163 -2679 400 2711 -322 -2483 489 2210 -219 -2786 127 3039 -771
5446 -771 -2545 706 2084 -661 -1986 116 2420 -136 -2880 758 2558 -1167 -1438 812 1249 73
5462 73 -2110 -170 2595 -772 -2563 1651 1395 -1271 -602 212 1125 623 -2050 474 2501 -1717 -1206
5479 -1206 1472 -110 -367 -492 -365 1625 -17 -2233 1509 1401 -1825 113 522 -427 701 -900
5495 -900 -586 2232 -1281 -1410 1891 -393 -1020 1194 -786 193 1193 -1927 463 1820 -2034 182
5511 182 1463 -1646 613 427 -1419 1367 381 -1585 1661 41 -1484 1950 -549 -1186 2193 -585
$$ packed form
5401C119k758k972J359M733k352m947L295M123l692l555L463L143k204l916K359
5416h02M087l014l707L318L354l403k852K926L135k814l510L223K956k920k893
5431b916K917K945l109k516L079K311l033k161K972J721k429k567K913K912l810
5446g71j774L251J378k745j325K102K304k556k744L638J800l725k71K250M37j176
5462G3k183J940K765l367j791M214k56k666O69Q14R13n02k673K524K027m218N11
5479a206K678j582k57j25J27J990j642k216L742j08l226J938M09r49J128j601
5495i00L14K818l513j29L301k284o27K214j980R79J000l120K390J357l854K216
5511A82J281l109K259j86j846K786r86j966L246j620j525L434k499o37L379k778
$$ plain form
5527 -585 -843 2011 -1088 -464 1588 -1577 562 1911 -2166 177 1622 -1794 444 952 -1707 1422
5543 1422 287 -2140 2029 489 -2470 1473 598 -1202 1144 -1081 -390 2187 -1930 -1258 3256 -1241
5559 -1241 -1668 1360 -684 315 630 -2224 1614 1658 -3389 418 2620 -1748 -368 35 -418 2055 -1440
5576 -1440 -2248 3332 -181 -3093 1865 1011 -910 232 -1432 1243 2346 -3383 -431 3806 -1638
5591 -1638 -1858 1510 190 857 -847 -2314 3073 927 -3956 1305 2700 -1657 -1060 -81 724 1682
5607 1682 -2933 -1200 4378 -989 -3045 2218 1351 -874 -945 -1220 2419 1074 -4299 857 3936 -2284
5623 -2284 -2052 1476 1156 216 -2383 -906 3791 -574 -4239 2092 2971 -2210 -1712 705 2093 352
5639 352 -3825 502 3963 -2264 -3370 2488 2162 -1237 -2051 141 3521 -908 -4141 1909 4006 -2446
$$ packed form
5527e85k58K854l099O24K052l165K139J349m077K343J445l416K238N08k659L129
5543A422j135k427M169j540k959L943q75j800K346k225O91K577m117O72M514m497
5559a241m27L028k044R99L15k854L838M4n047L807K202m368J380M03m53K473l495
5576a440q08N580l513k912M958q54j921J142j664K675J103n729K952M237n444
5591a638k20L368j320O67j704j467N387k146m883N261J395m357N97R79Q05R58
5607A682m615J733N578n367k056N263q67k225p1k75L639j345n373N156L079o220
5623b284K32L528l20r40k599J477M697m365l665O331Q79n181M98K417J388j741
5639C52m177M327L461o227j106N858l26l399q14K192L380m429l233O050K097o452
$$ plain form
5655 -2446 -2313 1971 2181 -931 -2927 1081 3814 -1910 -3523 2832 2708 -2419 -2167 1728 2821 -1365
5671 -1365 -3639 2179 3574 -2973 -2905 2819 2261 -2516 -2558 2229 3067 -2464 -3297 3016 2884 -3208 -2561
5688 -2561 2622 2491 -2434 -2634 2779 3063 -2856 -2812 3397 2479 -3144 -2362 2988 2548 -3071 -2503 3303
5705 3303 2401 -3514 -2301 3460 2349 -3352 -2371 3616 1980 -3606 -1960 3316 2208 -3284 -2239
5720 -2239 3759 2182 -4067 -1538 4089 1159 -3344 -1473 3387 1977 -3911 -1830 4374 1341 -4167
5735 -4167 -1002 3475 1008 -3310 -1850 3641 1946 -4531 -897 4643 127 -3639 -282 3167 1417
5750 1417 -3460 -1658 4814 951 -5140 273 4107 -159 -3218 -859 3383 1616 -4282 -1137 5496
5765 5496 69 -4725 1138 2908 -391 -3025 -1201 3815 1099 -5374 564 4805 -1284 -3238 909
$$ packed form
5655b446J33M284K10l112j996M008K733n724j613O355j24n127K52L895J093m186
5671a365k274N818J395o547O8N724n58m777m2M787Q38n531q33O313j32o092O47
5688b561N183j31m925k00N413K84n919M4O209r18n623P82N350m40n619N68N806
5705C303r02n915J213N761j111n701R81N987j636n586J646N276j108n492J045
5720b239N998j577o249K529N627k930m503J871M860j410n888K081O204l033n508
5735d167L165M477k467m318J460N491j695o477L634N540m516l766L357L449j750
5750A417m877J802O472l863o091N413L834m266l059K359M242j767n898L145O633
5765E496n427m794N863J770l299k634J824N016k716o473N938M241o089j954M147
$$ plain form
5780 909 2674 665 -3602 -1125 5134 -551 -5113 2078 3355 -1553 -2156 2 3112 970 -4795
5795 -4795 241 5271 -2105 -3777 2397 2392 -843 -2346 -600 4321 149 -5251 1828 4189 -2944 -2338
5811 -2338 1600 1799 330 -3244 -56 5179 -1602 -4417 3014 2476 -2134 -1358 533 2757 270 -4363
5827 -4363 1303 4329 -3002 -2583 3130 1182 -1093 -1926 -151 3673 -1248 -4407 3050 2620 -3483 -887
5843 -887 1552 1054 -236 -3219 943 3976 -2746 -2780 3647 973 -2279 -349 351 2016 -634 -3724
5859 -3724 2395 3232 -3813 -1092 2534 16 -775 -1361 236 2981 -1496 -3060 3579 1587 -3163 63
5875 63 1103 424 -72 -2105 1257 2568 -2948 -1307 3202 -530 -1754 360 -106 1706 -708 -2634
5891 -2634 2569 1479 -3091 47 1759 -646 -482 -747 210 2239 -1674 -1606 3183 10 -1915 776
$$ packed form
5780I09J765k009m267K477O259n685m562P191J277m908o03K158L110k142n765
5795d795N036N030p376j672O174nl235j503J746M921m172n400P079K361p133O06
5811b338L938J99j469l574L188N235o781k815P431n38m610P76J891K224k487m633
5827d363N666L026p331M19N713j948k275q33J775L824m921l159P457m30o103K596
5843h87K439m98j290k983M162L033o722l4O427k674l252J930P00J665k650l090
5859c724O119Q37p045K721L626k518p91n86J597K745m477j564O639j992m750L226
5875F3J040o79m96k033L362J311n516J641M509l732j224K114m66J812k414j926
5891b634N203j090m570L138J712k405J64k65R57K029l913O8M789l173j925K691
$$ plain form
5907 776 319 366 -205 -1547 1299 1565 -2496 -224 2151 -755 -887 348 -141 898 -468 -1453 1845
5924 1845 251 -2183 894 839 -676 197 -425 -114 1182 -1450 -19 1486 -407 -817 607 -306 286
5941 286 47 -628 985 342 -1219 175 594 -743 144 268 -443 635 -133 -641 770 -24 -525 350
5959 350 141 -280 400 -192 -117 500 -12 -143 -24 -131 136 90 -436 36 519 -266 -115 520 205 -279 -306
5980 -306 225 473 -99 -703 29 660 -243 -840 384 924 -411 -787 596 408 -285 -929 27 1193 -487
5999 -487 -1069 957 894 -790 -403 277 850 -284 -1586 575 1413 -1354 -936 1145 388 -597 -683 40
6017 40 1518 -615 -1961 1414 1449 -1670 -311 1123 506 -444 -1729 801 2167 -1660 -1565 2621 756
6034 756 -1735 -320 602 1201 -618 -2400 1842 2038 -2690 -730 2162 321 -949 -895 685 1997
$$ packed form
5907G76m57M7n71j342K846K66m061K272K375k906j32J235m89J039j366r85L298
5924A845j594k434L077n5j515Q73o22L11J296k632J431J505j893m10J424r13N92
5941B86k39o75J613o43j561J394M19j337Q87J24p11J078p68n08J411p94n01Q75
5959C50k09m21O80n92P5O17n12j31J19j07K67m6n26M72M83p85J51O35l15m84k7
5980c06N31K48n72o04P32O31r03n97J224N40j335l76J383j88o93o44R56J166j680
5999d87n82K026o3j684L87O80N73j134j302K161Q38k767M18K081p57r85q6P23
6017D0J478k133j346L375L5l119J359J434o17r50j285K530J366l827R5M186j865
6034G56k491J415R22N99j819j782M242J96m728J960K892j841j270N4J580J312
$$ plain form
6050 1997 -1702 -2429 3020 1122 -3163 -129 1759 296 -690 -1890 1650 2804 -3200 -1376 3381
6065 3381 156 -2258 290 975 1426 -1153 -2590 2768 1693 -4140 -209 3032 -201 -1423 -867 1319
6081 1319 2568 -3067 -1982 4381 -137 -3630 882 1945 -112 -1460 -1940 2615 2090 -4729 -227
6096 -227 4166 -1139 -2417 433 1434 1343 -2499 -1958 4327 629 -4671 1417 3239 -1296 -1665 -618
6112 -618 2466 1916 -3805 -710 5022 -1029 -3684 1839 1981 -222 -1893 -1327 3835 725 -4873 1299
6128 1299 4292 -1993 -2274 1036 1816 948 -3387 -1205 4903 -504 -4856 2183 2630 -1437 -1716 -179
6144 -179 2915 578 -4656 801 4739 -2409 -3067 2410 1935 -901 -2385 -287 4170 -730 -4890 2372
6160 2372 3739 -2762 -2225 1544 2041 -366 -3685 669 4784 -2288 -3714 3327 2240 -2254 -1845 772
$$ packed form
6050A997l699p27N449j898m285L034J888j463r86j200L540J154o004J824M757
6065C381l225k414K548O85M51k579j437N358j075n833L931L241l233j222N56K186
6081A319J249n635J085O363m518l493M512J063k057j348m80M555n25o819M502
6096b27M393n305j278K850J001r1l842N41O285l698n300O088J822m535l69J047
6112f18L084n50n721L095N732o051k655N523J42k203j671N66N162l110n598O172
6128A299K993o285k81L310P80q68m335K182O108n407m352P039M47m067k79J537
6144a79L094k337n234N457L938p148o58N477m75k836j484K098M457m900m160P262
6160B372J367o501N37L769M97k407l319M354M115p072j426P041j087m494M09K617
$$ plain form
6176 772 2982 -1004 -4113 2376 4048 -3156 -2700 2948 1840 -1652 -2472 1103 3790 -2039 -3808 3319
6192 3319 2630 -3017 -1765 2229 2013 -1442 -2961 2191 3645 -3374 -2700 3477 1574 -2501 -1699 1822
6208 1822 2489 -2241 -3125 2755 2684 -3134 -1682 3234 1307 -2371 -2223 2324 2569 -2819 -2215 3546 1315
6225 1315 -3361 -1398 2600 1374 -2499 -2080 2959 1901 -3175 -1418 3182 1107 -2896 -1294 2634
6240 2634 1448 -2951 -1585 3399 1116 -3300 -1010 2939 838 -2887 -805 2958 1090 -2756 -939
6255 -939 2989 868 -2698 -808 2874 664 -2954 -438 2730 689 -2574 -704 2548 963 -2890
6270 -2890 -334 2900 241 -2690 -188 2295 274 -2315 -609 2845 398 -3191 168 2793 -278
6285 -278 -2197 123 1796 664 -2463 -474 2959 -418 -3156 681 2008 -523 -1665 -61 2234
$$ packed form
6176G72K210l986l109O489J672p204M56N648j108l492q20L575K687n829j769P127
6192C319o89n647J252L994k16l455j519N152J454p019O74O177j903m075Q02L521
6208A822O67m730q84N880p1n818J452M916j927l678J48M547K45n388O04N761k231
6225A315m676J963L998j226l873M19N039j058n076J757M600k075m003J602L928
6240B634j186m399J366M984k283m416K290L949k101l725K082L763j868l846J817
6255i39L928k121l566J890L682k210l618K516L168k041l263J870L252j585l853
6270b890K556L234k659k931K502K483k021k589J706L454k447l589L359K625l071
6285b78j919K320J673j132l127J989L433l377k738L837J327k531j142J604K295
$$ plain form
6300 2234 425 -3059 425 2861 -1320 -1970 983 1217 24 -1636 -449 2534 -159 -3003 1391
6315 1391 2107 -1186 -836 566 1006 314 -1974 -103 2653 -1434 -2127 1864 702 -861 -241 -422 1424
6332 1424 369 -2674 815 2221 -1733 -857 1400 100 127 -885 -576 2347 -589 -2444 1967 580
6348 580 -1606 302 -26 -39 826 -1802 19 2307 -1590 -1013 2082 -380 -475 324 -696 1045 236
6365 236 -1788 1308 1154 -2058 368 860 -905 868 -398 -757 1820 -981 -1478 1781 -366 -1062
6381 -1062 1077 -886 5 1417 -1447 158 1600 -1749 102 1263 -1419 605 786 -1425 1305
6396 1305 491 -1361 1231 303 -1421 1394 -273 -1357 1580 -320 -1093 1495 -560 -488 1482 -1377
6412 -1377 -1 1493 -1651 39 1715 -1220 48 900 -830 957 12 -1763 1649 561 -1806
$$ packed form
6300B234j809l484L484K436m181o50K953K34j193j660J187K983k693k844M394
6315A391P16l293L50J402M40o92k288J871K756m087o93L991j162j563O20j81J846
6332A424j055l043L489J406l954Q76K257j300K7j012L09K923k936j855M411j387
6348E80k186J908l28j3Q65k628J821K288l897N77L095k462r5P99j020J741q09
6365B36k024L096j54l212K426M92j765J773j266l59K577k801m97L259k147o96
6381a062K139j963Q91J412k864J605J442l349J851J161k682K024J81k211K730
6396A305q14j852K592r28j724K815j667j084K937j900p73K588k055P2J970k859
6412a377J376J494l144J690J676k935J268Q52j730J787r45j775L412j088k367
$$ plain form
6427 -1806 1040 742 -993 722 -450 -7 1468 -1201 -994 2368 -623 -1343 1177 -112 -107 103 -1269
6444 -1269 1368 1041 -2007 686 1950 -1086 -678 437 -283 783 -1042 -1247 2220 -39 -2164 998
6460 998 1293 -735 -525 -556 708 712 -2004 -42 2508 -1066 -1717 1149 872 -26 -975 -478 2110 48
6478 48 -2476 857 2091 -1104 -1307 581 1099 243 -1938 -61 2879 -931 -2299 1478 1577 -1003 -1426
6495 -1426 272 1932 -280 -2546 671 2618 -1303 -1896 1109 1821 -695 -1927 684 2630 -1154
6510 -1154 -2433 1252 2332 -1282 -2096 1465 1961 -1342 -2176 1441 2290 -1658 -2418 1713 2267 -1751
6526 -1751 -2156 1589 2228 -1826 -2261 1459 2021 -1666 -2316 1986 2208 -1784 -2167 2031 1645 -2124 -1656
6543 -1656 1795 2242 -1979 -2243 2323 2093 -2609 -1687 2256 1543 -2242 -1801 1967 1941 -2583 -2125 3029
$$ packed form
6427a806K846k98j735J715j172M43J475k669K07L362k991p20K520j289NK10j372
6444a269K637l27l048K693J264l036M08J115p20J066j825k05L467k259k125L162
6460I98K95k028K10l1J264Mk716J962K550l574o51K866k77q98r49M97K588k062
6478D8k524L333J234l195k03J888N18q56k181J877K940l810j368L777R9k580m23
6495a426J698J660k212k266L217J947l921n93L005P12k516j232K611J946l784
6510a154j279L685J080l614q14L561M96l303q34L617Q49l948p60M131N54m018
6526a751m05L745O39m054m35L720N62l687o50M302K22l992l83M198l86l769M68
6543a656L451M47m221k64M566k30m702R22L943p13l785M41L768k6m524M58N154
$$ plain form
6560 3029 1655 -2465 -1042 2298 1472 -2178 -1761 2565 2070 -3342 -1348 3187 778 -2377 -1049 2208
6576 2208 1950 -2619 -2183 3708 1595 -3822 -477 2981 585 -2109 -1125 2416 1928 -3412 -1331 3976
6592 3976 287 -3301 -176 2068 753 -2274 -1644 3609 1786 -4534 -367 3790 -544 -2533 -148
6607 -148 2283 1308 -3273 -1727 4353 163 -3939 1014 2897 -223 -2051 -960 2900 1288 -4308
6622 -4308 -138 4350 -927 -3225 1223 1923 134 -2436 -865 3966 226 -4485 1161 3659 -1738
6637 -1738 -2213 214 2112 426 -3558 -284 4358 -978 -3848 1741 2301 -888 -1522 -526 3096 308
6653 308 -4377 1269 4024 -2439 -2383 1726 1371 -273 -2474 -388 3779 -890 -4083 2685 2752 -2320
6669 -2320 -1344 837 1567 265 -3511 469 4156 -2349 -2732 2576 1217 -1316 -1407 178 2671 -397
$$ packed form
6560C029j374m120J423L340q26l650M17M326m95n412J994M535k409l155J328L257
6576B208k58m569M36N891k113n417L345L458k396k694R84L541m88n340K081N307
6592C976l689l588L125K244j315l027O30N253j823o320M167M157m334j989K385
6607a48K431r75m581J546O080m190m102M953J883l120j828J091L860j612n596
6622d308M170M488n277k298M448P00j789k570J571M831l740m711N646K498n397
6637a738m75K427J898j686l984L274M642n336k870N589N60l189o34R96L622k788
6653C08m685N646K755o463N6M109l55j644k201K086M167m669l193O768O7n072
6669b320R76K181P30j302l776L980L687o505l83N308j359k533r1J585K493l068
$$ plain form
6685 -397 -3819 2202 2910 -3265 -1399 1832 711 -529 -2208 697 3471 -1876 -3120 3149 1557
6700 1557 -2349 -534 871 1628 -421 -2928 1684 3003 -2839 -1866 2627 820 -1572 -885 715 2227
6716 2227 -1246 -2779 2472 1790 -2882 -483 1588 400 -848 -1751 1079 2360 -2581 -1957 2770 773
6732 773 -2334 -143 911 1003 -1000 -2127 1879 1733 -2568 -594 1962 34 -1168 -559 615 1540
6748 1540 -1666 -1474 2491 634 -2231 -10 1512 53 -657 -1263 1259 1346 -1988 -661 2088 -14
6764 -14 -1650 -37 604 665 -875 -1266 1601 381 -1943 174 1400 -302 -875 -346 805 691 -1303
6781 -1303 -299 1461 -30 -1314 315 1299 76 -748 -203 941 144 -1061 116 1229 35 -733
6797 -733 146 809 17 -836 -181 799 231 -767 -8 652 -206 -901 38 558 -65 -255 212 388 -82 -458
$$ packed form
6685c97l422O021P08o175J866L231j121j240j679K905K774n347j244O269j592
6700A557l906J815J405P57k049k507M612J319n842R73M493j807k392O87J600J512
6716B227l473j533N251o82m672K399K071j188j248r03K830J281m941O24M727j997
6732G73l107K191J054R2k003j127M006j46m301J974K556j928j202O09J174R25
6748A540l206J92L965j857k865K221J522j459p10o06K522Q7l334J327K749k102
6764a4j636J613O41O1j540l91K867j220k324K117J226j702n73N29J151j14j994
6781a303J004J760j491j284J629R84j223q24N45J144p97j205J177J113j194p68
6797g33Q79O63p92q53O55R80n68r98P59O60q58o95R39N20o23j90M67J76m70l76
$$ plain form
6817 -458 -61 575 4 -664 429 196 -450 71 -327 130 168 -468 -44 597 -185 -257 341 -567 164 461
6837 461 -611 -70 282 -348 233 96 -394 686 -180 -784 675 432 -428 439 -72 -231 497 -557 82
6856 82 1198 -701 -729 852 -440 -423 82 -423 949 266 -1567 1014 1205 -1268 226 926 -321 335
6874 335 -605 -80 1509 -778 -1301 1696 187 -1415 306 458 294 296 -1331 583 1761 -2132 -884
6891 -884 1829 -377 -532 -133 94 1302 -910 -1778 1863 966 -2435 227 1403 -90 -109 -1176 672
6908 672 2232 -1908 -1542 2849 -255 -1838 668 485 1008 -552 -1931 1988 1644 -2885 -248 2479
6924 2479 -802 -893 -344 482 1649 -1745 -1981 2769 383 -2986 838 1457 -403 -640 -1062 1465 1685
6941 1685 -3001 -620 3274 -597 -2150 787 831 534 -1561 -1534 3165 1088 -3669 827 2936 -1235
$$ packed form
6817d58L97O36n71o68J093k33o46N21l98M57L8o36M24O41p82p2N98r08P31K97
6837D61j072N41L52o30N81j37m90J080q66o04J459k43q60Q67n11j59P28j054O39
6856H2J116j899k8J581j292J7N05n05J372o83j833K581J91k473J494P00j247O56
6874C35r40N25J589k287n23K997j509j602J721J52j64Kj627J914J178l893J248
6891h84K713k206j55L99K27J208k212q68L641q97l401K662J176j493j9j067J848
6908F72J560m140L66M391l104j583K506j83N23j560j379L919l44m529K637K727
6924B479l281r1N49Q26J167l394k36M750k386l369L824O19j860k37m22K527K20
6941A685m686K381L894l871j553K937M4k97k095K7M699k077m757M496K109m171
$$ plain form
6957 -1235 -1351 -120 1241 1136 -2602 -833 3844 -533 -2954 1311 2010 -700 -1227 -987 2465 1027
6973 1027 -3764 399 3754 -1415 -2262 939 1308 313 -2077 -871 3517 -294 -4149 1618 2458 -1339
6989 -1339 -1470 479 2205 320 -2950 228 3778 -1722 -2940 1714 1704 -904 -1633 123 2694 -147
7005 -147 -3973 1285 3200 -2335 -2073 1671 1743 -607 -2501 531 2987 -1548 -3239 2211 2352 -2027
7021 -2027 -1651 1033 2109 -837 -3016 1466 3236 -2336 -2347 2420 1860 -1709 -1906 1168 2528 -1613
7037 -1613 -3026 2503 2412 -2480 -1893 2088 1770 -1500 -2431 1797 2789 -2266 -2411 2629 1939 -2336 -1403
7054 -1403 2067 2190 -1856 -2378 2495 2310 -2600 -1823 2572 1486 -2011 -1511 2223 1914 -2410 -2035 2629
7071 2629 1539 -2623 -1433 2554 1337 -2684 -1318 2617 1440 -2701 -1339 2601 1494 -2689 -1317
$$ packed form
6957a235j16J231J361j05l738J769M677m377k421M265O99k710n27K40L452j438
6973A027m791M163L355n169q47L201L69r95k390J206M388l811l855N767Q40l797
6989a339j31J949J726j885l270L178L550n500j218M654j0k608p29J756K571k841
7005a47l826N258J915n535K62L744P2k350j894L032K456m535j691N450J41m379
7021b027L76K684J076k946k179M482J770n572j1M767n60l569j97L074J360m141
7037a613j413N529r1m892N87L981l18l270r31M228R92n055j45N040o90m275R33
7054a403L470J23m046n22M873j85m910P77M395j086l497N00L734l09m324L75M664
7071B629j090m162J190L987j217m021J366L935j177m141J362L940j107m183J372
$$ plain form
7086 -1317 2809 975 -2972 -1134 2521 784 -2514 -1235 2516 1436 -2681 -916 3119 612 -2568
7101 -2568 -708 2496 1138 -2562 -763 2717 896 -3160 -249 2983 249 -2254 -587 2466 1030
7116 1030 -2849 -935 3318 189 -3019 290 2158 169 -1987 -756 2612 708 -3276 332 3156
7131 3156 -492 -2129 479 1825 379 -2117 -698 3001 -209 -3179 883 2297 -946 -1389 -59
7146 -59 2085 697 -2637 123 3088 -1019 -2400 1413 1512 -269 -1352 -410 2698 -50 -2872 1066
7162 1066 2524 -1591 -1488 1028 987 394 -1878 -226 3151 -733 -2803 1597 1498 -1368 -593 -192 1368
7179 1368 525 -2472 754 2519 -2052 -1459 1613 544 -443 -730 -326 2356 -192 -2660 1938 1584
7195 1584 -1928 -421 762 313 297 -1502 3 2644 -1414 -1757 2240 336 -1478 211 -330 1257
$$ packed form
7086a317M126j834l947J838L655j737l298J279L751j080m117J765M035k507l180
7101b568J860L204j358l700J799L480j821m056K911L232k734k503J667L053j436
7116A030l879J914M253l129l208L309J868j989k156J231L368j904l984L608K824
7131C156l648j637K608J346j446k496J419L699l210k970M062J414l243m43J330
7146e9K144j388l334K760K965m107j381L813R9j781j083R42L108k748k822L938
7162A066J458m115J03K516m1n93k272J652L377l884k070M400r9k866P75M01J560
7179A368q43k997L226J765m571N93L072j069r87k87M04K682k548k468M598l54
7195A584l512J507J183m49j6j799J505K641m058l43L997j904j814J689n41J587
$$ plain form
7211 1257 104 -2058 1251 1835 -2079 -301 1435 -380 -152 -573 -361 1698 -659 -1903 1843 66
7227 66 -1754 654 -60 -160 709 -1174 -15 1862 -1688 -722 1962 -564 -485 495 -713 930 109
7244 109 -1707 934 845 -1753 300 898 -1042 694 -314 -708 1403 -400 -953 1487 -532 -713 953
7261 953 -404 -124 943 -822 -315 1029 -826 58 768 -1225 175 768 -1027 635 283 -1021 773
7278 773 180 -716 766 -156 -773 910 -382 -937 805 -292 -389 668 -445 497 891 -881 -9 1314
7296 1314 -674 -533 438 -259 449 -76 -843 1266 303 -1361 542 983 -594 -438 -79 432 547 -1047
7314 -1047 -248 1574 -694 -1133 700 507 -432 -539 -142 942 -142 -1459 541 1423 -490 -1007 637
7331 637 747 -180 -924 60 1393 -453 -1351 876 1251 -714 -1030 613 1271 -466 -1585 573 1402
$$ packed form
7211A257j153k162L309N84l914J778J736j815K28m21K12K059k357j244L746j777
7227F6j820K408p14j00Q69j883J159J877l550R66K684k526P9R80j208J643q21
7244A09j816K641q9k598K053N98j940J736j008l94K111j803n53K440k019j81J666
7261I53j357K80J067j765N07J344j855Q84P10j993J400N93j795J662l52j304J794
7278G73n93q96J482r22o17J683j292n55J742j097r7J057j113R42L94j772Q72J323
7296A314j988J41R71o97P08n25p67K109r63j664J903M41j577J56L59N11J15j594
7314a047P99J822k268m39J833j93r39j07L97J084j084j317K000Q82j913n17J644
7331F37J10r27p44R84J333j846q98K227L75j965l16J643O58j737j119K158Q29
$$ plain form
7348 1402 -702 -1483 738 1454 -704 -1548 758 1268 -978 -1622 1129 1550 -793 -1579 1161 1558 -1044
7365 -1044 -1245 898 1501 -1205 -1528 821 1737 -1020 -1680 1562 1611 -1706 -1290 1253 1424 -1136 -1488
7382 -1488 1296 1835 -1761 -1785 2194 1086 -1733 -821 1455 1570 -1128 -2140 1766 2010 -2321 -1038
7398 -1038 2248 972 -1533 -988 1363 1710 -1958 -1956 2877 1347 -2449 -447 1670 938 -1270 -1753 1820
7415 1820 1995 -2946 -1244 2902 294 -2115 -12 1661 1349 -1721 -1884 2845 1423 -3230 -306 2686
7431 2686 302 -1803 -802 1833 2048 -2832 -1609 3682 403 -3258 314 2021 486 -1681 -1545
7446 -1545 2731 1633 -3653 -355 3733 -404 -2418 199 1683 969 -2251 -1260 3815 506 -4062
7461 -4062 776 2780 -673 -1669 -387 2135 1291 -3507 -291 4378 -732 -3231 949 1878 -162 -1865
$$ packed form
7348A402k104p81K221P16k158q44K306N10k246o44K751M21k343p86K740L97k602
7365a044k01K143O03k706l23K349R16k757o60L242M9l317M16K543J71k560l52
7382a488K784N39l596k4L979j108k819R12K276J15k698j012L906K44m331J283
7398a038L286j276k505N45K351L47l668KM833j530l796K002K117p32k208m83L573
7415A820J75m941J702M146k608k409K103J673l12l070j63M729j422m653K924K992
7431B686k384k105J001K635K15m880J223N291l279l661L572J707j535k167J36
7446a545M276j098n286L298M088m137k014K617J484p14l220R91N075l309m568
7461d062M838K004l453r96J282K522q44m798L216M669n110k499M180R29k040j703
$$ plain form
7477 -1865 -970 3257 470 -3938 831 3611 -1586 -2281 714 1674 387 -2935 -405 4091 -853 -3724
7493 -3724 1725 2314 -1181 -1739 150 2236 431 -3881 539 3961 -2202 -2652 1895 1200 -831 -1992
7509 -1992 -116 3468 -496 -3903 1688 2781 -2458 -1647 1110 1697 19 -2868 546 3901 -1812
7524 -1812 -3147 2727 1750 -1674 -1297 371 2150 -961 -3655 1610 2952 -2558 -1941 2228 1159 -903
7540 -903 -1944 628 3169 -1363 -2939 2444 2029 -2588 -941 1463 1274 -952 -2625 1280 2909 -2538
7556 -2538 -2095 2704 1060 -1696 -1257 1004 1921 -1283 -2577 2425 2021 -2516 -1025 2017 932 -1234
7572 -1234 -1511 1376 2194 -2009 -1893 2656 1039 -2313 -485 1548 803 -1222 -1511 2158 1745 -2534
7588 -2534 -921 2230 435 -1781 -821 1574 1256 -1801 -1263 2392 981 -2420 -405 1903 212 -1437
$$ packed form
7477a865Q95M227k787m408M769K780n197o95K995R60j287l322K530M496m944k871
7493c724N449N89l495n58J889K086j805m312M420L422o163m50M547o95k031j161
7509a992J876L584l964l407N591J093n239Q11K757N87j678k887L414L355n713
7524a812j335N874r77l424L77J668J779l111k694N265J342n510O17M169j069k062
7540i03j041K572K541m532j576N383m15m617J647K404j89k226j673L905J629n447
7556b538M43M799j644k756M39K261R17l204j294N002m04m537J491L042j085k166
7572a234k77K887Q18m203J16M549j617l352J828K033p45k025k89L669m13m279
7588b534J613L151j795k216R60K395l18l057N38L655j411l401K015K308j691j649
$$ plain form
7604 -1437 -822 1545 983 -2012 -545 2017 430 -1908 -277 1627 454 -1454 -526 1766 741 -2029
7620 -2029 -212 1592 196 -1621 -268 1446 336 -1540 -560 1576 238 -1527 -113 1638 -85
7635 -85 -1375 4 1589 -119 -1382 -158 1195 352 -1453 35 1458 -171 -1219 236 1176 -83
7651 -83 -973 16 997 203 -1233 12 1274 -540 -994 407 306 131 -731 -275 1098 31 -1044 493
7669 493 860 -648 -219 -143 480 459 -775 -116 1351 -555 -620 775 -136 -242 66 -94 466 482 -912
7688 -912 324 796 -870 107 671 -373 500 -139 -507 848 30 -835 866 -84 -711 756 -495 -351
7706 -351 960 -817 -353 840 -662 -70 924 -940 -139 623 -1033 351 603 -1069 366 284 -704
7723 -704 1141 -31 -1263 1348 206 -1152 978 -233 -559 679 -728 19 1295 -1373 -475 1807
$$ packed form
7604a437O15K367n62k995J467K562j587k338J631J904j173j908R28K292j025k770
7620b029J817J804j396j817J353J714j110j876R80K136j338j765J414J751j723
7635h5j290J379J585j708j263J224J353q43j805J488J423j629j048J455R40j259
7651h3q90R89R81p94j436J245J262j814m54J401j01j75q62M56J373j067j075J537
7669D93L67j508M29P6O23k1j234O59J467j906o5J395r11j06L08j60N60J6j394
7688i12J236M72j666R77N64j044Q73o39l68J355q18q65J701r50o27J467j251J44
7706c51J311j777M64J193j502N92R94j864Q01P62j656J384K52j672J435q2r88
7723g04J845j172j232K611j142j358K130j211l26J238j407P47J276k668Q98K282
$$ plain form
7739 1807 -402 -564 565 -711 901 83 -1480 1353 1203 -1868 -11 1326 -793 250 -162 -115
7755 -115 1671 -1095 -1171 2260 19 -2087 646 60 -39 183 -1471 1079 1495 -2438 -490 2264 -756
7772 -756 -1049 138 125 843 -783 -1681 2064 898 -2498 490 1532 -1010 -451 -571 888 1583 -2061
7789 -2061 -785 2940 -529 -2077 806 899 194 -665 -935 1831 1037 -2780 263 2600 -996 -1229 744
7806 744 702 903 -1724 -908 2608 -291 -3013 1031 1779 -828 -1069 -397 1555 991 -2884 -64 3216
7823 3216 -998 -2475 849 1406 -199 -1445 -445 2435 13 -3192 874 2700 -1463 -1407 660 1546
7839 1546 -50 -2614 98 3169 -1175 -2852 1326 1831 -1325 -1453 365 1958 -498 -2773 1062
7854 1062 2766 -1570 -2219 1624 1614 -938 -2042 758 2649 -975 -2834 1632 2272 -1792 -1554 1118
$$ packed form
7739A807k209j62J129j276J612q18j563K833j50l071J857J337k119J043m12M7
7755a15J786k766p6L431k241k106K733n86r9K22j654K550M16l933J948K754l020
7772g56k93J187j3P18j626q98L745j166l396K988J042k542N59j20J459O95l644
7789b061J276L725l469j548K883R3p05q59k70K766p94l817L043K337l596k33J973
7806G44m2K01k627Q16L516k899k722M044P48k607k41O72J952n64l875K820L280
7823C216m214j477L324N57j605j246J000K880k422l205M066J826m163N6K067Q86
7839A546j596k564K712L071m344j677M178N05l156j28J818J593k456k275L835
7854A062J704m336o49L843j0k552j104K800J891l624j859M466O40m064K38K672
$$ plain form
7870 1118 2116 -1057 -2408 1399 2801 -1785 -2349 1861 1793 -1623 -1996 1463 2306 -1603 -2371 1728 2332
7887 2332 -1921 -1924 1843 1790 -1849 -2330 1867 2081 -1921 -1988 2239 1967 -2345 -1682 2103 1925 -2101 -1747
7905 -1747 2133 1729 -2189 -1801 2164 1913 -2039 -1588 2275 1632 -2442 -1524 2422 1472 -2255 -1716 2352
7922 2352 1662 -2573 -1479 2621 1044 -2238 -1231 2283 1503 -2499 -1601 2595 1187 -3010 -677 2885
7938 2885 652 -2178 -1152 2364 1580 -2972 -1346 3176 369 -2849 -458 2163 610 -2540 -1234
7953 -1234 2739 1008 -3474 -200 3037 -238 -2295 -423 1962 1306 -2658 -929 3497 307 -3108
7968 -3108 584 2212 -62 -1747 -639 2338 1095 -3540 -187 3494 -865 -2516 831 1700 316
7983 316 -2032 -869 2906 356 -3438 824 2821 -1189 -1860 124 1862 601 -2676 -58 3252
$$ packed form
7870A118R98l173j351L807J402m586n64M210o8l416l73L459Q43l909p68M099O04
7887B332m253lL767n3l639m81M197K14m002o7M227k72m312O63L785j78m026L54
7905a747L880m04l918L88L965k51l952M51L863o43m074R18L946r50l727N39M068
7922B352o90m235J094M100j577l282J007L514p80m002Q98M196j408m197K333L562
7938B885k233k830J026L516p84m552J626M522k807l218K391K621j553l150J306
7953a234L973j731m482L274L237l275k057J872K385o56l964J729M426l190l415
7968c108L692J628k274j685J108K977j243m635L353L681m359j651L347Q69j384
7983C16k348J163L775k550l794M262J997m010o71J984J738j261l277K618L310
$$ plain form
7998 3252 -1049 -2900 1297 1833 -775 -1429 -285 2353 414 -3391 578 3108 -1406 -1777 1203 1203
8014 1203 87 -1639 -506 2991 -652 -3218 1716 1970 -1746 -674 613 1211 502 -2546 309 2952
8030 2952 -1931 -2050 1984 815 -870 -1296 130 1945 -263 -3057 1603 2495 -2417 -946 1534 691
8046 691 -143 -1308 -210 2489 -1300 -2347 1845 924 -1678 4 198 879 352 -2279 923 2109
8062 2109 -1829 -1170 1799 200 -558 -308 -87 1798 -561 -2205 1704 1302 -1911 76 1060 0
8078 0 -151 -1193 244 1961 -1392 -1403 2091 -93 -1274 95 290 537 77 -1417 1072 1083 -1808 -197
8096 -197 1342 -411 -308 -158 -323 1206 -605 -1163 1574 130 -1316 242 245 -290 320 -717 113 1087
8114 1087 -1030 -570 1108 -371 -528 303 -182 120 -205 -1013 811 469 -1299 497 655 -423 338
$$ packed form
7998C252m301j851M197N36k608o54J144K638j939l805L969K530m514l71K980%
8014A203j116j726J133L497l643k566M934K54l716J072J287N98p09l048K855K643
8030B952m883j19M034j169j685m26J426J815k208k794M660Q92m912J471K480q43
8046F91q34j165J098K699l789j047M192r21k602J682J94O81n27k631L202J186
8062B109l938O59K969j599p58K50K21J885k359j644L909m02l213J987R84j060
8078@j51j042J437J717l353j1L494k184j181J369J95K47m60j494K489J1k891J611
8096a97J539j753J03J50j65J529j811n58K737j444j446J558Ln35O10j037Q30R74
8114A087k117M60J678j479j57Q31m85L02l25q08J824l42j768J796J58j078P61
$$ plain form
8131 338 -66 -173 655 -184 -495 768 -14 -555 435 -172 7 276 -390 -187 549 -306 -11 103 -666 64
8151 64 437 -483 342 507 -125 47 -40 59 268 -62 -394 708 -79 -625 511 506 -437 -577 225 545 -26
8172 -26 -693 237 738 -145 -524 -5 657 -482 -743 352 783 91 -532 294 742 -145 -977 388 861
$$ packed form
8131C38m04j07Q28q39l11J263p82n41R90o07J79K69o66K03P36q55K95J14p69P30
8151F4L73r20Q25J65o32J72q7R9K09l30l32J102p87n46J136nr43j40Q02L20n71
8172b6o67R30N01q83l79N19O62j139k61J095M31o92o23Q26M48q87q32J365M73
8191H61
$$ Imaginary data points
##PAGE= N=2
##DATA TABLE= (X++(I..I)), XYDATA
$$ plain form
0 0 0 0 0 8 -9 16 -16 24 -32 40 -48 64 -81 97 -113 138 -171 203 -237 282 -332 384 -442 513 -595 680
26 680 -771 877 -999 1128 -1268 1428 -1603 1792 -1997 2226 -2480 2755 -3054 3386 -3752 4153
42 4153 -4596 5088 -5641 6254 -6941 7727 -8631 9676 -10900 12369 -14163 16403 -19301
55 -19301 23218 -28826 37551 -53079 88976 -332646 143803 664558 -355859 -253773 57094
66 57094 243018 149070 -413899 -124215 595252 -177380 -461638 312879 228790 -183739 -162132
77 -162132 -59645 408258 64931 -654938 144681 651150 -334482 -415256 266271 243107
87 243107 -42797 -289255 -75278 458330 -62242 -484233 270073 302764 -292592 -121850
97 -121850 115705 179934 17645 -416956 65568 564201 -280968 -468645 366892 269970
$$ packed form
0@%%%Qj7K5l2M0n6P2q8J12j45J78k10K51l09L74m40N19o14P16q26R55j108J275
26F80j451J648j876K127k396K696l031L395l789M223m706N235n809O440p138P905
42D153q749R684j0729J1895j3195J4668j6358J8307k0576K3269k6532L0566l5704
55a9301M2519n2044O6377r0630J42055m21622M76449N20755j020417J02086L10867
66E7094J85924r3948n62969K89684P19467p72632k84258P74517q4089m12529K1607
77a62132J02487M67903l43327p19869P99619N06469r85632q0774O81527k3164
87B43107k85904k46458K13977N33608n20572m21991P54306L2691n95356J70742
97a21850K37555O4229j62289m34601M82524M98633q45169j87677Q35537r6922
$$ plain form
107 269970 -215680 -212794 27458 345001 -40193 -448478 216367 348488 -318149 -145998
$$ packed form
107B69970m85650K886K40252L17543l85194m08285O64845J32121o66637J72151
$$ [...]
8191c02
##END NTUPLES=NMR FID
##END=
