##TITLE=1H_AP-17MHK2_HCl
 D2O
 8 sc, 
 2.11.2023
##JCAMPDX= 6.0         $$ Bruker NMR JCAMP-DX V2.0
##DATA TYPE= NMR FID
##DATA CLASS= NTUPLES
##ORIGIN= UXNMR, Bruker Analytische Messtechnik GmbH
##OWNER= root
$$ XWIN-NMR		Version 3.5
$$ Thu Nov  2 14:00:03 2023 Russian Standard Time (UT+4h)  she@DPX200
##.OBSERVE FREQUENCY= 200.13135
##.OBSERVE NUCLEUS= ^1H
##.DELAY= (6, 6)
##.ACQUISITION MODE= SIMULTANEOUS
##.ACQUISITION SCHEME= undefined
##.AVERAGES= 8
##.DIGITISER RES= 18
##SPECTROMETER/DATA SYSTEM= spect
##.PULSE SEQUENCE= zg30
##.SOLVENT NAME= CDCl3
##.SHIFT REFERENCE= (INTERNAL, CDCl3, 0, 15.7039)
##AUDIT TRAIL= $$ (NUMBER, WHEN, WHO, WHERE, WHAT)
$$ ##TITLE= Audit trail, XWIN-NMR		Version 3.5
$$ ##JCAMPDX= 5.01
$$ ##ORIGIN= Bruker BioSpin GmbH
$$ ##OWNER= she
$$ F:/spectra/data/she/nmr/H-F/1/audita.txt
$$ ##AUDIT TRAIL=  $$ (NUMBER, WHEN, WHO, WHERE, WHAT)
(   1,<2023-11-02 13:58:43.73 +0400>,<she>,<DPX200>,
      <created by zg, POWCHK disabled, PULCHK disabled
       configuration hash MD5:
       00 E9 B6 7A A2 85 ED C7 34 08 36 98 17 FE 4E 26
       data hash MD5: 16K
       94 4E 2B D0 5A 23 85 7A F8 CE 8B A1 57 9B E8 26>)
$$ ##END=
$$ 
$$ hash MD5
$$ 8D 08 F0 E8 D9 4E 6D 78 A5 B6 B7 EE FD 6B 9F 24
##$RELAX= 
##$RELAX= 
##$RELAX= 
##$RELAX= 
##$RELAX= 
##$RELAX= 
$$ Bruker specific parameters
$$ --------------------------
##$DU= <F:/spectra>
##$EXPNO= 1
##$NAME= <H-F>
##$PROCNO= 1
##$TYPE= <nmr>
##$USER= <she>
##$AMP= (0..31)
100 100 100 100 100 100 100 100 100 100 100 100 100 100 100 100 100 100 
100 100 100 100 100 100 100 100 100 100 100 100 100 100 
##$AQSEQ= 0
##$AQ_mod= 1
##$AUNM= <au_zg>
##$AUTOPOS= <>
##$BF1= 200.13
##$BF2= 200.13
##$BF3= 200.13
##$BF4= 200.13
##$BF5= 200.13
##$BF6= 200.13
##$BF7= 200.13
##$BF8= 200.13
##$BYTORDA= 1
##$CFDGTYP= 0
##$CFRGTYP= 5
##$CHEMSTR= <none>
##$CNST= (0..31)
1 1 145 1 1 1 1 1 1 1 1 1 1 1 1 1 1 1 1 1 1 1 1 1 1 1 1 1 1 1 1 1 
##$CPDPRG= <>
##$CPDPRG1= <>
##$CPDPRG2= <>
##$CPDPRG3= <>
##$CPDPRG4= <mlev>
##$CPDPRG5= <mlev>
##$CPDPRG6= <mlev>
##$CPDPRG7= <mlev>
##$CPDPRG8= <mlev>
##$CPDPRGB= <>
##$CPDPRGT= <>
##$D= (0..31)
0 1.2 0 0 0 0 0 0 0 0.06 0 0.03 0 0 0 0 0.0002 0 0 0 0 0 0 0 0 0 0 0 0 
0 0 0 
##$DATE= 1698919123
##$DBL= (0..7)
120 120 120 120 120 120 120 120 
##$DBP= (0..7)
150 150 150 150 150 150 150 150 
##$DBP07= 0
##$DBPNAM0= <>
##$DBPNAM1= <>
##$DBPNAM2= <>
##$DBPNAM3= <>
##$DBPNAM4= <>
##$DBPNAM5= <>
##$DBPNAM6= <>
##$DBPNAM7= <>
##$DBPOAL= (0..7)
0.5 0.5 0.5 0.5 0.5 0.5 0.5 0.5 
##$DBPOFFS= (0..7)
0 0 0 0 0 0 0 0 
##$DE= 6
##$DECBNUC= <off>
##$DECIM= 32
##$DECNUC= <off>
##$DECSTAT= 4
##$DIGMOD= 1
##$DIGTYP= 9
##$DL= (0..7)
0 120 120 120 120 120 120 120 
##$DP= (0..7)
150 150 150 150 150 150 150 150 
##$DP07= 0
##$DPNAME0= <>
##$DPNAME1= <>
##$DPNAME2= <>
##$DPNAME3= <>
##$DPNAME4= <>
##$DPNAME5= <>
##$DPNAME6= <>
##$DPNAME7= <>
##$DPOAL= (0..7)
0.5 0.5 0.5 0.5 0.5 0.5 0.5 0.5 
##$DPOFFS= (0..7)
0 0 0 0 0 0 0 0 
##$DQDMODE= 0
##$DR= 18
##$DS= 0
##$DSLIST= <SSSSSSSSSSSSSSS>
$$ [...]
##$SUBNAM2= <"">
##$SUBNAM3= <"">
##$SUBNAM4= <"">
##$SUBNAM5= <"">
##$SUBNAM6= <"">
##$SUBNAM7= <"">
##$SUBNAM8= <"">
##$SUBNAM9= <"">
##$SW= 18.05172834244
##$SWIBOX= (0..15)
0 0 2 0 0 0 0 0 0 0 0 0 0 0 0 0 
##$SW_h= 3612.71676300578
##$TD= 16384
##$TD0= 1
##$TE= 0
##$TE2= 300
##$TE3= 300
##$TEG= 300
##$TL= (0..7)
0 120 120 120 120 120 120 120 
##$TP= (0..7)
150 150 150 150 150 150 150 150 
##$TP07= 0
##$TPNAME0= <>
##$TPNAME1= <>
##$TPNAME2= <>
##$TPNAME3= <>
##$TPNAME4= <>
##$TPNAME5= <>
##$TPNAME6= <>
##$TPNAME7= <>
##$TPOAL= (0..7)
0.5 0.5 0.5 0.5 0.5 0.5 0.5 0.5 
##$TPOFFS= (0..7)
0 0 0 0 0 0 0 0 
##$TUNHIN= 0
##$TUNHOUT= 0
##$TUNXOUT= 0
##$USERA1= <user>
##$USERA2= <user>
##$USERA3= <user>
##$USERA4= <user>
##$USERA5= <user>
##$V9= 5
##$VALIST= <valist>
##$VCLIST= <CCCCCCCCCCCCCCC>
##$VD= 0
##$VDLIST= <DDDDDDDDDDDDDDD>
##$VPLIST= <PPPPPPPPPPPPPPP>
##$VTLIST= <TTTTTTTTTTTTTTT>
##$WBST= 1024
##$WBSW= 4
##$XGAIN= (0..3)
0 0 0 0 
##$XL= 0
##$YL= 0
##$YMAX_a= 439925
##$YMIN_a= -432215
##$ZGOPTNS= <>
##$ZL1= 120
##$ZL2= 120
##$ZL3= 120
##$ZL4= 120
##$ABSF1= 10
##$ABSF2= 0
##$ABSG= 5
##$ABSL= 3
##$ALPHA= 0
##$AQORDER= 0
##$ASSFAC= 0
##$ASSFACI= 0
##$ASSFACX= 0
##$ASSWID= 0
##$AUNMP= <proc_1d>
##$AZFE= 0.1
##$AZFW= 0.1
##$BCFW= 1
##$BC_mod= 2
##$BYTORDP= 1
##$COROFFS= 0
##$CY= 11.3945322036743
##$DATMOD= 1
##$DC= 2
##$DFILT= <>
##$DTYPP= 0
##$F1P= 15.7292609196834
##$F2P= 12.9074282941183
##$FCOR= 0.5
##$FTSIZE= 0
##$FT_mod= 4
##$GAMMA= 1
##$GB= 0.15
##$INTBC= 1
##$INTSCL= 1
##$ISEN= 128
##$LB= 0.24
##$LEV0= 0
##$LPBIN= 0
##$MAXI= 10000
##$MC2= 0
##$MEAN= 0
##$ME_mod= 0
##$MI= 1.114404
##$NCOEF= 0
##$NC_proc= 0
##$NLEV= 6
##$NOISF1= 3.799351
##$NOISF2= 2.8
##$NSP= 1
##$NTH_PI= 0
##$NZP= 0
##$OFFSET= 15.70392
##$PC= 1
##$PHC0= -23878.89
##$PHC1= 7.852705
##$PH_mod= 1
##$PKNL= yes
##$PPARMOD= 0
##$PSCAL= 0
##$PSIGN= 0
##$REVERSE= no
##$SF= 200.130013532006
##$SI= 16384
##$SIGF1= 3
##$SIGF2= 2
##$SINO= 400
##$SIOLD= 16384
##$SREGLST= <1H.CDCl3>
##$SSB= 0
##$STSI= 0
##$STSR= 0
##$SW_p= 3612.71676300578
##$SYMM= 0
##$S_DEV= 0
##$TDeff= 0
##$TDoff= 0
##$TI= <>
##$TILT= no
##$TM1= 0
##$TM2= 0
##$TOPLEV= 0
##$USERP1= <user>
##$USERP2= <user>
##$USERP3= <user>
##$USERP4= <user>
##$USERP5= <user>
##$WDW= 1
##$XDIM= 8192
##$YMAX_p= 0
##$YMIN_p= 0
$$ End of Bruker specific parameters
$$ ---------------------------------
##NTUPLES= NMR FID
##VAR_NAME=  TIME,          FID/REAL,        FID/IMAG
##SYMBOL=    X,             R,               I
##VAR_TYPE=  INDEPENDENT,   DEPENDENT,       DEPENDENT
##VAR_FORM=  AFFN,          ASDF,            ASDF
##VAR_DIM=   8192,          8192,            8192
##UNITS=     SECONDS,       ARBITRARY UNITS, ARBITRARY UNITS
##FACTOR=    0.0002768,     1,               1
##FIRST=     0,             0,               0
##LAST=      2.2672688,     0,               0
##MIN=       0,             -432215,         0
##MAX=       2.2672688,     439925,          0
$$ Real data points
##PAGE= N=1
##DATA TABLE= (X++(R..R)), XYDATA
$$ [...]
$$ plain form
1898 1136 1815 1677 1033 -525 -1728 -1759 -1186 -25 1054 1615 1371 540 -595 -1331 -1560 -1285 -45 717
1916 717 1397 1273 601 -386 -1418 -1603 -1210 -229 1030 1640 1709 736 -216 -1182 -1945 -1105 -96 632 1429
1935 1429 1174 607 -255 -1263 -1270 -1174 -417 503 1295 1343 805 -83 -793 -1478 -1461 -572 700 1404 1485 1105 -86
1956 -86 -1165 -1570 -1235 -375 638 1538 1391 774 18 -846 -1343 -1410 -607 483 1263 1273 782 188 -979 -1163
1976 -1163 -1442 -519 371 1397 1681 1170 65 -596 -1323 -1429 -583 259 901 1293 824 175 -704 -1055 -1305
1995 -1305 -548 384 1416 1431 1283 500 -596 -1214 -1221 -728 424 861 1299 1092 253 -683 -991 -1220 -671 -92
2015 -92 783 1267 826 543 -612 -1075 -1482 -910 -40 868 966 1235 668 -628 -1167 -1206 -905 88 905 1350
2035 1350 936 650 -306 -1080 -1156 -701 70 563 1222 1149 627 -9 -902 -1135 -824 -265 693 1268 875 633
$$ packed form
1898A136O79j38o44j558j203l1N73J161J079N61k44q31j135p36k29K75J240P62
1916G17O80j24o72r87j032j85L93R81J259O10O9r73r52r66p63Q40J009P28P97
1935A429k55n67q62j008pR6P57R20P92M8n38q88p10o85J7Q89J272P04Q1l80j191
1956h6j079m05L35Q60J013R00j47o17p56q64m97o7Q03J090P80J0m91n94j167j84
1976a163k79R23Q90J026K84n11j105o61p27j06Q46Q42O42L92m69o49q79l51k50
1995a305P57R32J032J5j48p83j096o18pM93J152M37M38k07q39r36l08k29N49N79
2015i2Q75M84m41k83j155m63m07N72Q70R08R8K69n67j296n39l9L01R93Q17M45
2035A350m14k86r56p74p6M55P71M93O59p3n22o36q93k33L11N59R58N75l93k42
$$ plain form
2055 633 -77 -947 -1233 -1016 -194 442 1151 1281 782 46 -598 -1010 -946 -202 414 1172 1025 931 -147 -749
2075 -749 -980 -1004 -328 465 964 1110 562 -268 -531 -873 -865 -200 224 752 752 895 257 -723 -1043 -990 -748 240
2097 240 962 1062 622 138 -573 -1301 -915 -275 90 1068 1062 649 59 -973 -907 -708 -566 280 761 958 484
2118 484 -30 -432 -1081 -1077 -475 267 622 1044 872 507 -476 -1229 -1018 -437 106 766 1244 728 -174 -363 -822
2139 -822 -1158 -532 288 264 914 961 217 -421 -895 -974 -603 41 548 1214 544 109 -417 -636 -1032 -393 40
2160 40 579 818 793 477 -341 -775 -935 -868 -237 707 1048 657 165 43 -168 -967 -610 -184 570 279 802
2181 802 246 -199 -569 -883 -744 -160 540 799 591 458 -39 -593 -731 -835 -389 332 633 551 741 -354
2201 -354 -675 -1159 -544 -344 474 831 749 679 -86 -519 -709 -691 -429 308 1085 741 569 -100 -357 -799 -789
$$ packed form
2055F33p10q70k86K17Q22O36P09J30m99p36o44m12O4P44O16P58j47r4j078o02
2075g49k31k4O76P93M99J46n48q30k63l42QO65M24N28%J43o38r80l20N3K42R88
2097B40P22J00m40m84p11p28L86O40L65R78om13n90j032O6J99J42Q46M81J97m74
2118D84n14m02o49MO02P42L55M22j72l65r83p53K11N81N43O60M78n16r02j89m59
2139h22l36O26Q20k4O50M7p44o38m74p9L71O44N07O66o70m35n26k19l96O39M33
2160D0N39K39k5l16q18m34j60O7O31R44L41l91m92j22k11p99L57M26P54k91N23
2181H02n56m45l70l14J39N84P00K59k08j33m97n54j38j04M46P21L01q2J90j095
2201c54l21m84O15K00Q18L57q2p0p65m33j90J8K62P37P77l44j72o69k57m42J0
$$ plain form
2222 -789 -269 221 638 993 552 9 -555 -912 -640 -159 245 701 685 191 179 -445 -703 -797 -198 -58 743
2243 743 635 565 -167 -283 -333 -892 -329 108 690 660 658 155 -187 -867 -906 -394 163 550 671 798 172 -342
2265 -342 -432 -627 -357 80 712 841 407 215 -476 -967 -676 -325 108 594 570 318 242 -285 -804 -695 -546
2286 -546 -123 659 667 473 332 -265 -469 -691 -489 -173 241 763 491 353 -187 -375 -856 -420 -90 367 533
2307 533 550 264 31 -404 -581 -381 -55 395 481 668 346 -213 -434 -602 -332 -152 254 770 498 156 217
2328 217 -699 -649 -328 -94 139 620 416 314 164 -78 -346 -235 -66 330 691 674 371 105 -266 -628 -646
2349 -646 -302 319 523 660 289 -91 -498 -499 -371 -102 192 709 373 388 173 -272 -461 -384 -175 -172 442 445 454
2372 454 196 -339 -472 -267 -220 95 691 716 185 53 -277 -572 -476 -187 26 325 542 524 339 -526 -624 -202
$$ packed form
2222g89N20M90M17L55m41n43n64l57K72M81M04M56j6m94j2o24k58r4N99J40Q01
2243G43j08p0p32j16n0n59N63M37N82l0kn03l42o80l9N12N57L87J21J27o26n14
2265c42r0j95K70M37O32J29m34j92o91m91K91L51M33M86k4k52p6n27n19J09J49
2286e46M23P82Qj94j41n97k04k22K02L16M14N22k72j38n40j88m81M36L30M57J66
2307E33J7k86k33m35j77K00L26M50Q6J87l22n59k21j68K70J80M06N16k72l42O1
2328B17r16N0L21K34K33M81k04j02j50k42k68J11J69L96L61j7l03k66l71l62j8
2349f46L44O21K04J37l71l80m07jJ28K69K94N17l36J5k15m45j89P7K09LO14LR
2372D54k58n35j33K05M7L15N96K5n31j32l30k95R6K89K13K99K17j8j85q65r8M22
$$ plain form
2394 -202 -330 -146 571 591 362 20 -180 -549 -649 -259 55 406 448 408 207 -254 -532 -288 -127 -31 308
2415 308 824 572 184 -27 -215 -597 -337 93 485 424 320 -26 -327 -523 -637 -265 147 386 215 491
2435 491 156 -59 -206 -439 -303 -113 281 446 497 -1 -67 -272 -660 -134 -41 513 413 304 236 -36 -502
2456 -502 -484 -247 97 112 550 346 213 -187 -178 -506 -447 -41 29 326 361 267 0 -57 -436 -507 135 252 571
2479 571 281 313 182 -410 -315 -380 84 22 184 325 232 -56 -401 -390 -474 -183 -80 441 149 358 -164 -266
2501 -266 -531 -358 -326 147 366 482 206 -60 -69 -395 -501 -184 249 142 589 220 106 -90 -484 -409 -75
2522 -75 117 480 344 208 -109 -30 -375 -569 -148 119 509 208 385 167 -6 -356 -537 -287 -24 245 603
2543 603 538 29 -247 -120 -295 163 -51 -192 502 447 316 25 -387 -301 -371 74 218 384 213 295 -133 -111
$$ packed form
2394b02j28J84P17K0k29l42k00l69j00L90L14L51M2m0k01m61k78K44J61R6L39
2415C08N16k52l88k11j88l82K60M30L92o1j04l46l01j96j14L72M12K39j71K76
2435D91l35k15j47k33J36J90L94J65N1m98o6k05l88N26R3N54j00j09o8k72m66
2456e02J8K37L44J5M38k04j33m00Rl28N9M06P0K97L5r4k67n7l79p1O42J17L19
2479E71k90L2j31n92R5o5M64o2J62J41r3k88l45J1q4K91J03N21k92K09n22j02
2501b66k65J73L2M73K19J16k76k66rl26j06L17M33j07M47l69j14j96l94P5L34
2522g5J92L63j36j36l17P9l45j94M21K67L90l01J77k18j73l50j81K50K63K69L58
2543F03o5n09k76J27j75M58k14j41O94n5j31k91m12Q6p0M45J44J66j71Q2m28K2
$$ plain form
2565 -111 -391 -261 -120 15 303 355 163 -260 -220 -370 -319 -145 60 423 180 436 229 -30 -346 -276 18
2586 18 49 510 461 493 -424 -327 -381 -196 -235 207 264 304 197 -90 -36 -202 -733 -51 -6 307 413 223 -98 -308
2610 -308 -204 -132 47 207 136 92 207 164 64 -311 -316 117 119 116 249 507 223 -330 -447 -296 -88 83 23 283
2634 283 84 -209 -135 -434 -296 -66 15 333 536 267 27 -373 -389 -26 -137 -115 137 318 528 -83 -45 -241
2656 -241 -329 -101 -27 228 250 241 75 -175 -503 -238 -118 -158 259 285 262 23 -39 -535 -338 -46 -124 277 197 337
2680 337 211 -291 -102 -261 -248 -96 274 83 385 206 -165 -160 -451 -198 143 217 434 181 -53 63 -304
2701 -304 -170 -173 -83 3 50 282 37 -147 -267 -47 -378 -127 435 658 111 35 -182 -242 -404 -252 -158 146 289
2724 289 96 78 -400 -162 -462 -329 -352 177 283 277 321 -2 -124 0 -248 -221 166 171 143 216 72 -134 -251
$$ packed form
2565a11k80J30J41J35K88N2j92m23M0j50N1J74K05L63k43K56k07k59l16P0K94
2586A8L1M61m9L2r17R7n4J85l9M42N7M0j07k87N4j66n31O82M5L13J06j90l21k10
2610c08J04P2J79J60p1m4J15m3j00l75nM33KlJ33K58k84n53j17J51K08J71o0K60
2634B83j99k93P4k99J38K30Q1L18K03k69k40m00j6L63j11K2K52J81K10o11L8j96
2656b41q8K28P4K55K2rj66k50l28K65J20m0M17K6k3k39o2m96J97K92p8M01q0J40
2680C37j26n02J89j59J3J52L70j91L02j79l71Nk91K53L41P4K17k53k34J16l67
2701c04J34lR0Q6M7K32k45j84j20K20l31K51N62K23n47p6k17o0j62J52R4L04J43
2724B89j93j8m78K38l00J33k3N29J06oM4l23j22J24k48K7L87Nk8P3j44k06j17
$$ plain form
2747 -251 -459 -14 240 273 388 50 35 -462 -172 -342 42 -13 5 270 234 -121 -73 -207 -179 -146 258 75 198
2770 198 293 -182 25 -405 -231 -54 171 -86 52 229 8 -255 -80 -255 -1 138 164 212 97 -25 112
2791 112 -295 -59 -208 -12 321 96 78 -169 -130 -261 -313 -133 40 202 -13 -116 102 16 -428 -76 -108 91
2813 91 157 117 141 51 174 -167 -166 35 65 287 108 255 131 65 -42 -13 -24 125 129 110 434 -44 -170 -45 -265
2838 -265 -243 -70 453 168 228 -23 14 -127 -109 -1 -66 64 392 235 210 -51 -84 -410 48 250 -205 84
2860 84 137 173 -136 -69 -33 -244 -109 -48 100 267 -26 295 -66 -300 -179 -112 206 89 388 -282 -110 85
2882 85 -98 -163 -12 65 266 179 -11 -88 -6 36 -111 -71 -33 126 216 152 -128 -171 -261 -90 -62 46 75 312 204
2907 204 -61 202 -332 -332 147 -73 27 163 -73 114 -82 -185 -97 -9 26 405 152 -30 -122 70 -147 -230
$$ packed form
2747b51k08M45K54L3J15l38j5m97K90j70L84n5J8K65l6l55M8j34K8L3M04j83J23
2770A98R5m75K07m30J74J77K25k57J38J77k21k63J75j75K54J39K6M8j15j22J37
2791A12m07K36j49J96L33k25j8k47L9j31n2J80J73J62k15j03K18q6m44L52l2J99
2813I1O6m0K4r0J23l41JK01L0K22j79J47j24o6j07K9j1J49Mj9L24m78j26J25k20
2838b65K2J73N23k85O0k51L7j41J8J08o5J30L28j57k5k61l3l26M58K02m55K89
2860H4N3L6l09O7L6k11J35O1J48J67k93L21l61k34J21O7L18j17K99o70J72J95
2882H5j83o5J51P7K01q7j90p7Q2M2j47M0L8J59R0o4k80m3r0J71K8J08K9K37j08
2907B04k65K63n34%M79k20J00J36k36J87j96j03Q8Q8L5L79k53j82r2J92k17q3
$$ plain form
2929 -230 121 99 140 -108 11 58 -67 -50 -295 -246 -120 292 139 270 -164 -67 -96 -226 -133 34 105 -121 269
2952 269 41 51 -342 -4 -158 -110 -7 265 138 141 -101 -87 -69 -130 10 100 -56 357 27 136 -59 -306 29
2975 29 -202 310 310 216 239 84 -220 -259 -139 236 -48 109 255 107 -159 194 -59 -30 -128 -130 195 360 107
2998 107 -42 101 -50 -314 -210 -38 243 -61 -198 22 -365 -42 148 -56 71 179 102 -66 -114 -25 -362
3019 -362 -316 -107 185 151 83 140 -99 -148 -51 51 73 35 144 294 -151 125 45 3 -174 26 265 -1 166
3042 166 198 70 -71 77 -237 -251 117 152 -211 64 184 -64 -76 -138 89 -141 67 91 -29 -30 -75 -225 -293
3065 -293 -13 17 203 -266 -198 41 -187 6 -173 7 128 18 259 -248 45 -29 34 55 -11 71 41 -142 40
3088 40 -3 156 -182 -177 -195 -139 43 325 255 -25 -113 15 -160 -50 229 55 170 -172 141 45 -278 -224 -217 9
$$ packed form
2929b30L51k2M1k48J19M7j25J7k45M9J26M12j53J31m34R7k9j30R3J67P1k26L90
2952B69k28J0l93L38j54M8J03K72j27Lk42J4J8o1J40R0j56M13l30J09j95k47L35
2975B9k31N12%r4K3j55l04l9J20L75k84J57J46j48k66L53k53K9r8kL25J65k53
2998A07j49J43j51k64J04J72K81l04j37K20l87L23J90k04J27J08p7j68m8Q9l37
3019c62M6K09K92l4o8N7k39m9R7J02K2l8J09J50m45K76q0m2j77K00K39k66J67
3042A66L2j28j41J48l14j4L68L5l63K75J20k48j2o2K27k30K08K4j20jm5j50o8
3065b93K80L0J86m69O8K39k28J93j79J80J21j10K41n07K93p4O3K1o6Q2l0j83J82
3088D0m3J59l38Nj8N6J82K82p0k80q8J28j75J10K79j74J15l42L13r6l23N4PK26
$$ plain form
3112 9 284 -35 -65 119 -116 -229 99 -199 87 -261 137 123 -247 -90 -91 -71 18 -224 254 71 84 75 35 -16
3136 -16 52 78 -62 14 76 -147 -21 27 -100 -58 -70 8 74 194 119 33 30 -243 -112 -37 222 56 45 13 42 -36
3162 -36 -141 -118 55 12 258 49 4 -44 166 37 -183 -47 -35 107 -133 81 -40 -8 40 -42 141 164 157 186
3186 186 129 128 -43 -11 -122 -135 -129 89 -129 -50 -145 6 -90 -143 -249 226 198 260 93 -6 193 138 -18 -161 122
3211 122 270 -91 64 -64 164 42 13 -324 -166 89 193 265 48 42 -162 51 -75 -23 248 -91 225 -28
3233 -28 68 -171 -188 -52 -332 11 184 52 355 -92 -154 51 -144 -157 127 128 31 -97 -66 -73 -263 -7 -68 -60 -224
3258 -224 271 97 -176 80 -36 125 -122 -318 -215 313 208 -35 62 45 -128 47 -90 -12 -101 97 -131
3279 -131 22 67 -45 -221 -29 -31 193 214 -3 -37 -335 -272 -85 -79 173 -158 121 -147 143 52 -206 82 -19
$$ packed form
3112IK75l19l0J84k35j13L28k98K86l48L98j4l70J57jK0Q9k42M78j83J3rm0n1
3136a6O8K6j40P6O2k23J26M8j27M2j2P8O6J20p5q6lk73J31P5K59j66j1l2K9p8
3162c6j05K3J73m3K46k09m5m8K10j29k20J36J2J42k40K14j21L2M8q2J83K3pK9
3186A86n7jj71L2j11j3OK18k18P9r5J51r6n3j06M75k8O2j67r9J99n5j56j43K83
3211A22J48l61J55j28K28j22k9l37J58K55J04P2k17ok04K13j26N2K71l39L16k53
3233b8R6k39j7J36k80L43J73j32L03m47o2K05j95j3K84Jr7j28L1pj90K56o1Qj64
3258b24M95j74k73K56j16J61k47j96J03N28j05k43R7j7j73J75j37P8q9J98k28
3279a31J53M5j12j76J92kK24K1k17l4k98O3J87OK52l31K79k68K90r1k58K88j01
$$ plain form
3302 -19 244 32 117 -15 -24 139 -153 48 135 7 12 -59 32 -57 23 -196 -231 -39 114 162 74 87 -42 79 -228
3327 -228 -222 -103 65 0 175 33 112 -95 -179 39 44 189 37 38 -169 107 -172 -150 -61 -110 -113 71 23 -65 -169
3352 -169 -224 -203 -45 -122 36 33 135 269 -100 -299 178 134 21 -61 -135 -3 43 140 68 -183 -80 59 295 388
3376 388 227 48 -66 -41 7 -32 -277 -81 -59 145 -11 154 145 -290 -86 65 161 130 -38 -245 -7 -85 119
3399 119 108 -190 185 130 342 312 -96 -149 37 22 116 -62 -92 -96 -151 45 -65 94 136 185 111 -26 101 -59
3423 -59 58 -89 -128 106 -15 43 119 194 265 -60 -340 15 -159 -55 -100 -160 5 -30 128 33 -331 -98 45
3446 45 -129 60 -267 -78 164 163 -124 183 113 -480 -42 110 -55 -163 147 -309 101 32 -28 53 -61 -23 -116
3469 -116 6 -18 42 -151 87 150 -124 -124 197 -198 -175 7 -80 -33 -52 96 118 -135 79 40 -175 -10 -35 -25
$$ packed form
3302a9K63k12Q5j32rJ63k92K01Q7j28Np1R1q9Q0k19l5J92J53M8q8J3j29J21l07
3327b28OJ19J68o5J75j42P9k07q4K18NJ45j52Jk07K76k79K2Q9m9lJ84m8q8j04
3352a69n5K1J58p7J58lJ02J34l69j99M77m4j13q2p4J32M6R7p2k51J03J39K36R3
3376C88j61j79j14K5M8l9k45J96K2K04j56J65rm35K04J51R6l1j68k07K38p8K04
3399A19j1k98L75n5K12l0m08n3J86j5R4j78l0mn5J96j10J59M2M9p4j37J27j60
3423e9J17j47l9K34j21N8P6P5P1l25k80L55j74J04m5o0J65l5J58r5l64K33J43
3446D5j74J89l27J89K42jk87L07p0n93M38J52j65j08L10m56M10o9o0Q1j14L8r3
3469a16J22k4O0j93K38O3k74%L21l95K3J82q7M7j9J48K2k53K14l9k15J65k5J0
$$ plain form
3493 -25 67 374 -2 -125 -11 26 -96 -104 -186 245 -131 -33 181 53 43 -365 104 -45 -139 -113 76 -367 122
3516 122 -197 -9 -47 -52 -47 -104 -201 -32 43 129 101 51 -76 -43 142 382 106 41 108 -184 -148 113 -1 460 35
3541 35 151 240 54 -77 -26 21 127 180 92 198 119 195 126 -190 59 241 318 -11 -1 -135 -172 -69 -115 7
3565 7 228 -133 -69 -295 68 -29 148 -22 339 142 -95 259 -90 -95 -46 42 -276 33 87 99 -66 71 -184
3588 -184 -5 -23 -21 38 -32 172 163 14 136 53 -84 45 23 -68 297 214 -47 30 -76 -45 -6 66 71 49 32 -174
3614 -174 1 -73 -136 164 -143 100 152 91 108 -136 -101 22 64 7 87 255 -8 -243 -98 80 -111 109 54
3637 54 46 -79 138 107 -81 -18 22 -49 -97 -246 -80 -65 55 -147 150 19 -166 -196 -138 -96 22 -33 33 146 -43
3662 -43 105 -82 189 137 129 239 63 170 136 -67 94 -69 72 -10 -227 -84 -12 24 -242 -184 151 -101 59
$$ packed form
3493b5R2L07l76j23J14L7j22qq2M31l76R8K14j28j0m08M69j49r4K6J89m43M89
3516A22l19J88l8nNn7r7J69P5Q6k8n0j27L3J85K40k76o5O7k92L6K61j14M61m25
3541C5J16Q9j86j31N1M7J06N3q8J06p9P6o9l16K49J82P7l29J0j34l7J03m6J22
3565GK21l61O4k26L63r7J77j70L61j97k37L54l49nM9Q8l18L09N4J2j65J37k55
3588a84J79j8KN9p0K04rj49J22q3j37J29k2r1L65q3k61P7j06L1L9P2Nk2j7k06
3614a74J75p4o3L00l07K43N2o1J7k44L5J23M2n7Q0J68k63k35J45J78j91K20n5
3637E4qj25K17l1j88O3M0p1m8j49J66J5J20k02K97j31j85l0N8M2J18n5O6J13j89
3662d3J48j87K71n2qJ10j76J07l4k03J61j63J41q2k17J43P2L6k66N8L35k52J60
$$ plain form
3685 59 294 -62 -66 -18 -93 152 96 -51 -183 -24 -91 -173 81 168 -20 -32 439 120 173 49 17 64 7 -251 208
3710 208 44 -67 -71 67 -163 70 -84 -104 228 288 -246 54 18 -73 -123 -153 31 41 -73 218 -36 68 235
3733 235 82 1 38 45 -92 -12 93 62 43 -228 -389 -41 -75 125 -10 158 -3 -100 222 -62 -135 -108 170 -177
3757 -177 -207 273 3 43 -161 174 123 -78 52 155 -115 20 37 156 -202 -147 241 41 23 -210 155 -94
3779 -94 93 -243 224 -26 -64 90 -30 113 -31 352 -222 -15 221 -24 148 129 25 111 -110 -81 95 -58
3801 -58 -103 291 -33 -64 224 -264 -199 -291 76 -72 225 135 -28 -252 -174 -168 -142 -40 -96 36 -69 -18 -127 11
3825 11 -96 74 74 55 -48 116 -95 -119 -84 -30 97 27 -125 137 98 -80 25 151 -138 -78 196 -114 -65 103
3849 103 -35 182 38 30 136 -179 160 -128 -7 -9 -61 28 -45 -42 -136 2 44 2 112 -7 21 7 -13 -147 -38
$$ packed form
3685E9K35l56mM8p5K45n6j47j32J59o7q2K54Q7j88j2M71l19N3j24l2M7n7k58M59
3710B08j64j11mJ38k30K33j54k0L32O0n34L00l6r1n0l0J84J0j14K91k54J04J67
3733B35j53q1L7Pj37Q0J05l1j9k71j61L48l4K00j35J68j61r7L22k84p3K7K78l47
3757a77l0M80k70M0k04L35n1k01J30J03k70J35J7J19l58N5L88k00j8k33L65k49
3779i4J87l36M67k50l8J54j20J43j44L83n74K07K36k45J72j9j04Q6k21K9J76j53
3801e8m5L94l24l1K88m88O5r2L67j48K97r0j63k24P8OK6J02n6J32j05N1j09J38
3825A1j07J70%j9j03J64k11k4L5N4J27p0j52K62l9j78J05J26k89O0K74l10M9J68
3849A03j38K17j44qJ06l15L39k88J21kn2Q9p3Lr4J38M2m2J10j19K8j4k0j34J09
$$ plain form
3874 -38 68 52 -238 0 63 70 -29 -192 -14 -57 -42 -78 -138 66 157 -53 -55 -113 70 -153 190 -149 17 -75 66
3899 66 -18 -53 4 11 -225 -8 -13 124 -164 -62 -141 -43 222 -36 142 6 3 -79 46 -166 -198 177 169 101 6 -16
3925 -16 -149 94 -178 -80 -38 197 21 -16 86 -37 122 51 92 -130 -74 -74 152 -140 85 116 95 97 15 92 -105
3950 -105 339 -102 125 4 -228 101 0 272 99 110 27 21 -66 -153 210 42 164 232 83 -78 91 19 -47
3973 -47 52 160 36 222 -4 -92 172 -18 -53 -352 -102 104 95 0 -153 -45 114 135 -49 -127 -176 -78 124 100
3997 100 156 16 16 257 8 92 -96 -154 -44 -52 142 -8 77 -100 177 -129 333 295 -14 -38 8 -190 33 -160
4021 -160 30 170 234 -186 43 -146 -279 205 157 262 -96 -4 -260 -198 417 276 -61 -180 117 52 -198 -66
4043 -66 67 30 -229 -205 -14 158 41 16 -23 102 158 112 41 199 -287 23 177 -258 -119 2 10 78 48 8
$$ packed form
3874c8J06j6k90K38O3Pr9j63J78m3J5l6o0K04R1k10kn8J83k23L43l39J66r2J41
3899F6q4l5N7Pk36K17nJ37k88J02p9R8K65k58J78j36lq2J25k12l2L75qo8r5k2
3925a6j33K43k72R8M2K35j76l7J02j23J59p1M1k22N6%K26k92K25L1k1Kq2P7j97
3950a05M44m41K27j21k32L29j01K72j73J1q3oq7q7L63j68J22O8j49j61J69p2o6
3973d7R9J08j24J86k26q8K64j90l5k99K50K06rr5j53J08J59K1j84p8m9R8K02k4
3997A00N6j40%K41k49Q4j88n8J10qJ94j50Q5j77K77l06M62l8l09k4M6j98K23j93
4021a60J90J40O4m20K29j89j33M84m8J05l58R2k56O2O15j41l37j19K97o5k50J32
4043f6J33l7k59K4J91J72j17k5l9J25N6m6p1J58m86L10J54m35J39J21QO8l0m0
$$ plain form
4067 8 237 -18 -113 -209 239 120 -57 105 116 -106 -125 38 -70 103 70 141 -183 -130 -120 102 -32 -110 238 95
4091 95 69 109 227 38 -48 0 1 -52 254 169 65 -9 -87 249 -172 341 83 -65 109 203 -225 -231 278 -77 86
4116 86 -50 -34 -53 -5 160 -36 -157 156 -337 -158 -107 -11 113 222 289 8 130 -80 -8 -29 49 272 -135
4139 -135 60 23 -87 67 90 11 -160 -78 -23 -44 -57 128 14 214 -59 212 46 49 -73 110 33 -136 151
4162 151 220 -147 103 72 -224 199 -212 56 171 197 89 -167 51 -21 -243 -148 -65 179 59 -30 -97 231 -215
4185 -215 -207 116 -69 22 93 89 151 -107 180 107 -102 -79 -35 1 134 147 -345 -50 -85 25 115 -69 -100 73 -77
4210 -77 -128 -22 101 1 -237 -74 10 343 -185 25 -68 126 -224 -254 51 -108 133 -115 38 102 -206 234
4232 234 -190 -42 -124 24 117 -112 -198 -29 -38 9 -172 49 23 230 -107 -78 71 37 65 -31 -152 150 247 246 223
$$ packed form
4067HK29k55r5r6M48j19j77J62J1k22j9J63j08J73l3P1l24N3J0K22j34p8L48j43
4091I5k6M0J18j89q6M8Jn3L06q5j04p4p8L36m21N13k58j48J74R4m28oN09l55J63
4116H6j36J6j9M8J65j96j21L13m93J79N1R6J24J09O7k81J22k10P2k1P8K23m07
4139a35J95l7j10J54K3p9j71Q2N5k1j3J85j14K00k73K71j66Lj22J83p7j69K87
4162A51O9l67K50l1k96M23m11K68J15K6j08k56K18p2k22R5Q3K44j20q9o7L28m46
4185b15QL23j85R1P1mO2k58K87p3k09K3M4L6J33J3m92K95l5J10R0j84l1J73j50
4210g7n1J06J23j00k38J63Q4L33n28K10r3J94l50l0L05j59K41k48J53O4l08M40
4232B34m24J48q2J48R3k29q6J69rM7j81K21k6K07l37K9J49l4K8r6j21L02R7jk3
$$ plain form
4257 223 -147 122 92 39 90 -79 -80 18 166 139 -68 234 111 -48 160 -67 53 -64 -187 -48 216 -81
4279 -81 30 34 -151 89 -13 -152 -160 90 -5 -188 238 -7 -189 -44 -187 -93 57 34 126 91 -84 -182 29 12
4303 12 193 107 -42 140 6 226 -113 55 53 135 -61 -57 -38 -72 -135 -69 88 -149 175 42 102 -19 283 -231
4327 -231 -244 171 270 -68 -50 150 -36 29 -34 153 -155 32 16 198 69 8 -60 53 200 192 -54 198 88
4350 88 74 128 65 135 287 73 -60 226 32 -25 -151 -104 -154 138 -196 65 192 30 -66 106 69 40 -15 261
4374 261 64 -50 -57 -108 -249 -9 -24 147 173 180 224 -117 -166 11 66 -8 165 -87 40 27 13 -166 278 35
4398 35 -339 -90 -26 52 -193 257 -145 -203 93 -120 -33 28 -140 -61 -7 349 -185 79 186 -150 169 8 231
4421 231 -129 6 278 92 -9 -21 49 303 173 -27 -146 18 241 -206 25 58 85 8 163 185 74 112
$$ packed form
4257B23l70K69l0n3N1j69jR8J48k7k07L02j23j59K08k27J20j17j23J39K64k97
4279h1J11Mj85K40j02j39qK50r5j83M26k45j82J45j43R4J50k3R2l5j75r8K11j7
4303A2J81q6j49J82j34K20l39J68kQ2j96MJ9l4o3O6J57k37L24j33O0j21L02n14
4327b31j3M15R9l38J8K00j86O5o3J87l08J87j6J82j29o1o8J13J47qk46K52j10
4350H8j4N4o3P0J52k14j33K86j94n7j26M7n0K92l34K61J27j62r6J72l7k9n5K76
4374B61j97j14pn1j41K40j5J71K6PM4l41m9J77N5p4J73k52J27j3j4j79M44k43
4398C5l74K49O4P8k45M50m02n8K96k13Q7O1j68P9N4L56n34K64J07l36L19j61K23
4421B31l60J35K72j86j01j2P0K54j30k00j19J64K23m47K31L3K7p7J55K2j11L8
$$ plain form
4443 112 46 -121 49 225 284 363 63 -124 28 117 52 -62 -51 -107 -238 -6 -127 82 -11 -188 -92 109 45
4466 45 115 58 -103 12 1 2 -31 -1 3 145 -72 282 35 -25 184 65 -181 -18 -88 -32 15 109 140 72 -56 13
4492 13 96 154 203 258 -33 -252 86 107 27 116 18 -49 67 -37 -88 -61 -138 85 -147 20 -26 -217 128 -44 90
4517 90 -112 -212 77 -260 -70 -11 -72 -76 -272 60 45 -38 -263 -39 -17 112 179 55 -53 -129 160 -148 -69 -1
4541 -1 297 105 -281 -73 -70 163 -14 -37 -101 -256 -54 -134 19 -115 113 127 4 43 223 68 -36 -56 -86 -18
4565 -18 -192 -146 -181 202 -6 58 -149 30 -30 107 39 126 41 -121 -13 -146 -2 -43 -81 -62 13 189 -72 -276
4589 -276 -1 -22 -284 247 197 -107 74 133 -34 -82 -118 73 -125 93 60 139 -115 36 254 232 244 38 147
4612 147 180 -33 35 67 104 -78 139 -47 102 202 -70 200 54 -20 160 268 154 -154 -186 6 -83 -215
$$ packed form
4443A12o6j67J70J76N9P9l00j87J52Q9o5j14J1n6j31K32j21K09r3j77R6K01o4
4466D5P0n7j61J15j1Jl3L0MJ42k17L54k47o0K09j19k46J63p0N6M7R4L1o8j28O9
4492A3Q3N8M9N5k91k19L38K1q0Q9r8o7J16j04n1K7p7K23k32J67m6j91L45j72J34
4517I0k02j00K89l37J90N9o1mj96L32j5q3k25K24K2J29O7j24j08p6K89l08P9O8
4541aK98j92l86K08LK33j77k3o4j55K02q0J53j34K28J4j23L9J80j55j04k0l0O8
4565a8j74M6l5L83k08O4k07J79o0J37o8Q7q5j62J08j33J44m1l8J9P5J76k61k04
4589b76K75k1k62N31n0l04J81N9j67m8l6J91j98K18l3P9k54J51K18k2J2k06J09
4612A47L3k13O8L2L7j82K17j86J49J00k72K70j46p4J80J08j14l08l2J92q9j32
$$ plain form
4634 -215 -173 297 21 163 61 120 83 87 86 -35 -13 36 13 -78 -65 -162 155 -176 44 66 56 60 -159 147 -5 126
4660 126 -79 -96 -45 7 -160 224 -381 -75 146 14 273 126 91 263 3 -100 256 37 279 -5 -142
4681 -142 -51 -52 232 -215 -60 -90 -73 -159 -91 257 -95 19 23 169 -146 -153 12 -161 -146 129 -155 94 -225 364
4705 364 93 -172 -17 -98 -5 -61 120 159 -35 55 215 199 -204 -216 0 -175 227 -80 47 -155 -110 -207 -142
4728 -142 183 139 -205 68 36 -203 105 -2 60 -127 -160 189 -4 -69 -279 134 129 135 -47 113 -19 -50 288
4751 288 -165 185 57 -73 -15 111 0 72 42 -41 -178 34 102 128 172 146 -72 309 61 89 -50 -147 -5
4774 -5 109 -80 -148 78 -10 51 -80 133 -183 48 -173 24 -77 27 -19 97 -52 -45 7 -134 84 -45 -20
4797 -20 41 11 -80 143 72 -113 222 -176 -65 -142 -3 80 116 -278 -170 28 35 197 133 11 184 -145 -154 135
$$ packed form
4634b15M2M70k76J42j02N9l7Mjj21K2M9k3r1J3r7L17l31K20K2j0Mk19L06j52J31
4660A26k05j7N1N2j67L84o05L06K21j32K59j47l5J72k60j03L56k19K42k84j37
4681a42R1jK84m47J55l0J7q6O8L48l52J14MJ46l15pJ65j73J5K75k84K49l19N89
4705C64k71k65J55q1R3n6J81L9j94R0J60j6m03j2K16j75M02l07J27k02M5r7O5
4728a42L25m4l44K73l2k39L08j07O2j87l3L49j93o5k10M13nOj82J60j32l1L38
4751B88m53L50j28j30N8J26j11P2l0q3j37K12O8K6M4k6k18L81k48K8j39r7J42
4774eJ14j89o8K26q8O1j31K13l16K31k21J97j01J04m6J16j49PN2j41K18j29K5
4797b0O1l0r1K23p1j85L35l98J11p7J39Q3L6l94J08J98PJ62o4j22J73l29rK89
$$ plain form
4821 135 -175 126 90 192 70 -143 193 145 186 216 -128 73 95 -59 47 35 10 179 -13 58 44 -248 -103
4844 -103 37 -255 199 -70 150 -50 247 -202 -215 101 24 -58 -150 220 45 251 -152 -15 235 -154 136
4865 136 103 56 71 -21 -31 114 123 101 80 22 -29 21 -163 210 -175 166 6 -104 -97 67 131 -151 -160 -199 26 31 112
4892 112 2 133 101 -214 -24 -76 51 -55 -30 -112 -239 79 162 57 -16 -154 -127 -176 -8 -205 -81 191 -125
4915 -125 -16 0 29 -43 -129 -231 168 -114 143 55 175 -411 -123 -84 -103 -190 3 112 84 -101 -31 -39 -57 22 -41
4940 -41 -36 50 -110 -361 164 -24 -105 -111 12 -94 -81 -111 134 43 22 161 56 31 40 -71 46 71 56 135 20 130
4966 130 52 76 -25 69 249 -144 165 -267 -210 -85 -79 -87 184 87 -62 173 62 -62 67 21 -44 109 215 106
4990 106 212 -8 72 -45 -76 87 54 265 208 -223 -62 -32 5 87 -4 148 97 -95 148 17 -42 -5 -40 -58
$$ packed form
4821A35l10L01l6J02j22k13L36m8M1L0l44K01K2j54J06j2k5J69j92P1j4k92J45
4844a03J40k92M54k69K20k00K97m49j3L16p7q2r2L70j75K06m03J37K50l89K90
4865A36l3m7J5r2j0J45Rk2k1n8n1N0j84L73l85L41j60j10PJ64O4k82rl9K25NQ1
4892A12j10J31l2l15J90n2J27j06K5q2j27L18Q3j05p3j38K7m9J68j97J24K72l16
4915a25J09J6K9p2q6j02L99k82K57q8J20n86K88L9j9q7J93J09k8j85P0qj8P9o3
4940d1NQ6j60k51N25j88q1oJ23j06J3l0K45r1k1J39j05k5Rj11J17K5j5P9j15J10
4966A30p8K4j01R4J80l93L09m32N7J25OqK71r7j49K35j11j24J29m6o5J53J06j09
4990A06J06k20Q0j17l1J63l3K11n7m31J61L0L7Q2r1J52n1j92K43j31n9L7l5j8
$$ plain form
5014 -58 -163 -6 71 138 -116 -79 -63 -178 -18 -82 -47 -85 -206 -40 -211 165 -82 -12 57 90 -120 -213 231 -88
5038 -88 -38 -38 -175 22 156 143 65 -83 -129 -132 29 108 23 -76 340 -112 -264 160 -210 -267 -264 -105 174 -337 -209
5063 -209 104 -196 -94 -57 -174 -21 -3 -119 138 -12 -73 27 -163 -195 -78 15 -2 66 77 -14 222 121 248
5086 248 -112 -5 -39 151 -48 92 -5 -179 -34 -64 170 -152 58 -61 19 274 -328 33 299 -121 122
5107 122 -131 -131 79 -339 -286 -119 -288 -98 121 -40 23 -30 73 -101 -11 83 154 -15 192 39 172 -99 -22
5130 -22 2 -17 -71 94 -145 -9 55 -88 -15 -9 -127 30 41 -213 -70 288 -99 -68 77 38 -88 156 44 93
5154 93 -115 -128 36 115 38 141 -100 4 101 -121 157 -142 -50 -5 -100 1 28 64 -87 349 -49 15 -78 12
5178 12 99 -4 -22 35 -20 -128 82 89 66 68 19 264 -130 -219 -2 148 230 6 58 64 24 -187 -256 -100 1 60
$$ packed form
5014e8j05J57P7O7k54L7J6j15J60o4L5l8j21J66j71L76k47P0O9L3k10r3M44l19
5038h8N0%j37J97J34j3p8j48m6lJ61P9q5r9M16m52j52M24l70n7LJ59K79n11J28
5063b09L13l00J02L7j17J53J8j16K57j50o1J00j90l2J17R3j7O8J1r1K36j01J27
5086B48l60J07l4J90j99J40r7j74J45l0K34l22K10j19Q0K55o02L61K66m20K43
5107A22k53%K10m18N3J67j69J90K19j61O3n3J03j74R0R4P1j69K07j53J33k71P7
5130b2K4j9n4J65k39J36O4j43P3Oj18J57J1k54J43L58l87L1J45l9j26K44j12M9
5154I3k08j3J64P9p7J03k41J04R7k22K78k99R2M5r5J01K7L6j51M36l98O4r3R0
5178A2Q7j03j8N7n5j08K10Pk3Km9K45l94q9K17J50Q2k24N2Om0k11o9J56J01N9
$$ plain form
5204 60 -58 139 81 -62 148 77 -103 -107 -28 96 36 -113 84 76 116 -103 61 233 -192 -34 77 7 -101 -189
5228 -189 -208 -261 264 -1 -56 -4 129 -135 -323 38 284 -86 46 -188 -14 -66 -350 1 -86 -132 -36 -71 171
5251 171 -132 -30 32 64 -30 56 -77 32 -176 121 169 88 -190 21 189 -67 105 -285 57 52 -46 -92 -45 165
5275 165 173 44 -185 122 134 -44 -14 220 110 -125 162 105 20 -147 -87 -130 156 -230 -76 75 -62 -23 -170
5298 -170 71 -64 -144 10 -45 -13 -98 77 -150 252 -16 213 90 131 -344 16 -142 -170 27 -94 99 22
5320 22 50 57 121 159 93 -75 5 124 -255 -228 -235 185 33 -44 -135 -95 19 68 77 32 19 -106 118 -234 54 27 -68
5347 -68 127 -252 -67 -25 113 104 313 -11 2 -154 -94 -102 159 77 -80 23 239 151 -183 148 -95 -40 242 90
5371 90 -40 -55 -58 -88 -12 39 236 135 -217 -55 -180 13 140 89 80 -280 -42 32 93 -15 164 72 67 148 -1
$$ packed form
5204F0j18J97n8j43K10p1j80mP9J24o0j49J97qM0k19J64J72m25J58J11p0j08q8
5228a89j9n3N25k65n5N2J33k64j88L61K46l70J32k34J74n2k84L51q7m6R6l5K42
5251A71l03J02O2L2r4Q6j33J09k08K97M8q1k78K11J68k56J72l90L42nr8m6M7K10
5275A65Qj29k29L07J2j78L0K34j10k35K87n7q5j67O0m3K86l86J54J51j37L9j47
5298a70K41j35q0J54n5L2q5J75k27M02k68K29j23M1m75L60j58k8J97j21J93p7
5320B2K8PO4L8o6j68Q0J19l79K7pM20j52p7r1M0J14M9Rm5j3j25K24l52K88k7r5
5347f8J95l79J85M2J38rK09l24J3j56O0qK61q2j57J03K16q8l34L31k43N5K82j52
5371I0j30j5ll0P6N1J97j01l52J62j25J93J27n1rl60K38P4O1j08J79r2nQ1j49
$$ plain form
5396 -1 91 -192 108 -45 342 323 63 -135 -26 126 -93 86 9 161 28 -109 -52 194 6 -53 -36 -160 -105
5419 -105 -73 -173 134 129 -32 -250 158 118 -120 -59 -65 41 361 -105 -84 -1 -383 148 57 -76 10 67 -63 114
5443 114 70 -17 123 -32 -235 154 53 -89 -55 -27 42 -28 34 -249 148 36 46 -22 -23 6 -101 176 -7 33
5467 33 251 61 238 -168 -400 91 133 157 -50 100 -111 132 -127 -56 -64 160 0 126 37 30 76 83 38 6 94
5492 94 130 117 94 73 -244 -275 -74 -195 50 148 33 9 52 -78 -176 79 -154 -258 39 -127 -213 134 112 165
5516 165 -111 -31 134 -76 131 64 -96 32 169 119 125 342 -64 -50 253 54 -191 -103 289 54 -80 -76 51
5539 51 -266 -61 -88 -145 118 136 31 -54 52 -26 -14 125 -141 182 44 -228 17 -106 221 62 -77 -120 31
5562 31 -51 -37 88 -84 -32 -126 68 -72 -11 118 158 70 257 -70 20 -134 -74 63 -47 -126 -143 -34 54 -43 -112
$$ packed form
5396aR2k83L00j53L87j9k60j98J09J52k19J79p7J52j33j37N7K46j88n9J7j24N5
5419a05L2j00L07nj61k18M08m0k38O1oJ06L20m66K1Q3l82N31r1j33Q6N7j30J77
5443A14m4q7J40j55k03L89j01j42L4K8O9p0O2k83L97j12J0o8jK9j07K77j83M0
5467C3K18j90J77m06k32M91M2K4k07J50k11K43k59P1qK24j60J26q9pM6Pm5l2Q8
5492I4L6j3k3k1l17l1K01j21K45R8j15k4M3j30r8K55k33j04K97j66q6L47k2N3
5516A65k76Q0J65k10K07o7j60J28J37n0OK17m06J4L03j99k45Q8L92k35j34MJ27
5539E1l17K05k7n7K63J8j05q5J06p8J2J39k66L23j38k72K45j23L27j59j39m3J51
5562C1q2J4J25j72N2r4J94j40O1J29M0q8J87l27R0j54O0J37j10p9j7J09Q8r7o9
$$ plain form
5587 -112 182 -1 -66 121 -102 202 15 -71 -100 -127 -84 12 -117 43 74 290 -16 -48 -19 -39 -130 55 110 7
5611 7 13 -83 -23 135 -188 31 135 19 352 -47 165 71 157 44 -6 21 252 -137 -15 -69 -355 37 -30 133
5635 133 -69 35 -140 -94 -167 -124 168 5 109 325 198 5 44 22 -145 104 3 -180 190 -47 56 -61
5657 -61 -103 216 -95 -60 -58 -18 -126 -17 91 24 -57 99 -71 88 279 -25 -290 -150 55 17 35 121 -37 -97
5681 -97 40 60 -142 132 57 62 119 9 -221 16 209 -78 14 169 -7 -15 242 1 1 -38 -59 26 124 -56 153
5706 153 -51 31 11 -43 -36 -30 146 -111 130 -293 -182 43 -350 -25 31 -8 -207 -7 -127 98 87 -232 -57
5729 -57 24 109 44 72 165 257 -81 134 300 174 70 -83 58 59 105 283 177 125 21 -20 135 129 -231 47 -181
5754 -181 -14 84 -160 -192 129 19 155 217 -193 -148 36 -192 21 53 338 34 181 275 290 -61 35 -21 3
$$ packed form
5587a12K94j83o5J87k23L04j87q6k9k7M3R6j29J60L1K16l06l2K9k0r1J85N5j03
5611GOr6O0J58l23K19J04j16L33l99K12r4Q6j13n0K7K31l89J22n4k86L92o7J63
5635A33k02J04j75M6p3M3K92j63J04K16j27j93L9k2j67K49j01j83L70k37J03j17
5657f1m2L19l11L5KM0j08J09J08o7q1J56j70J59J91l04k65J40K05l8J8Q6j58o0
5681i7J37K0k02K74p5NN7j10k30K37J93k87R2J55j76qK57k41%l9k1Q5R8j80K09
5706A53k04Q2k0n4POJ76k57K41m23J11K25l93L25N6l9j99K00j20K25j1l19J75
5729e7Q1Q5o5K8R3R2l38K15J66j26j04j53J41JM6J78j06n2j04m1J55ol60K78k28
5754a81J67R8k44l2L21j10J36O2m10M5J84k28K13L2K85l04J47R4J5l51R6n6K4
$$ plain form
5777 3 152 83 -124 -277 15 66 -37 61 -110 -96 -58 120 -18 257 -13 -32 38 175 64 79 -78 -103 -203 143
5801 143 20 -146 130 106 187 91 -204 253 -138 225 -69 149 41 -83 7 -18 200 38 -61 -73 207 -9
5823 -9 -53 -38 76 -106 11 114 70 -25 143 -100 -24 210 230 -93 -68 -281 1 112 88 70 -118 -31 -3 93 -137
5848 -137 42 -142 182 -47 -182 -26 -85 17 97 158 274 -203 -6 185 41 -79 -130 99 -30 -9 -47 78
5870 78 -35 68 102 284 52 -97 116 90 22 -160 168 -274 18 46 -45 109 -38 -47 226 -221 -208 -91 134
5893 134 -114 -47 -179 16 -104 -82 139 -141 -76 -316 -87 17 34 -192 -15 -12 -104 -13 3 119 -128 77 153
5916 153 -54 -227 -3 -163 17 112 225 53 -143 -144 -43 50 52 86 -92 -57 24 -340 -69 15 -101 19 -2 -230
5940 -230 -46 86 -135 379 -31 -208 31 241 -209 0 -46 67 -17 44 -251 8 -44 -100 -4 137 20 63
$$ packed form
5777CJ49o9k07j53K92N1j03R8j71J4L8J78j38K75k70j9P0J37j11J5j57k5j00L46
5801A43j23j66K76k4Q1r6k95M57l91L63k94K18j08j24R0k5K18j62r9j2K80k16
5823im4J5J14j82J17J03m4r5J68k43P6K34K0l23K5k13K82J11k4j8j88Q7K8R6k30
5848a37J79j84L24k29j35J56n9J02Q0O1J16m77J97J91j44j20n1K29j29K1l8J25
5870G8j13J03L4J82k32j49K13k6o8j82L28m42K92K8r1J54j47rK73m47J3J17K25
5893A34k48O7j32J95j20K2K21k80O5k40K29J04J7k26J77Lr2R1J6J16k47K05P6
5916A53k07j73K24j60J80R5J13j72j96jJ01R3KL4j78L5Q1l64K71Q4j16J20k1k28
5940b30J84J32k21N14m10j77K39K10m50K09m6J13q4O1k95K59n2n6R6J41j17M3
$$ plain form
5962 63 20 85 69 -361 -16 33 -90 92 -54 56 78 53 88 -27 86 44 -1 -89 22 123 -100 58 -36 -110
5986 -110 -59 -107 -43 104 -323 -147 -103 162 138 25 -59 -12 38 357 194 64 116 -104 -229 82 -83 88 111
6009 111 113 182 -53 -34 289 122 -43 -101 -63 50 1 22 100 64 138 -1 78 213 112 -43 107 -183 -188 -287 30
6034 30 -254 -36 -2 -86 107 -115 159 -192 18 -11 150 192 132 265 -50 92 141 42 15 164 -29 -23 -309 -65
6058 -65 -11 127 -11 -164 76 38 157 -89 146 -98 -40 55 -206 69 -37 62 -90 77 33 65 -193 78 -183
6081 -183 -56 135 -269 -22 100 -134 -87 7 48 -153 54 115 -53 -68 132 63 66 -180 -65 -126 12 45 107 -62
6105 -62 -90 28 44 -25 24 -168 111 -1 313 153 -34 -217 13 289 170 35 -139 64 -24 83 38 97 -88
6128 -88 8 214 110 -129 -133 5 189 -230 -81 18 78 113 0 -37 -32 -166 34 -90 172 -193 -207 107 178 51
$$ packed form
5962F3m3O5j6m30L45M9j23J82j46J10K2k5L5j15J13m2m5q8J11J01k23J58r4p4
5986a10N1m8O4J47m27J76M4K65k4j13q4M7N0L19j63j30N2k20j25L11j65J71K3
6009A11KO9k35J9L23j67j65n8L8J13m9K1P8l6P4j39P9J35j01j55J50k90nr9L17
6034C0k84K18L4q4J93k22K74l51K10k9J61M2o0J33l15J42M9r9k7J49j93Ok86K44
6058f5N4J38j38j53K40l8J19k46K35k44N8R5k61K75j06R9j52J67m4L2k58K71k61
6081a83J27J91m04K47J22k34M7R4M1k01K07O1j68j5K00o9Lk46J15o1J38L3O2j69
6105f2k8J18J6o9M9j92K79j12L14j60j87j83K30K76j19j35j74K03q8J07m5N9j85
6128h8R6K06j04k39mJ38J84m19J49R9O0L5j13l7Nj34K00j24K62l65j4L14P1j27
$$ plain form
6152 51 -218 15 51 121 -28 -170 -218 -160 211 94 -38 -86 9 -144 230 19 -239 194 33 -205 102 138 -80
6175 -80 -209 20 -94 -113 88 151 18 -105 175 160 60 73 -108 -28 60 282 30 -28 -205 71 80 -166 -123 -59
6199 -59 -39 -10 8 -99 210 64 -3 -175 83 -66 -25 -67 145 -161 207 24 -247 -38 61 220 33 -52 26
6222 26 -17 -22 135 -46 152 -155 -3 79 -68 -6 58 -310 90 103 -104 38 -65 55 215 -152 -226 95 -175
6245 -175 -188 161 -50 137 79 -68 123 93 6 -85 -13 -175 -9 -32 -155 156 147 -120 120 -171 -228 -246 33 -69
6269 -69 -85 106 127 -44 -74 -105 74 21 47 -118 138 -26 -115 -35 -92 78 280 -116 -140 57 -95 -193 29 -89
6293 -89 152 200 -92 -135 121 19 41 22 149 -235 -19 -107 -93 12 106 13 -138 -31 -57 132 -234 -43 92
6316 92 -103 -104 131 -152 -32 -20 19 -267 -98 107 -4 -124 240 128 -64 81 -201 -152 -8 69 86 -303 125
$$ packed form
6152E1k69K33L6P0j49j42m8N8L71j17j32m8R5j53L74k11k58M33j61k38L07L6k18
6175h0j29K29j14j9K01O3j33j23K80j5j00J3j81Q0Q8K22k52n8j77K76Rk46M3O4
6199e9K0K9J8j07L09j46o7j72K58j49M1m2K12l06L68j83k71K09R9J59j87q5P8
6222B6m3nJ57j81J98l07J52Q2j47O2O4l68M00J3k07J42j03J20J60l67p4L21k70
6245a75j3L49k11J87n8j47J91l0q7r1P2j62J66k3j23L11rk67K40k91n7j8K79j02
6269f9j6J91K1j71l0l1J79n3K6j65K56j64q9Q0n7J70K02l96k4J97j52r8K22j18
6293h9K41M8k92m3K56j02K2j9J27l84K16q8J4J05R4r3j51J07k6J89l66J91J35
6316I2j95jK35k83J20J2L9k86J69K05j11j20L64j12j92J45k82M9J44P7J7l89M28
$$ plain form
6339 125 -169 -113 -61 -315 -25 -125 -254 44 -255 -92 -126 -9 -65 -145 24 -154 -13 11 129 194 131 39 39 237
6363 237 100 102 154 -74 -34 -169 120 176 -2 107 37 50 -70 27 -249 82 -337 -301 -91 31 -69 -120 68
6386 68 -8 254 -355 127 161 6 -75 -128 3 -54 98 143 90 163 -113 -13 186 27 142 -26 -16 44 101 -68
6410 -68 -129 -37 -140 62 90 104 57 83 77 -67 1 174 80 -256 -27 -165 95 284 106 6 31 -135 -92 227
6434 227 16 167 -57 151 274 22 68 -71 -7 -127 73 -98 92 116 19 -113 284 -8 401 34 -178
6455 -178 75 -97 39 -179 75 -230 217 -308 -197 -115 -201 -171 -45 255 75 -7 -173 26 -88 -102 -86 -199
6477 -199 -132 -187 -158 -57 170 -49 52 -25 70 129 215 -206 -103 45 66 -3 -47 -280 60 72 -61 98 132 -69
6501 -69 202 27 -227 98 59 109 58 -65 -28 -5 9 -21 -122 125 -22 -105 17 144 -35 -256 255 -148 182
$$ packed form
6339A25k94N6N2k54K90j00j29K98k99J63l4J17n6q0J69j78J41K4J18O5o3r2%J98
6363B37j37KN2k28M0j35K89N6j78J09p0J3j20R7k76L31m19L6K10J22j00n1J88
6386F8p6K62o09M82L4j55q1n3J31n7J52M5n3P3k76J00J99j59J15j68J0O0N7j69
6410f8o1R2j03K02K8J4m7K6oj44O8J73r4l36K29j38K60J89j78j00K5j66M3L19
6434B27k11J51k24K08J23k52M6j39O4j20K00j71J90K4r7j32L97k92M09l67k12
6455a78K53j72J36k18K54l05M47n25J11Q2q6L0J26L00j80q2j66J99j14j4J6j13
6477a99O7n5K9J01K27k19J01p7R5N9Q6m21J03J48K1o9m4k33L40J2j33J59L4k01
6501f9K71j75k54L25l9N0n1j23L7K3J4l0j01K47j47q3J22J27j79k21N11m03L30
$$ plain form
6524 182 -171 -46 110 74 25 -130 144 94 24 143 54 -162 169 -126 149 101 30 142 -386 -62 -248 -183 58
6547 58 -191 -121 33 -287 -42 73 188 21 -179 -85 265 7 5 36 63 -86 -19 -200 181 82 60 -132 -41 -85
6571 -85 -258 -37 -22 -56 184 21 -14 224 -16 144 228 26 104 -29 -76 84 18 -203 113 74 99 -43 -18 -5
6595 -5 101 154 -144 -86 -70 -193 -41 -164 -62 31 74 -42 -48 53 55 18 -89 -273 108 -95 189 -137 127 -188
6619 -188 -113 -18 -140 196 -272 141 -88 3 -224 -56 -136 -145 -33 28 -153 -107 -42 -46 214 8 1 -60 101 -245 82
6644 82 76 13 25 61 108 -113 225 -162 48 -22 -17 78 -254 -166 -100 36 15 110 48 36 61 -38 -18 162 -196 -172 -24
6671 -24 -289 30 -129 -125 -33 -47 -163 49 17 139 184 -173 -153 1 -275 -140 186 -40 -128 -11 77 -185 82
6694 82 -98 4 79 16 146 142 109 229 -124 -124 -10 -69 -24 -61 -158 -136 -22 212 80 76 107 68 82 251 -53 -357
$$ packed form
6524A82l53J25J56l6m9j55K74n0p0J19q9k16L31k95K75m8p1J12n28L24j86O5K41
6547E8k49P0J54l20K45J15J15j67k00R4L50k58kL1K7j49O7j81L81r9k2j92R1m4
6571h5j73K21J5l4K40j63l5K38k40J60Q4k02P8j33m7J60o6k21L16l9K5j42K5J3
6595eJ06N3k98N8J6j23J52j23J02R3M3j16oJ01Kl7j07j84L81k03K84l26K64l15
6619a88P5R5j22L36m68M13k29R1k27J68q0rJ12O1j81M6O5mK60k06po1J61l46L27
6644H2oo3J2L6M7k21L38l87K10p0NR5l32Q8O6J36k1R5o2j2K5r9K0J80l58K4J48
6671b4k65L19j59MR2j4j16K12l2J22M5l57K0J54k76J35L26k26q8J17Q8k62K67
6694H2j80J02P5o3J30ml3J20l53%J14n9M5l7r7K2J14K34j32mL1l9J4J69l04l04
$$ plain form
6720 -357 188 5 -284 -165 -150 -190 -193 193 5 92 106 -111 70 191 24 55 81 51 -70 -23 47 -95 62 268
6744 268 -71 349 -48 23 -14 14 27 31 -20 -136 -62 -195 252 106 37 285 -118 -205 119 -40 -123 143 -138 96
6768 96 -294 -156 -140 -156 -5 4 37 17 -75 48 -22 149 -29 14 -71 174 60 75 33 -54 106 -125 2 102 -69
6793 -69 -127 -19 36 210 -170 137 388 -37 -91 -37 45 3 -87 -140 -420 89 -154 243 -163 163 -57 -34 -164
6816 -164 48 156 -242 223 18 -78 -163 143 16 68 -385 -295 -4 -2 -72 101 -79 57 68 -168 153 -111 80
6839 80 51 255 148 105 53 -61 107 -1 88 36 -46 167 83 -78 -70 170 18 95 -70 -265 210 59 218 74
6863 74 -90 199 -212 -222 -3 -185 251 -25 25 115 -205 -136 -85 -19 206 232 133 -38 -117 -75 -115 103 66 -101
6887 -101 53 94 106 -75 -6 332 -8 9 179 -169 95 84 -81 40 -128 13 158 58 -196 -173 178 131
$$ packed form
6720c57N45j83k89J19J5m0lL86j88Q7J4k17J81J21j67L1K6l0j21M7P0j42J57K06
6744B68l39M20l97P1l7K8J3Mn1j16P4j33M47j46o9K48m03q7L24j59q3K66k81K34
6768I6l90J38J6j6J51RL3k0r2J23p0J71j78M3q5K45j14J5m2q7J60k31J27J00j71
6793f9n8J08N5J74l80L07K51m25n4N4Q2m2r0n3k80N09k43L97m06L26k20K3j30
6816a64K12J08l98M65k05r6q5L06j27N2m53R0K91Kp0J73j80J36J1k36L21k64J91
6839H0k9K04j07m3n2j14J68j08Q9n2q2K13q4j61QK40j52P7j65j95M75j51J59j44
6863G4j64K89m11j0K19j82M36k76N0R0l20O9N1O6K25K6r9j71p9M2m0K18l7j67
6887a01J54M1J2j81O9L38l40J7J70l48K64j1j65J21j68J41J45j00k54K3L51m7
$$ plain form
6909 131 111 115 106 214 -222 17 -82 156 0 -283 -28 103 144 -47 31 -70 33 89 37 -6 -6 -186 30 24 -52
6934 -52 -91 0 -145 -222 46 292 44 68 149 175 41 -285 -214 -4 109 -43 46 38 68 -197 157 131 -4 126
6958 126 50 23 -192 38 258 51 25 6 -12 186 212 -99 134 -147 59 102 -256 22 -4 14 -132 -143 102
6981 102 -272 -63 112 -30 -217 53 -200 -58 -208 -191 20 -75 -30 -114 -55 53 -175 81 210 -236 -94 149
7003 149 -36 -98 136 -272 113 -145 83 334 -113 -9 134 17 0 89 138 -98 -6 175 7 -170 277 276
7025 276 -48 -213 -102 -23 -273 -8 69 46 160 -223 -66 -31 189 161 24 -100 -23 -153 -192 3 82 -36 -12
7048 -12 13 -105 174 77 2 -71 -127 -204 250 -70 -61 -228 65 164 -100 119 -2 -75 52 267 63 -95 -7 21
7072 21 -97 54 76 75 224 205 -60 118 207 -82 -110 -2 109 -334 164 -354 46 -94 -226 -9 -6 9 -99
$$ packed form
6909A31k0MrJ08m36K39r9K38j56k83K55J31M1j91P8j01J03N6n2m3%j80K16op6
6934e2l9R1j45p7K68K46k48K4Q1K6j34l26P1K10J13j52Q9qL0k65L54k6j35J30
6958A26p6k7k15K30K20k07k6j9j8J98K6l11K33k81K06M3l58K78k6J8j46j1K45
6981A02l74K09J75j42j87K70k53J42j50J7K11r5M5q4N9J08k28K56J29m46J42K43
7003A49j85o2K34m08L85k58K28K51m47J04J43j17j7Q9M9k36R2J81j68j77M47j
7025B76l24j65J11P9k50K65P7k3J14l83J57L5K20k8j37j24P7j30l9J95P9j18K4
7048a2K5j18K79r7p5p3n6p7M54l20Rj67K93R9k64K19j21p3J27K15k04j58Q8K8
7072B1j18J51K2jJ49j9k65J78Q9k89k8J08J11m43M98n18M00j40j32K17LJ5j08
$$ plain form
7095 -99 -136 -75 -27 -171 43 110 -109 93 -160 128 70 315 -44 98 124 36 -69 -121 -107 461 38 -17 118 -132
7119 -132 63 43 25 -151 -75 61 52 215 337 -31 -7 34 20 76 -87 -11 50 -57 -94 257 -12 140 -124 -42
7143 -42 178 59 41 -98 29 58 -93 16 -55 88 -103 -62 -173 -37 -11 -158 367 163 296 -122 30 176
7165 176 -46 42 -290 -107 -57 -164 -218 154 46 -59 65 105 127 -77 -80 83 144 -74 -51 291 141 -92 117
7188 117 -132 -88 -191 -236 -65 -70 -22 -8 52 134 71 -230 -143 -196 160 -201 -81 -113 72 -126 143 -109 -76 -4 328
7213 328 238 79 122 30 95 156 15 12 9 -168 36 119 116 49 30 155 -19 127 -123 -103 -206 -42 68 159 -81
7238 -81 -12 -162 141 178 68 183 -162 -49 -248 165 -125 -279 -35 -84 136 -9 -12 180 223 -78 -22 -61 53
7261 53 -37 -138 2 -74 252 56 145 -37 -54 26 -125 261 99 -51 -42 -169 -11 -194 110 -81 339 6 32
$$ packed form
7095i9l7O1M8j44K14O7k19K02k53K88n8K45l59J42K6q8j05n2J4N68m23n5J35k50
7119a32J95k0j8j76P6J36rJ63J22l68K4M1j4N6j63P6O1j07l7L51k69J52k64Q2
7143d2K20j19j8j39J27K9j51J09p1J43j91M1j11J36K6j47N25k04J33m18J52J46
7165A76k22Q8l32J83N0j07n4L72j08j05J24M0K2k04lJ63O1k18K3L42j50k33K09
7188A17k49M4j03m5J71nM8J4O0Q2o3l01Q7n3L56l61J20l2J85j98K69k52L3P2L32
7213C28r0j59M3r2O5O1j41llj77K04Q3lo7j9J25j74J46k50K0j03J64J10R1k40
7238h1O9j50L03L7j10J15l45J13j99M13k90j54K44m9K20j45lJ92M3l01N6l9J14
7261E3r0j01J40p6L26j96Q9j82j7Q0j51L86j62j50Rj27J58j83L04j91M20l33K6
$$ plain form
7284 32 -189 -105 96 -109 145 203 15 -49 -10 -124 201 76 -112 12 -112 -41 -155 134 -153 186 -140 -69
7306 -69 87 68 177 -171 123 -239 -105 102 261 -28 17 239 16 51 57 199 24 2 20 -80 -51 -113 57
7329 57 49 -9 -195 -159 -47 -80 271 -42 6 -244 6 178 -43 45 -3 77 -36 79 -58 -64 -5 31 -155 100 -43
7354 -43 193 -39 -33 -25 -357 178 -98 -42 -113 -60 91 238 69 211 27 179 -5 81 -155 -33 120 -12 123
7377 123 -112 -263 121 235 -97 120 277 47 76 -81 116 101 168 -148 -35 2 -138 128 408 37 -116
7398 -116 121 37 12 98 -40 234 -317 -31 -276 -190 -255 -70 177 -55 -134 20 -70 -214 -119 38 -121 110 63
7421 63 -82 -13 49 38 -149 -123 101 154 -71 -24 -32 109 -193 22 59 94 104 -19 46 1 -69 -29 -193 101 262
7446 262 161 26 -149 220 83 -62 110 -11 26 -79 369 -147 33 184 -186 101 66 -301 7 -92 24
$$ packed form
7284C2k21Q4K01k05K54N8j88o4L9j14L25j25j88J24j24P1j14K89k87L39l26P1
7306f9J56j9J09l48K94l62J34K07J59k89M5K22k23L5OJ42j75k2J8j00K9o2J70
7329E7qn8j86L6J12l3L51l13M8k50K50J72k21Q8m8Q0j13J15j37oN9L6j86K55j43
7354d3K36k32OQl32N35k76N6p1N3J51J47j69J42j84J52j84Q6k36J22J53j32J35
7377A23k35j51L84J14l32K17J57k30K9j57J97j5O7l16J13L7j40K66K80l71j53
7398a16K37q4k5Q6j38K74n51K86k45Q6o5J85K47k32p9J54r0j44R5J57j59K31m7
7421F3j45O9O2j1j87K6K24N3k25M7qJ41l02K15L7L5J0j23O5m5p0M0j64K94J61
7446B62j01j35j75L69j37j45J72j21L7j05M48n16J80J51l70K87l5l67L08r9J16
$$ plain form
7467 24 -282 61 180 66 79 -262 -86 -341 89 274 -4 -37 -159 113 -257 -22 86 -207 419 267 57
7488 57 68 11 22 -50 75 97 -85 131 -28 160 140 -81 44 35 -129 132 -217 -74 -103 147 -58 -262 98
7511 98 -139 138 -182 71 49 -140 124 93 -17 206 47 252 108 -85 225 -82 44 -66 -1 125 -259
7532 -259 232 98 132 18 346 71 98 126 -14 134 40 -39 -52 -88 9 12 -126 -260 10 -7 -163 -289 -120 -73
7556 -73 -84 -26 -2 -151 -43 280 265 42 -42 20 -189 -52 121 77 -85 104 156 9 10 205 112 151 -234 132
7580 132 69 -266 -30 79 75 58 -114 -62 77 -25 -148 -78 -18 -168 72 -14 195 13 67 -19 -48 34 172 142
7604 142 241 208 14 183 -183 97 -195 -50 62 -63 83 22 -142 243 84 -120 -151 -104 159 71 97 -117
7626 -117 -7 -39 -122 258 45 83 0 197 -193 132 -117 102 -92 -224 -54 1 54 -25 177 -26 -27 -125 -19
$$ packed form
7467B4l06L43J19j14J3l41J76k55M30J85k78l3j22K72l70K35J08k93O26j52k10
7488E7J1n7J1p2J25K2j82K16j59J88k0k21J25rj64K61l49J43k9K50k05k04L60
7511I8k37K77l20K53k2j89K64l1j10K23j59K05j44j93L10l07J26j10O5J26l84
7532b59M91j34L4j14L28k75K7K8j40J48r4p9j3l6R7Lj38j34K70j7j56j26J69M7
7556g3j1N8K4j49J08L23j5k23q4O2k09J37J73m4j62J89N2j47JJ95r3L9l85L66
7580A32o3l35K36J09mj7j72N2J39j02j23P0O0j50K40q6K09j82N4q6k9Q2J38l0
7604A42R9l3j94J69l66K80k92J45J12j25J46o1j64L85j59k04l1M7K63q8K6k14
7626a17J10l2q3L80k13L8q3J97l90L25k49K19j94j32J70N5N3p9K02k03jr8J06
$$ plain form
7649 -19 -74 -119 -183 139 243 166 -173 -173 -64 127 152 22 104 221 73 267 -49 -36 -96 -82 142 36 -8 161
7673 161 -4 -82 68 -33 -98 72 -136 -151 -151 42 -120 -81 139 -166 -71 -113 192 -100 178 4 -2 -62 -12 88
7697 88 82 362 -106 95 -41 -27 -26 -337 136 122 -6 51 -186 80 107 -79 -1 -29 87 53 24 -225 -235 163 -40
7722 -40 114 -80 -96 -107 -62 -142 157 -13 80 -46 62 -287 -129 -137 34 83 22 227 63 34 73 72 -2 117 -4
7747 -4 101 4 -55 122 177 161 190 -116 14 223 134 -64 3 8 60 -52 -177 -174 -76 -168 61 -46 -75 24 42 0 85
7774 85 -61 -81 173 146 -176 -57 -94 131 33 10 64 -83 -11 35 112 -24 364 186 -18 7 43 177 317 -40
7798 -40 -171 127 32 3 -208 -80 289 120 -55 136 -32 161 29 46 2 169 -130 -199 85 -121 -227 -24
7820 -24 34 75 -57 148 34 -74 178 67 42 107 42 211 -39 60 -114 98 26 -82 -171 -45 116 -215 -23
$$ packed form
7649a9n5m5o4L22J04p7l39%J09J91K5j30Q2J17j48J94l16J3o0J4K24j06m4J69
7673A61j65p8J50j01o5J70k08j5%J93j62L9K20l05R5m2L05k92K78j74oo0N0J00
7697H8oK80m68K01j36J4Jl11M73j4j28N7k37K66K7j86P8k8J16l4k9k49j0L98k03
7722d0J54j94j6j1M5q0K99j70R3j26J08l49J58qJ71M9o1K05j64k9L9jp4J19j21
7747dJ05r7n9J77N5j6K9l06J30K09q9j98O7NN2j12j25LR8r2K29j07k9R9J8m2Q5
7774H5j46k0K54k7l22J19l7K25r8k3N4j47P2M6P7j36L88j78k04K5L6J34J40l57
7798d0j31K98r5k9k11J28L69j69j75J91j68J93j32J7m4J67k99o9K84k06j06K03
7820b4N8M1j32K05j14j08K52j11k5O5o5J69k50R9j74K12p2j08q9J26J61l31J92
$$ plain form
7843 -23 -65 -98 -114 33 -57 144 45 -53 -47 -144 -41 -86 165 148 270 272 -37 -42 -33 -92 -142 -18 -140 161 -87 221 83
7870 83 -154 94 -79 -38 310 -4 1 -43 12 -210 -246 125 210 148 85 -89 -5 -14 -10 95 -45 117 240 61 -177
7895 -177 3 -68 -84 15 -50 -63 31 -53 -84 -14 -288 204 222 -83 -120 -21 -73 -151 -45 -75 45 -24 -272 -75 3 -120
7921 -120 54 82 -115 -155 -80 -113 124 181 260 -186 7 -126 -95 149 84 279 -59 -51 -49 -62 -47 77 -311 -123 -331
7946 -331 -35 -102 -110 187 46 53 62 50 -284 -9 -174 173 -214 -61 -104 136 4 -212 -47 -50 -9 -92 332 55
7970 55 -58 -291 -155 62 -189 -102 231 122 -49 30 -89 -140 102 19 149 -24 129 98 -83 -50 56 -166
7992 -166 -249 -32 -181 71 -200 -159 51 -49 -156 -161 -206 111 11 -97 -65 80 -251 -140 -81 55 228 171 212
8015 212 19 -21 112 73 -21 -60 -32 148 -205 273 64 171 -17 1 -160 -33 24 -54 -35 69 131 224 -58 -21
$$ packed form
7843b3m2l3j6J47r0K01r9r8Or7J03m5K51j7J22Kl09nRn9n0J24j22L01k48L08j38
7870H3k37K48j73M1L48l14Nm4N5k22l6L71Q5o2o3j74Q4rMJ05j40J62J23j79k38
7895a77J80p1j6R9o5j3R4q4l1P0k74M92J8l05l7R9n2p8J06l0J20o9k48J97P8j23
7921a20J74K8j97m0P5l3K37N7P9m46J93j33L1K44o5J95l38QKj3J5J24l88J88k08
7946c31K96o7qK97j41PRj2l34K75j65L47l87J53m3K40j32k16J65lM1q3M24k77
7970E5j13k33J36K17k51Q7L33j09j71P9j19n1K42q3J30j73J53l1j81L3J06k22
7992a66q3K17j49K52k71M1K10j00j07nm5L17j00j08L2J45l31J11N9J36J73n7M1
8015B12j93m0J33l9r4l9K8J80l53M78k09J07j88J8j61J27N7p8J9J04O2R3k82L7
$$ plain form
8039 -21 -58 62 110 -2 74 -109 -15 180 -41 -30 -203 -146 -165 11 154 -37 -63 20 -278 -66 61 -175 -172 5
8063 5 -83 3 83 -17 -94 16 21 -57 -89 27 -134 112 -120 -71 56 37 -32 59 -152 54 -113 -168 -198 -75 -122 -50
8089 -50 163 22 -57 92 89 -50 158 -72 159 -154 -62 -173 112 -34 65 33 -163 77 136 -17 -113 -22 -19 178
8113 178 -181 -33 -334 110 50 -34 -168 21 157 -51 -50 102 177 49 45 72 -82 -11 135 -11 -167 64 -147
8136 -147 144 273 -61 55 -15 199 -8 -31 121 -86 -274 202 105 215 11 -128 -158 73 85 70 -277 35
8158 35 -106 59 73 -81 -120 30 72 31 -88 88 -244 -35 -215 -70 18 -13 -62 -100 -95 75 -89 -21 73 -69
8182 -69 -87 14 -153 -117 58 -76 -36 -20 133
$$ packed form
8039b1l7J20M8j12P6j83R4J95k21J1j73N7j9J76J43j91k6Q3k98K12J27k36LJ77
8063Eq8Q6Q0j00p7J10Np8l2J16j61K46k32M9J27j9o9R1k11K06j67n5l0J23m7P2
8089e0K13j41p9J49lj39K08k30K31l13R2j11K85j46R9l2j96K40N9j53r6R1LJ97
8113A78l59J48l01M44o0q4j34J89J36k08JJ52P5j28mK7j54P1J46j46j56K31k11
8136a47K91J29l34J16p0K14k07k3J52k07j88M76r7J10k04j39l0K31J2j5l47L12
8158C5j41J65J4j54l9J50M2m1j19J76l32K09j80J45Q8l1m9l8NJ70j64O8R4j42
8182f9j8J01j67L6J75j34M0J6J53
8191A33
$$ Imaginary data points
##PAGE= N=2
##DATA TABLE= (X++(I..I)), XYDATA
$$ plain form
0 0 0 0 0 0 0 0 0 0 0 -8 0 -8 8 -8 16 -16 16 -24 27 -36 40 -48 62 -71 82 -96 112 -130 150 -173 197 -224 256
33 256 -288 326 -367 411 -461 515 -575 641 -711 791 -874 968 -1070 1178 -1301 1433 -1579
50 -1579 1739 -1915 2112 -2331 2576 -2853 3166 -3527 3946 -4438 5035 -5761 6679 -7881 9520
65 9520 -11911 15736 -22884 40890 -192129 -231211 146944 277720 394357 335857 94753
76 94753 -246545 -375733 -335230 -192654 12806 286414 410138 302134 63263 -143214
86 -143214 -318948 -384088 -244086 45069 269317 358227 312043 126190 -150681 -344527 -359125
97 -359125 -211100 20296 243137 349050 295197 107022 -127813 -298487 -323812 -208982
107 -208982 -9615 195994 323354 298027 125657 -99395 -264330 -317594 -238422 -32893
$$ packed form
0@%%%%%%%%%qQqJ6j6K4l2L2m0N1o3P6q8J10j33J53j78K08k42K80l23L70m21M80
33B56n44O14o93P78q72R76j090J216j352J502j665J842k038K248k479K734l012
50a579L318l654M027m443M907n429O019o693P473q384R473j0796J2440j4560J7401
65I520k1431K7647l8620O3774k33019l9082L78155J30776J16637n8500k41104
76I4753l41298j29188M0503J42576K05460K73608J23724j08004k38871k06477
86a43214j75734o5140J40002K89155K24248Q8910m6184j85853k76871j93846j4598
97c59125J48025K31396K22841J05913n3853j88175k34835j70674k5325J14830
107b08982J99367K05609J27360k5327j72370k25052j64935n3264P9172K05529
$$ plain form
117 -32893 202532 319452 275091 130186 -69991 -262203 -324813 -210398 -12480 163547
127 163547 275164 277277 139618 -72505 -232192 -274029 -210328 -60901 135525 276138 270463
138 270463 138363 -38619 -201721 -287370 -231286 -53977 138017 252811 257028 149276 -32516
149 -32516 -201295 -267698 -205164 -58295 107280 229128 249388 148748 -19846 -170045 -242508
160 -242508 -211795 -83005 89831 220895 244743 155446 -1308 -158451 -244808 -214388 -79744
171 -79744 86818 205998 231530 153246 2696 -147363 -223901 -197806 -85730 63507 185176
182 185176 221590 155658 19341 -124217 -210722 -202734 -99728 51212 176984 218934 159900
193 159900 27002 -117956 -206053 -197132 -97581 45305 164840 206121 152892 32562 -101440
$$ packed form
117c2893K35425J16920m4361j44905k00177j92212o2610J14415J97918J76027
127A63547J11617K113j37659k12123j59687m1837O3701J49427J96426J40613n675
138B70463j32100j76982j63102q5649N6084J77309J91994J14794M217j07752j81792
149c2516j68779o6403O2534J46869J65575J21848K0260j00640j68594j50199p2463
160b42508L0713J28790J72836J31064K3848q9297j56754j57143q6357L0420J34644
171g9744J66562J19180K5532p8284j50550j50059p6538K6095J12076J49237J21669
182A85176L6414o5932j36317j43558q6505P988J03006J50940J25772M1950n9034
193A59900j32898j44958q8097Q921R9551J42886J19535M1281n3229j20330j34002
$$ plain form
204 -101440 -188195 -188463 -102825 28536 145747 196987 158756 46339 -87811 -180519 -188679 -110963
216 -110963 17761 139757 195375 157462 48544 -79863 -171387 -183212 -109318 13512 127049
227 127049 180373 153106 56566 -66390 -157923 -175771 -113556 -669 112262 175576 156841
238 156841 63832 -56576 -149822 -174761 -118970 -6407 108031 169362 152511 66574 -49318
249 -49318 -142352 -167726 -115172 -12016 94385 158005 150247 72257 -38807 -129901 -161284 -120463
261 -120463 -23671 85462 153794 149548 77230 -29825 -123659 -159994 -120652 -26001 77895
272 77895 145731 146614 79593 -23709 -114820 -151628 -119293 -33638 67844 137320 143442 83155
284 83155 -13826 -104586 -147114 -121825 -40173 59224 130807 142122 86966 -7573 -97595 -142506
$$ packed form
204a01440q6755k68Q5638J31361J17211N1240l8231j12417j34150r2708q160P7716
216a10963J28724J21996N5618l7913j08918j28407r1524j1825P3894J22830J13537
227A27049N3324k7267r6540j22956r1533j7848O2215J12887J12931O3314j8735
238A56841r3009j20408r3246k4939N5791J12563J14438O1331j6851q5937j15892
249d9318r3034k5374N2554J03156J06401O3620p758p7990j11064r1094l1383M0821
261a20463R6792J09133O8332m246p2318j07055r3834l6335L9342R4651J03896
272G7895O7836Q83o7021j03302r1111l6808L2335Q5655J01482O9476O122o0287
284H3155r6981r0760m2528K5289Q1652R9397P1583J1315n5156r4539r0022m4911
$$ plain form
296 -142506 -121198 -43870 52656 123318 137670 89102 -773 -88900 -135228 -119882 -49928 43039
308 43039 115750 134730 91438 6488 -80508 -130796 -120672 -54354 36434 109320 131329 93411
320 93411 12100 -74298 -125142 -118092 -57465 29216 102216 127385 93636 17709 -65746 -118812
332 -118812 -117291 -61349 22289 94977 123590 95678 23356 -59119 -113637 -115587 -64343 15824
344 15824 88840 120376 95798 27738 -51970 -107875 -113957 -66594 10370 81518 115256 96212
356 96212 32853 -45700 -101744 -110749 -69961 2874 75107 111706 95947 36896 -37895 -95901
368 -95901 -110104 -72101 -1071 68696 106260 96735 41622 -33184 -90949 -105651 -73352 -7971
380 -7971 62296 103441 95146 43572 -25905 -83962 -104691 -75537 -11240 55995 97256 95208 49136
$$ packed form
296a42506K1308P7328R6526P0662J4352m8568q9875q8127m6328J5346O9954R2967
308D3039P2711J8980m3292q4950q6996n0288J0124O6318R0788P2886K2009l7918
320I3411q1311q6398n0844P050O0627Q6681P3000K5169l3749p5927q3455n3066
332a18812J521N5942Q3638P2688K8613k7912p2322q2475n4518j950N1244Q0167
344A5824P3016L1536k4578o8060p9708n5905o082M7363P6964P1148L3738j9044
356I6212o3359p8553n6044r005M0788P2835P2233L6599j5759n9051p4791n8006
368i5901j4203L8003P1030O9767L7564r525n5113p4806n7765j4702L2299O5381
380g971P0267M1145q295n1574o9477n8057k0729K9154O4297O7235M1261k048m6072
$$ plain form
393 49136 -20897 -80146 -100717 -75851 -17778 50260 94833 93793 49469 -14904 -73357 -98904
405 -98904 -77299 -20156 44689 88021 92239 54208 -10226 -69172 -94236 -77593 -26229 38993
417 38993 86134 91447 54710 -4804 -62884 -93024 -78520 -26902 34527 79429 89505 57765
429 57765 -1769 -59020 -87238 -76984 -32527 28696 76522 87444 58270 4506 -52497 -86633
441 -86633 -78735 -33235 24955 70596 86521 61655 5589 -50386 -80572 -76431 -38722 20087
453 20087 69231 82369 58990 12192 -42233 -79807 -77501 -37953 15279 60255 81720 65680
465 65680 14300 -42338 -74604 -74484 -44012 10202 62739 80180 59266 17541 -32750 -72190
477 -72190 -76662 -41603 8844 52195 74902 65650 22342 -32192 -68050 -72143 -47004 578 51617
$$ packed form
393D9136p0033n9249k0571K4866N8073O8038M4573j040m4324o4373n8453k5547
405i8904K1605N7143O4845M3332M218l8031o4434n8946k5064J6643N1364O5222
417C8993M7141N313l6737n9514n8080l0140J4504N1618O1429M4902J0076l1740
429E7765n9534n7251k8218J0254M4457O1223M7826J0922k9174n3764n7003l4136
441h6633P898M5500N8190M5641J5925k4866n6066n5975l0186M141L7709N8809
453B0087M9144J3138k3379m6798n4425l7574K306L9548N3232M4976K1465j6040
465F5680n1380n6638l2266J20L0472N4214N2537J7441k0914m1725n0291l9440
477g2190m472L5059N0447M3351K2707r252m3308n4534l5858m093K5139M7582N1039
$$ plain form
490 51617 76892 63370 22984 -25624 -65391 -75169 -46926 2216 46757 70597 63748 26080
502 26080 -23516 -60228 -69987 -48660 -4867 41764 68852 64260 30345 -17811 -58101 -71257
514 -71257 -50705 -7049 38651 67839 65268 30724 -16965 -54584 -67666 -50890 -8990 36872
526 36872 62770 60423 33031 -10036 -50175 -66166 -51054 -14294 29162 60987 64605 36438
538 36438 -8682 -47896 -65364 -53682 -15956 30133 59557 60888 36013 -5249 -45176 -62741
550 -62741 -50694 -16726 23790 54092 60265 38105 -921 -39300 -59766 -53750 -22816 19637
562 19637 53398 61404 40769 1603 -38797 -60649 -52953 -21684 18562 50778 58567 39087 3018
575 3018 -33293 -55358 -51851 -23862 13667 44418 56666 42678 8417 -29725 -54263 -53460 -28266
$$ packed form
490E1617K5275j3522m0386m8608l9767r778K8243M9142M4541K3840o849l7668
502B6080m9596l6712r759K1327M3793M6631K7088m592l3915m8156m0290j3156
514g1257K0552M3656M5700K9188k571l4544m7689l7619j3082J6776M1900M5862
526C6872K5898k347k7392m3067m0139j5991J5112L6760M3456L1825L618k8167
538C6438m5120l9214j7468J1682L7726M6089K9424J331k4875m1262l9927j7565
550f2741J2047L3968M0516L0302O173k2160l9026l8379k0466O016L0934M2453
562A9637L3761Q006k0635l9166m0400k1852P696L1269M0246L2216P789j9480l6069
575C018l6311k2065L507K7989L7529L0751J2248j3988l4261l8142k4538Q03K5194
$$ plain form
588 -28266 10036 44999 58542 43357 7956 -28600 -52559 -53274 -26948 11526 40772 52050
600 52050 42066 11661 -24684 -48043 -49709 -29924 3042 36611 53952 44614 14334 -20883 -46750
613 -46750 -52945 -32990 4245 37672 51430 43960 15975 -21199 -46877 -48373 -29510 552 31907
626 31907 49150 41903 16813 -14953 -40099 -48733 -35055 -3247 30044 47964 44143 21385 -12870
639 -12870 -42331 -49512 -33009 -3455 28025 47465 43373 18831 -12219 -37449 -45956 -33081 -5816
652 -5816 23471 42736 42533 22688 -6897 -33940 -46134 -36787 -10048 21370 43341 44553 24446
665 24446 -6062 -33978 -46353 -35860 -8089 20398 39802 41925 24550 -4856 -30168 -41165
677 -41165 -35277 -12859 15764 37174 41616 27101 174 -27158 -42782 -38342 -15088 15034 37070
$$ packed form
588b8266L8302L4963J3543j5185l5401l6556k3959p15K6326L8474K9246J1278
600E2050r984l0405l6345k3359j666J9785L2966L3569J7341r338l0280l5217k5867
613d6750o195J9955L7235L3427J3758p470k7985l7174k5678j496J8863L0062L1355
626C1907J7243p247k5090l1766k5146q634J3678L1808L3291J7920l821k2758l4255
639a2870k9461p181J6503K9554L1480J9440m092k4542l1050k5230q507J2875K7265
652e816K9287J9265k03j9845k9585k7043j2194R347K6739L1418K1971J212k0107
665B4446l0508k7916j2375J0493K7771K8487J9404K123j7375k9406k5312j0997
677d1165N888K2418K8623K1410M442j4515k6927k7332j5624M440K3254L0122K2036
$$ plain form
690 37070 42570 28005 -553 -27635 -40380 -35550 -14084 13456 34088 38458 26777 3376 -22754
703 -22754 -37971 -35571 -17435 8355 31359 40439 30232 4992 -21691 -37966 -37151 -19291 8875
716 8875 32740 39067 27822 5353 -19757 -36571 -35139 -17352 6604 26663 36298 29285 8199
729 8199 -16807 -33178 -35156 -21547 2569 26442 37985 30605 9417 -15485 -33378 -35977 -21400
742 -21400 3314 26013 35430 28598 9959 -13081 -30669 -33952 -20746 819 20620 32867 30570
755 30570 13625 -10880 -29176 -33312 -23649 -3189 20999 34920 30668 12758 -9274 -27622 -33842
768 -33842 -23278 -1302 19621 30928 28776 14471 -7310 -25465 -31777 -23020 -5004 15681 29845
781 29845 30163 16419 -5030 -24169 -32064 -24641 -6308 15083 30167 30327 15750 -5452 -22161
$$ packed form
690C7070N500j4565k8558k7082j2745M830K1466K7540K0632M370j1681k3401k6130
703b2754j5217K400J8136K5790K3004R080j0207k5240k6683j6275Q15J7860K8166
716H875K3865O327j1245k2469k5110j6814J432J7787K3956K0059R635p013k1086
729H199k5006j6371j978J3609K4116K3873J1543p380k1188k4902j7893k599J4577
742b1400K4714K2699R417o832j8639k3040j7588l283J3206K1565J9801J2247k297
755C0570j6945k4505j8296m136R663K0460K4188J3921m252j7910k2032j8348o220
768c3842J0564K1976K0923J1307k152j4305k1781j8155o312Q757J8016K0685J4164
781B9845L18j3744k1449j9139p895P423J8333K1391J5084J60j4577k1202j6709
$$ plain form
794 -22161 -29945 -25067 -6992 14523 27200 26998 17230 -939 -20942 -30475 -23807 -8110 10021
807 10021 25440 30307 19114 -2299 -19840 -27829 -25177 -10820 11362 26743 27479 16964 867
820 867 -17171 -28477 -24552 -9188 8370 21972 27324 19887 1508 -16630 -26370 -24480 -12352
833 -12352 6410 22857 27383 19374 2901 -14584 -25786 -24909 -11577 6087 21073 25824 19606
846 19606 3979 -13276 -24138 -24313 -12909 4077 19061 25713 20067 5594 -11738 -23749 -24417
859 -24417 -13870 2960 17860 25180 20419 5865 -10780 -22359 -23700 -14369 1883 16826 23919
872 23919 20006 7039 -9027 -20959 -23590 -14789 444 15434 23081 20538 8575 -8245 -20419
885 -20419 -23184 -15311 -705 14186 23010 20315 8547 -6735 -18920 -22645 -16104 -1721 13264
$$ packed form
794b2161p784M878J8075K1515J2677k02r768j8169k0003r533O668J5697J8131
807A0021J5419M867j1193k1413j7541p989K652J4357K2182J5381P36j0515j6097
820H67j8038j1306L925J5364J7558J3602N352p437j8379j8138r740J890J2128
833a2352J8762J6447M526q009j6473j7485j1202Q77J3332J7664J4986M751o218
846A9606j5627j7255j0862j75J1404J6986J4984O652n646j4473j7332j2011o68
859b4417J0547J6830J4900P320m761j4554j6645j1579j341R331J6252J4943P093
872B3919l913j2967j6066j1932k631Q801J5233J4990P647k543j1963j6820j2174
885b0419k765P873J4606J4891Q824k695j1768j5282j2185l725O541J4383J4985
$$ plain form
898 13264 21316 20168 9804 -5315 -18259 -22038 -15561 -2411 11647 21180 20579 10168 -4738
911 -4738 -16657 -21303 -16561 -3466 10871 20228 19758 10708 -3356 -15672 -21170 -16524 -4226 9571
925 9571 19111 19820 11570 -2094 -14734 -20407 -16588 -5217 8394 18246 19877 12112 -1280 -13778
939 -13778 -19594 -16796 -6177 7624 17275 19306 12231 -113 -12680 -19068 -16981 -6633 6094
952 6094 16080 18838 13295 962 -11669 -18176 -16667 -7848 5174 15916 18752 12835 1715 -10277
966 -10277 -17882 -17142 -7887 4557 14306 17857 13880 2672 -9831 -17360 -16328 -8950 3068 13976
980 13976 17919 13289 3436 -8012 -16150 -16788 -9019 2569 12815 17416 13940 3824 -7821 -15655
994 -15655 -16155 -9322 1363 12059 17084 13686 4350 -6027 -14963 -16823 -10150 1137 10937 16175
$$ packed form
898A3264Q052j148j0364j5119j2944l779O477J3150J4058R533o01j0411j4906
911d738j1919m646M742J3095J4337R357m70r050j4064j2316n498M646J2298J3797
925I571R540P09q250j3664j2640n673L819J1371J3611R852J631p765j3392j2498
939a3778n816K798J0619J3801R651K031p075j2344j2567o388K087J0348J2727
952F094R986K758n543j2333j2631o507J509Q819J3022J0742K836n917j1120j1992
966a0277p605P40R255J2444R749L551l977j1208j2503p529J032P378J2018J0908
980A3976L943m630r853j1448q138o38P769J1588J0246M601l476j0116j1645p834
994a5655n00O833J0685J0696N025l398r336j0377q936j860O673J1287R800N238
$$ plain form
1008 16175 14624 5408 -5977 -14583 -15977 -10511 -560 10466 16168 13836 5410 -4772 -13451 -15934
1022 -15934 -10539 -239 9061 14488 14352 6743 -4387 -12753 -15272 -11182 -2205 8487 15105 14102
1036 14102 6759 -3157 -11768 -15359 -11245 -2029 7860 13897 14071 7321 -2725 -11070 -14253 -11734 -3243
1051 -3243 6905 13269 13463 8115 -1031 -10626 -14800 -11658 -3535 5700 13253 14550 8021 -1640 -9687
1066 -9687 -13398 -11614 -4231 5990 12482 12697 8191 541 -8636 -13863 -11432 -4158 3859 11210 13440
1081 13440 8974 233 -8490 -13254 -12275 -5268 4109 11543 13227 8480 514 -7834 -12374 -11445 -4845
1096 -4845 3045 10142 12454 8737 1552 -6332 -12056 -12132 -5859 2571 9417 12559 10202 2520 -7051
1111 -7051 -12037 -11450 -6363 2065 9594 12868 9277 1469 -5754 -10142 -11236 -6944 1605 8457 11482
$$ packed form
1008A6175j551r216j1385q606j394N466R951J1026N702k332q426j0182q679k483
1022a5934N395J0300R300N427j36p609j1130q366k519M090Q977J0692O618j003
1036A4102p343r916q611l591M114R216R889O037J74o750j0046q345l183K519Q491
1051c243J0148O364J94n348r146r595m174L142Q123R235P553J297o529r661q047
1066i687l711J784P383J0221O492K15m506p650r177n227K431P274Q017P351K230
1081A3440m466q741q723m764R79P007R377P434J684m747p966q348m540R29O600
1096d845P890P097K312l717p185p884n724p6O273Q430O846L142k357p682r571
1111g051m986N87N087Q428P529L274l591p808p223m388j094M292Q549O852L025
$$ plain form
1126 11482 9375 4098 -4566 -10727 -11592 -7191 442 7882 11918 10100 3386 -4586 -10643 -11251 -6838
1141 -6838 335 7197 11409 9356 3154 -3835 -8861 -10589 -7827 -380 7119 10574 9440 5202 -2214
1156 -2214 -9700 -11862 -7383 -610 5916 10724 10658 4575 -3791 -9091 -9869 -7724 -1463 6140 10239 8728
1172 8728 4209 -1381 -7418 -10374 -7948 -1925 4716 9191 10408 6107 -1648 -8208 -10520 -8259 -2024
1187 -2024 5143 9610 9652 4998 -1498 -7310 -9413 -7457 -2443 3812 8552 9381 5321 -390 -5694 -9359
1203 -9359 -9072 -3525 3930 8528 9300 6601 713 -6998 -10321 -7790 -2389 2570 7973 9582 5985
1218 5985 -1064 -5617 -7535 -8205 -4447 2602 7783 8137 6244 2089 -4314 -9522 -8907 -3491 1958 6469
1234 6469 9526 7458 699 -5740 -8374 -7746 -4225 1696 7232 8393 5604 1362 -3534 -7723 -8076
$$ packed form
1126A1482k107n277q664o161q65M401P633P440M036j818o714p972o057o08M413
1141f838P173O862M212k053o202o989n026j728K762P447P499L455j134m238p416
1156b214p486k162M479O773O526M808o6o083q366n300p78K145O261P603M099j511
1172H728m519n590o037k956K426O023O641M475J217m301p755o560k312K261O235
1187b024P167M467M2m654o496n812k103J956N014O255M740Q29m060n711n304l665
1203i359K87N547P455M598P72k699n888p711l323K531N401M959N403J609l597
1218E985p049m553j918o70L758P049N181L54j893m155o403n208O15N416N449M511
1234F469L057k068o759o439k634O28L521N921N536J161k789m242m896m189l53
$$ plain form
1249 -8076 -4354 986 5672 8034 7332 2575 -3665 -7936 -8603 -5024 589 6073 8840 6952 1641
1264 1641 -3650 -7404 -7672 -4548 540 5487 7407 6369 2454 -2200 -6537 -7801 -5555 -592 4832
1279 4832 7900 7332 3322 -2251 -7120 -7977 -5099 -290 4821 7978 6848 2571 -2594 -6246 -6776 -5281
1295 -5281 -825 4122 6789 6391 3791 -1093 -5637 -7515 -5644 -1161 3541 7176 7432 3835 -1624
1310 -1624 -6153 -7521 -5631 -1317 3666 7027 6402 3476 -828 -4869 -6593 -5599 -1642 2901 6024
1325 6024 6585 4531 -29 -4766 -7130 -5942 -1922 2581 6270 7176 4417 -660 -4987 -6779 -5478
1340 -5478 -2039 2250 6017 6105 3899 235 -3740 -6182 -5972 -2600 1617 4903 6241 5186 779 -4225
1356 -4225 -6549 -6109 -2787 1702 5665 6694 4266 167 -3575 -5904 -5735 -2688 1827 4620 5907
$$ packed form
1249h076L722N340M686K362p02m757o240m271o67L579N613N484K767j888n311
1264A641n291l754k68L124N088M947J920j038l915m654m337j264K246M963N424
1279D832L068n68m010n573m869q57K878M809N111L157j130m277n165l652n30J495
1295e281M456M947K667l98k600m884m544j878J871M483M702L635K56l597n459
1310a624m529j368J890M314M983L361o25k926m304m041j724R94L957M543L123
1325F024N61k054m560m737k364J188M020M503L689R06k759n077m327j792J301
1340e478L439M289L767Q8k206l664l975k442K10L372M217L286J338j055m407n004
1356d225k324M40L322M489L963J029k428m099l742k329J69L047M515K793J287
$$ plain form
1371 5907 4856 1336 -3019 -5869 -5859 -3306 559 4482 6410 4958 1528 -2620 -5601 -5770 -3194 1345
1387 1345 4434 6067 4972 1363 -2595 -5297 -5636 -3300 209 3734 5738 4960 1799 -2276 -4746
1402 -4746 -5853 -3993 -262 3936 5629 5159 2130 -2112 -5359 -5625 -3556 -160 3461 5350 4815 2138
1418 2138 -1393 -4358 -5328 -3613 -526 3034 5183 5087 2553 -1207 -4501 -5588 -3965 -1034 2909 5226
1434 5226 5242 2601 -1032 -4211 -5254 -3787 -1133 2295 4726 4789 2564 -626 -3692 -5187 -4174 -1397
1450 -1397 2309 4475 4843 3134 -319 -3425 -5229 -4313 -1100 2188 4629 4943 3021 -497 -3454 -4539
1466 -4539 -4036 -1657 1808 4291 4924 2961 158 -2873 -4857 -4302 -1891 1513 3838 4749 3423 122
1482 122 -3007 -4716 -4200 -2187 1469 4104 4417 3154 448 -2586 -4477 -3946 -1859 931 3492 4692
$$ packed form
1371E907j051l520m355k850J0K553L865L923J928j452l430m148k981j69K576M539
1387A345L089J633j095l609l958k702l39K336L509L525K004p78l161m075k470
1402d746j107J860L731M198J693m70l029m242l247k66K069L396L621J889n35k677
1418B138l531k965r70J715L087L560K149r6k534l760l294j087J623K931L943K317
1434E226J6k641l633l179j043J467K654L428K431O3k225l190l066j495J013K777
1450a397L706K166L68j709l453l106j804R16L213L288K441L14j922l518k957j085
1466d539N03K379L465K483O33j963k803l031j984N55K411L404K325R11j326l301
1482A22l129j709N16K013L656K635L13j263k706l034j891N31K087K790K561J200
$$ plain form
1498 4692 3480 600 -2272 -4114 -4183 -2354 527 3498 4528 3343 1048 -1978 -4330 -4588 -2267 848
1514 848 2700 4412 3429 819 -2080 -3671 -4097 -2627 359 2894 4456 3423 1275 -1507 -3999 -4384
1530 -4384 -2309 242 2607 4208 3852 1413 -1864 -3569 -3696 -3056 -344 3071 3938 3305 1252 -827
1546 -827 -3179 -4254 -2686 331 2245 3537 4101 1919 -1433 -3532 -3685 -2943 -555 2196 3945 3526
1562 3526 1495 -719 -3298 -4094 -2812 -228 1907 3426 3547 1860 -888 -2861 -3389 -2811 -900 1804
1578 1804 3662 3385 1964 22 -2811 -3840 -2830 -683 1557 3240 3765 2047 -539 -2482 -3361 -2888
1594 -2888 -1289 1456 3390 3248 1966 198 -2180 -3712 -3010 -1282 937 2827 3756 2756 -186 -2427
1610 -2427 -3115 -3292 -1511 1078 2784 2953 2155 362 -1908 -3368 -3051 -1330 961 2385 3302 2703 315
$$ packed form
1498D692j212k880k872j842o9J829K881K971J030j185k295l026k352k58K321L115
1514H48J852J712r83k610k899j591m26J470K986K535J562j033k148k782k492l85
1530d384K075K551K365J601l56k439l277j705j27O40K712L415Q67o33k053k079
1546h27k352j075J568L017J914J292N64k182l352k099j53P42K388K751J749m19
1562C526k031k214k579p96J282K584K135J519J21j687k748j973n28N78J911K704
1578A804J858k77j421j942k833j029J010K147K240J683N25j718k586j943q79M73
1594b888J599K745J934j42j282j768k378j532P02J728K219J890R29j000k942k241
1610b427o88j77J781K589J706J69p98j793k270j460L17J721K291J424R17n99k388
$$ plain form
1627 315 -1942 -3001 -3109 -1879 721 2796 3336 2325 487 -1771 -3037 -3073 -1218 578 2265 3097
1643 3097 2778 766 -1609 -2875 -2801 -1737 109 2217 3258 2392 858 -1128 -2928 -3154 -1723 335
1659 335 2384 2953 2201 702 -1461 -2884 -2827 -1819 33 1817 2895 2448 894 -792 -2497 -2962 -2081
1676 -2081 -264 2094 3170 2663 1215 -861 -2521 -2734 -2077 -162 1860 2822 2654 1379 -948 -2088
1692 -2088 -2459 -1979 -527 1318 2639 2715 1281 -520 -1981 -2987 -2228 -375 1445 2658 2606 1553 -521
1709 -521 -2111 -2483 -2104 -384 1242 2732 2041 1445 -188 -1707 -2960 -2031 -675 773 1969 2585 1774
1726 1774 -180 -1772 -2542 -2121 -997 770 2493 2451 1481 -96 -1555 -2123 -1783 -720 992 1967 2542
1743 2542 1773 184 -1564 -2180 -1932 -929 503 2212 2462 1556 286 -1132 -2444 -2467 -832 643 1745
$$ packed form
1627C15k257j059j08J230K600K075N40j011j838k258j266l6J855J796J687Q32
1643C097l19k012k375j266P4J064J846K108J041q66j534j986j800k26J431K058
1659C35K049N69p52j499k163j423N7J008J852J784J078m47j554j686j705m65Q81
1676b081J817K358J076n07j448k076j660k13O57J915K022R62j68j275k327j140
1692b088l71M80J452J845J321P6j434j801j461j006P59J853J820J213n2j053k074
1709e21j590l72L79J720J626J490o91n96j633j519j253R29J356J448J196O16q11
1726A774j954j592p70M21J124J767J723m2r70j577j459n68L40J063J712R75N75
1743B542p69j589j748o16K48J003J432J709K50r06j270j418j312k3J635J475J102
$$ plain form
1760 1745 2565 1976 140 -1356 -2021 -1962 -1284 433 1834 1935 1463 552 -744 -2192 -2382 -1299 379
1777 379 1629 2109 2193 594 -1177 -2288 -1889 -1316 350 1683 2302 1580 394 -657 -1770 -2123 -1509
1794 -1509 -91 1371 2095 1902 963 -803 -1816 -2414 -1531 -36 1665 2083 1914 611 -966 -2002 -1735
1811 -1735 -1413 -193 1385 1802 1793 774 -617 -1562 -2022 -1595 -24 1029 1733 1685 1058 -396 -1777 -2185
1829 -2185 -1537 -174 1199 1893 1952 867 -241 -1577 -2015 -1347 -431 912 1512 1832 1169 -261 -1177 -1911
1847 -1911 -1593 -537 877 2009 1936 1285 -7 -1241 -2096 -1642 -431 829 1632 1786 1184 113 -1451
1864 -1451 -1801 -1387 -468 537 1588 1642 1129 59 -870 -1636 -1767 -806 344 1591 1674 1175 85 -1094
1882 -1094 -1959 -1613 -485 648 1361 1421 1219 148 -989 -1628 -1263 -926 56 1356 1864 1562 336 -597
$$ packed form
1760A745Q20n89j836j496o65N9O78J717J401J01m72r11j296j448j90J083J678
1777C79J250M80Q4j599j771j111L99N73J666J333O19p22j186j051j113l53O14
1794a509J418J462P24j93r39j766j013n98Q83J495J701M18j69j303j577j036K67
1811a735L22J220J578M17rj019j391r45m60M27J571J053P04m8o27j454j381m08
1829b185O48J363J373O94N9j085j108j336m38O68R16J343O00L20o63j430r16p34
1847a911L18J056J414J132p3o51j292j234q55M54J211J260Q03J54o02j071j564
1864a451l50M14R19J005J051N4n13j070r29p66j31R61J150J247Q3m99j090j179
1882a094q65L46J128J133P13O0k02j071j137o39L65L37R82J300N08l02j226r33
$$ plain form
1900 -597 -1687 -1855 -873 232 1258 1843 1179 354 -863 -1544 -1484 -983 -106 1127 1480 1441 575 -541 -1489
1919 -1489 -1408 -979 78 1061 1630 1373 569 -704 -1533 -1541 -1184 39 1019 1472 1137 732 -449 -1232 -1585
1938 -1585 -872 115 994 1490 1207 481 -321 -1062 -1393 -1326 -356 907 1374 1472 657 -302 -1236 -1663 -1032 -98
1958 -98 895 1194 1358 903 -293 -1238 -1328 -1159 -352 516 1515 1460 537 -6 -1380 -1537 -1315 -397 791 1326
1978 1326 1222 807 -42 -1245 -1252 -1069 -327 437 1087 1221 864 58 -817 -1560 -1033 -520 638 1271 1382 738
1998 738 -141 -869 -1550 -1072 -637 391 1164 1249 764 290 -996 -1485 -858 -625 75 1189 1142 1014 -41
2017 -41 -626 -1303 -1173 -704 105 1063 1169 763 234 -598 -1041 -971 -599 212 701 1478 984 190 -594 -954 -1249
2038 -1249 -738 435 1032 1246 1054 373 -376 -1112 -958 -799 253 987 1084 909 317 -416 -1268 -948 -518
$$ packed form
1900e97j090j68R82J105J026N85o64q25j217o81O0N01Q77J233L53l9q66j116r48
1919a489Q1M29J057R83N69k57q04j273q29qL57J223R80M53l35m05j181p83l53
1938a585P13R87Q79M96k83p26q02p41l31O7R70J263M67R8q15r59r34m27O31R34
1958i8R93K99J64m55j196r45r0J69Q07Q68R99n5r23n43j374j57K22R18J188N35
1978A326j04m15q49j203pJ83P42P64O50J34l57q06q75p43N27N13J158O33J11o44
1998G38q79p28o81M78M35J028P73Q5m85m74j286m89O27K33P00J114m7j28j055
2017d1n85o77J30M69Q09R58J06m06n29q32m43P0L72Q11M89P77m94p94p84l60k95
2038a249N11J173N97K14j92o81p49p36J54J59J052P34R7j75n92p33q52L20M30
$$ plain form
2057 -518 58 788 840 1008 351 -502 -1021 -756 -630 -204 917 1191 695 593 -212 -1124 -1104 -823 -30 579
2077 579 1178 874 646 -139 -952 -651 -978 -28 580 1074 968 265 181 -858 -1143 -855 -260 392 958 808
2097 808 618 -247 -667 -1087 -754 -161 399 1204 1177 327 -58 -572 -915 -664 -350 457 711 1108 653 -18
2117 -18 -615 -1003 -1105 -376 727 891 731 631 -116 -761 -1023 -865 -100 524 779 962 528 63 -531 -925
2137 -925 -586 -556 371 532 886 589 189 -478 -961 -762 -339 344 754 944 918 197 -700 -708 -843 -380 333
2158 333 692 997 767 110 -502 -723 -818 -591 220 805 736 839 367 -467 -901 -827 -653 408 571 999 736
2179 736 207 -314 -826 -869 -207 116 744 723 716 266 -402 -830 -988 -409 16 412 921 668 294 -95 -799
2200 -799 -950 -629 -124 685 811 727 361 -159 -607 -828 -423 -207 301 712 782 553 -521 -589 -800 -581 -369
$$ packed form
2057e18N76P30N2J68o57q53n19K65J26M26J121K74m96j02q05r12K0K81P93O09
2077E79N99l04k28p85q13L01l27R50O08M94j06p03q4j039k85K88N95O52N66j50
2097H08j90q65m20m20L33N93N60Q05k7q50l85n14l43K51L14Q07K54L97m55o71
2117a8n97l88j02P29J103J64j60j00p47o45k62J58P65O24K55J83m34m65n94l94
2137i25L39L0R27J61L54k97m00o67m83J99M23O83M10J90k6p21q97qj35M63P13
2158C33L59L05k30o57o12k21r5K27Q11N85o9J03m72q34m34P4J74J061J63M28k63
2179G36n29n21n12m3O62L23O28k1pm50o68m28j58N79M25L96N09k53l74l89p04
2200g99j51L21N05Q09J26q4l66n20m48k21M05K16N08M11P0k29j074o8k11K19K12
$$ plain form
2221 -369 520 787 693 446 -187 -722 -678 -726 -62 559 666 680 509 48 -507 -629 -517 -150 -115 701 557 741
2243 741 70 -401 -543 -439 -247 249 956 790 321 -165 -391 -772 -501 -144 205 511 912 160 243 -212
2263 -212 -809 -573 -370 100 590 912 616 76 -428 -757 -786 -338 84 712 931 401 164 -322 -501 -602
2283 -602 -151 272 650 826 669 314 -225 -617 -805 -384 139 524 672 292 -51 -191 -680 -527 -381 187
2303 187 742 773 587 -120 -304 -560 -473 -327 178 496 389 563 225 -90 -542 -545 -254 20 409 866 645
2324 645 176 -122 -401 -424 -505 172 434 866 458 129 -34 -286 -460 -353 241 257 434 1012 255 -269 -523
2345 -523 -807 -406 -237 89 734 563 -2 -332 -398 -812 -187 -70 352 634 460 45 82 -361 -440 -225 -88
2366 -88 -42 338 490 325 -11 -482 -118 -441 -77 228 744 608 114 -15 -505 -380 -339 -227 248 374 64
$$ packed form
2221c69Q89K67r4k47o33n35M4m8O64O21J07J4j71m61n55j22J12L67L5Q16j44J84
2243G41o71m71j42J04J92M96P07j66m69m86k26l81K71L57L49L06M01p52Q3m55
2263b12n97K36K03M70M90L22k96n40n04l29k9M48M22O28K19n30k37m86j79j01
2283f02M51M23L78J76j57l55n39l92j88M21N23L85J48l80l43j40m89J53J46N68
2303A87N55L1j86p07j84k56Q7J46N05L18j07J74l38l15m52lK91K74L89M57k21
2324F45m69k98k79k3q1O77K62M32m08l29j63k52j74J07N94J6J77N78p57n24k54
2345e23k84M01J69L26O45j71n65l30o6m14O25J17M22K82j74m15L7m43p9K15J37
2366h8M6L80J52j65l36m71L64l23L64L05N16j36m94j29m90J25M1J12M75J26l10
$$ plain form
2387 64 118 -70 -154 -478 -412 -401 202 346 328 359 -157 -320 -484 -338 -229 383 582 401 -40 -79 -134 -553 -288
2410 -288 152 225 107 416 455 151 -184 -207 -605 -505 -37 417 675 384 231 -158 -524 -203 -191 -85 337
2431 337 477 403 126 -161 -551 -482 -180 299 168 380 383 360 -231 -504 -483 -307 203 152 558 428 169 -199
2453 -199 -718 -395 -199 17 299 248 132 230 -220 -303 -225 -268 -174 205 477 418 388 -194 -249 -361 -247 -124 234
2476 234 626 379 252 -162 -399 -322 -137 -69 97 221 349 182 -76 -463 -373 -491 -31 18 279 459 43
2497 43 85 -377 -341 -219 -170 193 346 460 206 11 -158 -346 -260 -236 198 291 262 224 287 -131 -271 -224 -28 141
2521 141 301 548 410 -122 -64 -342 -412 95 152 495 470 326 276 -429 -256 -307 -191 37 200 549 190 114
2543 114 -303 -477 -481 -118 151 393 53 106 144 -129 -491 -593 -11 168 220 469 371 -151 -216 -190 -214 -306 200
$$ packed form
2387F4N4j88q4l24O6J1O03J44j8L1n16j63j64J46J09O12J99j81m41l9n5m19K65
2410b88M40P3j18L09L9l04l35k3l98J00M68M54K58k91j53l89l66L21J2J06M22
2431C37J40p4k77k87l90O9L02M79j31K12Lk3n91k73K1J76N10n1M06j30k59l68
2453a99n19L23J96K16K82n1j16R8m50q3P8m3R4L79K72n9l0n82n5j12J14J23L58
2476B34L92k47j27m14k37P7J85O8J66J24J28j67k58l87R0j18M60M9K61J80m16
2497D3M2m62L6J22M9L63J53J14k54j95j69j88Q6K4M34R3k9l8O3m18j40M7J96J69
2521A41J60K47j38n32N8k78p0N07N7L43k5j44n0p05J73n1J16K28J63L49l59p6
2543A14m17j74mL63K69K42l40N3L8k73l62j02N82J79N2K49r8n22o5K6k4r2N06
$$ plain form
2566 200 232 291 223 75 -515 -248 -314 -141 63 469 537 253 81 -143 -225 -400 -234 -149 131 273 149 148 149 -502
2590 -502 -235 -250 64 221 320 80 418 -23 -512 -276 -278 -42 175 405 339 -15 -115 -460 -241 -220 154 281
2612 281 169 100 136 -52 -204 -194 -163 -247 77 193 250 103 -70 -172 -208 -52 -32 193 378 333 126 4 -280
2635 -280 -312 5 -15 -48 364 378 30 58 -148 -286 -343 148 291 502 376 253 -97 20 -278 -201 -225 332 150
2658 150 261 260 239 -103 -309 -401 -149 -56 223 469 -18 100 -179 -129 -446 -205 132 707 214 207 267 29 -302
2681 -302 -475 -187 89 296 118 493 -56 -36 -406 -236 -22 85 137 492 388 -197 -58 -165 -314 -207 114
2702 114 93 270 259 -133 -13 -314 -217 -120 -40 402 316 153 149 -56 -287 75 -363 77 -22 274 65 128 -27
2725 -27 -209 -269 -138 196 124 211 273 44 -233 -334 -309 -233 -174 129 376 208 165 4 -382 -339 -198 179 -27
$$ packed form
2566B00L2N9o8j48n90K67o6J73K04M06O8k84j72k24q2j75J66Q5K80J42j24jJo51
2590e02K67j5L14J57R9k40L38m41m89K36kK36K17K30o6l54j00l45K19K1L74J27
2612B81j12o9L6j88j52J0L1q4L24J16N7j47j73j02l6J56K0K25J85m5k07j22k84
2635b80l2L17k0l3M12J4l48K8k06j38n7M91J43K11j26j23l50J17k98P7k4N57j82
2658A50J11jk1l42k06r2K52R3K79K46m87J18k79N0l17K41L37N75m93pO0k38l31
2681c02j73K88K76K07j78L75n49K0l70J70K14J07N2L55j04n85J39j07j49J07L21
2702A14k1J77j1l92J20l01R7R7Q0M42q6j63mk05k31L62m38M40r9K96k09O3j55
2725b7j82o0J31L34p2Q7O2k29k77j01K5P6N9L03K47j68m3j61l86M3J41L77k06
$$ plain form
2748 -27 248 369 68 -11 47 -152 -100 -48 268 -112 215 -75 -88 -344 -284 -131 -60 184 140 360 114 -12 -171
2771 -171 -180 -66 138 86 272 411 78 -60 -348 -131 -182 59 28 253 322 104 -233 -23 -103 -158 -353 -48 180
2794 180 375 261 -55 -379 15 -101 -1 80 208 324 200 54 -232 -276 -288 -77 -58 -33 149 211 229 -257
2816 -257 -193 -239 -11 174 196 306 395 -70 -111 -96 -190 -112 262 283 44 49 287 -86 -153 -156 -236 50 36 107 235 154
2842 154 46 -264 -282 -88 -133 108 329 198 -74 39 -27 -185 -437 42 391 130 -87 210 -19 126 -183
2863 -183 256 -21 -111 279 263 394 -190 -43 -50 -28 -22 -21 70 301 -233 -162 132 -333 -253 -144 103 192 91 -118
2887 -118 -72 -49 119 -17 -91 159 121 124 -151 122 -133 -166 -100 -131 -22 327 195 18 3 -283 -150 -66 -14 114
2911 114 -82 -51 -29 71 -184 -196 -106 -169 -118 252 61 217 -162 -235 -101 -179 -464 77 97 63 40 103 80 -202
$$ packed form
2748b7K75J21l01p9N8j99N2N2L16l80L27k90j3k56O0J53P1K44m4K20k46j26j59
2771a71rJ14K04n2J86J39l33j38k88K17n1K41l1K25O9k18l37K10q0n5j95L05K28
2794A80J95j14l16l24L94j16J00Q1J28J16j24j46k86m4j2K11J9K5J82O2J8m86
2816b57O4m6K28J85K2J10Q9m65m1J5r4P8L74K1k39NK38l73o7lq0K86j4P1J28q1
2842A54j08l10j8J94m5K41K21j31k72J13o6j58k52M79L49k61k17K97k29J45l09
2863a83M39k77r0L90j6J31n84J47pK2OJR1K31n34P1K94m65Q0J09K47Q9j01k09
2887a18M6K3J68j36p4K50l8Lk75K73k55l3O6l1J09L49j32j77j5k86J33Q4N2J28
2911A14j96L1K2J00k55j2R0o3N1L70j91J56l79p3J34p8k85N41K0l4k3O3k3k82
$$ plain form
2935 -202 -238 -20 139 27 238 226 132 104 -270 -189 64 36 128 76 213 -98 -193 -46 -134 -167 132 121 116 322 65
2960 65 -277 -268 -167 23 138 -87 187 293 173 -356 -315 -65 -305 210 -74 131 178 -86 165 -154 -285 -1
2982 -1 93 -57 259 217 -80 75 135 -110 -186 185 16 286 235 -14 103 70 -151 -330 103 140 270 28 -90
3005 -90 53 -290 -343 -134 175 64 233 -125 -49 -85 -43 -121 -16 -97 375 98 306 241 -32 -34 -189 -105 -212 -44
3029 -44 87 2 76 101 -332 102 -291 207 -291 252 209 77 282 -39 -259 -40 122 195 149 359 -43 52 22
3052 22 -275 3 -185 69 142 229 -22 0 -112 -144 -439 30 110 258 176 16 33 -111 -127 -15 71 34 -5 40
3076 40 191 -131 -344 8 -241 112 136 25 28 -360 -235 95 -64 -96 -272 296 -16 48 -98 -149 -202 -357 -217
3099 -217 -174 -141 -27 127 301 396 -28 -13 -81 20 8 95 231 54 -72 97 -68 -390 62 45 -113 77 261
$$ packed form
2935b02l6K18J59j12K11j2r4k8l74Q1K53k8R2n2J37l11r5J47q8l3K99j1nK06k57
2960F5l42RJ01J90J15k25K74J06j20n29M1K50k40N15k84K05M7k64K51l19j31K84
2982aR4j50L16m2k97J55O0k45p6L71j69K70n1k49J17l3k21j79M33L7J30k42j18
3005i0J43l43n3K09L09j11J69l58P6l6M2p8J05q1M72k77K08o5k73kj55Q4j07J68
3029d4J31q5P4K5m33M34l93M98m98N43m3j32K05l21k20K19J62P3m6K10m02R5l0
3052B2k97K78j88K54P3Q7k51K2j12l2k95M69Q0J48q2j60J7j44j6J12Q6l7l9M5
3076D0J51l22k13L52k49L53K4j11Ll88J25L30j59l2j76N68l12O4j46n1n3j55J40
3099b17M3L3J14J54J74R5m24J5o8J01j2Q7J36j77j26J69j65l22M52j7j58J90J84
$$ plain form
3122 261 132 -102 -16 -197 70 -54 -51 -105 -89 -326 -98 148 -225 -269 4 16 -94 178 -19 -164 -197 -218 -227 95
3146 95 -143 170 260 62 112 -355 -143 -167 145 149 55 101 347 -115 -143 -87 20 -12 241 42 187 -43 -105 -202
3170 -202 8 221 -10 158 -77 52 67 -36 -31 -427 -74 131 54 101 211 153 35 88 -154 -35 83 142 157
3193 157 -87 -5 144 -175 -154 1 7 -181 72 23 -4 332 204 -81 12 71 -89 -29 204 205 40 109 -121 -98
3217 -98 212 121 -35 -124 19 151 -227 -193 -414 -332 -100 -56 189 121 219 25 88 -330 -23 -97 129 -114 141
3240 141 140 -114 99 -108 -200 -7 30 275 126 183 -25 -121 -167 104 69 240 -68 252 185 -293 -354 30 -122
3263 -122 -64 109 209 221 196 55 -156 -126 32 -24 133 110 23 16 -164 -62 -20 -19 -60 101 25 -167 -55 211 -73
3288 -73 54 -40 37 41 -19 -47 -242 91 -80 -32 23 -182 2 186 -36 170 -12 191 15 2 49 118 34 -96
$$ packed form
3122B61j29k34Q6j81K67j24Ln4J6k37K28K46l73m4K73J2j10K72j97j45l3k1rL22
3146I5k38L13R0j98N0m67K12k4L12Mr4M6K46m62k8N6J07l2K53j99J45k30o2r7
3170b02K10K13k31J68k35J29J5j03Nl96L53K05p7M7J10n8j18N3k42J19J18N9J5
3193A57k44Q2J49l19K1J55Oj88K53m9k7L36j28k85R3N9j60O0K33Jj65O9k30K3
3217i8L10r1j56q9J43J32l78L4k21Q2K32M4K45o8R8j94O3m18L07p4K26k43K55
3240A41jk54K13k07r2J93L7K45j49N7k08r6m6K71l5J71l08L20o7m78o1L84j52
3263a22N8J73J00J2k5j41k11L0J58n6J57k3q7pj80J02M2Jm1J61p6j92J12K66k84
3288g3J27r4P7Mo0k8j95L33j71M8N5k05J84J84k22K06j82K03j76j3M7O9q4j30
$$ plain form
3312 -96 -7 34 -1 -108 39 -105 7 41 -122 -227 91 1 -32 67 55 -7 18 44 -129 3 -132 -39 94 -43
3336 -43 92 55 70 16 -23 39 -13 -77 -282 -111 148 6 214 -75 -34 -51 -149 53 53 -277 253 -2 -210 153
3360 153 -270 -37 -83 -138 387 -4 -143 -102 -18 -130 43 113 287 492 427 -224 104 -28 188 280 -134 161
3382 161 40 24 174 165 -265 -110 -224 84 -208 109 9 98 49 -19 -108 -27 -153 -105 -81 -78 180 158 -81 -96 13
3407 13 -212 272 -71 112 84 106 14 -38 -51 166 113 -132 115 171 34 121 -123 131 94 -35 162 -85 -35 -111
3431 -111 71 -143 -52 145 38 -171 -153 189 -53 -93 53 -65 -84 10 -160 6 -57 -105 -270 186 -74 -184
3453 -184 20 98 42 46 54 345 -63 162 15 -186 279 -154 -167 243 -107 -160 -107 115 -222 13 -55 116 -236
3476 -236 0 -20 36 -56 148 -136 207 7 -60 113 110 59 -175 188 -120 -23 141 -61 -208 62 -94 -29 -6
$$ packed form
3312i6Q9M1l5j07J47j44J12L4j63j05L18r0l3R9j2o2K5K6j73J32j35R3J33j37
3336d3J35l7J5n4l9O2n2o4k05J71K59j42K08k89M1j7r8K02%l30N30k55k08L63
3360A53m23K33m6n5N25l91j39M1Q4j12J73P0J74K05o5o51L28j32K16R2m14K95
3382A61j21j6J50rm30J55j14L08k92L17j00Q9m9o8q9Q1j26M8K4LK58k2k39j5J09
3407A3k25M84l43J83k8K2r2n2j3K17n3k45K47N6j37Q7k44K54l7j29J97k47N0p6
3431a11J82k14R1J97j07k09J8L42k42m0J46j18j9R4j70J66o3m8j65M56k60j10
3453a84K04P8n6MQK91m08K25j47k01M65m33j3M10l50n3N3K22l37K35o8J71l52
3476b36K36k0N6r2K04k84L43k00o7J73ln1k34L63l08R7J64k02j47K70j56O5K3
$$ plain form
3499 -6 80 138 44 97 -39 108 123 15 30 -143 201 -72 313 286 110 -140 61 157 -26 -19 128 -223 212 103
3523 103 -109 -169 35 -17 61 117 47 -135 -189 -77 2 7 -71 -100 -50 -148 219 -112 88 -232 -213 256 27 121 219
3548 219 385 179 -44 179 -130 76 -28 121 99 30 46 123 -172 -131 110 -136 101 91 -190 -140 -134 -175 -13
3571 -13 -189 144 166 126 -33 46 18 -215 -147 -223 -80 -101 38 -192 -79 -156 19 -294 -153 -38 33 -60 -7 -76
3595 -76 -120 39 -123 151 43 91 46 -54 -163 -80 70 -148 -127 11 166 153 -207 173 45 -215 -97 126
3617 126 -119 33 -117 -135 -70 116 -63 -31 -271 -147 168 47 35 149 135 30 65 85 -66 61 291 -26
3639 -26 143 49 -48 74 171 -162 88 -124 -128 83 42 -125 149 -34 -132 30 25 262 31 203 -205 -57 -179
3662 -179 171 -120 -57 -2 -189 -136 25 -73 76 -77 -85 4 83 -9 71 21 -139 95 -249 -64 114 -126 73 198
$$ packed form
3499fQ6N8r4N3j36J47J5j08J5j73L44k73L85k7j76k50K01R6j83PJ47l51M35j09
3523A03k12o0K04n2P8N6p0j82n4J12P9Np8k9N0r8L67l31K00l20J9M69k29R4R8
3548B19J66k06k23K23l09K06j04J49k2o9J6P7k95M1K41k46K37j0k81N0Om1J62
3571a3j76L33K2m0j59P9k8k33O8p6J43k1J39k30J13p7J75l13J41J15P1r3N3o9
3595g6m4J59j62K74j08M8m5j00j09Q3J50k18K1J38J55j3l60L80j28k60J18K23
3617A26k45J52j50j8O5J86j79L2k40J24L15j21j2J14j4j05L5K0j51J27K30l17
3639b6J69r4r7J22R7l33K50k12mK11m1j67K74j83r8J62nK37k31J72m08J48j22
3662a79L50k91O3N5j87N3J61r8J49j53qQ9P9r2Q0n0j60K34l44J85J78k40J99J25
$$ plain form
3686 198 -56 5 173 195 0 101 -208 -214 -113 56 -248 -212 35 59 -25 -14 -126 125 -60 98 -53 32 -27
3709 -27 -36 125 -67 -73 -30 -140 -12 -10 -45 199 -106 192 26 75 245 11 142 85 160 239 -96 31 79 -57 182
3734 182 -183 19 186 -206 -41 -130 -112 69 125 -209 -13 -10 -32 -70 76 -285 125 -232 -105 160 107 18 -48
3757 -48 -42 -502 66 -183 134 185 68 129 140 55 258 27 136 167 -129 47 174 173 -21 84 -128 -186 -6 -38
3781 -38 -11 -249 -12 92 -52 -185 -121 -86 27 -219 50 132 -182 -81 -55 54 -30 233 124 91 6 -5 -212
3804 -212 5 31 123 137 -186 -13 153 132 -192 91 -237 44 -21 15 45 -37 62 210 -99 -184 -63 -5 235 -108
3828 -108 24 166 -65 -166 -95 4 84 -13 -39 -23 43 -145 -181 -28 -43 5 99 133 -19 -34 -110 -29 -26 -89 -155 160
3854 160 -100 -112 -121 -135 82 22 142 -149 28 47 254 -82 3 -60 -75 89 -135 277 -32 58 62 -82 77 -145
$$ packed form
3686A98k54O1J68K2j95J01l09oJ01J69l04L6K47K4q4J1j12K51j85J58j51Q5n9
3709b7rJ61j92oM3j10J28Kl5K44l05K98j66M9J70k34J31n7P5P9l35J27M8j36K39
3734A82l65K02J67l92J65q9J8J81N6l34J96Lk2l8J46l61M10l57J27K65n3q9o6
3757d8Om60N68k49L17N1j17O1J1q5K03k31J09L1k96J76J27jj94J05k12n8J80l2
3781c8K7k38K37J04j44j33O4L5J13k46K69Q2l14J01K6J09q4K63j09l3q5j1k07
3804b12K17K6R2J4l23J73J66k1l24K83l28K81o5L6L0q2R9J48l09q5J21N8K40l43
3828a08J32J42k31j01P1R9Q0r7k6J6O6j88l6J53j5M8R4L4j52j5p6Q1Lo3o6L15
3854A60k60j2rj4K17o0J20k91J77J9K07l36Q5o3j5J64k24M12l09R0Mj44J59k22
$$ plain form
3878 -145 16 45 118 -85 60 207 -60 -371 -119 -46 106 26 116 49 -58 -91 -103 -79 176 -43 32 140 73 -25
3902 -25 148 -45 -71 126 -58 -101 127 193 0 -118 -243 10 -50 -113 -58 132 6 -97 79 -184 -65 80
3924 80 0 35 207 -202 122 208 96 -173 -194 120 36 29 118 -74 145 -51 124 -63 5 -96 254 -20 2 -192
3948 -192 -90 -5 -113 -67 1 -128 -210 -127 -9 -96 -240 -72 -96 -125 64 -4 128 31 25 30 -242 -160 -189 76 92 -239
3974 -239 -178 -13 -2 247 -16 15 119 -21 -181 -197 -91 81 168 126 87 67 1 63 -244 -50 250 -235 82
3997 82 7 -16 28 105 -12 -35 11 -350 -124 -122 197 -129 -69 -37 81 112 -155 27 -148 -105 192 1 244 -98
4021 -98 52 -142 -251 102 -92 -123 7 36 12 214 38 -64 136 -17 -89 43 -135 101 -70 -69 -109 45 -39
4044 -39 230 -134 4 -115 -62 28 65 95 -26 -10 -15 -36 65 -43 -329 -105 147 180 -90 7 -64 -46 -50 -3 94 -108
$$ packed form
3878a45J61K9P3k03J45J47k67l11K52P3J52q0R0o7j07l3j2K4K55k19P5J08o7r8
3902b5J73j93k6J97j84m3K28O6j93j18j25K53o0o3N5J90j26j03J76k63J19J45
3924H0q0L5J72m09L24Q6j12k69k1L14q4pQ9j92K19j96J75j87O8j01L50k74K2j94
3948a92J02Q5j08M6O8j29q2Q3J18q7j44J68k4k9J89o8J32r7oNk72Q2k9K65J6l31
3974b39O1J65J1K49k63L1J04j40j60j6J06J72Q7m2l9k0o6O2l07J94L00m85L17
3997H2p5k3M4P7j17k3M6l61K26KL19l26O0L2J18L1k67J82j75M3K97j91K43l42
4021i8J50j94j09L53j94l1J30K9k4K02j76j02K00j53p2J32j78K36j71Jm0J54q4
4044c9K69l64J38j19N3R0L7L0j21J6nk1J01j08k86K24K52L3k70R7p1J8mM7R7k02
$$ plain form
4070 -108 -240 70 -137 -10 -106 38 -68 69 14 -107 144 47 155 -45 315 -199 -193 -152 267 30 7 193
4092 193 -65 8 17 119 44 -99 2 -41 71 0 -127 -232 -74 201 155 1 28 206 -53 161 -141 -32 43
4115 43 -13 -86 -30 276 -23 -84 -119 -138 -57 61 -111 -110 162 250 -330 -49 -31 -61 357 -59 83 159 184 -1 41
4140 41 -80 31 -18 149 -89 155 -58 -50 -280 -48 -13 -327 51 280 184 -30 -204 7 -123 -278 41 85
4162 85 251 96 206 93 9 213 -61 -146 252 -27 50 -298 -169 -57 90 -239 -6 -194 -73 104 77 86
4184 86 -56 239 9 176 2 187 -102 95 -110 83 56 -25 -164 -11 2 -52 225 -73 -8 -5 -119 33 35
4207 35 -3 7 45 -138 34 -118 -4 -18 -266 -198 362 24 -114 -90 297 -218 145 96 -163 33 149 -12 -186
4230 -186 183 -123 134 0 -39 -96 196 -130 -101 -112 188 45 -13 -71 38 84 187 96 -91 -77 97 109 215
$$ packed form
4070a08j32L10k07J27r6J44j06J37n5j21K51r7J08k00L60n14OM1M19k37k3J86
4092A93k58P3RJ02p5j43J01m3J12p1j27j05J58K75m6j54K7J78k59K14l02J09P5
4115D3n6p3N6L06k99o1l5j9Q1J18j72JK72Q8n80K81J8l0M18m16J42P6K5j85M2
4140D1j21J11m9J67k38K44k13Qk30K32L5l14L78K29r6k14j74K11j30j55L19M4
4162H5J66j55J10j13q4K04k74q5L98k79P7l48J29J12J47l29K33j88J21J77k7R
4184H6j42K95k30J67j74J85k89J97k05J93k7q1j39J53J3n4K77k98O5Lj14J52K
4207C5l8J0L8j83J72j52J14j4k48O8N60l38j38K4L87n15L63m9k59J96J16j61j74
4230a86L69l06K57j34l9n7K92l26K9j1L00j43n8n8J09M6J03r1j87J4J74J2J06
$$ plain form
4253 215 19 -70 -71 71 -71 -262 -183 -181 -40 -238 -12 192 -123 92 -68 93 -151 174 -29 49 13 -141 201
4276 201 -30 -77 -118 28 -130 38 -223 -57 251 -52 95 77 -66 -201 42 183 71 120 -90 -197 18
4297 18 -27 2 -74 21 55 32 -93 116 118 -154 129 -149 -115 77 227 17 -30 -65 -145 -204 344 234 31 -217 186
4322 186 259 -9 200 -116 -176 187 -97 59 -64 126 -17 272 -43 26 -151 16 -236 110 -242 237 -153
4343 -153 -177 -134 203 -11 -8 115 -79 -161 164 93 -253 279 -152 -91 29 -38 -64 -185 144 76 -41 191 66
4366 66 67 108 13 -60 275 78 202 69 -60 -19 94 71 -23 85 64 197 123 126 173 3 154 -2 42 3 63 245
4392 245 99 -16 -62 -7 -72 5 -194 -56 364 105 94 -278 -47 -95 -83 -301 -92 293 -3 -34 -27 -6 -166 -135
4416 -135 -139 -88 -77 -81 -36 97 -99 -141 233 9 114 -341 -307 232 -188 -104 29 -38 -308 -197 3 -96 -60 201
$$ packed form
4253B15j96q9jJ42j42j91P9KJ41j98K26K04l15K15j60J61k44L25k03P8l6j54L42
4276B01k31m7m1J46j58J68k61J66L08l03J47j8j43j35K43J41j12M9k10j07K15
4297A8m5K9p6R5L4k3j25K09Kk72K83k78L4J92J50k10m7l5q0n9N48j10k03k48M03
4322A86P3k68K09l16o0L63k84J56j23J90j43K89l15O9j77J67k52L46l52M79l90
4343a53k4M3L37k14LJ23j94q2L25p1l46N32m31O1J20o7k6j21L29o8j17K32j25
4366F6JM1r5p3L35j97J24j33j29M1J13k3r4J08k1J33p4LM7j70J51j56M4l9O0J82
4392B45j46j15m6N5o5P7j99J38M20k59j1l72K31m8J2k18K09L85k96l1PK1j60L1
4416a35mN1J1mM5J33j96m2L74k24J05m55L4N39m20Q4J33o7k70J11K00r9L6K61
$$ plain form
4440 201 -339 161 145 -93 -26 -321 -132 166 -70 -130 -127 78 -67 28 279 144 -106 113 -249 -107 349 -46
4462 -46 72 -51 -35 -277 -156 -224 -245 -141 215 -62 69 88 -82 -137 -13 -130 -143 126 134 -48 -329 -16 -70
4485 -70 -45 214 47 -108 -109 128 -282 -91 65 -105 -76 -44 -207 -34 162 -17 124 92 176 -8 -44 74 -40
4508 -40 34 -12 -37 174 -264 202 -58 21 -68 67 -82 -271 52 30 232 66 3 -248 144 -175 -71 -219 -11
4531 -11 -102 128 -40 66 -20 -97 -63 -322 -32 72 0 -124 63 25 11 69 -109 -280 -75 -107 24 25 -33 -222
4555 -222 -19 -99 -130 18 182 174 133 -35 -102 10 59 29 -120 154 5 -45 -8 -15 89 -331 -61 210 71 -338
4579 -338 -411 16 67 108 16 -195 94 -226 -30 170 -7 60 259 -157 67 -176 127 -231 66 -133 -51 141
4601 141 164 -126 95 41 -152 118 -82 -43 105 42 -192 -148 104 4 -109 -16 2 -63 -268 97 8 -67 -147 194
$$ packed form
4440B01n40N00j6k38O7k95J89K98k36o0LK05j45R5K51j35k50K19l62J42M56l95
4462d6J18j23J6k42J21o8k1J04L56k77J31J9j70n5J24j17j3K69Qj82k81L13n4
4485g0K5K59j67j55jK37m10J91J56j70K9L2j63J73J96j79J41l2Q4j84l6J18j14
4508d0P4m6k5K11m38M66k60P9q9J35j49j89L23k2K02j66o3k51L92l19J04j48K08
4531a1r1K30j68J06q6p7L4k59K90J04p2j24J87l8j4N8j78j71K05l2J31Jn8j89
4555b22K03q0l1J48J64qm1j68o7J12M9l0j49K74j49n0L7pJ04m20K70K71j39m09
4579c38p3M27N1M1r2k11K89l20J96K00j77O7J99m16K24k43L03l58K97j99Q2J92
4601A41K3k90K21n4j93K70k00L9J48o3k34M4K52j00j13R3J8o5k05L65q9p5q0L41
$$ plain form
4625 194 -46 -150 10 -171 -221 -269 -327 33 -79 -88 -21 158 169 -156 -232 188 -130 -177 48 -12 -67 145 276 281
4649 281 167 1 -19 253 44 119 45 -157 -52 177 -169 73 -93 -125 -33 -206 -111 -145 -108 -351 -255 61 -113
4672 -113 13 125 74 58 92 47 -56 25 -102 -10 197 -6 -78 -93 79 113 81 41 -110 247 29 136 101 -33
4696 -33 29 -83 49 -8 103 72 -273 335 -86 -168 137 -197 -127 -50 261 71 53 15 -24 -120 152 -105 143 232
4720 232 -141 60 -240 -145 -56 -152 -97 40 7 70 -97 57 -427 -19 199 1 109 82 132 80 -231 -209 69
4743 69 26 224 49 91 -130 -20 -98 136 -51 -9 -135 -18 -109 84 67 -222 124 13 -122 -48 -21 -36 87
4766 87 -14 172 -168 -229 -112 322 -106 -31 -2 -119 94 -42 121 -101 -123 -83 26 43 -355 -74 131 63 128
4789 128 79 -114 -204 -257 -38 -15 45 -21 107 58 -46 -39 82 22 -58 -68 132 -165 -26 10 -84 131 -54 130 11
$$ packed form
4625A94k40j04J60j81n0m8n8L60j12rO7J79J1l25p6M20l18m7K25o0n5K12J31N
4649B81j14j66k0K72k09P5p4k02J05K29l46K42j66l2R2j73R5l4L7k43R6L16j74
4672a13J26J12n1j6L4m5j03Q1j27R2K07k03p2j5J72L4l2m0j51L57k18J07l5j34
4696c3O2j12J32n7J11l1l45O08m21q2L05l34P0P7L11j90j8l8l9r6K72k57K48Q9
4720B32l73K01l00R5Q9r6N5J37l3O3j67J54m84M08K18j98J08k7N0n2l11K2K78
4743F9m3J98j75M2k21J10p8K34j87M2j26J17r1J93j7k89L46j11j35P4K7j5J23
4766H7j01J86l40o1J17M34m28P5K9j17K13j36J63k22k2M0J09J7l98K81K05o8O5
4789A28m9j93r0n3K19K3O0o6J28m9j04PJ21o0q0j0K00k97J39L6r4K15j85J84j19
$$ plain form
4814 11 243 -147 -142 6 -142 82 59 133 -114 38 -67 -163 65 186 42 -128 63 -75 -63 -214 44 -189
4836 -189 -111 8 -216 191 53 205 -182 329 135 38 -282 -254 -165 -103 249 70 117 -103 -37 74 211 103
4858 103 -326 -117 -41 28 -29 -85 124 39 122 -50 27 -202 -157 -90 46 87 -210 -92 60 59 -122 -64 -62 84 -65
4883 -65 28 -70 80 -175 87 -70 205 79 65 197 -63 -175 44 -65 170 -66 457 27 147 79 -3 -90
4905 -90 19 -15 -37 -210 -127 -180 -3 126 -66 -121 -128 56 -17 -62 131 -39 68 -39 -84 53 -189 -121 -114 -84 -4
4930 -4 -100 -90 53 27 17 -16 26 -22 -49 78 -109 -162 -149 -72 -59 -30 -74 117 221 35 80 91 -135 -10 253 -175
4956 -175 92 3 210 -55 -108 97 -168 86 -10 -77 128 29 108 -109 123 118 -62 -220 -214 -319 -49 1 2 44 17
4981 17 -84 181 245 72 -45 -142 -31 -43 63 53 -16 -80 129 -115 197 -23 269 88 -64 -50 -290 33 -196
$$ packed form
4814A1K32l90NJ48j48K24k3P4k47J52j05r6K28J21j44j70J91j38J2j51K58k33
4836a89P8J19k24M07j38J52l87N11j94r7l20K8Q9O2L52j79M7k20O6J11J37j08
4858A03m29K09P6O9n7n6K09q5Q3j72P7k29M5O7J36M1k97J18J52jj81N8KJ46j49
4883f5R3r8J50k55K62j57K75j26j4J32k60j12K19j09K35k36N23m30J20o8q2q7
4905i0J09l4k2j73Q3n3J77J29j92n5pJ84p3m5J93j70J07j07m5J37k42O8PL0Q0
4930dr6J0J43k6j0l3M2m8k7J27j87n3J3P7J3K9m4J91J04j86M5J1k26J25K63m28
4956a75K67q9K07k65n3K05k65K54r6o7K05r9P9k17K32nj80j58Oj05K70N0JM2k7
4981A7j01K65O4j73j17r7J11j2J06j0o9o4K09k44L12k20K92j81j52J4k40L23k29
$$ plain form
5004 -196 69 2 134 -146 -181 31 -182 203 15 181 -12 -66 -306 51 67 -100 131 -196 194 56 53 121
5026 121 -60 100 109 204 127 -154 -224 133 -139 41 -68 -84 -22 0 -52 -9 123 -148 -65 -95 -121 -35 183 -174 -205
5051 -205 -96 -92 196 -179 7 68 128 69 124 75 -248 34 112 -205 -133 49 92 130 80 -70 -75 -104 41 -10 115
5076 115 54 192 -174 118 -89 13 -247 60 127 59 49 241 99 -30 -187 154 44 46 -83 88 134 116 103
5099 103 95 118 -48 278 -53 147 55 -62 -89 -46 3 85 -161 -1 226 -282 171 355 -171 90 73 -60 -82
5122 -82 -182 -120 -121 -93 -94 24 68 -43 93 43 76 -101 90 -44 44 -106 43 -213 186 -56 -209 -90 -294 29
5146 29 -134 -52 172 26 151 137 143 44 232 26 -140 -190 -103 258 -178 -79 20 129 94 -89 12 77 -6 -100 70
5171 70 -191 53 97 16 92 -55 313 -42 -21 240 -112 135 -91 86 -40 16 -272 69 -437 135 44 -43 244
$$ packed form
5004a96K65o7J32k80l5K12k13L85j88J66j93n4k40L57J6j67K31l27L90j38lO8
5026A21j81J60RR5p7k81p0L57k72J80j09j6O2K2n2M3J32k71Q3l0k6Q6K18l57l1
5051b05J09MK88l75J86O1O0n9N5m9l23K82P8l17P2J82M3L8n0j50nk9J45n1J25
5076A15o1J38l66K92k07J02k60L07O7o8j0J92j42j29j57L41j10Kj29J71M6j8j3
5099A03qK3j66L26l31K00r2j17k7M3M9Q2k46J60K27n08M53J84n26K61j7j33k2
5122h2j00O2jK8jJ18M4j11J36n0L3j77J91j34Q8j50J49k56L99k42j53J19k04L23
5146B9j63Q2K24j46J25j4Or9J88k06j66n0Q7L61m36R9R9J09l5j83J01O5q3r4J70
5171G0k61K44M4q1P6j47L68l55K1K61l52K47k26J77j26N6k88L41n06N72r1q7K87
$$ plain form
5194 244 -203 -284 125 -168 -20 -34 74 -93 -42 195 217 -70 -249 66 -61 -85 -166 -96 90 252 -14 0 -62
5217 -62 -134 -161 -77 112 -81 45 -51 41 285 -241 -328 239 74 57 -286 -254 56 -160 -84 42 156 131 104 -74
5241 -74 -130 -171 -43 -297 -50 -240 -98 134 -88 -174 2 -183 -27 -36 95 -54 220 176 -51 107 -40 258
5263 258 -124 49 -76 -46 -11 106 2 124 -109 230 138 31 -65 56 193 16 -228 16 -90 60 -134
5284 -134 53 -90 202 -176 -187 -113 220 221 5 -182 271 231 18 -83 147 165 -229 -67 -322 -39 -32 -213 17
5307 17 80 -43 68 127 153 46 119 -231 -26 -195 -139 -161 -6 44 246 35 -99 -53 -19 128 171 142 152 86 357
5332 357 -255 178 -115 105 -145 -171 289 79 -130 42 187 150 -21 160 -75 -24 270 -11 -141 21 -75
5353 -75 -73 -153 116 76 -263 -61 -68 246 103 -31 -107 -35 307 -107 58 -19 -55 -97 -56 46 163 18 96 -86 -114
$$ packed form
5194B44m47q1M09k93J48j4J08j67N1K37K2k87j79L15j27k4q1P0J86J62k66J4o2
5217f2p2k7Q4J89j93J26r6R2K44n26q7N67j65j7l43L2L10k16P6J26J14k5k7j78
5241g4n6m1J28k54K47j90J42K32k22q6J76j85J56rJ31j49K74m4k27J58j47K98
5263B58l82J73j25L0L5J17j04J22k33L39r2j07r6J21J37j77k44K44j06J50j94
5284a34J87j43K92l78j1P4L33Jk16j87M53m0k13j01K30J8l94J62k55K83Pj81K30
5307A7O3j23J11N9K6j07P3l50K05j69N6k2J55N0K02k11j34M6L4J47M3k9J0o6K71
5332C57o12M33k93K20k50k6M60k10k09J72J45l7j71J81k35N1K94k81j30J62r6
5353g5Kq0K69m0l39K02pL14j43j34p6P2L42m14J65p7l6m2M1J02J17j45P8j82k8
$$ plain form
5378 -114 209 27 97 -1 -153 -160 61 -192 80 185 -88 76 165 -57 51 166 48 -67 6 -141 75 20
$$ packed form
5378a14L23j82P0r8j52pK21k53K72J05k73J64Q9k22J08J15j18j15P3j47K16n5
$$ [...]
8191a14
##END NTUPLES=NMR FID
##END=
