##TITLE=1H_AP-17M2H_HCl
 D2O
 8 sc, 
 2.11.2023
##JCAMPDX= 6.0         $$ Bruker NMR JCAMP-DX V2.0
##DATA TYPE= NMR FID
##DATA CLASS= NTUPLES
##ORIGIN= UXNMR, Bruker Analytische Messtechnik GmbH
##OWNER= root
$$ XWIN-NMR		Version 3.5
$$ Thu Nov  2 14:08:22 2023 Russian Standard Time (UT+4h)  she@DPX200
##.OBSERVE FREQUENCY= 200.13135
##.OBSERVE NUCLEUS= ^1H
##.DELAY= (6, 6)
##.ACQUISITION MODE= SIMULTANEOUS
##.ACQUISITION SCHEME= undefined
##.AVERAGES= 8
##.DIGITISER RES= 18
##SPECTROMETER/DATA SYSTEM= spect
##.PULSE SEQUENCE= zg30
##.SOLVENT NAME= CDCl3
##.SHIFT REFERENCE= (INTERNAL, CDCl3, 0, 15.7039)
##AUDIT TRAIL= $$ (NUMBER, WHEN, WHO, WHERE, WHAT)
$$ ##TITLE= Audit trail, XWIN-NMR		Version 3.5
$$ ##JCAMPDX= 5.01
$$ ##ORIGIN= Bruker BioSpin GmbH
$$ ##OWNER= she
$$ F:/spectra/data/she/nmr/H-F/1/audita.txt
$$ ##AUDIT TRAIL=  $$ (NUMBER, WHEN, WHO, WHERE, WHAT)
(   1,<2023-11-02 14:07:19.60 +0400>,<she>,<DPX200>,
      <created by zg, POWCHK disabled, PULCHK disabled
       configuration hash MD5:
       00 E9 B6 7A A2 85 ED C7 34 08 36 98 17 FE 4E 26
       data hash MD5: 16K
       91 29 AC 0F 21 44 BC 5B 49 B2 9E 83 AF FA 4D 96>)
$$ ##END=
$$ 
$$ hash MD5
$$ CA 62 A8 2E 4F 19 33 6D FA 39 3A 5D 20 77 DE 37
##$RELAX= 
##$RELAX= 
##$RELAX= 
##$RELAX= 
##$RELAX= 
##$RELAX= 
$$ Bruker specific parameters
$$ --------------------------
##$DU= <F:/spectra>
##$EXPNO= 1
##$NAME= <H-F>
##$PROCNO= 1
##$TYPE= <nmr>
##$USER= <she>
##$AMP= (0..31)
100 100 100 100 100 100 100 100 100 100 100 100 100 100 100 100 100 100 
100 100 100 100 100 100 100 100 100 100 100 100 100 100 
##$AQSEQ= 0
##$AQ_mod= 1
##$AUNM= <au_zg>
##$AUTOPOS= <>
##$BF1= 200.13
##$BF2= 200.13
##$BF3= 200.13
##$BF4= 200.13
##$BF5= 200.13
##$BF6= 200.13
##$BF7= 200.13
##$BF8= 200.13
##$BYTORDA= 1
##$CFDGTYP= 0
##$CFRGTYP= 5
##$CHEMSTR= <none>
##$CNST= (0..31)
1 1 145 1 1 1 1 1 1 1 1 1 1 1 1 1 1 1 1 1 1 1 1 1 1 1 1 1 1 1 1 1 
##$CPDPRG= <>
##$CPDPRG1= <>
##$CPDPRG2= <>
##$CPDPRG3= <>
##$CPDPRG4= <mlev>
##$CPDPRG5= <mlev>
##$CPDPRG6= <mlev>
##$CPDPRG7= <mlev>
##$CPDPRG8= <mlev>
##$CPDPRGB= <>
##$CPDPRGT= <>
##$D= (0..31)
0 1.2 0 0 0 0 0 0 0 0.06 0 0.03 0 0 0 0 0.0002 0 0 0 0 0 0 0 0 0 0 0 0 
0 0 0 
##$DATE= 1698919639
##$DBL= (0..7)
120 120 120 120 120 120 120 120 
##$DBP= (0..7)
150 150 150 150 150 150 150 150 
##$DBP07= 0
##$DBPNAM0= <>
##$DBPNAM1= <>
##$DBPNAM2= <>
##$DBPNAM3= <>
##$DBPNAM4= <>
##$DBPNAM5= <>
##$DBPNAM6= <>
##$DBPNAM7= <>
##$DBPOAL= (0..7)
0.5 0.5 0.5 0.5 0.5 0.5 0.5 0.5 
##$DBPOFFS= (0..7)
0 0 0 0 0 0 0 0 
##$DE= 6
##$DECBNUC= <off>
##$DECIM= 32
##$DECNUC= <off>
##$DECSTAT= 4
##$DIGMOD= 1
##$DIGTYP= 9
##$DL= (0..7)
0 120 120 120 120 120 120 120 
##$DP= (0..7)
150 150 150 150 150 150 150 150 
##$DP07= 0
##$DPNAME0= <>
##$DPNAME1= <>
##$DPNAME2= <>
##$DPNAME3= <>
##$DPNAME4= <>
##$DPNAME5= <>
##$DPNAME6= <>
##$DPNAME7= <>
##$DPOAL= (0..7)
0.5 0.5 0.5 0.5 0.5 0.5 0.5 0.5 
##$DPOFFS= (0..7)
0 0 0 0 0 0 0 0 
##$DQDMODE= 0
##$DR= 18
##$DS= 0
##$DSLIST= <SSSSSSSSSSSSSSS>
$$ [...]
##$SUBNAM2= <"">
##$SUBNAM3= <"">
##$SUBNAM4= <"">
##$SUBNAM5= <"">
##$SUBNAM6= <"">
##$SUBNAM7= <"">
##$SUBNAM8= <"">
##$SUBNAM9= <"">
##$SW= 18.05172834244
##$SWIBOX= (0..15)
0 0 2 0 0 0 0 0 0 0 0 0 0 0 0 0 
##$SW_h= 3612.71676300578
##$TD= 16384
##$TD0= 1
##$TE= 0
##$TE2= 300
##$TE3= 300
##$TEG= 300
##$TL= (0..7)
0 120 120 120 120 120 120 120 
##$TP= (0..7)
150 150 150 150 150 150 150 150 
##$TP07= 0
##$TPNAME0= <>
##$TPNAME1= <>
##$TPNAME2= <>
##$TPNAME3= <>
##$TPNAME4= <>
##$TPNAME5= <>
##$TPNAME6= <>
##$TPNAME7= <>
##$TPOAL= (0..7)
0.5 0.5 0.5 0.5 0.5 0.5 0.5 0.5 
##$TPOFFS= (0..7)
0 0 0 0 0 0 0 0 
##$TUNHIN= 0
##$TUNHOUT= 0
##$TUNXOUT= 0
##$USERA1= <user>
##$USERA2= <user>
##$USERA3= <user>
##$USERA4= <user>
##$USERA5= <user>
##$V9= 5
##$VALIST= <valist>
##$VCLIST= <CCCCCCCCCCCCCCC>
##$VD= 0
##$VDLIST= <DDDDDDDDDDDDDDD>
##$VPLIST= <PPPPPPPPPPPPPPP>
##$VTLIST= <TTTTTTTTTTTTTTT>
##$WBST= 1024
##$WBSW= 4
##$XGAIN= (0..3)
0 0 0 0 
##$XL= 0
##$YL= 0
##$YMAX_a= 563608
##$YMIN_a= -586892
##$ZGOPTNS= <>
##$ZL1= 120
##$ZL2= 120
##$ZL3= 120
##$ZL4= 120
##$ABSF1= 10
##$ABSF2= 0
##$ABSG= 5
##$ABSL= 3
##$ALPHA= 0
##$AQORDER= 0
##$ASSFAC= 0
##$ASSFACI= 0
##$ASSFACX= 0
##$ASSWID= 0
##$AUNMP= <proc_1d>
##$AZFE= 0.1
##$AZFW= 0.1
##$BCFW= 1
##$BC_mod= 2
##$BYTORDP= 1
##$COROFFS= 0
##$CY= 11.3945322036743
##$DATMOD= 1
##$DC= 2
##$DFILT= <>
##$DTYPP= 0
##$F1P= 15.7292609196834
##$F2P= 12.9074282941183
##$FCOR= 0.5
##$FTSIZE= 0
##$FT_mod= 4
##$GAMMA= 1
##$GB= 0.15
##$INTBC= 1
##$INTSCL= 1
##$ISEN= 128
##$LB= 0.24
##$LEV0= 0
##$LPBIN= 0
##$MAXI= 10000
##$MC2= 0
##$MEAN= 0
##$ME_mod= 0
##$MI= 1.114404
##$NCOEF= 0
##$NC_proc= 0
##$NLEV= 6
##$NOISF1= 3.799351
##$NOISF2= 2.8
##$NSP= 1
##$NTH_PI= 0
##$NZP= 0
##$OFFSET= 15.70392
##$PC= 1
##$PHC0= -23883.3
##$PHC1= 13.2527
##$PH_mod= 1
##$PKNL= yes
##$PPARMOD= 0
##$PSCAL= 0
##$PSIGN= 0
##$REVERSE= no
##$SF= 200.130013532006
##$SI= 16384
##$SIGF1= 3
##$SIGF2= 2
##$SINO= 400
##$SIOLD= 16384
##$SREGLST= <1H.CDCl3>
##$SSB= 0
##$STSI= 0
##$STSR= 0
##$SW_p= 3612.71676300578
##$SYMM= 0
##$S_DEV= 0
##$TDeff= 0
##$TDoff= 0
##$TI= <>
##$TILT= no
##$TM1= 0
##$TM2= 0
##$TOPLEV= 0
##$USERP1= <user>
##$USERP2= <user>
##$USERP3= <user>
##$USERP4= <user>
##$USERP5= <user>
##$WDW= 1
##$XDIM= 8192
##$YMAX_p= 0
##$YMIN_p= 0
$$ End of Bruker specific parameters
$$ ---------------------------------
##NTUPLES= NMR FID
##VAR_NAME=  TIME,          FID/REAL,        FID/IMAG
##SYMBOL=    X,             R,               I
##VAR_TYPE=  INDEPENDENT,   DEPENDENT,       DEPENDENT
##VAR_FORM=  AFFN,          ASDF,            ASDF
##VAR_DIM=   8192,          8192,            8192
##UNITS=     SECONDS,       ARBITRARY UNITS, ARBITRARY UNITS
##FACTOR=    0.0002768,     1,               1
##FIRST=     0,             0,               0
##LAST=      2.2672688,     0,               0
##MIN=       0,             -586892,         0
##MAX=       2.2672688,     563608,          0
$$ Real data points
##PAGE= N=1
##DATA TABLE= (X++(R..R)), XYDATA
0 0 0 0 0 0 0 0 0 0 0 0 0 -8 0 -8 8 -8 16 -16 16 -24 24 -32 34 -42 50 -56 67 -75 89 -102 115 -132 149 -167 191
35 191 -210 241 -267 299 -334 368 -411 456 -502 558 -614 677 -748 822 -907 998 -1099 1215
53 1215 -1339 1481 -1641 1826 -2039 2287 -2585 2944 -3390 3964 -4723 5794 -7404 10098 -15453
68 -15453 30251 -162487 -586892 -504673 -334456 -10958 357754 491712 409519 273636 -77542
79 -77542 -430783 -521418 -421073 -140820 302197 516495 447935 289045 -23675 -384311 -480752
90 -480752 -402589 -210260 175161 473511 467558 323693 44091 -319555 -467876 -401015 -246362
101 -246362 86809 414847 467883 348574 109468 -252164 -450104 -396371 -256035 13126
111 13126 334798 443009 370367 182232 -168293 -434130 -420762 -278066 -31055 289016
121 289016 422918 351604 203197 -78744 -362688 -417701 -315091 -99977 225493 413105
131 413105 367127 229654 -21987 -315232 -405336 -318332 -144948 148831 377970 375250 252003
142 252003 34984 -251675 -386112 -332095 -189131 76495 337018 382198 277931 84380
152 84380 -200220 -371385 -331459 -203895 14826 273148 366786 297279 139805 -126174 -343161
163 -343161 -350723 -236034 -32766 232503 357045 298309 164722 -63005 -294489 -345820 -257669
174 -257669 -89850 166511 339620 318287 196519 -13181 -255940 -340902 -266974 -122402
184 -122402 109245 305523 319697 220040 42623 -199645 -331464 -287027 -157339 56198
194 56198 272457 323034 236514 79268 -149630 -309146 -293728 -182054 4206 226002 318104
205 318104 255695 117792 -94882 -280869 -303168 -206554 -37582 182711 305872 267193 145512
216 145512 -46728 -244788 -302165 -226526 -80390 130271 286656 282467 173527 -3526 -207528
227 -207528 -296968 -240371 -110039 83648 256500 285018 198065 42298 -162417 -286899 -258061
238 -258061 -140520 40992 225688 284616 214996 75454 -117900 -264802 -267506 -167817 -2189
249 -2189 190070 281309 232192 105682 -76636 -239274 -270767 -187921 -38491 149783 267873
260 267873 246679 133982 -37744 -210638 -270586 -205683 -70550 110066 248781 254991 157531
271 157531 -666 -177616 -265198 -221629 -98358 73668 224853 257837 179056 34254 -142192
282 -142192 -254081 -234444 -123097 38762 197891 256045 195190 63845 -104811 -234155
292 -234155 -244301 -149746 4756 170010 251346 209381 88388 -71566 -209932 -244165 -170627
303 -170627 -30807 133819 240805 227312 116667 -41523 -186850 -240885 -185086 -58523
313 -58523 97762 218011 233235 145297 -3276 -158662 -240122 -204545 -84420 69083 195009
324 195009 230866 165342 31220 -122177 -223911 -218940 -116769 35981 175057 231164 181722
335 181722 57375 -90847 -201909 -222518 -143439 -1017 144553 223902 199810 87057 -62573
346 -62573 -182986 -220966 -161291 -31522 112400 207889 210411 116388 -29809 -160256 -218112
357 -218112 -178656 -58492 85676 188929 211253 139178 2632 -133680 -209883 -192906 -86774
368 -86774 57950 171353 210093 156420 29360 -107063 -193653 -199046 -112853 28512 151379
379 151379 206509 171964 55133 -83718 -178329 -199207 -131786 -257 125813 196069 184308
390 184308 83310 -58016 -163707 -198531 -148271 -25053 103883 181451 187457 107718 -27041
401 -27041 -142295 -195547 -166266 -52392 83017 169362 188020 125617 -756 -119488 -183262
412 -183262 -176433 -82626 54613 155153 189232 143746 23481 -99832 -169650 -178221 -106398
423 -106398 23981 133999 184402 161966 54392 -78552 -160315 -178775 -123268 -1964 111494
434 111494 171866 170981 84515 -49229 -146255 -180172 -142278 -28005 93166 159410 169991 107020
446 107020 -18561 -125580 -174783 -158308 -57177 72533 150800 170952 122737 5603 -105135
457 -105135 -161294 -164038 -86329 44617 138766 170525 138126 29738 -88612 -151437 -162976
468 -162976 -105062 16715 119478 164646 152378 57404 -69690 -143757 -162019 -118588 -5354
479 -5354 102823 153912 155524 82731 -44246 -132775 -161609 -132947 -29067 86823 145699 155103
491 155103 100105 -18975 -117327 -156287 -143553 -53512 68209 137937 154336 114431 4329
502 4329 -101594 -147882 -147909 -77782 46070 128999 151950 125545 27501 -85222 -139850 -147458
514 -147458 -96039 19747 114589 148915 136359 50994 -67868 -132619 -145258 -109249 -4518
525 -4518 98386 140970 141377 76032 -43872 -124739 -145545 -120956 -26683 82983 133159 139613
537 139613 93559 -16955 -109731 -141703 -131596 -53727 63127 128297 139715 106496 6735
548 6735 -93643 -134134 -134570 -76349 38126 118106 139138 118822 31415 -77972 -129265 -134483
560 -134483 -92600 12652 104302 134954 126047 55006 -56802 -121103 -133379 -106173 -12597 88856
572 88856 130045 130408 76861 -33914 -113838 -132422 -114010 -33610 71333 121763 128163 92807
584 92807 -6804 -99178 -130502 -123006 -56245 53426 116757 126554 101575 15357 -82640 -123140
596 -123140 -124421 -76217 29174 108288 126940 110268 35769 -66615 -117379 -123112 -90605 4595
608 4595 95934 125206 115610 53699 -49309 -110585 -119557 -97991 -18515 77279 119883 120920 74792
621 74792 -28264 -107031 -121185 -101831 -32822 62883 110261 115800 87099 -1551 -91566 -121456
633 -121456 -111787 -52279 48459 108324 113742 91204 17108 -75090 -114501 -113244 -70337 26563
645 26563 102482 115798 97280 32521 -60090 -107171 -110991 -83026 2370 90848 116978 103166
657 103166 47810 -45612 -102589 -107080 -87078 -19421 69875 111689 110304 67984 -26137 -100925
669 -100925 -111831 -89572 -29571 56540 101742 104195 79175 1682 -83987 -113180 -100697 -48341
681 -48341 42508 100894 104286 82377 17990 -67532 -106463 -102618 -64929 20293 93331 106852
693 106852 87554 32967 -51650 -99691 -101996 -75975 -1970 81006 108360 94395 46942 -37127
705 -37127 -95268 -100014 -79642 -20541 61859 103119 99242 62699 -17508 -89335 -103500 -83573
717 -83573 -31806 47781 95863 97115 71734 4631 -73807 -103968 -91906 -47001 32661 91934
729 91934 98583 75582 18035 -59499 -98311 -92871 -58684 13755 82166 99458 81477 32374
741 32374 -44199 -93396 -94740 -66780 -2607 70928 98712 85816 43811 -29637 -87041 -94944
753 -94944 -72091 -17550 56088 94787 89157 54888 -13193 -78264 -96163 -77888 -29779 42620
765 42620 89651 89885 62374 2795 -65430 -93802 -82452 -42761 26964 83281 92803 68822 15387
778 15387 -53966 -90054 -83861 -51560 10441 72164 92167 75469 30066 -39492 -86833 -87950
790 -87950 -58688 -2038 61774 89132 78429 41137 -22942 -77949 -89155 -67164 -16522 49911
802 49911 86855 81709 49068 -8864 -67660 -88141 -72724 -29107 36088 82092 85011 56453
814 56453 2688 -57962 -85229 -75484 -39033 21363 73770 86509 64226 15005 -46835 -83442
826 -83442 -78620 -46037 9313 64139 84645 69043 26712 -33852 -78032 -81760 -53792 -2289
838 -2289 54606 82500 72751 35812 -20998 -70076 -82524 -60768 -13508 44406 79333 76012 43650
851 43650 -9215 -61118 -81574 -66261 -24366 32375 74054 78484 50562 1243 -51192 -78583
863 -78583 -70056 -34158 20160 67177 80332 58174 12024 -41981 -75692 -72950 -41210 8724
875 8724 57039 78276 64710 23479 -30790 -70861 -76244 -49179 -1296 48288 75131 68245 33278
888 33278 -17940 -62479 -77730 -57564 -12268 39765 71843 71019 40085 -7889 -53221 -75000
900 -75000 -63394 -23693 27755 66934 74620 48235 1208 -45431 -71481 -66319 -32116 16851
912 16851 58576 74623 56440 11951 -37361 -68853 -69280 -38554 8467 50586 71561 61187
924 61187 22150 -26646 -63499 -71849 -47135 -646 43962 68814 64027 29719 -16858 -55902
936 -55902 -71298 -54530 -10838 35784 65793 67421 37602 -8815 -48837 -68275 -58837 -20819
948 -20819 25654 59665 69079 45848 -11 -42501 -66375 -62183 -28080 17044 52605 67914
960 67914 52857 11249 -33502 -62508 -65831 -36741 9384 47297 65449 56367 19470 -24243
972 -24243 -55517 -66505 -46088 -1325 39953 63738 61001 27411 -17051 -49633 -63742 -50883
984 -50883 -11685 30353 58819 64754 37856 -8793 -45567 -62888 -54635 -18301 22949 51586
996 51586 63321 45180 2360 -37799 -61504 -59779 -26349 17531 47395 60526 49032 10994
1008 10994 -29226 -55653 -62562 -36492 9403 44528 60169 52089 16329 -22722 -48740 -59751
1020 -59751 -44165 -2322 37100 59064 58065 24514 -18998 -46200 -56977 -46087 -9489 27808
1032 27808 52573 60435 35826 -9747 -43341 -58113 -50265 -14630 23596 46505 56492 41873
1044 41873 1508 -35417 -56020 -55920 -24355 18276 44206 54833 44891 8995 -27746 -50170
1056 -50170 -57322 -34783 9490 41528 54967 48668 15045 -22513 -44318 -54234 -41353 -2156
1068 -2156 34263 53523 54211 24467 -17895 -43095 -52080 -43270 -9302 26211 47057 54488 34941
1081 34941 -7463 -39517 -53102 -48480 -15910 22643 43366 51926 39227 2011 -32423 -49811
1093 -49811 -51313 -25344 15864 40741 51092 43577 9505 -26880 -46104 -52407 -33437 7856
1105 7856 37950 49562 45972 16330 -20787 -41326 -50018 -38875 -2117 32450 48721 49511 23668
1118 23668 -16304 -40356 -48269 -40580 -8591 25826 43086 49165 32630 -6547 -36612 -48923
1130 -48923 -45312 -15870 21865 41578 47592 36071 593 -31327 -45017 -46480 -24470 14679
1142 14679 38379 47350 40996 8966 -26580 -43395 -47321 -30262 7537 35502 45495 42570 16273
1155 16273 -19933 -39252 -45815 -36301 -2060 30742 44720 45545 23531 -14688 -38165 -44559 -38475
1168 -38475 -8766 24877 40411 44921 30772 -5482 -34439 -44527 -41736 -16088 20365 39471
1180 39471 44051 33858 1429 -29799 -41974 -42493 -22967 12917 36435 42836 37375 9502 -24704
1193 -24704 -40696 -43601 -28786 6559 34003 41801 38592 15235 -19067 -37460 -41853 -33085 -2198
1206 -2198 28884 41739 41549 21706 -14090 -36355 -40868 -34732 -8120 23773 38238 40404 27972
1219 27972 -5198 -32925 -41487 -37796 -14795 19263 37374 40275 30738 1191 -28278 -39169 -38700
1232 -38700 -21372 11662 34515 39759 34375 8880 -23429 -38282 -39474 -25975 5358 31453
1244 31453 38846 35620 14788 -17217 -35544 -39204 -30676 -2415 27624 38510 37392 20509 -11317
1257 -11317 -33155 -38437 -32938 -9305 22010 36911 37722 25550 -4398 -30201 -37302 -34477 -15376
1270 -15376 15639 34666 38045 29909 2487 -26459 -37154 -35223 -19849 9901 31794 37175 31973
1283 31973 9824 -20914 -36501 -36644 -24095 4136 29081 36318 32365 14655 -14565 -33610 -36757
1296 -36757 -28109 -2525 25566 36223 33784 18612 -9701 -30989 -35935 -30232 -8674 20348 35343
1309 35343 35093 22674 -3953 -28120 -35311 -31434 -13929 14352 33093 35747 26511 1887 -25071
1322 -25071 -35429 -32153 -17249 9183 30103 35015 28766 8415 -19454 -34415 -34032 -21544 3874
1335 3874 27403 34847 29998 12928 -13865 -32039 -34321 -25267 -2137 23617 34187 31277 16825
1348 16825 -8470 -29120 -34019 -27848 -7771 18287 33405 32923 20813 -3062 -26089 -34058 -29387
1361 -29387 -12646 12822 30880 33253 23928 2470 -22337 -33524 -30338 -16556 7836 28133
1373 28133 33294 26582 7747 -17510 -32307 -31816 -19985 2728 24921 33254 28276 12221 -12461
1386 -12461 -30262 -32598 -23202 -2399 21333 32609 29812 15560 -7681 -27268 -32443 -25194 -7493
1399 -7493 16604 31039 31179 19257 -2828 -23887 -32465 -27118 -11083 11830 28943 31571 22421
1412 22421 2380 -19714 -31636 -29442 -15020 7346 26442 31918 24345 6420 -15756 -30030
1424 -30030 -30213 -18502 2136 22610 31781 26957 10809 -11278 -27945 -30728 -21270 -2270 18859
1437 18859 30569 28606 14924 -6584 -25160 -31572 -23945 -6371 14898 28817 29474 17951 -2195
1450 -2195 -21511 -30477 -26130 -10764 10513 26850 30282 20821 2096 -18147 -29719 -27541 -13945
1463 -13945 6251 23522 30595 23340 6129 -14058 -28166 -29149 -17228 2359 20540 29583 25297
1476 25297 9585 -9953 -25239 -29311 -20508 -1825 17048 28770 27464 13425 -6421 -22881
1488 -22881 -29791 -22742 -5730 13171 26354 28282 16985 -1879 -19679 -29114 -25198 -8967 9951
1501 9951 24472 28523 19650 1787 -15968 -27537 -27172 -13227 6087 22070 29075 22539 5255
1514 5255 -12943 -25338 -27658 -16565 1979 18871 28199 25027 9260 -9332 -23683 -28368 -19619
1527 -19619 -1472 15281 26255 26529 12932 -5595 -20866 -28093 -22559 -5465 12129 24540 27557
1540 27557 16355 -2545 -18202 -26971 -24491 -8929 8849 22265 27652 19501 1788 -14566 -25665
1553 -25665 -26162 -12602 5980 19873 27181 21741 5406 -11604 -23451 -27068 -16260 2394 17675
1566 17675 26367 23604 8535 -8619 -20916 -26743 -19533 -1645 14633 25022 25678 11913 -6008
1579 -6008 -19009 -26027 -21285 -5542 11289 22914 26737 15830 -2942 -16910 -25315 -22873 -8351
1592 -8351 8386 20033 26029 19530 1930 -14340 -24505 -25016 -11870 5985 17953 24806 21281
1605 21281 5838 -10754 -22057 -26450 -16164 2642 16697 24453 22180 8423 -7685 -18838
1617 -18838 -25102 -19764 -2313 13982 23816 24760 11791 -5924 -17033 -23521 -20726 -6344 9482
1630 9482 20787 25697 16617 -2177 -16194 -23482 -21891 -8578 7371 17869 24263 19068 2768
1643 2768 -13049 -22349 -24184 -12088 5029 16388 22669 20574 6027 -9683 -20032 -24667 -16022
1656 -16022 2191 15454 22051 21372 8926 -7008 -17162 -23581 -19120 -2733 12891 21873 23503
1669 23503 11766 -5702 -16312 -21531 -19739 -6067 9153 19167 24094 16401 -1985 -15304 -21694
1682 -21694 -20900 -8055 7631 17056 22176 17781 2365 -11982 -20348 -22560 -12129 5209 15931
1695 15931 21478 19460 5435 -9882 -18733 -22295 -15168 1929 14288 20388 20525 8488 -7229
1708 -7229 -16440 -21684 -17853 -2311 12371 19743 21637 11654 -5135 -15503 -20473 -18518 -5945 9223
1722 9223 17537 21629 15315 -1257 -13984 -20117 -20363 -8873 7633 16216 20650 17080 2156 -11574
1736 -11574 -18489 -20855 -12296 3648 14844 20083 19139 5858 -9543 -17763 -20470 -14336 1281 13264
1750 13264 19023 19418 9295 -6421 -15723 -19969 -17154 -2798 11287 18504 19847 11805 -3929 -14680
1764 -14680 -18949 -17597 -5770 8779 16449 19872 14945 -356 -13284 -19116 -19289 -8834 6847
1777 6847 15683 19167 16047 2579 -10890 -17167 -19096 -12217 3416 14219 18818 17937 5935 -8790
1791 -8790 -16806 -19196 -13966 768 12385 17505 18393 8893 -5985 -15034 -18664 -15917 -3316 10415
1805 10415 17197 18968 11446 -3291 -13788 -18049 -16728 -6050 7962 15520 18343 13968 391
1818 391 -12270 -17622 -18075 -9142 5845 14864 18059 15092 3107 -9660 -16163 -17862 -11808 1997
1832 1997 13397 17619 16759 6303 -8053 -15562 -17531 -13082 -509 11431 16401 17169 9321 -4825
1846 -4825 -14175 -17360 -15114 -3466 9605 15933 17192 11391 -2105 -12762 -16774 -15878 -6306 7360
1860 7360 14922 16684 12825 658 -10814 -16208 -16494 -8829 4512 14006 16916 13908 3183 -9072
1874 -9072 -15250 -16154 -10922 1470 12110 16434 15318 5849 -6957 -14596 -16254 -12122 -929 10176
1888 10176 15459 15767 8787 -4169 -13500 -16510 -13335 -3235 8845 14574 15397 10650 -1203 -11460
1902 -11460 -16026 -14845 -5972 6611 14303 15454 11518 1093 -9455 -14962 -15146 -8707 3549 12958
1916 12958 16100 13160 3437 -8065 -14115 -14883 -9871 1197 10934 15104 14421 6355 -5918 -13910
1930 -13910 -15112 -11161 -1285 9129 14332 14499 8016 -2793 -12068 -15508 -12910 -3649 7812 14099
1944 14099 14583 9266 -727 -10438 -14540 -13452 -6199 5150 13401 14966 10874 1247 -9129 -13991
1958 -13991 -13617 -7635 2548 11409 14614 12583 3798 -7085 -13791 -14138 -8905 730 10109 14329 13140
1973 13140 6054 -4679 -12776 -14882 -10923 -1303 8436 13730 13201 7324 -2519 -11009 -14422 -11783 -3849
1988 -3849 6604 13388 13849 8523 -800 -9569 -13748 -12415 -5903 4033 11975 14582 10232 1416 -8281
2003 -8281 -13655 -12871 -6937 2164 10379 13738 11505 4039 -6184 -13118 -13564 -8213 597 9312 13451
2018 13451 11818 5432 -3815 -11549 -14015 -10288 -1601 7773 13171 12521 6595 -2186 -10054 -13469 -11137
2033 -11137 -3879 5752 12375 13430 8175 -526 -8863 -13133 -11566 -5409 3701 10943 13744 9882 1581
2048 1581 -7338 -12741 -12563 -6505 1952 9363 12975 10734 3422 -5197 -12093 -13071 -8118 279 8545
2063 8545 12783 11545 5190 -3308 -10590 -13388 -9694 -1466 6872 12548 12275 6154 -2153 -9030 -12652
2078 -12652 -10608 -3610 4979 11323 12914 7797 -692 -8095 -12374 -11186 -4710 3090 10135 12966 9282
2093 9282 1663 -6588 -11873 -12114 -6071 2256 8612 12610 10236 3155 -4919 -10708 -12645 -7620 180
2108 180 7466 11909 10912 4276 -3090 -9399 -12643 -8913 -1422 6149 11528 11735 5806 -1981 -8311 -12113
2124 -12113 -9935 -3063 4386 10463 12140 7460 -594 -7369 -11629 -10628 -4616 2807 9070 11865 8918
2139 8918 1519 -5842 -11150 -11533 -5486 1640 7830 11531 9843 2890 -4225 -10130 -12031 -7301 492
2154 492 6903 11152 10636 4406 -2619 -8616 -11672 -8896 -1299 5811 10695 11111 5505 -1901 -7450 -11150
2170 -11150 -9747 -2823 4103 9713 11733 6926 -690 -6557 -10688 -10254 -4146 2775 8522 11573 8514
2185 8514 997 -5382 -10175 -10891 -5514 1621 7150 10927 9655 2925 -4126 -9172 -11352 -6963 391
2200 391 6037 10207 10057 4114 -2752 -8004 -11363 -8572 -911 5264 9584 10556 5202 -1603 -6765 -10567
2216 -10567 -9171 -2684 3962 8643 10818 6732 -588 -6072 -9975 -9762 -3944 2951 7941 10654 7663
2231 7663 560 -5068 -9232 -10238 -5510 1668 6610 10517 9132 2315 -4276 -8612 -10421 -6362 447
2246 447 5626 9544 9888 4183 -2781 -7647 -10597 -7786 -801 5259 8690 9937 5415 -1564 -6403
2261 -6403 -9911 -9064 -2066 4325 8314 10123 6135 -551 -5848 -9165 -9483 -3892 2782 7638 10051
2276 10051 7528 572 -5075 -8686 -9603 -5027 1528 6464 9697 8811 2394 -4153 -8168 -9764 -6236
2291 -6236 598 5648 8989 9277 3763 -2742 -7093 -9580 -7458 -897 4850 7969 9240 5179 -1516
2306 -1516 -6444 -9288 -8533 -2155 4305 7770 9292 6191 -502 -5391 -8676 -9201 -3698 2854 7277
2321 7277 9528 7566 865 -4971 -7972 -8880 -4969 1636 6386 8593 8026 2087 -3985 -7379 -9029
2336 -9029 -6109 337 5272 8446 8370 3551 -2899 -6998 -8987 -6973 -899 4587 7813 8813 5087
2351 5087 -1907 -5977 -8543 -7875 -1953 3962 7333 8640 5890 -486 -5313 -7897 -8404 -3433 3029
2366 3029 6703 8608 6783 918 -4637 -7538 -8380 -4757 1665 6040 8007 7495 1937 -3480 -7010
2381 -7010 -8441 -5665 439 5520 7718 7920 3536 -2692 -6467 -8066 -6564 -1010 4373 7568 8177
2396 8177 4494 -1495 -5874 -7628 -7199 -2253 3681 6748 7819 5815 -203 -5152 -7560 -7513 -3497 2596
2412 2596 6328 7768 6250 843 -4179 -7071 -7490 -4393 1536 5874 7751 6992 2004 -3609 -6657
2427 -6657 -7932 -5488 223 5133 7457 7371 3400 -2570 -6197 -7463 -6023 -1014 4182 6803 7409 4142
2443 4142 -1115 -5711 -7402 -6877 -2007 3163 6470 7345 5257 -129 -4965 -7113 -6785 -2943 2140 6160
2459 6160 7439 5857 1023 -4112 -6837 -7219 -4296 1158 5340 7201 6520 2111 -3023 -6456 -7066 -4845
2475 -4845 295 5053 7163 6748 3107 -2187 -5760 -6986 -5581 -1175 3992 6808 6703 4213 -1177
2490 -1177 -5327 -6840 -5925 -2008 2999 6145 6733 4744 -413 -4710 -6954 -6515 -3005 2263 5530 6795
2506 6795 5162 1143 -3593 -6369 -6560 -3761 1004 4817 7140 5829 1666 -3169 -5950 -6901 -4397
2521 -4397 64 4360 6666 6274 2792 -2375 -5557 -6621 -5123 -847 3792 6239 6355 3704 -960
2536 -960 -4898 -6748 -5618 -1898 2691 6123 6772 4224 -184 -4431 -6259 -5982 -2692 2017 5763 6816
2552 6816 4844 879 -3579 -5943 -6077 -3332 1215 4637 6421 5559 1979 -2812 -5786 -6160 -3670 26
2568 26 4083 6328 5686 2640 -1645 -5316 -6585 -4910 -671 3208 5838 5776 3425 -723 -4522 -5891
2584 -5891 -5215 -1849 2380 5620 6351 4005 189 -3832 -5846 -5625 -2484 1587 5229 6477 4500 826
2600 826 -3460 -5745 -5509 -3005 680 4416 6166 5219 1710 -2488 -5799 -5965 -3614 273 3813 5539
2616 5539 5192 2330 -1380 -5026 -6137 -4385 -865 3385 5720 5284 2839 -704 -4053 -5915 -5158 -1472
2632 -1472 2666 5339 5942 3593 -43 -3509 -5643 -4962 -2242 1205 4825 6112 4322 844 -3074
2647 -3074 -5540 -5327 -2827 726 4019 5643 4880 1476 -2267 -5095 -5900 -3053 -136 3647 5270 5064
2663 5064 2353 -1298 -4482 -5886 -4160 -698 2845 5420 5132 2949 -661 -3932 -5717 -4428 -1138
2678 -1138 2143 4991 5558 3353 -190 -3317 -5410 -4946 -2044 1370 4344 5595 3684 373 -2648
2693 -2648 -4886 -5030 -2795 732 4064 5581 4692 1185 -1944 -4952 -5388 -3287 53 3167 5351 4917
2709 4917 1968 -1328 -4050 -5344 -3887 -638 2515 5160 4960 2343 -916 -3372 -5121 -4254 -1244
2724 -1244 1910 4446 5319 3120 -428 -3014 -4859 -4334 -1523 1197 3918 5345 3566 404 -2247
2739 -2247 -4763 -4790 -2184 816 3399 5030 4127 934 -1923 -4449 -4977 -2879 371 2842 4852 4566
2755 4566 1721 -1297 -3889 -5002 -3361 -379 2722 4761 4690 1959 -787 -3336 -4649 -3969 -1016 1786
2771 1786 4204 4936 2698 -463 -2973 -4437 -3960 -1327 1359 3465 4658 3491 220 -2478 -4270
2786 -4270 -4452 -2206 1024 3161 4672 3812 907 -1819 -3970 -4518 -2837 576 2756 4306 4118 1342
2802 1342 -1418 -3666 -4719 -3075 54 2644 4106 4323 1927 -1001 -2894 -4470 -3579 -571 1837
2817 1837 3824 4540 2397 -607 -2840 -4193 -4013 -1211 1712 3186 4430 3161 61 -2265 -3959
2832 -3959 -4133 -2011 1328 3017 4268 3483 332 -1993 -3497 -4050 -2402 236 2591 4132 3948 1432
2848 1432 -1498 -3285 -4414 -2606 90 2372 3873 3732 1750 -865 -3015 -4113 -3305 -507 2003
2863 2003 3543 4010 2117 -564 -2560 -3815 -3580 -1241 1542 3277 4109 2716 -5 -2068 -3754 -3708
2879 -3708 -1744 961 3097 4087 3129 468 -1824 -3455 -3688 -2364 599 2350 3626 3358 1300 -1649
2895 -1649 -3067 -3904 -2756 18 2093 3441 3688 1480 -1086 -2741 -4118 -2966 -306 2035 3567
2910 3567 3558 2253 -614 -2656 -3496 -3454 -1131 1556 3124 3826 2656 -297 -1925 -3289 -3464 -1708 1408
2927 1408 3011 3646 2852 431 -2003 -3236 -3512 -2119 542 2593 3474 3338 1076 -1589 -3022 -3719
2943 -3719 -2366 -42 2089 3331 3383 1433 -894 -2577 -3436 -2773 -383 1842 2932 3215 1824 -555
2959 -555 -2499 -3495 -3118 -1095 1308 2825 3574 2347 -11 -2231 -3121 -3220 -1476 1020 2713 3404 2670
2976 2670 204 -1896 -2937 -3048 -1815 876 2305 3373 2898 598 -1385 -2993 -3348 -2266 91 2035
2992 2035 3247 3097 1344 -837 -2563 -3137 -2365 -310 1509 2877 2878 1593 -671 -2448 -3052 -2928 -812
3009 -812 1447 2780 3189 2233 -169 -1902 -2840 -2831 -1047 1286 2602 3004 2452 533 -2182 -3060 -2977 -1531
3027 -1531 852 2268 2997 2454 804 -1461 -2451 -3001 -2044 330 2196 2708 2686 979 -1285 -2626 -2929
3044 -2929 -2175 -153 1800 2685 2901 1358 -493 -2437 -2800 -2440 -476 1607 2368 2788 1713 -264 -1981
3061 -1981 -2938 -2630 -983 886 2413 2966 1769 68 -1692 -2809 -2651 -1455 675 2172 2699 2331
3077 2331 519 -1471 -2557 -2714 -1846 291 1984 2667 2548 779 -1036 -2358 -2867 -1854 -185 1693
3093 1693 2710 2445 1089 -859 -2093 -2487 -2315 -881 1200 2494 2665 1418 -361 -1852 -2553 -2328
3109 -2328 -845 1164 2217 2603 2067 87 -1685 -2657 -2357 -1074 409 2109 2374 2196 638 -1205
3125 -1205 -2585 -2595 -1477 317 1973 2641 2146 636 -932 -2584 -2621 -1693 -68 1705 2419 2335 938
3142 938 -743 -1909 -2546 -1822 -482 1375 2326 2634 1271 -319 -1891 -2531 -2130 -711 902 2367 2602
3159 2602 1335 164 -1537 -2346 -2076 -931 592 1760 2236 1635 227 -1490 -2384 -2367 -1156 190 1714
3176 1714 2508 1851 680 -887 -2111 -2155 -1481 -137 1692 2333 2336 694 -877 -2032 -2354 -1557 -159 1219
3194 1219 2219 1819 1182 -626 -2005 -2466 -1777 -414 1184 1877 2282 1368 -352 -1692 -2303 -1921 -481
3211 -481 917 1958 2144 1578 73 -1183 -2114 -2061 -853 665 1841 2078 1461 281 -968 -2077 -2145
3228 -2145 -1139 67 1602 2456 1664 713 -635 -1741 -2268 -1487 -165 1102 1919 2177 856 -668 -1765
3245 -1765 -2128 -1842 -192 1123 1855 2310 1185 -495 -1743 -2104 -1780 -457 855 1725 2115 1234 161
3262 161 -1035 -1912 -1643 -721 607 1739 1966 1301 220 -1006 -1870 -2047 -1072 380 1307 2083 1567 582
3280 582 -471 -1709 -2224 -1070 -6 1204 1983 1908 575 -708 -1869 -1727 -1298 -504 1197 1901 1965 905
3298 905 -239 -1449 -1843 -1580 -270 750 1597 2157 1061 -337 -1002 -1601 -1548 -611 842 1620 1860 1556
3316 1556 -59 -699 -1414 -1412 -541 700 1279 1576 1629 316 -849 -1445 -2020 -896 159 1192 2007 1576
3334 1576 594 -732 -1527 -1794 -1427 134 1195 1645 1631 744 -216 -1445 -1775 -1428 -137 1102 1711 1848
3352 1848 908 -47 -1051 -1529 -1457 -525 876 1389 1743 985 -263 -950 -1751 -1431 -670 477 1367 1532 1222
3371 1222 41 -1037 -1367 -1772 -640 381 1355 1836 1402 293 -800 -1413 -1745 -1319 215 1096 1593
3388 1593 1347 517 -621 -1235 -1403 -1174 -50 817 1452 1400 655 -471 -1332 -1462 -1141 -112 613 1352 1422
3407 1422 900 -299 -1108 -1230 -1372 -410 750 1207 1562 1132 85 -1029 -1411 -1330 -436 689 1163 1845
3425 1845 1216 123 -762 -1577 -1514 -1098 262 952 1462 1234 206 -695 -1269 -1265 -1092 159 961 1477 1154
3444 1154 491 -518 -1204 -1176 -1021 -139 806 1349 1309 722 -492 -996 -1289 -1301 218 668 1220 1342 771 -227
3464 -227 -708 -1541 -1470 -711 852 1138 1490 833 18 -590 -1128 -1342 -485 567 1231 1594 922 204 -779 -1128
3484 -1128 -1416 -757 312 1000 1314 1174 264 -501 -1298 -1527 -817 102 1101 1123 1201 411 -510 -1102 -1503 -1067
3504 -1067 -153 836 1266 951 549 -274 -1282 -1059 -1105 -168 718 1037 1325 702 -68 -1051 -1181 -1254 -404 912
3524 912 852 999 489 25 -865 -1185 -784 -928 455 997 1337 989 290 -765 -1132 -1314 -778 160 963 1227
3544 1227 1196 516 -433 -1141 -1199 -808 -81 792 1128 1183 436 -435 -1099 -1435 -965 -307 780 1261 1030 706
3564 706 -214 -831 -1071 -1014 -230 819 1022 1176 677 24 -768 -1247 -1083 -353 546 825 897 1017 83 -818
3584 -818 -1355 -916 -532 329 1074 890 770 -28 -755 -1011 -969 -703 50 901 1285 609 227 -257 -1039 -1043 -598
3605 -598 -93 652 1085 997 430 -459 -1121 -1268 -664 51 714 1121 910 567 -441 -948 -1086 -702 -325 671
3625 671 1280 926 616 61 -1077 -1126 -978 -510 662 996 1207 619 96 -783 -1345 -1261 -350 490 1051 1102
3645 1102 792 122 -666 -1405 -1152 -688 83 892 1064 803 305 -546 -1039 -949 -547 221 796 878 628 279
3665 279 -533 -1051 -1168 -610 -102 649 903 1091 421 -111 -972 -1236 -596 32 642 990 999 471 -5 -811 -1040
3686 -1040 -930 -360 695 1191 1168 574 -46 -834 -1000 -1030 -446 311 874 1036 896 74 -836 -1081 -945 -355
3706 -355 251 978 1172 912 19 -213 -999 -1102 -615 162 993 1164 765 -31 -234 -945 -1305 -700 -60 854
3726 854 1066 997 358 -573 -1221 -1083 -729 -147 328 1124 1010 547 -344 -957 -1381 -831 -171 600 1025 1060 701
3747 701 -241 -819 -1241 -1028 -263 595 822 1155 673 10 -690 -965 -1114 -416 290 892 1357 846 308 -502
3767 -502 -1042 -1256 -584 20 462 1202 1159 422 -612 -1111 -1215 -948 -150 748 1323 1126 644 -358 -822 -1058
3787 -1058 -1007 -342 647 958 1166 571 -335 -1106 -1100 -992 -293 444 1234 887 804 -273 -823 -1218 -1032 -514 428
3808 428 809 678 969 189 -618 -1241 -1158 -611 328 1024 1020 1034 91 -436 -872 -1208 -621 216 1074 883 935 498
3830 498 -455 -1095 -1131 -721 -22 911 1499 1024 586 -211 -918 -1031 -809 -175 430 1113 1332 528 -228 -872
3850 -872 -1066 -929 -243 685 737 1015 867 238 -677 -1190 -1128 -558 305 1048 1015 656 292 -725 -1060 -1069 -531
3871 -531 -35 845 1303 1185 446 -787 -1358 -934 -627 105 1050 1201 902 348 -569 -1186 -984 -873 238
3890 238 707 1358 1106 390 -109 -952 -1312 -867 -514 741 1010 1211 501 18 -927 -1256 -878 -500 779
3909 779 1330 1328 996 165 -757 -985 -1098 -538 481 918 1234 853 194 -616 -1278 -1098 -557 142 1392 1113
3929 1113 1140 83 -597 -1239 -1173 -788 -23 953 1059 919 592 -444 -1027 -816 -794 34 708 1328 825 607
3949 607 -167 -1093 -1368 -772 -430 861 1313 1230 490 -79 -1068 -1476 -996 -462 715 1114 1234 790 73 -943
3969 -943 -1567 -1130 -725 531 1157 1387 797 178 -756 -1473 -1002 -570 271 981 1145 879 574 -591 -1121
3988 -1121 -1215 -788 -130 933 1414 886 464 -219 -956 -1154 -843 -267 703 1283 1082 397 -252 -1024 -1265 -798
4008 -798 -286 491 1070 1109 829 -52 -1124 -1158 -1072 -333 179 1031 1338 856 -54 -625 -1343 -870 -526 298 978
4029 978 1210 983 171 -416 -1449 -1225 -889 258 946 1597 815 405 -386 -1409 -1274 -703 -221 1054 1482
4048 1482 919 468 -106 -1280 -1395 -1050 -348 922 1579 1159 618 -14 -897 -1752 -950 -108 626 1163 1339
4067 1339 805 29 -967 -1282 -1081 -474 334 976 1528 770 169 -748 -1275 -1214 -443 242 991 1260 978 415
4087 415 -574 -1436 -1140 -1025 -105 917 1571 1172 578 -256 -1626 -1550 -836 -8 920 1672 1231 357 -311 -1113
4107 -1113 -1415 -1221 -361 482 1461 1102 797 104 -1140 -1462 -1201 -499 556 1110 1714 675 -120 -989 -1633
4126 -1633 -1268 -504 381 1025 1651 1140 204 -816 -1271 -1263 -649 157 1071 1252 1091 374 -543 -1219 -1370 -775
4146 -775 -120 1025 1500 1235 624 -362 -1080 -1659 -949 -80 656 1224 1392 651 -268 -1045 -1518 -1056 -151 494
4166 494 1328 1424 927 -4 -955 -1542 -1322 -681 664 1202 1554 1135 81 -689 -1318 -1331 -829 30 1039 1212
4186 1212 1425 66 -616 -1478 -1477 -837 -315 947 1467 1327 486 -367 -1488 -1425 -884 -158 787 1435 1365 718
4206 718 -375 -1181 -1445 -993 -487 504 1309 1472 840 -211 -1077 -1793 -1241 -505 606 1522 1648 986 212
4225 212 -881 -1503 -1510 -903 653 1174 1698 1049 81 -823 -1714 -1490 -917 145 1056 1704 1498 255 -779
4244 -779 -1432 -1622 -1162 -128 782 1410 1386 765 -355 -1205 -1685 -1013 -330 768 1588 1311 885 -250 -1294
4263 -1294 -1556 -1347 -540 687 1353 1549 898 43 -1009 -1764 -1592 -399 333 1296 1697 1143 281 -1038
4281 -1038 -1483 -1670 -818 142 1063 1554 1202 379 -572 -1556 -1771 -1075 81 1100 1499 1509 823 -547 -1500
4300 -1500 -1639 -1149 -126 721 1611 1656 898 -124 -1067 -1730 -1482 -325 833 1613 1626 985 8 -1139 -1587
4319 -1587 -1547 -599 480 1358 1660 1094 63 -1008 -1693 -1534 -912 199 1118 1713 1331 589 -935 -1558
4337 -1558 -1669 -1080 -80 1331 1740 1280 488 -747 -1487 -1728 -1047 -29 847 1314 1525 733 -436 -1236
4355 -1236 -1927 -1405 -315 865 1583 1382 867 -208 -1096 -1908 -1276 -499 737 1398 1567 1113 -3 -990
4373 -990 -1804 -1457 -944 474 1308 1763 1236 391 -974 -1359 -1388 -964 24 1054 1749 1440 543 -551 -1342
4392 -1342 -1512 -1246 -84 873 1818 1484 900 -282 -1559 -1701 -1296 -251 904 1726 1356 946 -34 -1578
4410 -1578 -1777 -1450 -630 630 1638 1730 1027 128 -1177 -1662 -1814 -601 527 1671 1695 1232 386 -975
4428 -975 -1646 -1562 -963 245 1341 1799 1626 507 -572 -1412 -1315 -837 -150 907 1874 1601 714 -526 -1408
4447 -1408 -1867 -1075 -213 787 1478 1694 881 -301 -1286 -2161 -1246 -605 811 1824 1825 848 95 -1099 -1852
4466 -1852 -1422 -863 331 1532 1657 1476 28 -710 -1566 -1686 -1123 29 1508 2159 1680 527 -713
4483 -713 -1720 -1704 -892 -256 797 1625 1362 1115 -458 -1479 -1691 -1128 -92 850 1795 1697 703 -157 -1570
4502 -1570 -1815 -1327 -335 625 1662 1899 946 133 -1299 -1716 -1517 -808 489 1484 1825 1311 54 -851
4520 -851 -1987 -1712 -895 523 1492 2022 1371 462 -960 -1709 -1833 -894 15 1001 1744 1654 672 -208 -1693
4539 -1693 -1853 -1523 -276 870 1668 1703 669 -42 -1567 -2184 -1284 -484 496 1800 1695 1034 -44 -1292
4557 -1292 -1978 -1611 -714 328 1566 1921 1263 124 -1002 -1770 -1737 -1016 149 1458 1977 1151 569 -731
4575 -731 -1907 -1759 -1052 15 1067 1933 1551 638 -310 -1604 -2045 -1155 -213 765 1599 1807 942 -325
4593 -325 -1457 -1968 -1248 -407 794 2002 2101 1161 -47 -1139 -1774 -1581 -519 764 1441 2107 1412 223
4611 223 -1172 -2046 -1596 -783 245 1592 2046 1578 412 -807 -1608 -1835 -1161 490 1208 1962 1583 742
4629 742 -529 -1568 -2167 -1131 -160 1164 2082 1656 599 -150 -1434 -2097 -1146 -239 744 1806 2151 859
4647 859 -111 -1448 -1861 -1586 -552 493 1632 1738 1253 22 -1237 -2107 -1714 -654 503 1568 1956
4664 1956 1379 430 -792 -1813 -1843 -1011 248 1175 1856 1731 486 -597 -1581 -2065 -1202 -118 983 1673
4682 1673 1646 650 -387 -1345 -2109 -1482 -225 987 1686 1874 1198 -337 -1203 -1857 -1495 -520 641 1562
4700 1562 2046 1113 45 -1139 -1925 -1820 -595 405 1195 2011 1369 247 -883 -1855 -2216 -954 404
4717 404 1424 1949 1575 537 -731 -1570 -2017 -1050 3 935 1883 1792 577 -537 -1443 -1775 -1337 -461
4735 -461 877 1921 1803 1044 -444 -1123 -1857 -1738 -392 770 1660 2025 1131 -31 -1205 -1943 -1474 -853
4753 -853 665 1522 1998 1787 451 -1025 -1837 -1885 -1046 109 1409 1961 1607 489 -901 -1602 -1790 -1220
4771 -1220 253 1376 2035 1528 463 -230 -1879 -1886 -1539 -339 869 1813 1668 1036 -285 -1704 -2108 -1624
4789 -1624 -371 951 1813 2149 1269 -148 -1246 -1883 -1895 -770 689 1794 1873 1335 346 -1217 -1817 -1954
4807 -1954 -616 333 1575 1791 1469 646 -700 -1749 -1968 -867 235 1268 1769 1609 506 -714 -1421
4824 -1421 -2123 -1514 -117 964 1886 1757 849 -376 -1471 -1788 -1623 -636 682 1863 1898 1027 -2 -1243
4842 -1243 -1848 -1700 -745 587 1580 1856 1290 -78 -1187 -1933 -2123 -877 488 1442 1788 1635 398 -760
4860 -760 -1969 -1961 -803 156 1133 1881 1557 532 -726 -1599 -1997 -1689 -137 1116 1836 1908 986 -664 -1568
4879 -1568 -1972 -1347 -345 968 2057 1813 908 -307 -1317 -1996 -1825 -587 736 1655 1881 1310 150
4896 150 -1304 -2104 -1831 -886 317 1576 2229 1496 356 -874 -1775 -1859 -1039 236 1516 1908 1847 722
4914 722 -608 -1766 -1968 -1197 -234 1336 2147 1770 754 -630 -1724 -1996 -1530 -512 850 2078 1842
4931 1842 1327 -58 -1359 -1924 -1620 -694 507 1873 2074 1302 139 -1143 -1902 -1733 -796 367 1731
4948 1731 2096 1534 292 -862 -2030 -1978 -1065 -83 1310 2243 1660 494 -689 -1800 -2062 -1778 -407
4965 -407 1437 2225 1782 883 -398 -1564 -1978 -1388 -531 976 2100 1853 1072 -18 -1630 -1840 -1559 -315
4983 -315 704 1989 1945 1543 123 -1228 -2096 -2049 -919 624 1595 1902 1688 408 -1261 -2019 -1992 -1108
5001 -1108 69 1521 2327 1809 656 -808 -1848 -1868 -1305 8 1315 1955 1745 813 -420 -1849 -2232
5018 -2232 -1642 -182 950 2175 2046 1240 -247 -1654 -2129 -1666 -690 740 2115 2296 1237 131 -1400
5035 -1400 -2130 -1735 -812 492 1603 2108 1311 321 -1042 -2002 -1933 -885 227 1526 2247 1649 691 -857
5053 -857 -2099 -2316 -1324 69 1421 2162 1672 978 -650 -1977 -2327 -1494 -484 1022 2139 2020 882
5070 882 -255 -1411 -2113 -1620 -640 668 2043 2466 1521 182 -1245 -2245 -1785 -980 55 1473 2466
5087 2466 1576 279 -1251 -2206 -1920 -989 113 1323 2343 1566 445 -786 -2085 -2287 -1231 -87
5103 -87 1406 2117 2030 568 -593 -1765 -2285 -1299 -322 1050 2391 2197 873 -119 -1451 -1995 -1650 -630
5121 -630 645 1912 2270 1272 205 -983 -2131 -1883 -678 589 1869 2264 1527 198 -948 -2113
5137 -2113 -2154 -1124 479 1639 2296 1584 490 -749 -1963 -2056 -1316 -48 1238 2197 2118 698 -534
5154 -534 -1710 -2315 -1353 -312 1083 2459 2145 993 -179 -1652 -2123 -1763 -381 635 1539 2120 1107
5171 1107 -140 -1416 -2527 -1990 -671 748 1668 2271 1578 272 -1174 -1983 -2300 -736 108 1446 2381
5188 2381 1636 542 -971 -1929 -2390 -1354 31 1208 2240 2081 650 -420 -1924 -2189 -1711 -498
5204 -498 686 2121 2215 1177 -392 -1282 -2437 -1930 -442 530 2178 2178 1303 37 -1354 -2279 -2063 -1119
5222 -1119 460 1706 2391 1639 264 -1222 -2212 -2192 -1142 136 1549 2300 1885 674 -853 -1945 -2293
5239 -2293 -1423 -132 1160 2270 2177 878 -467 -1780 -2186 -1632 -347 934 2110 2262 1407 -372 -1412
5256 -1412 -2183 -1704 -607 698 1936 2184 1520 329 -1261 -2105 -2057 -678 594 1526 2367 1585 116
5273 116 -1122 -2098 -2359 -1009 361 1563 2368 1764 451 -679 -2006 -2259 -1432 -169 1270 2263 2136
5290 2136 919 -512 -1733 -2164 -1797 -357 1091 2310 2081 1429 -250 -1596 -2173 -1699 -281 633 1904
5307 1904 2159 1268 50 -1164 -2132 -2145 -790 705 1724 2492 1734 215 -935 -2163 -2103 -1382 316
5324 316 1514 2146 1770 545 -650 -1877 -2036 -1499 -65 1228 2076 2165 1149 -553 -1907 -2251 -1573
5341 -1573 -487 1131 2244 2283 1184 -398 -1715 -2272 -2026 -983 689 1913 2106 1466 -33 -1276
5357 -1276 -2110 -2396 -996 479 1631 2568 1638 541 -875 -1983 -2281 -1385 125 1343 2441 1904 952
5374 952 -594 -1943 -2176 -1582 186 1331 2114 1977 1072 -171 -1717 -2303 -1789 -544 1008 2208 2334
5391 2334 1176 -201 -1606 -2331 -1876 -845 773 1907 2518 1587 323 -1221 -1972 -1803 -1140 584 1449
5408 1449 2280 1880 551 -783 -1923 -2095 -1191 124 1488 2095 1821 826 -526 -1832 -2357 -1485 -33
5425 -33 1273 2331 2128 1155 -416 -1722 -2081 -1762 -431 876 1975 2488 1323 -18 -1332 -2305 -2218
5442 -2218 -935 512 1927 2106 1552 288 -1386 -2208 -2337 -1148 294 1666 2087 1886 474 -1282
5458 -1282 -1844 -2035 -1452 80 1736 2446 1836 695 -674 -1873 -2168 -1739 -154 1506 2342 2029 1231
5475 1231 -199 -1695 -2396 -2166 -624 804 2337 2227 1338 -127 -1495 -2412 -2193 -1045 748 1959
5491 1959 2206 1688 308 -1621 -2304 -2095 -1087 248 1733 2457 1866 594 -929 -2101 -2186 -1429 48
5508 48 1740 2338 1900 1009 -544 -2001 -2228 -1997 -105 1182 2345 2128 1255 -80 -1853 -2476 -2027 -511
5526 -511 890 2177 2409 1261 135 -1541 -2426 -1972 -1016 909 2206 2469 1737 256 -1369 -2109 -2222
5543 -2222 -1214 336 1716 2123 1789 576 -1175 -2019 -2226 -1355 78 1749 2265 1933 1005 -575 -1933
5560 -1933 -2126 -1819 -241 1208 2328 2269 1188 -111 -1759 -2263 -1924 -831 1020 2293 2475 1534 -83
5577 -83 -1459 -2502 -2397 -998 491 1976 2380 1680 580 -1004 -2487 -2131 -1525 265 1877 2257 1967
5594 1967 727 -954 -2213 -2413 -1554 -57 1538 2453 1925 886 -501 -2074 -2347 -1722 -606 1290
5610 1290 2204 2279 1386 -227 -1809 -2439 -1785 -851 980 2156 2439 1331 45 -1369 -2138 -1852 -1017 498
5628 498 2002 2490 1476 470 -1077 -2366 -2241 -1137 44 1766 2404 1846 667 -835 -2401 -2347 -1525
5645 -1525 -442 1366 2508 1884 858 -273 -1952 -2469 -1664 -431 1129 2453 2209 1176 16 -1594
5661 -1594 -2314 -1811 -712 672 2106 2177 1527 -7 -1648 -2363 -2145 -1043 721 1946 2323 1682 638
5678 638 -1083 -2457 -2378 -1291 337 1682 2496 1711 554 -722 -2353 -2586 -1432 -225 1506 2350 2009
5695 2009 1168 -303 -1876 -2484 -1914 -505 977 2099 2020 1398 -144 -1737 -2196 -1800 -861 906 2019
5712 2019 2274 1624 91 -1398 -2194 -1977 -865 532 1884 2369 1813 541 -1004 -2410 -2299 -1230 194
5729 194 1840 2429 1817 813 -725 -2010 -2418 -1675 -280 1468 2148 2298 977 -363 -1750 -2531 -1750
5746 -1750 -678 1224 2345 2040 1214 -263 -1600 -2345 -1941 -703 560 1739 2675 1567 219 -1379
5762 -1379 -2328 -2106 -1108 355 1645 2490 1908 347 -992 -2263 -2309 -1299 -23 1722 2335 1764 942
5779 942 -830 -1728 -2548 -1629 -167 1154 2268 2291 909 -210 -1725 -2608 -2031 -632 980 2169 2296
5796 2296 1473 -7 -1569 -2525 -2231 -940 739 1849 2553 1698 185 -1211 -2152 -2302 -1376 323 1763
5813 1763 2267 1888 421 -802 -2077 -2444 -1567 -23 1274 2466 2079 772 -659 -2100 -2219 -1766 -313
5830 -313 1059 2272 2410 1157 -251 -1601 -2406 -1824 -663 870 2482 2298 1337 -215 -1433 -2493
5846 -2493 -1982 -978 458 2063 2191 1653 415 -1133 -2197 -1941 -1183 183 1716 2329 1958 692 -763
5863 -763 -2204 -2086 -1322 -206 1139 2342 1980 883 -843 -1930 -2190 -1645 -352 1251 2225 2358 1378
5880 1378 -382 -1758 -2378 -1757 -689 980 1919 2303 1497 44 -1329 -2256 -1707 -928 566 1796 2568
5897 2568 1547 287 -1114 -2325 -2225 -996 168 1540 2446 1800 502 -773 -2016 -2340 -1537 5
5913 5 1473 2294 2094 1059 -461 -1762 -2533 -1612 -205 1235 2304 2122 1289 -386 -1602 -2442 -2243 -753
5931 -753 828 2032 2261 1396 36 -1170 -2205 -2110 -1164 720 1855 2486 1871 156 -1154 -1912 -2184
5948 -2184 -1402 360 1454 2371 1851 791 -967 -2169 -2331 -1210 -64 1451 2024 1955 1121 -457 -1796
5965 -1796 -2429 -1913 -479 1161 2080 2190 1468 -103 -1396 -2445 -1884 -916 807 2078 2575 1381 89
5982 89 -1263 -2144 -2173 -1229 776 1940 2259 1634 535 -966 -2156 -2226 -1326 230 1628 2206 1733 603
6000 603 -828 -1894 -2095 -1473 -280 1435 2350 2020 1056 -450 -1858 -2386 -1799 -862 1186 1985 2168 1638
6018 1638 -42 -1508 -2348 -1860 -976 821 1887 2186 1524 219 -1521 -2378 -2413 -1193 317 1824 2489
6035 2489 1649 156 -1175 -1956 -2069 -1192 147 1523 2489 2107 1086 -772 -2151 -2058 -1514 -299 1300
6052 1300 2241 2032 1041 -591 -1824 -2281 -1770 -405 913 2010 2124 1352 -68 -1775 -2164 -1969 -954
6069 -954 697 1866 1936 1422 280 -1378 -2161 -1958 -1235 349 1690 2310 2059 287 -1037 -1821 -2054 -1367
6087 -1367 134 1460 2300 1974 946 -782 -1986 -2223 -1571 -309 1313 2126 1954 1180 -276 -1773 -2204
6104 -2204 -1414 -603 873 1951 2097 1295 21 -1502 -1969 -1899 -939 806 1973 2042 1567 544 -1417 -2015
6122 -2015 -1961 -844 205 1959 2115 1711 530 -883 -2206 -2009 -1365 20 1623 2240 2101 864 -670
6139 -670 -2099 -2190 -1571 -238 1117 2164 1728 935 -289 -1972 -2076 -1645 -691 869 2100 1791 1522 34
6157 34 -1661 -1769 -1705 -917 647 1846 1955 1507 406 -1205 -1995 -2094 -1031 153 1662 1898 1638 816
6175 816 -729 -1838 -1994 -1212 192 1790 2026 1835 736 -485 -1759 -2238 -1747 -372 1250 1893 1863
6192 1863 981 -255 -1588 -1958 -1709 -640 977 1968 2087 1278 -67 -1502 -1849 -1726 -954 670 2028
6209 2028 1976 1455 245 -825 -1992 -1841 -926 298 1636 2050 2042 433 -984 -1863 -2267 -1397 -33 1228
6227 1228 1965 1925 926 -639 -1860 -2229 -1578 -423 1063 1931 1894 1080 -132 -1476 -2113 -1642 -592 901
6245 901 1656 1936 1561 -28 -1455 -1985 -1676 -646 800 1775 1906 1485 172 -1295 -1823 -1994 -972 196
6263 196 1565 2141 1572 816 -921 -1834 -1861 -1167 -188 1483 1985 1621 1023 -542 -1858 -2218 -1583 -239
6281 -239 1046 1992 2188 1163 -156 -1598 -2063 -1493 -655 696 1860 2117 1295 -104 -1455 -1999 -1782
6298 -1782 -662 419 1678 2007 1327 389 -997 -1854 -1922 -1083 253 1384 2042 1619 649 -881 -2102
6315 -2102 -1971 -1215 -100 1390 1831 1677 806 -368 -1538 -1930 -1311 -159 995 1694 1701 1312 -124 -1488
6333 -1488 -2151 -1545 -581 446 1915 1888 1370 67 -1404 -2225 -1814 -726 376 1816 1906 1448 590 -941
6351 -941 -1898 -1945 -899 243 1639 1756 1332 504 -720 -1636 -1718 -966 -61 1355 1951 1795 740 -511
6369 -511 -1640 -1958 -1533 -325 1034 1625 1804 1178 -212 -1657 -2014 -1336 -514 711 1722 1719 1273 156
6387 156 -978 -1992 -1815 -767 424 1575 1917 1419 361 -911 -1948 -1955 -1136 217 1438 1887 1646
6404 1646 416 -761 -1866 -1769 -1407 16 980 1928 1824 687 -373 -1364 -1586 -1140 -335 940 1765 1729
6422 1729 1286 -266 -1580 -1920 -1586 -339 807 1797 1913 1471 77 -1115 -2135 -1683 -721 299 1471
6439 1471 1952 1595 232 -819 -1998 -1785 -891 357 1164 2107 1591 776 -751 -1811 -1844 -1151 6 1066
6457 1066 1767 1501 665 -429 -1604 -1717 -1444 -146 788 1798 2021 1000 -318 -1163 -2047 -1447 -627 886
6475 886 1851 1912 1139 43 -903 -1907 -1697 -843 511 1793 1938 1349 365 -920 -1847 -1949 -761 374
6493 374 1431 1898 1610 697 -654 -1694 -1880 -1046 14 897 2140 1808 593 -541 -1596 -1914 -1402
6510 -1402 -145 1031 1582 1747 1241 -226 -1527 -1730 -1595 -754 873 1804 1789 1197 178 -1191 -1869 -1820
6528 -1820 -862 600 1475 1851 1442 321 -833 -1615 -1731 -961 379 1384 1866 1663 355 -664 -1674
6545 -1674 -1832 -1411 -29 1188 1887 1799 676 -419 -1546 -1599 -1300 -317 871 1629 1992 972 -219 -1225
6563 -1225 -1912 -1412 -243 874 1669 1805 1178 90 -1095 -1951 -1652 -834 559 1632 1894 1404 297
6580 297 -945 -1963 -1713 -1002 133 1524 1665 1400 384 -740 -1753 -1950 -1153 -22 1168 1938 1461
6597 1461 844 -659 -1667 -1652 -1216 -95 881 2070 1641 840 -244 -1396 -1860 -1528 -480 962 1816
6614 1816 1756 1108 193 -1208 -1821 -1580 -956 404 1510 1440 1180 231 -850 -1615 -1929 -953 409 1523
6632 1523 1604 1308 418 -772 -1746 -1937 -1205 -59 1153 1775 1634 726 -471 -1665 -1717 -1382 -329 1057
6650 1057 1761 1535 1275 -148 -1247 -1771 -1405 -485 562 1958 1881 1326 35 -1078 -1470 -1551 -513 652
6668 652 1416 1621 1022 180 -768 -1671 -1782 -935 222 1384 1739 1354 497 -639 -1765 -1651 -1199 62
6686 62 1119 1893 1720 746 -570 -1517 -1611 -1388 -403 959 1446 1438 569 -213 -1378 -1653 -1546 -574 764 1606
6706 1606 1859 1263 -144 -1479 -1757 -1479 -693 479 1481 1935 1139 141 -832 -1602 -1454 -1129 412 1310
6724 1310 1690 1636 437 -649 -1632 -1456 -1043 -89 1215 1797 1582 743 -374 -1571 -1865 -1164 -230 825
6742 825 1452 1583 1175 -376 -1228 -1796 -1361 -649 779 1703 1631 1213 282 -1083 -1746 -1382 -903 491 1476
6761 1476 1612 974 246 -1032 -1560 -1450 -908 179 1475 1809 1263 851 -458 -1646 -1710 -963 81 1318
6779 1318 1595 1457 852 -436 -1433 -1333 -1180 -410 752 1719 1546 972 -167 -1547 -1700 -1183 -611 780
6797 780 1733 1703 1331 -30 -947 -1615 -1403 -670 653 1720 1790 1153 31 -998 -1673 -1602 -804 4 1586
6816 1586 1746 1405 498 -491 -1366 -1695 -961 -104 1007 1817 1508 679 -513 -1713 -1362 -1108 -426 775
6834 775 1556 1435 924 -124 -1121 -1676 -1366 -65 827 1673 1822 1020 146 -905 -1504 -1439 -471 345 1580
6853 1580 1690 1174 166 -640 -1577 -1376 -922 34 1257 1611 1442 354 -497 -1401 -1441 -1009 45 1024 1559
6872 1559 1300 610 -544 -1388 -1471 -1230 -261 482 1671 1711 814 -177 -1237 -1498 -1335 -410 580 1415 1674
6891 1674 1134 -32 -1003 -1416 -1414 -662 587 1411 1477 1126 -188 -792 -1513 -1415 -962 17 1283 1746 1407 245
6911 245 -600 -1407 -1428 -644 -62 1092 1601 1454 582 -598 -1230 -1676 -1157 -300 902 1631 1374 563 -102
6930 -102 -1156 -1468 -1408 -622 623 1544 1236 969 -106 -1150 -1579 -1245 -743 462 1371 1797 1152 98
6948 98 -820 -1657 -1559 -908 204 1208 1539 1072 181 -724 -1267 -1766 -794 -138 1018 1283 1151 506 -447 -1315
6968 -1315 -1603 -1083 -266 656 1549 1650 1017 -73 -1389 -1579 -1238 -340 621 1279 1569 985 18 -1145 -1599
6987 -1599 -1482 -629 389 1228 1689 1358 229 -762 -1667 -1588 -908 281 1285 1492 1300 478 -749 -1568
7005 -1568 -1420 -1049 126 1088 1654 1489 591 -477 -1239 -1484 -1214 -136 687 1442 1410 757 -181 -1427 -1538
7024 -1538 -1396 -463 571 1580 1670 1064 -31 -1036 -1572 -1246 -473 617 1097 1471 1240 106 -837 -1590
7042 -1590 -1403 -917 351 1376 1666 1079 247 -829 -1456 -1508 -1016 339 1310 1492 1381 231 -676 -1347
7060 -1347 -1654 -1120 -130 977 1230 1371 848 -413 -1204 -1673 -1051 -332 570 1376 1710 765 88 -990 -1441
7079 -1441 -1256 -521 312 1386 1596 905 72 -996 -1388 -1606 -774 434 1240 1611 1319 513 -497 -1403
7097 -1403 -1620 -846 235 848 1468 1281 432 -649 -1264 -1685 -1105 -200 869 1497 1534 831 -333 -1183 -1508
7116 -1508 -1149 -69 664 1601 1500 711 -190 -897 -1565 -1342 -428 703 1329 1532 1067 107 -699 -1484 -1385
7135 -1385 -679 512 1476 1323 1207 325 -404 -1267 -1456 -858 -65 1113 1354 1312 485 -429 -1452 -1558 -1160
7154 -1160 -280 966 1250 1264 516 -390 -1144 -1524 -1245 -295 596 1214 1137 723 76 -925 -1782 -1141 -712 684
7174 684 1093 1557 825 243 -651 -1438 -1438 -974 312 1081 1460 1228 150 -663 -1408 -1510 -851 -88 907 1323
7194 1323 1412 510 -705 -1069 -1420 -1109 -303 811 1579 1446 624 -332 -1170 -1638 -1000 -464 660 1306 1346
7213 1346 1011 -473 -1144 -1487 -1222 -345 580 1344 1490 1104 163 -864 -1403 -1232 -570 442 1208 1359 1263
7232 1263 186 -964 -1344 -1658 -1046 -4 953 1360 1272 488 -537 -1296 -1511 -1003 -42 902 1132 1127 711
7251 711 -249 -886 -1554 -1071 -283 753 1519 1640 723 -295 -801 -1308 -1190 -555 430 1259 1541 1122 309
7270 309 -807 -1368 -1243 -759 176 1255 1323 953 303 -648 -1539 -1293 -850 227 1036 1364 1348 444 -230 -1367
7290 -1367 -1281 -987 -109 726 1398 1291 556 -232 -1411 -1398 -1030 -164 952 1467 1533 1026 -163 -988 -999 -1439
7310 -1439 -532 611 1363 1196 769 27 -638 -1270 -1313 -536 489 1165 1542 1152 329 -591 -1342 -1117 -587
7329 -587 6 1013 1256 1053 434 -569 -1297 -1348 -915 -152 753 1378 1111 620 -339 -1374 -1449 -1149 -341 577
7349 577 1355 1213 785 -75 -933 -1494 -1150 -450 502 1330 1356 849 360 -823 -1396 -1297 -370 256 1090 1327
7369 1327 1219 149 -756 -1206 -1320 -796 -26 1045 1374 949 476 -377 -1283 -1494 -960 -161 794 1164 1357
7388 1357 613 -509 -1136 -1224 -1007 -311 582 1292 1131 598 -35 -949 -1390 -1199 -590 607 1099 1305 1049
7407 1049 108 -872 -1264 -1393 -614 296 971 1350 1001 332 -850 -1282 -1289 -963 -32 917 1286 1266 276 -544
7427 -544 -1477 -1424 -1020 -112 860 1275 1318 662 -207 -838 -1518 -977 -233 575 1372 1182 612 55 -874 -1384 -1321
7448 -1321 -198 578 1297 1488 1210 116 -700 -1171 -1141 -525 194 1143 1505 904 210 -753 -1120 -1141 -871 -61
7468 -61 954 1246 1040 548 -372 -1155 -1383 -766 -151 838 1295 1244 590 -367 -1242 -1143 -1001 -412 683 1134
7488 1134 1152 769 10 -1196 -1351 -1281 -649 631 1318 1248 962 -277 -920 -1227 -1202 -837 194 1242 1494
7507 1494 890 167 -506 -1217 -1265 -932 159 909 1173 1115 512 -591 -1081 -1043 -946 -456 772 1367 1077 833
7527 833 -254 -1159 -1484 -1195 -136 822 1245 1282 756 -286 -991 -1395 -1053 -181 373 1372 1072 792 94
7546 94 -887 -1350 -1283 -690 137 923 1212 891 387 -555 -1332 -1264 -934 12 758 1216 905 776 -498 -1206 -1177
7567 -1177 -873 75 521 1118 1442 806 -207 -1045 -1224 -1064 -305 566 1096 1220 666 -224 -719 -1226 -1238 -431
7587 -431 285 946 1152 828 -51 -1030 -1295 -1442 -771 331 901 1048 1039 89 -558 -1171 -1328 -648 -164 923
7607 923 1416 1142 460 -324 -1064 -1548 -887 -260 787 1170 1000 401 -351 -913 -1346 -974 -384 561 1301 1017
7627 1017 735 71 -781 -1375 -978 -411 364 1071 1071 931 160 -830 -1320 -995 -672 284 748 1264 846 268
7647 268 -731 -1043 -1051 -669 130 805 1369 1128 401 -562 -1262 -1235 -926 -20 688 1137 929 897 -199 -1194 -1334
7668 -1334 -1137 -274 391 1027 1361 774 -138 -682 -1409 -1077 -444 390 1159 1243 716 -159 -963 -1015 -1249 -469
7688 -469 295 716 1237 887 198 -595 -1248 -1335 -640 28 923 1245 867 301 -434 -990 -1138 -883 -184 794
7708 794 1185 1272 575 -330 -794 -1506 -1057 -282 518 1122 885 472 -144 -855 -1168 -1095 -130 397 924 1197 670
7729 670 45 -677 -1039 -1193 -497 218 977 1228 969 262 -619 -1199 -1301 -678 -105 808 1252 1023 249 -605
7749 -605 -1021 -1168 -934 -270 522 1103 1193 567 -522 -1085 -1216 -971 -161 530 781 1287 378 42 -803 -1167
7769 -1167 -959 -360 323 1063 1164 809 -52 -742 -1196 -937 -695 281 1077 1069 937 209 -586 -914 -1081 -338
7789 -338 98 854 1083 804 605 -574 -884 -1146 -626 -74 795 1261 833 531 -239 -884 -1208 -1160 -82 353
7809 353 953 1116 446 -365 -992 -1291 -889 -316 443 813 1382 635 67 -509 -1187 -931 -551 291 854 1270
7829 1270 776 219 -482 -1273 -1079 -640 141 796 877 1041 413 -806 -1111 -1289 -850 -123 510 827 890 492
7849 492 -233 -989 -989 -743 -134 422 930 996 796 -110 -663 -1117 -661 -380 230 972 947 710 -117 -708 -915
7870 -915 -947 -806 230 823 912 743 104 -567 -1245 -1223 -786 186 786 933 960 283 -197 -739 -978 -588 -318
7891 -318 733 1254 980 331 -398 -933 -1163 -877 -76 589 1038 1033 596 -80 -932 -1177 -984 -191 334 928
7911 928 926 834 21 -557 -852 -828 -572 322 881 1083 591 89 -535 -1168 -826 -723 40 840 990 664 252
7932 252 -361 -697 -925 -509 58 763 927 934 376 -361 -767 -816 -739 -47 787 868 1128 748 -89 -813 -889 -974
7954 -974 -556 392 933 932 580 -40 -678 -1110 -684 -601 306 835 980 753 232 -277 -1101 -850 -510 -65 890
7975 890 1173 1025 302 -390 -848 -896 -691 -202 879 944 871 284 -84 -699 -1028 -897 -285 416 1123 977 786
7996 786 -62 -936 -1118 -614 -490 299 882 1070 853 229 -441 -1083 -949 -580 34 860 1097 772 182 -661
8016 -661 -1100 -902 -621 92 407 726 861 194 -352 -639 -908 -538 54 818 1037 875 390 -156 -864 -785
8036 -785 -800 -292 429 712 803 440 153 -666 -1030 -676 -424 258 856 947 766 -66 -506 -923 -737 -530 132
8057 132 724 1114 680 117 -373 -831 -1068 -611 138 663 1066 790 298 -319 -950 -921 -504 -73 510 633
8077 633 946 463 -253 -822 -1069 -785 -162 532 943 1187 688 -228 -859 -900 -878 -189 253 541 658 603 55
8098 55 -664 -996 -1033 -410 280 904 1103 616 425 -232 -1027 -1096 -758 -67 692 1033 696 -2 -391 -662 -932
8119 -932 -674 -233 601 1070 834 530 -158 -648 -955 -812 -178 327 1075 672 360 30 -512 -964 -732 -70
8139 -70 538 798 909 682 52 -780 -796 -823 -409 177 624 1093 639 187 -347 -713 -904 -513 85 619 827
8160 827 852 229 -273 -1108 -733 -556 -42 674 733 799 465 -100 -660 -642 -780 -160 403 577 755 595 -105
8181 -105 -475 -782 -684 -415 360 718 856 767 39 -634
8191f34
$$ Imaginary data points
##PAGE= N=2
##DATA TABLE= (X++(I..I)), XYDATA
0 0 0 0 0 0 0 0 0 0 0 -8 8 -8 8 -14 16 -18 25 -32 40 -49 57 -66 82 -96 114 -131 153 -179 202 -235 267 -305
32 -305 347 -392 445 -499 561 -629 702 -784 873 -968 1077 -1190 1318 -1457 1604 -1774 1952
49 1952 -2151 2370 -2609 2879 -3175 3508 -3885 4311 -4803 5374 -6045 6854 -7840 9088
63 9088 -10715 12938 -16173 21343 -30957 55056 -253692 -298041 191118 374460 563608 397833
75 397833 78997 -195706 -405185 -553096 -337080 3684 315299 550702 508458 139598
85 139598 -165658 -392522 -526453 -367782 -26977 227833 464404 518121 239114 -105376
95 -105376 -341213 -505468 -403603 -84209 183320 399663 508310 299720 -38194 -288792
105 -288792 -470179 -434663 -133679 145681 340883 465307 337398 35012 -216768 -426551
115 -426551 -467805 -207697 106714 313885 446778 358001 66520 -176127 -354466 -439913
125 -439913 -266024 30120 258125 424071 395883 126003 -138079 -319176 -426175 -300551
135 -300551 -14786 210449 374683 403084 185391 -89321 -277423 -399042 -329635 -74007
145 -74007 158507 332168 405838 241124 -35540 -239573 -377934 -353665 -115875 125823
155 125823 285612 377392 276135 26159 -184453 -339575 -372207 -180621 75719 256583
165 256583 368347 304260 64033 -150383 -295968 -359458 -223305 21004 208323 338401
175 338401 331772 125455 -108022 -268229 -354146 -256746 -19514 174385 304410 333392 169568
186 169568 -60823 -226808 -333127 -289742 -75866 135073 277539 335063 210204 -19556
196 -19556 -196343 -309080 -301729 -118955 95686 242973 322347 244889 30802 -158843 -282773
207 -282773 -310743 -165384 52775 214176 308173 267127 73273 -124437 -255053 -307438 -201222
218 -201222 7983 178406 286154 285265 122376 -84959 -229780 -300774 -229559 -32365 147116
229 147116 262257 287857 159763 -41618 -196501 -287065 -255898 -79572 112531 240685
239 240685 287878 192007 -2789 -167063 -267162 -265932 -119781 73231 213956 282984 221215
250 221215 38303 -137203 -248258 -270738 -153678 36191 186487 269195 239205 78665
260 78665 -103845 -228211 -271416 -183048 -480 158977 253156 249997 114857 -69079 -204874
271 -204874 -265557 -207196 -38397 130772 236951 254418 145706 -32779 -178641 -255361 -224939
282 -224939 -74874 100325 218175 253868 171091 1295 -152465 -240676 -234537 -109988 64668
293 64668 197613 252394 193150 34707 -126533 -224837 -236543 -136436 29524 170925 242563
304 242563 212425 74073 -95590 -212217 -240413 -159163 -2136 144459 227023 218958 105969
315 105969 -56951 -188228 -240179 -185350 -38017 120036 217359 223322 129920 -22853 -159939
326 -159939 -229289 -200966 -75992 83778 201495 230619 155196 7857 -136688 -217895 -207260
337 -207260 -104256 46586 175769 227658 177349 44599 -106717 -207234 -215192 -126716 16538
348 16538 150327 218053 190412 77346 -71927 -189539 -219151 -150297 -15549 125468 208858
359 208858 197430 100282 -40012 -165511 -216038 -168429 -46909 96977 197491 204735 121807
370 121807 -11885 -142874 -208492 -178050 -72787 65566 178991 208277 141814 16188 -118894
381 -118894 -201025 -186571 -93197 37947 157053 204019 156399 45330 -89478 -189648 -195599
392 -195599 -113486 11959 136801 199354 166021 66917 -59934 -169397 -197563 -134344 -17723
403 -17723 112840 194773 176981 85778 -35309 -149433 -194276 -146582 -44432 81650 180739
414 180739 187154 108701 -9181 -130191 -191798 -156554 -63771 52737 160084 189453 128349
425 128349 20818 -103232 -186697 -171023 -82956 30185 139986 185957 140674 46005 -71859
436 -71859 -172151 -181698 -106086 3446 119717 184315 151711 63603 -44572 -149647 -182573
447 -182573 -124883 -24572 93645 178662 165531 81634 -23244 -130671 -179584 -135799 -46315
458 -46315 62902 162342 176074 102400 -653 -111151 -177249 -146442 -61184 39957 142196
469 142196 175948 119484 24768 -86173 -171465 -159621 -77024 21132 124542 173754 129199
480 129199 41906 -60518 -156071 -168407 -96042 389 105267 170864 140841 56730 -39688
491 -39688 -137239 -169780 -111233 -20107 83148 163807 152009 72223 -20427 -119260 -168341 -122855
503 -122855 -37659 58845 150583 160954 87806 -3520 -100043 -164012 -134378 -52037 38588 132332
515 132332 163855 104775 16892 -79367 -157859 -145343 -65854 20631 113126 161575 117747 34735
527 34735 -55590 -144167 -155929 -84343 2808 95112 158229 128973 48600 -35008 -124542 -158015
539 -158015 -101683 -17382 72830 151052 143006 65557 -18586 -106692 -155986 -114440 -34024 50194
551 50194 135401 151258 83845 82 -87687 -152616 -128228 -48921 32161 117329 152766 99350
563 99350 17968 -66595 -142219 -138599 -64980 13720 98151 151157 114473 35425 -45735 -128749
575 -128749 -147439 -82111 -1150 80620 144080 124205 49254 -26213 -109037 -148634 -99767 -19951
587 -19951 61584 136622 135614 63277 -12765 -90816 -143263 -111279 -35344 40916 120876 142776
599 142776 80873 2583 -75205 -137704 -121395 -48986 24337 102782 143359 97137 17911 -58875
611 -58875 -128226 -128866 -60589 10781 83663 136896 109468 36198 -39044 -116568 -139197 -77227
623 -77227 1181 72259 129064 114385 45683 -21694 -95477 -137449 -94863 -17441 56546 124122
635 124122 125725 57070 -13192 -79962 -129956 -104215 -32271 38290 109911 132179 73870 -1245
647 -1245 -68274 -123241 -110958 -44178 22181 92500 133029 90434 12867 -55859 -116005 -118082
659 -118082 -54021 12264 74219 122968 102484 32671 -37216 -106359 -128771 -70590 4642 66635
671 66635 115552 105034 41532 -21119 -84974 -125391 -89895 -15253 52771 111528 116100 53438
683 53438 -13628 -72031 -117479 -97701 -30044 35116 97685 121554 70700 -1317 -60941 -109959
695 -109959 -104625 -42855 20850 81819 120654 86711 13846 -49719 -103801 -110821 -53937 10877
707 10877 66958 111307 96410 31456 -33775 -92996 -116563 -69459 1021 58610 104486 100538
719 100538 42171 -19896 -76260 -112907 -85050 -16227 46199 98205 107789 54624 -11261 -66130
731 -66130 -106443 -91569 -29174 32724 85852 108975 68760 1564 -54980 -99479 -97868 -41611
743 -41611 21290 74749 107009 79645 14109 -44498 -92278 -101936 -53416 10394 63163 100902
755 100902 87851 28004 -32013 -82111 -103388 -65887 -1648 53464 95433 93313 39669 -21384
767 -21384 -71210 -100093 -75990 -15015 42178 87331 97542 52755 -10151 -62513 -96512 -83134
779 -83134 -26267 30746 76851 97166 64706 3697 -50491 -91137 -90572 -39870 21010 69001
791 69001 94556 72279 15137 -39167 -81694 -92437 -52716 7562 58682 92017 80888 27157
803 27157 -29763 -73322 -92056 -62390 -4838 48073 85959 86451 39677 -19095 -66057 -90129
815 -90129 -69659 -15474 37793 77670 87998 51445 -6726 -56758 -87483 -77088 -26643 28720
827 28720 70570 86813 59464 4520 -46760 -81762 -81821 -38573 18483 63378 85841 66839 15366
840 15366 -37131 -75034 -82796 -48735 6692 54981 82783 73106 26234 -28069 -68207 -82428
852 -82428 -57309 -4606 45824 78565 77093 36936 -17662 -61386 -80902 -63079 -15212 35543
864 35543 72081 79513 47337 -6116 -53869 -79670 -69164 -25324 26415 65273 78236 54946
876 54946 6053 -43669 -75417 -74031 -36583 16475 59512 77451 60764 16252 -33241 -68915
888 -68915 -75635 -46779 3860 51725 76792 66308 25945 -24520 -63081 -74570 -53493 -7972
900 -7972 40865 72139 71131 36693 -14253 -57407 -74629 -58183 -16709 31542 66207 71706 45455
913 45455 -1919 -49068 -73471 -63941 -25842 23496 61366 71366 50469 7956 -39223 -69646
925 -69646 -67564 -35473 12829 55784 71694 55764 16180 -30984 -64454 -68166 -42900 1225
937 1225 47414 70843 60979 25453 -21999 -59845 -68668 -47586 -7725 37843 66771 63791 34195
950 34195 -11430 -53916 -69609 -53411 -15875 29888 62672 64525 40278 -411 -44701 -68222
962 -68222 -58384 -25688 20156 58571 66563 45343 7427 -36731 -64243 -60385 -33409 8212 50897
975 50897 67906 52190 16652 -28364 -61212 -61991 -37994 -401 41646 64393 56213 26426 -17272
988 -17272 -56777 -65516 -44088 -7437 34783 61453 57017 32023 -6462 -47963 -65317 -50530
1000 -50530 -16992 27023 59859 59628 35696 545 -39460 -61765 -53282 -25588 15955 55320
1012 55320 63484 41574 6322 -34141 -59211 -53568 -29792 5834 45826 63246 48473 16108
1024 16108 -26930 -58965 -57070 -32197 591 38104 58840 50024 24511 -14656 -53442 -61607
1036 -61607 -39517 -5553 33388 57966 50501 27003 -5477 -43645 -60250 -45846 -15388 24616
1048 24616 56511 55063 30814 -203 -36795 -57335 -47568 -22987 13508 51373 59456 37272
1060 37272 5792 -31265 -55617 -48781 -26071 4349 41688 58856 44473 14999 -23079 -55094
1072 -55094 -53856 -29611 -220 34453 55021 45776 22000 -11504 -48189 -57862 -37281 -7166
1084 -7166 29158 54886 48472 24663 -4665 -39947 -56406 -41713 -14599 19985 51286 52440
1096 52440 29616 1543 -33232 -54727 -44936 -20259 11767 46421 55164 34703 6442 -26650
1108 -26650 -52109 -46887 -24135 3957 38287 55050 40843 13774 -19715 -50986 -50969 -27040 105
1121 105 32072 52037 42508 18788 -10312 -43486 -53534 -34348 -6733 26199 51725 46305 21771
1134 21771 -5374 -37122 -52357 -37393 -12174 17536 47289 49561 27290 1165 -30610 -51969
1146 -51969 -41973 -16992 11456 42525 51198 31412 5786 -24021 -48746 -44363 -21383 3916
1158 3916 35145 51580 37492 11573 -17559 -46457 -48467 -25210 -73 28864 48855 40038
1170 40038 16422 -9476 -39682 -50173 -31779 -5874 22999 47729 44184 20182 -4973 -33849
1182 -33849 -49333 -35270 -10774 16033 43066 46496 25032 273 -27728 -47944 -39965 -15337
1194 -15337 10382 38702 48530 29486 4108 -22408 -44833 -41691 -19473 4294 31856 48276
1206 48276 35150 10169 -16607 -42575 -45335 -23120 1097 26900 45547 37475 13940 -9680
1218 -9680 -36375 -46779 -29416 -4440 21565 43803 41282 17897 -5759 -31413 -45618 -32812
1230 -32812 -8699 15627 39499 43303 23266 -490 -25614 -44772 -37260 -13492 10646 35409
1242 35409 44582 27490 3457 -19925 -41321 -39869 -18395 4908 29858 44848 32649 8658
1254 8658 -15119 -37827 -41836 -22795 216 23868 42469 36579 13622 -9923 -33419 -43294 -27075
1267 -27075 -3858 18443 39562 38922 18772 -4581 -28567 -43250 -31745 -7750 14224 35548
1279 35548 40193 22623 22 -22583 -40895 -36010 -13417 9930 32488 41084 26316 3163
1291 3163 -18096 -37351 -37958 -18319 4592 27283 41291 31071 7390 -14522 -34070 -38741 -21757
1304 -21757 769 22440 39474 34494 12448 -10476 -31052 -39462 -25545 -2979 17914 36255
1316 36255 36524 17470 -5416 -27194 -39783 -29592 -6559 14398 33053 37238 21156 -903
1328 -903 -21664 -37842 -33736 -12110 10365 30076 38101 24777 2754 -17907 -34547 -35184 -16893
1341 -16893 5367 25659 37954 29051 6941 -14088 -31968 -35925 -20479 951 21380 36040
1353 36040 32582 11976 -9921 -28724 -36703 -24656 -2895 17198 33443 34203 16486 -5721 -25034
1366 -25034 -36091 -28407 -7259 13436 30637 35036 20718 -798 -21224 -34470 -31223 -11959
1378 -11959 9522 27705 35382 24201 3383 -17015 -32029 -32998 -16414 5415 24339 34752
1390 34752 27646 7115 -13643 -29896 -33558 -19945 1261 20656 32894 30216 11935 -9467
1402 -9467 -26993 -34205 -23689 -2871 17184 30900 31291 15779 -5180 -23412 -32985 -26870 -7773
1415 -7773 13225 28983 32330 19524 -1186 -20183 -31769 -28588 -12009 8961 26149 32624 23321
1428 23321 3300 -16783 -30536 -30160 -15446 5228 22852 31866 26005 7869 -12678 -28140 -31342
1441 -31342 -19569 836 19666 30796 27762 11675 -8689 -25400 -31077 -22338 -3795 16150
1453 16150 29119 29185 15871 -4716 -22484 -30787 -25028 -7769 12446 26892 29913 18773 -62
1466 -62 -19379 -29551 -26983 -12055 8662 24918 30096 21992 3656 -15919 -28482 -27904 -15575
1479 -15575 4149 21853 29413 24470 8303 -12052 -26766 -29047 -18316 200 18872 28282 25569
1492 25569 11961 -7465 -23777 -29102 -21419 -4117 15723 27636 26967 14933 -4036 -21119 -28481
1505 -28481 -23449 -8570 11160 25961 27986 18088 155 -18492 -27792 -24693 -11769 7086 23420
1518 23420 28116 20669 4588 -14836 -27131 -26256 -14887 3297 21120 27813 22326 8357 -10707
1531 -10707 -25161 -26681 -17812 -1108 17391 27326 24275 11829 -6679 -23151 -27308 -19895 -4536
1544 -4536 14228 26047 24960 14638 -2333 -20126 -27474 -21999 -8471 10294 25122 25846 17299
1557 17299 1255 -16945 -26430 -23211 -11730 5997 22598 26921 19217 4776 -13792 -25632 -24102
1570 -24102 -14132 2010 19521 26766 21424 8429 -9963 -24496 -25030 -16053 -1618 16129 25637
1583 25637 22709 11629 -5531 -22369 -26405 -18529 -4323 13474 24800 23016 13934 -1097 -18843
1596 -18843 -26453 -20756 -8428 9610 23820 24106 15481 1967 -15125 -25213 -22460 -11980 4857
1609 4857 22051 25842 17804 4589 -12259 -23804 -22294 -13866 232 17785 25999 20843 8310
1622 8310 -9513 -23449 -23376 -14678 -2358 14221 24073 21544 12193 -3989 -21230 -25459 -17845 -4787
1636 -4787 11866 23115 21723 13329 231 -16656 -25402 -20110 -8555 8056 22464 23149 14591
1649 14591 2685 -13559 -23708 -20984 -11456 3510 20397 24419 16566 4766 -10837 -22158 -21326
1662 -21326 -13359 -942 16467 25003 19459 8038 -8123 -22184 -22035 -13439 -2504 12603 22852
1675 22852 20262 11288 -3045 -19665 -24298 -16232 -4361 10654 22594 20522 11889 294 -15738
1688 -15738 -23424 -18349 -8288 6994 21176 22565 13748 2310 -12870 -22856 -19554 -10251 3480
1701 3480 18586 23064 15402 4728 -9562 -21442 -20295 -11976 -448 15290 23500 17960 7435
1714 7435 -6745 -20532 -21628 -12814 -2271 11729 21677 19047 9619 -2371 -17610 -22879 -15506
1727 -15506 -4741 9173 21325 19907 10863 47 -14549 -22391 -17006 -7072 5300 19035 21248
1740 21248 13522 2809 -11483 -21906 -18660 -9163 2710 16808 21851 14631 4790 -8131 -19895
1753 -19895 -19766 -11348 -421 13695 22178 16943 6908 -5864 -18718 -20804 -12684 -2221 10644
1766 10644 20455 18115 9297 -2087 -15805 -21739 -15172 -4743 8351 19888 19451 10358 -116
1779 -116 -12935 -20548 -15982 -6908 4466 17459 20441 13021 2551 -10742 -20238 -17840 -8555 2531
1793 2531 15504 20477 14064 4579 -7217 -18730 -19195 -10818 -597 12213 20799 16310 6747 -4724
1807 -4724 -17123 -20067 -12150 -2276 9749 19511 17436 8325 -2114 -14223 -20297 -14587 -4325 7034
1821 7034 18436 18802 10218 37 -11670 -19484 -15706 -6377 3991 15662 19563 12703 2505 -9328
1835 -9328 -19084 -17241 -7968 2364 13601 19169 13776 4344 -6312 -17106 -18451 -10343 -18 11419
1849 11419 18933 15324 6350 -4128 -14968 -18717 -12171 -2388 8679 18045 16870 8058 -2045 -13252
1863 -13252 -18583 -13597 -4253 6095 16376 17721 10086 -52 -10883 -18042 -14971 -5756 3891 14063
1877 14063 17881 11735 2445 -8505 -17334 -16150 -7691 2183 12481 17509 13416 4600 -5759 -15491
1891 -15491 -17451 -9806 230 10313 17494 14463 5683 -3664 -13157 -17314 -11737 -2407 8135 16399
1905 16399 16021 7646 -1805 -11640 -16816 -12683 -4235 5370 14465 16846 10110 229 -9840 -16797 -14239
1920 -14239 -5839 3606 12510 16272 11779 2785 -7389 -15523 -15882 -8001 2135 11425 16132 12388
1934 12388 4099 -4997 -13628 -15968 -10193 -695 9578 15950 14063 5659 -3585 -12002 -15808 -11189
1948 -11189 -2563 6940 14579 15174 8002 -1627 -10796 -15771 -12303 -3918 5045 12856 15345 9622 1022
1963 1022 -8798 -15271 -13559 -5999 3582 11765 15089 10807 2546 -6780 -13838 -14580 -7871 1685 10412
1978 10412 15309 11884 4079 -5257 -12599 -14425 -9530 -626 8579 14678 13581 5825 -3713 -11634 -14179
1993 -14179 -10585 -2555 6433 13204 14081 8394 -1110 -10393 -14524 -11773 -4023 5145 12054 13935 9328
2008 9328 948 -7887 -13980 -12980 -6183 3399 11374 13875 10199 2335 -6137 -12421 -13544 -8218 1135
2023 1135 9742 13980 11688 3883 -5135 -11596 -13275 -9003 -1053 7707 13301 12869 6160 -2972 -10889
2038 -10889 -13411 -10302 -2315 6341 12157 12802 7864 -777 -9689 -13455 -11336 -4284 4717 11126 12827
2053 12827 9101 769 -7992 -12669 -12366 -6117 3018 10550 12913 9797 2430 -6274 -11757 -12713 -7776
2068 -7776 1013 9232 13051 10989 4147 -4632 -10880 -12592 -8801 -1254 7614 12268 11676 6022 -2912
2083 -2912 -10623 -12589 -9702 -2405 6024 11645 11684 7604 -394 -8991 -12581 -10756 -4289 4737 10893
2098 10893 11857 8509 1197 -7328 -11773 -11313 -6118 2586 10131 12315 9353 2570 -6032 -11121 -11275
2113 -11275 -7411 395 8888 12117 10071 4277 -4336 -10539 -11417 -8348 -1283 6898 11456 10888 6140
2128 6140 -2294 -9874 -11698 -8860 -2576 5608 10755 10830 7075 -267 -8544 -11641 -9882 -4675 4105
2143 4105 10137 10937 7732 1319 -6529 -11084 -10542 -5954 2201 9400 11262 8518 2809 -5285 -10490
2158 -10490 -10487 -6932 89 8281 11558 9590 4199 -3841 -10067 -10554 -7751 -1553 6505 10859 10181 5849
2174 5849 -2184 -9370 -10826 -8468 -2652 5127 10229 10081 6782 -38 -7966 -10856 -9035 -4494 3677
2189 3677 9777 10218 7616 1553 -6357 -10553 -9626 -5447 1978 9049 10435 8133 2962 -4527 -10082
2204 -10082 -9625 -6835 -209 7831 10910 8582 3936 -3580 -9527 -9800 -7281 -1535 6161 10556 9243
2219 9243 5030 -1901 -8787 -10386 -7621 -2730 4703 9967 9545 6247 145 -7636 -10179 -8252 -3838
2234 -3838 3257 9063 9638 7044 1588 -6268 -10450 -8791 -4837 1796 8460 9755 7392 2783 -4246
2249 -4246 -9409 -9472 -5805 113 7614 10212 7953 3682 -2684 -8728 -9637 -6702 -1706 5725 10086 8726
2265 8726 4805 -1585 -8200 -9484 -7139 -2738 4394 9800 9164 5767 -179 -7120 -9930 -7602 -3527
2280 -3527 2983 8846 9323 6526 1687 -5553 -9938 -8374 -4360 1673 7800 9365 7125 2784 -3956
2295 -3956 -9292 -8984 -5090 26 7167 9304 7257 3406 -2674 -8310 -9065 -6075 -1342 5408 9648
2310 9648 8113 4215 -1292 -7518 -9197 -6777 -2613 3888 8945 8928 5120 -157 -6473 -9467 -7359
2325 -7359 -3050 2562 8257 8754 6139 1097 -5221 -9485 -7942 -3964 1264 7495 9156 6490 2296
2340 2296 -4047 -9128 -8051 -5162 127 6171 9069 6749 3233 -2179 -7787 -8823 -5487 -1121 5009
2355 5009 8978 7701 3968 -1083 -7043 -8909 -6172 -2323 3827 8695 8204 4670 -48 -6157 -9000
2370 -9000 -6838 -2920 2362 7873 8243 5304 1000 -4778 -8538 -7434 -3800 1031 6648 8684 6395
2385 6395 2175 -3541 -8264 -7893 -4460 -78 5941 8851 6765 2818 -2297 -7478 -8393 -5279 -1179
2400 -1179 4566 8351 7438 3762 -1272 -6670 -8347 -5941 -1682 3509 8075 7577 4481 -199 -5646
2415 -5646 -8544 -6654 -2529 2414 7146 7780 4992 725 -4266 -8014 -7246 -3551 1288 6127 8152
2430 8152 5771 1685 -3380 -7680 -7450 -4307 299 5228 7957 6311 2512 -2224 -6946 -7894 -4889
2445 -4889 -738 4230 7902 7099 3387 -1337 -5857 -8117 -5756 -1714 2848 7150 7217 4052 -224 -5067
2461 -5067 -7690 -6292 -2417 2429 6669 7498 4860 756 -3871 -7461 -6524 -3414 1286 6017 7610
2476 7610 5689 1317 -3453 -7239 -7435 -3951 250 4693 7451 6323 2523 -2007 -6384 -7477 -4685
2491 -4685 -558 3974 7176 6594 3160 -1144 -5427 -7204 -5453 -1496 3194 6667 7069 3811 -407
2506 -407 -4917 -7169 -5836 -2308 2251 6079 7118 4645 397 -3992 -6942 -6416 -2804 1351 5251
2521 5251 6897 5148 1369 -3163 -6256 -6652 -3892 320 4792 6915 5528 2228 -1956 -5629 -6526
2536 -6526 -4384 -329 3514 6692 6269 2641 -1216 -5068 -6825 -5011 -1356 2970 5977 6235 3552
2551 3552 -260 -4375 -6750 -5624 -1959 1987 5416 6428 4520 606 -3628 -6619 -6079 -3045 1474
2566 1474 5294 6333 4827 970 -2718 -5755 -6224 -3954 313 4506 6485 5332 1846 -2119 -5267
2581 -5267 -6037 -4274 -600 3715 6083 5851 2792 -1447 -5002 -6137 -4777 -1494 2616 5653 6214 3820
2597 3820 -387 -4113 -6047 -5124 -1783 2143 4989 6042 4343 928 -3557 -5766 -5860 -2738 1301 4900
2613 4900 5937 4498 1152 -2460 -5152 -5609 -3655 276 4232 5943 5004 1810 -2189 -5048 -5592 -4232
2629 -4232 -568 3297 5642 5596 2748 -1293 -4804 -5765 -4377 -978 2380 5253 5620 3735 -163 -4172
2645 -4172 -5931 -5110 -1946 2003 4933 5541 3900 875 -3180 -5601 -5214 -2697 1316 4355 5415 4491
2661 4491 1121 -2670 -5020 -5265 -3282 341 3907 5623 4792 2010 -2182 -4694 -5095 -3821 -786 3409
2677 3409 5437 5127 2639 -1432 -4432 -5276 -4011 -1310 2401 4907 5163 3408 -261 -3899 -5314 -4461
2693 -4461 -1693 1995 4732 4840 3727 220 -3025 -5003 -5029 -2527 1082 4479 5267 4071 971 -2563
2709 -2563 -4770 -4704 -3293 384 3815 5124 4584 1610 -2019 -4650 -4750 -3483 -631 2994 4849 4472
2725 4472 2748 -1343 -4123 -4968 -3827 -1190 2540 4449 4532 3079 -317 -3582 -5325 -3836 -1760 1697
2741 1697 4725 4772 3476 516 -3206 -4911 -4445 -2350 1026 4305 4701 3392 1023 -2527 -4431 -4349
2757 -4349 -3034 171 3602 4668 3942 1660 -1987 -4091 -4199 -3192 -450 2917 4575 4483 2380 -974
2773 -974 -4050 -4685 -3366 -1019 2282 4549 4116 2776 -289 -3764 -4533 -3586 -1606 1751 4387 4284
2789 4284 2931 129 -3188 -4617 -3782 -2172 1037 3817 4467 3041 1082 -2436 -4336 -4286 -2428 254
2805 254 3505 4468 3352 1622 -1727 -4048 -4431 -2574 -420 2852 4474 4048 2061 -1350 -3773 -4402
2821 -4402 -3203 -493 2497 4241 4037 2538 -508 -3278 -4414 -3419 -1387 1667 3778 4086 2584 219
2837 219 -2530 -4291 -3348 -1938 1054 3669 3999 3065 876 -2161 -4272 -3851 -2124 565 3352 4049
2853 4049 3199 1186 -1721 -3744 -3862 -2790 -302 2541 3874 3230 1411 -1206 -3520 -4038 -2817 -646
2869 -646 2220 4124 3814 1923 -648 -3072 -3961 -3072 -964 1284 3926 3981 2487 159 -2653 -3986
2885 -3986 -3236 -1393 709 3151 3799 2569 742 -2089 -3885 -3439 -1853 646 3116 3972 2658 1008
2901 1008 -1548 -3571 -3942 -2248 25 2723 3916 3118 1460 -1110 -3436 -3536 -2431 -374 2169 3746
2917 3746 3369 1758 -611 -2957 -3401 -2887 -962 1282 3504 3705 2227 1 -2517 -3740 -2945 -1315
2933 -1315 965 3156 3511 2196 598 -2112 -3660 -3152 -1711 580 3056 3611 2588 920 -1410 -3403
2949 -3403 -3247 -1948 -193 2514 3628 2978 1231 -1120 -3064 -3217 -2277 -568 1903 3366 3304 1507
2965 1507 -406 -2844 -3362 -2411 -893 1363 3328 3240 1899 -145 -2424 -3520 -2948 -1074 1093 3110
2981 3110 3710 2108 198 -1910 -3567 -2769 -1466 555 2737 3207 2321 637 -1531 -3360 -3042 -1617
2997 -1617 -35 2280 3425 2625 1006 -890 -3094 -3043 -2056 -46 1999 3360 2833 1046 -427 -2565
3013 -2565 -3252 -2316 -403 1506 2904 2950 1454 -509 -2180 -3399 -2513 -745 988 2563 3022 1872
3029 1872 151 -1777 -2949 -2758 -894 718 2452 3145 2072 231 -1537 -2890 -2928 -1510 152 2178
3045 2178 3009 2249 757 -968 -2847 -2871 -1877 -205 1654 3006 2584 1082 -692 -2393 -2702 -2076 -319
3062 -319 1540 2880 2753 1451 -251 -2287 -2937 -2345 -648 1163 2741 2731 1720 83 -1809 -2961
3078 -2961 -2458 -1138 613 2030 2732 2179 544 -1285 -2819 -2603 -1281 449 2041 2769 2244 694
3094 694 -1041 -2534 -2553 -1786 269 1443 2605 2370 896 -843 -2167 -2720 -2032 -351 1460 2540 2458
3111 2458 1245 -440 -2106 -2666 -2124 -743 1255 2382 2365 1509 37 -1352 -2387 -2211 -902 971
3127 971 2108 2366 1916 46 -1406 -2426 -2526 -1232 468 1965 2306 2194 362 -1007 -2373 -2414 -1454
3144 -1454 171 1701 2201 2109 974 -540 -2523 -2615 -1909 -309 1298 2315 2203 1121 -389 -2170 -2598
3161 -2598 -1988 -579 964 2285 2263 1511 16 -1526 -2336 -1996 -798 863 2077 2453 1520 -76 -1521
3178 -1521 -2245 -1779 -1049 652 1930 2520 1798 151 -1258 -2185 -2181 -1259 404 1665 2356 1870 780 -809
3196 -809 -2099 -2135 -1537 -136 1379 2321 2025 934 -731 -1828 -2201 -1877 -339 1164 2359 2171 1241
3213 1241 -221 -1771 -2313 -1795 -512 930 1973 2164 993 -75 -1438 -2203 -1716 -851 451 1967
3229 1967 2189 1707 330 -1371 -1834 -1805 -1028 346 1665 2309 1814 672 -951 -2117 -1946 -1220 62
3246 62 1230 1893 1772 822 -814 -1750 -2206 -1456 -218 1059 2134 2014 823 -106 -1615 -2096 -1482 -563
3264 -563 1269 1823 2038 1282 214 -1627 -1841 -1653 -878 581 1806 1793 1402 162 -1076 -1849 -1770 -984
3282 -984 155 1452 1961 1736 211 -824 -1925 -1924 -829 225 1399 1861 1780 835 -694 -1739 -1659 -1454
3300 -1454 -288 1064 1773 1740 751 -185 -1537 -2043 -1331 -563 955 1563 1615 1047 -94 -1356 -1956 -1410
3318 -1410 -697 461 1624 1836 1012 120 -1372 -2018 -1589 -885 502 1561 1698 1309 88 -1041 -1791
3335 -1791 -1577 -937 126 1522 1822 1216 629 -717 -1586 -1616 -818 -209 1124 1887 1282 648 -476 -1368
3353 -1368 -1754 -1097 -296 854 1740 1300 718 -96 -1490 -1729 -1278 -423 847 1716 1555 925 30 -1339
3371 -1339 -1699 -1199 -654 560 1642 1799 1208 225 -824 -1555 -1357 -406 290 1409 1759 1117 400 -783
3389 -783 -1617 -1474 -686 -12 1339 1600 1228 501 -602 -1617 -1454 -970 -91 1112 1758 1130 663 -425
3407 -425 -1367 -1630 -1209 -227 617 1657 1219 635 -321 -1418 -1772 -902 -67 684 1080 1504 741 19 -1043
3426 -1043 -1497 -1291 -503 480 1196 1495 734 95 -1060 -1778 -1336 -532 370 979 1729 928 318 -573 -1544
3445 -1544 -1396 -709 69 996 1522 1317 464 -629 -1404 -1376 -720 -61 772 1538 1091 743 -218 -1153 -1457 -1075
3465 -1075 -462 681 1321 1228 621 -153 -720 -1355 -915 -338 631 1254 1458 991 -128 -986 -1414 -1273 -586
3484 -586 339 999 1418 678 227 -857 -1293 -1494 -421 153 901 1716 1019 93 -341 -1025 -1376 -502 262
3503 262 1140 1045 1055 372 -573 -1185 -1460 -879 194 842 1343 1164 439 -299 -975 -1280 -692 -96 617 1580
3523 1580 1137 314 -114 -862 -1701 -1208 -415 389 1199 1224 561 -79 -749 -1511 -1116 -540 357 1026 1374 668
3543 668 -9 -519 -1381 -1329 -453 50 808 1304 755 224 -868 -1236 -1276 -749 62 791 1277 949 208 -257
3563 -257 -1108 -1256 -830 218 614 943 764 431 -154 -818 -1236 -741 -17 522 1032 1138 615 -217 -979 -870
3583 -870 -999 -313 801 921 1089 876 -125 -574 -1104 -1231 -143 432 820 1004 885 19 -577 -1088 -903
3602 -903 -545 364 906 1225 875 204 -349 -894 -1080 -552 139 949 1134 1004 -40 -474 -793 -1066 -682 -21
3622 -21 881 997 913 452 -350 -927 -1112 -928 -167 478 958 1017 503 -287 -961 -1228 -1072 -339 366 955 1229
3643 1229 729 -116 -978 -1243 -726 -194 416 1041 1105 696 -166 -582 -1193 -1082 -285 317 1035 1169 844 275
3663 275 -678 -1331 -1054 -390 338 887 995 1034 418 -484 -854 -1251 -647 471 772 1203 1006 24 -175 -1009
3683 -1009 -1005 -562 -46 683 1184 920 494 -282 -837 -1248 -639 -115 456 997 1137 675 -9 -942 -1379 -914
3703 -914 -363 543 823 990 444 -82 -489 -1059 -1040 -299 456 1166 1069 740 -10 -819 -1045 -884 -564 241 742
3724 742 811 916 260 -623 -1020 -989 -763 -123 733 1256 1262 392 -435 -1067 -1198 -740 26 786 1146 1165 446 -48
3746 -48 -930 -901 -736 -189 429 1280 973 679 -146 -906 -1157 -836 -461 495 1135 1517 616 -134 -753 -1106 -747
3767 -747 -167 237 1238 1283 614 244 -561 -1043 -1053 -578 208 871 1421 918 181 -513 -1141 -932 -894 227
3787 227 515 1186 1157 630 -142 -1288 -1316 -635 46 659 1239 1220 411 -399 -1236 -946 -799 -24 706 1349 1188
3808 1188 568 -139 -936 -1447 -1006 -546 353 1180 1162 753 -251 -852 -924 -1148 -418 329 865 1406 779 193
3828 193 -606 -1230 -912 -518 194 956 1293 947 476 -489 -1274 -934 -714 -71 675 1308 1087 448 -197 -945
3848 -945 -1355 -739 194 723 1121 985 609 -432 -1048 -1305 -809 -130 741 1340 1323 414 -50 -803 -1291 -859
3868 -859 -140 600 1082 1243 730 -148 -759 -917 -1124 -484 140 942 1201 842 -38 -837 -1281 -1104 -552 344
3888 344 957 1289 845 241 -642 -1195 -1282 -786 121 859 1150 1143 202 -471 -861 -1291 -1087 20 817 1285 1223
3909 1223 248 -349 -820 -1360 -1042 -96 565 1092 1421 731 -228 -790 -1095 -1167 -274 441 911 1200 828 -92
3929 -92 -861 -1525 -1163 -485 263 1098 1120 951 28 -279 -1093 -1415 -412 246 997 1351 960 467 -636 -1021
3949 -1021 -1516 -673 188 1009 1132 947 535 -548 -889 -1526 -878 -70 1038 1254 1254 684 -477 -944 -1295
3968 -1295 -1052 -292 704 1135 1543 788 -153 -884 -1201 -1254 -239 302 1056 991 850 234 -859 -1392 -1352 -525
3988 -525 471 948 1331 1039 458 -731 -1138 -1169 -573 115 948 1510 1223 125 -684 -869 -1047 -864 51 1057
4008 1057 1387 1210 470 -641 -1284 -1275 -876 188 461 1226 1239 618 -361 -1047 -1436 -1027 -465 876 1107 1544
4028 1544 715 -240 -601 -1328 -1514 -384 323 1061 1412 797 21 -784 -1139 -1328 -738 353 1070 1269 1146
4047 1146 287 -784 -948 -1358 -900 185 1029 987 1244 435 -438 -1047 -1304 -867 156 830 1382 1477 691
4066 691 -521 -1042 -1523 -1210 -303 648 1136 1225 909 -207 -936 -1250 -1221 -445 415 1298 1260 1015 70 -880
4086 -880 -1494 -1099 -629 568 1126 1243 1138 50 -779 -1303 -1552 -680 444 1101 1149 1158 362 -611 -1427 -1258
4106 -1258 -878 40 888 1363 1392 467 -578 -1411 -1313 -987 -116 1019 1360 1211 639 -349 -1189 -1405 -1345 -273
4126 -273 746 1213 1337 981 -166 -1092 -1581 -1416 -554 559 1368 1332 1051 -106 -887 -1434 -1371 -859 318
4145 318 1118 1260 1120 369 -624 -1604 -1488 -782 -81 1221 1062 1112 163 -652 -1164 -1355 -1011 -133 926 1376
4165 1376 1415 839 -353 -1090 -1521 -1021 -330 978 1073 1304 719 35 -1300 -1829 -1184 -473 703 1416 1613
4184 1613 879 -53 -1049 -1426 -1380 -366 264 1270 1418 1255 294 -826 -1648 -1388 -763 184 1070 1478 1392
4203 1392 451 -892 -1534 -1636 -1123 175 1075 1360 1177 416 -378 -1180 -1261 -892 -477 1031 1553 1492 694
4222 694 -351 -1203 -1580 -1053 -649 281 1731 1469 944 91 -1169 -1499 -1505 -713 505 1322 1498 984 157
4241 157 -838 -1597 -1229 -784 -14 1298 1419 1063 446 -1014 -1491 -1625 -751 -84 961 1209 1210 675 -420
4260 -420 -1229 -1451 -1267 -314 911 1641 1378 881 -479 -1427 -1456 -1364 -385 880 1604 1563 1013 -38 -1244
4279 -1244 -1717 -1193 -433 587 1124 1497 1045 303 -1174 -1776 -1358 -876 573 1226 1609 1536 117 -665 -1376
4298 -1376 -1571 -1183 33 1335 1611 955 485 -571 -1239 -1520 -1218 63 1028 1619 1608 552 -247 -1241
4316 -1241 -1803 -1368 -249 953 1605 1549 895 -230 -1306 -1713 -1436 -291 613 1589 1599 1086 -173 -1194
4334 -1194 -1553 -1653 -662 501 1186 1447 1049 263 -314 -1779 -1531 -787 -48 1277 1645 1429 415 -757
4352 -757 -1450 -1586 -952 157 969 1887 1601 683 -631 -1200 -1740 -1326 -335 946 1609 1347 1140 -304 -1247
4371 -1247 -1791 -1579 -440 734 1577 1751 1103 -200 -1021 -1701 -1643 -640 662 1289 1672 1200 330 -968
4389 -968 -1684 -1641 -719 240 1143 1680 1341 395 -849 -1444 -1731 -1270 15 1125 1455 1495 611 -434 -1221
4408 -1221 -1658 -1349 -157 921 1481 1785 664 -344 -1127 -1955 -1284 -163 621 1414 1871 1043 17 -1447
4426 -1447 -1816 -1371 -430 699 1391 1787 1263 -134 -1267 -1683 -1551 -818 462 1404 1603 1437 638 -666
4444 -666 -1480 -1883 -1214 283 1258 1574 1424 553 -576 -1413 -1744 -1282 -129 1192 1718 1640 753 -516 -1410
4463 -1410 -1590 -1265 -327 839 1431 1769 1127 -163 -1448 -1689 -1428 -637 489 1565 1766 1509 -165 -1227
4481 -1227 -1426 -1611 -879 354 1411 1849 1492 437 -827 -1599 -1725 -1211 370 1107 1857 1607 550 -715
4499 -715 -1563 -1723 -1204 -17 892 1750 1799 986 -564 -1282 -1735 -1540 -392 682 1552 1876 1014 -293 -1321
4518 -1321 -1969 -1572 -633 818 1575 1914 1284 -76 -1032 -1649 -1639 -1026 592 1363 1828 1332 351 -1110 -1715
4537 -1715 -1768 -1002 410 1289 1716 1424 657 -665 -1562 -1960 -1454 -30 1406 1653 1822 881 -487 -1472
4555 -1472 -1541 -1444 -162 1003 1718 1696 1239 -428 -1487 -1863 -1515 -608 821 1491 1750 1493 -279 -1199 -1806
4574 -1806 -1612 -805 636 1605 1792 1402 257 -911 -1611 -1706 -1117 314 1660 1739 1661 594 -945 -1850
4592 -1850 -1706 -1365 -134 1213 1793 1579 743 -695 -1494 -1580 -1333 -221 1074 1899 1636 904 -463 -1719
4610 -1719 -1948 -1448 -445 685 1782 1730 1125 -136 -1368 -1795 -1499 -996 611 1685 1777 1331 262 -1076
4628 -1076 -1701 -1694 -1187 330 1444 1691 1451 625 -926 -1602 -1699 -1355 40 1325 1881 1521 766 -441 -1635
4647 -1635 -1695 -1403 -155 934 1674 1633 1228 -456 -1637 -2005 -1765 -631 818 1579 1785 1241 -277 -1197
4665 -1197 -1713 -1544 -927 621 1634 1777 1440 60 -988 -1938 -1820 -1055 396 1444 1861 1633 318
4682 318 -856 -1590 -1797 -925 -41 1332 1923 1756 794 -961 -1711 -1802 -1438 -134 1131 1895 1484 941 -457
4701 -457 -1539 -1781 -1387 -409 990 1669 1662 940 -250 -1274 -2008 -1576 -979 636 2085 1947 1299 46
4719 46 -1197 -1878 -1625 -1032 534 1581 1871 1616 555 -1014 -1801 -1705 -927 197 1258 1854 1738 566
4737 566 -602 -1624 -2022 -1162 -92 1067 1871 1593 845 -198 -1433 -1948 -1374 -616 983 1749 1793 1110
4755 1110 -147 -1325 -1946 -1619 -557 630 1598 1907 1303 -64 -795 -2051 -1530 -709 258 1557 2043
4772 2043 1524 367 -784 -1878 -1872 -1187 18 1294 1748 1806 524 -774 -1539 -2057 -1189 -172 930 1900
4790 1900 1877 956 -389 -1443 -1951 -1339 -367 1074 2002 1789 1167 -296 -1157 -1902 -1745 -276 568 1720
4808 1720 1907 1254 341 -1297 -2038 -1591 -861 584 1649 1901 1729 430 -935 -2039 -1687 -959 95
4825 95 1169 2069 1859 408 -717 -1713 -1897 -1216 -123 1296 2006 1809 897 -294 -1715 -1873 -1531 -132
4843 -132 924 1999 1883 887 -477 -1247 -1831 -1566 -468 1017 1831 1736 1330 97 -1051 -1939 -1722 -604
4861 -604 440 1621 2149 1278 220 -1076 -1831 -1855 -857 269 1313 1921 1708 456 -727 -1528 -1864 -1178
4879 -1178 35 1244 1878 1841 843 -712 -1581 -2009 -1375 -302 881 1737 1928 1092 -282 -1555 -1971 -1597
4897 -1597 -528 810 1591 2040 961 208 -1321 -2010 -1883 -841 685 1824 1753 1617 28 -1029 -1812
4914 -1812 -1729 -1132 343 1417 1871 1685 322 -624 -1698 -2066 -1168 38 1158 1752 1971 917 -777
4931 -777 -1655 -1979 -1444 10 1164 1702 1985 1166 -217 -1340 -2077 -1797 -584 1022 1474 1827 1203 -165
4949 -165 -1227 -1939 -1896 -864 753 1492 1993 1484 296 -1367 -1885 -1925 -1267 439 1401 2149 1749 531
4967 531 -974 -1830 -1885 -1279 89 1256 2044 1943 609 -818 -1726 -2112 -1607 -108 1021 1667 2195 1116
4985 1116 -356 -1423 -1983 -1541 -451 906 1840 1851 1378 -121 -1240 -2054 -2040 -873 837 1777 2001 1567
5003 1567 -33 -1233 -1925 -1900 -949 450 1417 2098 1433 154 -912 -1640 -1957 -1282 208 1499 1982 2051
5021 2051 721 -866 -1789 -1981 -1536 -138 1266 1718 1877 1015 -651 -1514 -1880 -1648 -399 1077 1878
5038 1878 1926 1689 -119 -1382 -1957 -1993 -925 655 1869 2085 1619 72 -1348 -1839 -1971 -896 418
5055 418 1799 2056 1775 461 -1034 -1806 -1854 -1308 37 1552 2110 1853 842 -1059 -1946 -1751 -1932 11
5073 11 1097 2036 2003 1344 -304 -1582 -1954 -1777 -328 982 2172 1993 1567 -50 -1525 -1841 -1862 -878
5091 -878 940 1689 2044 1565 215 -1449 -1946 -2165 -1144 418 1790 2247 1684 524 -940 -1994 -2031
5108 -2031 -1137 167 1376 1906 1903 563 -939 -1891 -1887 -1513 -89 1417 2025 1893 1147 -496 -1554 -2125
5126 -2125 -1646 -539 1079 1889 1777 1544 -218 -1642 -1939 -1850 -793 838 1674 1861 1473 188 -1343
5143 -1343 -2197 -2061 -1171 207 1822 2108 1950 724 -970 -1707 -2204 -1153 188 1533 2358 1868 804
5160 804 -913 -1854 -2308 -1558 -256 1322 1949 1958 1198 -356 -1643 -1997 -1696 -677 1282 1928 2076 1295
5178 1295 -220 -1565 -2113 -1909 -777 738 1769 1988 1454 494 -1374 -1961 -1899 -1006 439 1764 1904
5195 1904 1881 464 -1257 -1882 -2128 -1292 102 1565 2145 1888 953 -815 -1888 -2084 -1439 -301 1283
5212 1283 1939 2217 1147 -277 -1799 -2020 -1747 -586 1174 1961 2138 1449 -94 -1364 -2050 -1868 -912
5229 -912 578 1964 1983 1733 337 -1152 -1948 -1938 -1122 215 1743 2119 1635 669 -1102 -1928 -2066 -1329
5247 -1329 99 1467 2257 1932 1047 -823 -1963 -2315 -1834 -295 1349 2125 2034 1126 -301 -1776 -2116
5264 -2116 -1888 -413 1191 2096 2198 1413 -288 -1595 -1885 -1972 -876 700 1775 2051 1566 -48 -1072
5281 -1072 -2125 -1981 -1105 331 1666 2185 1817 570 -1246 -2246 -2141 -1523 53 1466 2178 1950 975
5298 975 -607 -1959 -2292 -1553 -206 1265 1829 1933 1387 -394 -1642 -2045 -1801 -604 863 2107 2165
5315 2165 1252 -26 -1780 -2317 -1929 -1111 632 1808 2317 1488 90 -1189 -2166 -2106 -1217 478 1676
5332 1676 2140 1826 727 -919 -1942 -2222 -1421 -41 1450 2178 1927 874 -796 -1509 -2189 -1693 -82
5349 -82 1283 2203 2110 1212 -354 -1798 -2288 -1631 -579 1100 2181 2091 1437 -206 -1494 -2334 -2249 -902
5367 -902 604 1913 2263 1673 321 -1267 -2086 -2088 -1282 280 1805 2504 1741 571 -794 -2095 -2177 -1302
5385 -1302 -201 1389 2282 2088 1016 -373 -2021 -2235 -1666 -216 1176 2366 2086 1071 -533 -1603
5401 -1603 -2312 -1982 -591 974 2120 2261 1456 -58 -1299 -2216 -2049 -832 865 1830 2370 1662 439
5418 439 -1149 -2273 -2258 -1529 137 1766 2205 1913 627 -999 -1717 -2398 -1280 -158 1273 2235 2181 797
5436 797 -623 -1732 -2396 -1884 -308 953 2048 1993 1229 -326 -1816 -2053 -1695 -549 817 1839 2577
5453 2577 1495 9 -1356 -2489 -2125 -1044 619 1947 2409 1708 187 -990 -1844 -2252 -1373 365
5469 365 1627 2490 1951 725 -874 -2014 -2161 -1584 43 1298 2246 2261 869 -822 -1887 -2269 -1684
5486 -1684 -395 1039 1926 2522 1194 -628 -1592 -2380 -1976 -542 803 2188 2435 1514 131 -1184 -2301
5503 -2301 -2178 -881 574 1708 2133 1761 314 -775 -2213 -2204 -1406 236 1665 2362 2143 694 -844
5520 -844 -1956 -2405 -1448 60 1274 2087 2309 941 -564 -1711 -2349 -1664 -529 1048 1958 2234 1435
5537 1435 -127 -1708 -2326 -1991 -722 915 1797 2294 1535 140 -1378 -2226 -2148 -1029 698 1797 2291
5554 2291 1906 306 -971 -2365 -2398 -1447 399 1722 2019 2238 648 -1220 -1997 -2206 -1566 179 1507
5571 1507 2223 2107 1079 -412 -1768 -2210 -1743 -414 1098 2089 2348 1243 -444 -1307 -2582 -2120 -621
5588 -621 965 2078 2194 1993 139 -1361 -2231 -2368 -1016 455 1862 2536 1911 360 -1186 -2109 -2147
5605 -2147 -1388 -9 1585 2498 2097 685 -842 -1935 -2435 -1686 -50 1316 1950 2031 1104 -400 -1715
5622 -1715 -2289 -1949 -342 1038 2194 2363 1345 25 -1249 -2179 -2270 -754 776 2037 2499 1919 222
5639 222 -1159 -2113 -2577 -1192 607 1658 2278 1877 452 -1191 -1896 -2524 -1528 88 1372 2082 1894
5656 1894 990 -904 -1863 -2466 -1968 -263 1256 2207 2290 1087 -482 -1636 -2540 -1898 -617 820 2075
5673 2075 2368 1407 -321 -1421 -2139 -2089 -911 661 1933 2282 1906 -64 -1547 -2088 -2181 -1173 282
5690 282 2005 2302 2032 547 -1159 -2027 -2252 -1682 78 1373 2183 1912 1100 -857 -1930 -2195 -1774 -407
5708 -407 1354 2360 2289 1486 -283 -1680 -2419 -2122 -443 1069 1913 2312 1475 133 -1421 -2183 -2208 -1090
5726 -1090 659 1892 2406 1941 217 -1537 -2026 -2227 -1448 617 1768 2421 2002 658 -1020 -2110 -2185
5743 -2185 -1769 -117 1414 2101 2036 1037 -692 -1771 -2244 -1628 -108 1022 2134 2400 1158 -415 -1752
5760 -1752 -2306 -1945 -658 1163 2025 2174 1661 -64 -1285 -2187 -2256 -1088 710 1908 2379 1983 553
5777 553 -1117 -1982 -2467 -1348 356 1686 2092 1758 602 -780 -1932 -2345 -1459 -126 1261 2210 2130
5794 2130 1016 -466 -1832 -2121 -1933 -446 1285 2143 2154 1586 -355 -1892 -2292 -2021 -622 807 1859
5811 1859 2196 1631 159 -1526 -2350 -2155 -1263 739 1695 2166 1826 95 -1258 -2314 -2276 -1506 214 1775
5829 1775 2368 2214 958 -840 -2074 -2047 -1599 -166 1603 2075 2171 1066 -537 -1965 -2249 -1749 -244
5846 -244 1113 2185 2305 1320 -345 -1494 -2197 -2173 -567 635 1919 2174 1946 141 -1379 -1995 -2239
5863 -2239 -959 752 1750 2284 1901 425 -1015 -1984 -2383 -1516 53 1756 2025 2096 748 -754 -1831
5880 -1831 -2320 -1735 -382 1571 2319 2238 1012 -530 -1818 -2265 -1892 -767 1007 2356 2115 1441 -373
5897 -373 -1714 -2191 -2139 -792 702 1973 2122 1554 -32 -1150 -2452 -2026 -937 707 2070 2394 2015
5914 2015 502 -1015 -2153 -2136 -1367 260 1406 2413 1962 880 -1121 -1830 -2138 -1591 -39 1214 2256
5931 2256 2136 969 -437 -1644 -2231 -1646 -579 1105 2082 2264 1281 31 -1669 -2233 -2002 -726 719
5948 719 1821 2260 1583 335 -1300 -2155 -2106 -1040 606 1651 2462 2046 656 -1098 -1974 -2310 -1585 254
5966 254 1478 1999 2008 893 -729 -1957 -2396 -1596 -234 1154 2059 2327 983 -266 -1387 -2435 -1758
5983 -1758 -732 1111 2017 2090 1512 -201 -1488 -2238 -1943 -865 430 1856 2427 2008 217 -1051 -2029
6000 -2029 -2029 -1140 196 1517 2171 2045 359 -635 -2070 -2212 -1415 2 1561 2126 2027 784 -455 -2037
6018 -2037 -2265 -1619 -243 1195 2097 2044 702 -173 -1730 -2306 -1772 -473 859 1938 2255 1341 43
6035 43 -1294 -2128 -1878 -1049 384 1641 2182 1654 400 -1191 -2323 -1845 -941 351 1518 2289 1821 610
6053 610 -568 -1910 -2184 -1401 126 1506 2176 1893 965 -281 -1700 -2178 -1687 -70 1246 2031 2149
6070 2149 1168 -273 -1625 -2258 -1879 -268 806 2039 2176 1599 10 -1117 -2177 -2065 -705 326
6086 326 1781 2208 1816 28 -1237 -2040 -2232 -1263 208 1458 2283 1979 587 -674 -1846 -2376 -1175
6103 -1175 88 1228 2225 1987 863 -309 -1803 -2178 -1634 -355 1187 2208 2194 1263 -293 -1462 -2194
6120 -2194 -2031 -731 860 2072 2266 1404 -292 -1453 -2157 -1863 -768 290 1514 2341 1528 94 -1006
6137 -1006 -2001 -1996 -1292 133 1267 2017 2007 575 -714 -1931 -2035 -1392 -259 1431 2072 1935 1026 -385
6155 -385 -1596 -2278 -1653 -404 881 2110 2128 1141 -338 -1194 -2229 -1878 -641 769 1952 2353 1411
6172 1411 -73 -1437 -2018 -2122 -802 336 1680 2284 1590 322 -948 -2006 -2057 -1087 159 1408 1890
6189 1890 2058 484 -595 -1832 -2090 -1506 -3 1087 2195 2034 945 -428 -1444 -1987 -1800 -276
6205 -276 687 1734 2046 1142 -243 -1400 -1881 -1703 -687 769 2003 2150 1315 88 -1397 -2195 -1845
6222 -1845 -893 605 1572 2033 1772 436 -1153 -2043 -2003 -1193 404 1456 1970 1684 546 -617 -1950
6239 -1950 -2107 -1242 -115 1227 1847 1766 1062 -430 -1445 -1979 -1661 -437 960 1935 2278 1169 -322
6256 -322 -1443 -2023 -1810 -635 696 1636 2081 1470 206 -1291 -1924 -2058 -944 528 1543 2002 1778
6273 1778 523 -674 -1756 -2261 -1103 341 1558 1871 2010 331 -588 -1545 -1936 -1573 -184 1162 1754
6290 1754 2027 1142 -611 -1470 -1600 -1601 -190 639 1842 2076 1080 -247 -1166 -1973 -1705 -722 758 1421 2066
6309 2066 1487 241 -1189 -1950 -1873 -1053 673 1552 1953 1702 553 -1109 -1985 -1975 -1341 282 1383 1984
6327 1984 1705 738 -561 -1636 -1943 -1566 -57 1015 1753 1869 965 -499 -1313 -2113 -1674 -386 1102
6344 1102 1908 1764 1390 -192 -1226 -1894 -1584 -693 553 1675 1800 1425 213 -1020 -1819 -1916 -1006 336
6362 336 1546 2109 1752 379 -763 -1824 -1900 -1157 237 1278 1835 1985 806 -840 -1662 -2196 -1374 -22
6380 -22 1135 1822 1722 1042 -333 -1455 -1956 -1532 -398 992 1593 1889 920 -91 -1143 -1995 -1669 -653
6398 -653 514 1627 1714 1714 161 -1153 -1837 -1900 -827 323 1342 2060 1748 247 -890 -1653 -1966 -930
6416 -930 154 1242 1748 1714 677 -714 -1521 -1759 -1155 -208 1005 1873 1828 1097 -339 -1380 -1751 -1419
6434 -1419 -301 766 1670 1948 1095 -3 -1440 -1724 -1541 -745 674 1617 2108 1374 194 -1109 -1675
6451 -1675 -1734 -871 311 1673 2143 1524 495 -796 -1897 -1962 -1260 40 1132 1927 1806 641 -521
6468 -521 -1707 -1943 -1468 -55 1131 1885 1753 900 -413 -1386 -1724 -1551 -508 703 1828 1683 1190 -147
6486 -147 -1219 -1860 -1938 -803 984 1741 2052 1579 266 -1159 -1813 -2005 -1057 327 1426 1996 1682 534
6504 534 -917 -1802 -1724 -1188 95 1369 1674 1683 702 -656 -1827 -1978 -1276 -313 1114 1687 1792 892 -585
6523 -585 -1529 -1926 -1384 -517 972 1478 1686 856 -57 -1279 -2095 -1499 -899 310 1671 1953 1328 250
6541 250 -1143 -1572 -1821 -987 201 1279 1923 1618 456 -806 -1723 -1677 -1222 -85 1024 1802 1613 489
6559 489 -598 -1903 -1849 -1410 -313 1185 1910 1829 768 -247 -1187 -1816 -1340 -203 744 1716 1843 867
6577 867 129 -1106 -1892 -1526 -505 803 1439 1984 1302 251 -807 -1544 -1741 -641 348 1263 1888 1278
6595 1278 359 -913 -1648 -1845 -1086 125 1148 1750 1424 538 -458 -1661 -2152 -1124 -247 1026 1691 1492
6613 1492 922 -436 -1317 -1902 -1434 -435 684 1769 1692 841 -111 -1256 -1902 -1422 -502 362 1678 1485
6631 1485 1450 103 -819 -1725 -1528 -795 457 1316 1830 1259 453 -889 -1556 -1817 -1319 384 1071 1720 1521
6650 1521 433 -566 -1540 -1593 -1450 -54 1037 1630 1708 732 -165 -1297 -1769 -1186 -425 757 1574 1847 925
6669 925 6 -1154 -1882 -1655 -452 613 1552 1949 975 34 -955 -1806 -1599 -475 571 1515 2117 1412
6687 1412 335 -802 -1708 -1839 -967 -138 1222 1750 1633 583 -840 -1410 -1677 -1159 43 1084 1699
6704 1699 1503 850 -251 -1311 -1672 -1298 -197 918 1406 1873 1056 -57 -1182 -1832 -1485 -496 450 1206
6722 1206 1651 963 35 -988 -1599 -1320 -842 173 1490 1763 1304 278 -590 -1645 -1775 -989 484 998
6740 998 1646 1677 452 -428 -1280 -1841 -1089 -261 740 1851 1371 851 -416 -1357 -1644 -1355 -303 650 1560
6759 1560 1871 1062 16 -1184 -1598 -1717 -631 380 1649 1843 1080 87 -803 -1592 -1524 -446 90 1200
6777 1200 1750 1314 130 -704 -1949 -1629 -998 142 1165 1735 1781 392 -542 -1137 -1716 -1063 -250 851
6795 851 1536 1472 636 -436 -1260 -1729 -1237 -245 630 1706 1852 807 -334 -1341 -1662 -1332 -459 690
6813 690 1284 1735 1232 221 -943 -1684 -1683 -719 416 1473 1629 1335 262 -816 -1434 -1754 -767 156 1291
6832 1291 1650 1588 448 -591 -1394 -1790 -1208 104 938 1603 1647 729 -279 -1079 -1659 -1321 -226 830
6850 830 1484 1980 886 -178 -925 -1811 -1385 -709 610 1436 1608 1148 154 -805 -1827 -1641 -941 297
6868 297 1104 1455 1129 279 -805 -1394 -1775 -985 134 1041 1580 1389 374 -498 -1406 -1678 -996 153 1022
6887 1022 1735 1451 829 -337 -1248 -1443 -1335 -44 690 1687 1541 661 -160 -1126 -1671 -1440 -383 471 1162
6906 1162 1716 1178 159 -1286 -1568 -1886 -821 645 1383 1929 1370 393 -821 -1581 -1497 -666 78 974
6924 974 1726 1326 690 -526 -1435 -1593 -1300 -54 880 1531 1482 807 -288 -1094 -1668 -1318 -223 1033 1454
6943 1454 1587 940 -183 -830 -1556 -1535 -478 711 1337 1592 1142 0 -977 -1295 -1501 -780 315 1373
6961 1373 1712 1316 92 -950 -1618 -1457 -903 227 1045 1691 1384 258 -577 -1567 -1735 -1109 -157 983
6979 983 1539 1565 490 -463 -1200 -1688 -1211 -123 760 1529 1377 902 -377 -1155 -1668 -1416 -658 735 1419
6998 1419 1441 833 177 -1030 -1465 -1333 -923 270 1589 1702 1207 352 -691 -1297 -1906 -862 392 1030
7016 1030 1487 1601 427 -690 -1586 -1614 -850 -18 1149 1351 1610 816 -260 -1357 -1494 -1209 -165 602
7034 602 1506 1360 846 -237 -1207 -1527 -1215 -570 751 1582 1541 1393 209 -997 -1498 -1579 -621 435 1098
7053 1098 1548 1121 122 -984 -1598 -1433 -1065 234 1037 1295 1152 307 -658 -1350 -1807 -832 52 988 1389
7072 1389 1336 660 -484 -1315 -1693 -1009 -293 900 1544 1497 1091 -88 -931 -1385 -1053 -516 674 1409 1414 1251
7092 1251 225 -890 -1472 -1574 -788 309 1126 1750 1122 37 -779 -1403 -1365 -766 119 1231 1482 1232
7110 1232 352 -711 -1440 -1776 -718 169 859 1419 1174 597 -280 -1127 -1489 -940 -184 628 1250 1538 723
7129 723 -184 -1127 -1509 -1034 -474 700 1314 1266 807 -26 -899 -1462 -1261 -640 368 1088 1588 1300 325 -773
$$ [...]
8191e61
##END NTUPLES=NMR FID
##END=
