##TITLE=1H_AP-17KHCl
 D2O
 8 sc, 
 24.10.2023
##JCAMPDX= 6.0         $$ Bruker NMR JCAMP-DX V2.0
##DATA TYPE= NMR FID
##DATA CLASS= NTUPLES
##ORIGIN= UXNMR, Bruker Analytische Messtechnik GmbH
##OWNER= root
$$ XWIN-NMR		Version 3.5
$$ Tue Oct 24 14:39:40 2023 Russian Standard Time (UT+4h)  she@DPX200
##.OBSERVE FREQUENCY= 200.13135
##.OBSERVE NUCLEUS= ^1H
##.DELAY= (6, 6)
##.ACQUISITION MODE= SIMULTANEOUS
##.ACQUISITION SCHEME= undefined
##.AVERAGES= 8
##.DIGITISER RES= 18
##SPECTROMETER/DATA SYSTEM= spect
##.PULSE SEQUENCE= zg30
##.SOLVENT NAME= D2O
##.SHIFT REFERENCE= (INTERNAL, D2O, 0, 15.7039)
##AUDIT TRAIL= $$ (NUMBER, WHEN, WHO, WHERE, WHAT)
$$ ##TITLE= Audit trail, XWIN-NMR		Version 3.5
$$ ##JCAMPDX= 5.01
$$ ##ORIGIN= Bruker BioSpin GmbH
$$ ##OWNER= she
$$ F:/spectra/data/she/nmr/H-F/1/audita.txt
$$ ##AUDIT TRAIL=  $$ (NUMBER, WHEN, WHO, WHERE, WHAT)
(   1,<2023-10-24 14:38:05.87 +0400>,<she>,<DPX200>,
      <created by zg, POWCHK disabled, PULCHK disabled
       configuration hash MD5:
       00 E9 B6 7A A2 85 ED C7 34 08 36 98 17 FE 4E 26
       data hash MD5: 16K
       C3 4F 94 2D DC 20 87 F2 DD 76 3A AC 45 5B 9C D6>)
$$ ##END=
$$ 
$$ hash MD5
$$ 19 69 80 C8 4E AB 46 B1 4D 5C BD 53 ED 4D FD B7
##$RELAX= 
##$RELAX= 
##$RELAX= 
##$RELAX= 
##$RELAX= 
##$RELAX= 
$$ Bruker specific parameters
$$ --------------------------
##$DU= <F:/spectra>
##$EXPNO= 1
##$NAME= <H-F>
##$PROCNO= 1
##$TYPE= <nmr>
##$USER= <she>
##$AMP= (0..31)
100 100 100 100 100 100 100 100 100 100 100 100 100 100 100 100 100 100 
100 100 100 100 100 100 100 100 100 100 100 100 100 100 
##$AQSEQ= 0
##$AQ_mod= 1
##$AUNM= <au_zg>
##$AUTOPOS= <>
##$BF1= 200.13
##$BF2= 200.13
##$BF3= 200.13
##$BF4= 200.13
##$BF5= 200.13
##$BF6= 200.13
##$BF7= 200.13
##$BF8= 200.13
##$BYTORDA= 1
##$CFDGTYP= 0
##$CFRGTYP= 5
##$CHEMSTR= <none>
##$CNST= (0..31)
1 1 145 1 1 1 1 1 1 1 1 1 1 1 1 1 1 1 1 1 1 1 1 1 1 1 1 1 1 1 1 1 
##$CPDPRG= <>
##$CPDPRG1= <>
##$CPDPRG2= <>
##$CPDPRG3= <>
##$CPDPRG4= <mlev>
##$CPDPRG5= <mlev>
##$CPDPRG6= <mlev>
##$CPDPRG7= <mlev>
##$CPDPRG8= <mlev>
##$CPDPRGB= <>
##$CPDPRGT= <>
##$D= (0..31)
0 1.2 0 0 0 0 0 0 0 0.06 0 0.03 0 0 0 0 0.0002 0 0 0 0 0 0 0 0 0 0 0 0 
0 0 0 
##$DATE= 1698143885
##$DBL= (0..7)
120 120 120 120 120 120 120 120 
##$DBP= (0..7)
150 150 150 150 150 150 150 150 
##$DBP07= 0
##$DBPNAM0= <>
##$DBPNAM1= <>
##$DBPNAM2= <>
##$DBPNAM3= <>
##$DBPNAM4= <>
##$DBPNAM5= <>
##$DBPNAM6= <>
##$DBPNAM7= <>
##$DBPOAL= (0..7)
0.5 0.5 0.5 0.5 0.5 0.5 0.5 0.5 
##$DBPOFFS= (0..7)
0 0 0 0 0 0 0 0 
##$DE= 6
##$DECBNUC= <off>
##$DECIM= 32
##$DECNUC= <off>
##$DECSTAT= 4
##$DIGMOD= 1
##$DIGTYP= 9
##$DL= (0..7)
0 120 120 120 120 120 120 120 
##$DP= (0..7)
150 150 150 150 150 150 150 150 
##$DP07= 0
##$DPNAME0= <>
##$DPNAME1= <>
##$DPNAME2= <>
##$DPNAME3= <>
##$DPNAME4= <>
##$DPNAME5= <>
##$DPNAME6= <>
##$DPNAME7= <>
##$DPOAL= (0..7)
0.5 0.5 0.5 0.5 0.5 0.5 0.5 0.5 
##$DPOFFS= (0..7)
0 0 0 0 0 0 0 0 
##$DQDMODE= 0
##$DR= 18
##$DS= 0
##$DSLIST= <SSSSSSSSSSSSSSS>
$$ [...]
##$SUBNAM2= <"">
##$SUBNAM3= <"">
##$SUBNAM4= <"">
##$SUBNAM5= <"">
##$SUBNAM6= <"">
##$SUBNAM7= <"">
##$SUBNAM8= <"">
##$SUBNAM9= <"">
##$SW= 18.05172834244
##$SWIBOX= (0..15)
0 0 2 0 0 0 0 0 0 0 0 0 0 0 0 0 
##$SW_h= 3612.71676300578
##$TD= 16384
##$TD0= 1
##$TE= 0
##$TE2= 300
##$TE3= 300
##$TEG= 300
##$TL= (0..7)
0 120 120 120 120 120 120 120 
##$TP= (0..7)
150 150 150 150 150 150 150 150 
##$TP07= 0
##$TPNAME0= <>
##$TPNAME1= <>
##$TPNAME2= <>
##$TPNAME3= <>
##$TPNAME4= <>
##$TPNAME5= <>
##$TPNAME6= <>
##$TPNAME7= <>
##$TPOAL= (0..7)
0.5 0.5 0.5 0.5 0.5 0.5 0.5 0.5 
##$TPOFFS= (0..7)
0 0 0 0 0 0 0 0 
##$TUNHIN= 0
##$TUNHOUT= 0
##$TUNXOUT= 0
##$USERA1= <user>
##$USERA2= <user>
##$USERA3= <user>
##$USERA4= <user>
##$USERA5= <user>
##$V9= 5
##$VALIST= <valist>
##$VCLIST= <CCCCCCCCCCCCCCC>
##$VD= 0
##$VDLIST= <DDDDDDDDDDDDDDD>
##$VPLIST= <PPPPPPPPPPPPPPP>
##$VTLIST= <TTTTTTTTTTTTTTT>
##$WBST= 1024
##$WBSW= 4
##$XGAIN= (0..3)
0 0 0 0 
##$XL= 0
##$YL= 0
##$YMAX_a= 689432
##$YMIN_a= -681209
##$ZGOPTNS= <>
##$ZL1= 120
##$ZL2= 120
##$ZL3= 120
##$ZL4= 120
##$ABSF1= 10
##$ABSF2= 0
##$ABSG= 5
##$ABSL= 3
##$ALPHA= 0
##$AQORDER= 0
##$ASSFAC= 0
##$ASSFACI= 0
##$ASSFACX= 0
##$ASSWID= 0
##$AUNMP= <proc_1d>
##$AZFE= 0.1
##$AZFW= 0.1
##$BCFW= 1
##$BC_mod= 2
##$BYTORDP= 1
##$COROFFS= 0
##$CY= 11.3945322036743
##$DATMOD= 1
##$DC= 2
##$DFILT= <>
##$DTYPP= 0
##$F1P= 15.7292609196834
##$F2P= 12.9074282941183
##$FCOR= 0.5
##$FTSIZE= 0
##$FT_mod= 4
##$GAMMA= 1
##$GB= 0.15
##$INTBC= 1
##$INTSCL= 1
##$ISEN= 128
##$LB= 0.24
##$LEV0= 0
##$LPBIN= 0
##$MAXI= 10000
##$MC2= 0
##$MEAN= 0
##$ME_mod= 0
##$MI= 1.114404
##$NCOEF= 0
##$NC_proc= 0
##$NLEV= 6
##$NOISF1= 3.799351
##$NOISF2= 2.8
##$NSP= 1
##$NTH_PI= 0
##$NZP= 0
##$OFFSET= 15.70392
##$PC= 1
##$PHC0= -23157.89
##$PHC1= 12.4527
##$PH_mod= 1
##$PKNL= yes
##$PPARMOD= 0
##$PSCAL= 0
##$PSIGN= 0
##$REVERSE= no
##$SF= 200.130013532006
##$SI= 16384
##$SIGF1= 3
##$SIGF2= 2
##$SINO= 400
##$SIOLD= 16384
##$SREGLST= <1H.CDCl3>
##$SSB= 0
##$STSI= 0
##$STSR= 0
##$SW_p= 3612.71676300578
##$SYMM= 0
##$S_DEV= 0
##$TDeff= 0
##$TDoff= 0
##$TI= <>
##$TILT= no
##$TM1= 0
##$TM2= 0
##$TOPLEV= 0
##$USERP1= <user>
##$USERP2= <user>
##$USERP3= <user>
##$USERP4= <user>
##$USERP5= <user>
##$WDW= 1
##$XDIM= 8192
##$YMAX_p= 0
##$YMIN_p= 0
$$ End of Bruker specific parameters
$$ ---------------------------------
##NTUPLES= NMR FID
##VAR_NAME=  TIME,          FID/REAL,        FID/IMAG
##SYMBOL=    X,             R,               I
##VAR_TYPE=  INDEPENDENT,   DEPENDENT,       DEPENDENT
##VAR_FORM=  AFFN,          ASDF,            ASDF
##VAR_DIM=   8192,          8192,            8192
##UNITS=     SECONDS,       ARBITRARY UNITS, ARBITRARY UNITS
##FACTOR=    0.0002768,     1,               1
##FIRST=     0,             0,               0
##LAST=      2.2672688,     0,               0
##MIN=       0,             -681209,         0
##MAX=       2.2672688,     689432,          0
$$ Real data points
##PAGE= N=1
##DATA TABLE= (X++(R..R)), XYDATA
0 0 0 0 0 0 0 0 0 0 0 0 0 -8 0 -8 8 -8 16 -8 16 -17 24 -31 32 -40 46 -48 62 -68 80 -92 101 -118 132 -150 172
35 172 -189 216 -240 267 -299 331 -369 407 -451 501 -550 609 -671 738 -814 895 -987 1090
53 1090 -1203 1333 -1474 1642 -1833 2052 -2323 2645 -3047 3565 -4249 5222 -6682 9149 -14102
68 -14102 28056 -156196 -647199 -676477 -484778 -116840 337580 689432 655504 332795 -70675
79 -70675 -434628 -676612 -598805 -215114 236243 538271 647880 495123 81653 -383183
89 -383183 -626733 -592865 -333119 81312 483758 644184 502711 164120 -229417 -534431
99 -534431 -604078 -402510 -28191 350328 573978 547857 286387 -103681 -454280 -599280
109 -599280 -468134 -135883 245198 520314 569627 357366 -16290 -362831 -537777 -492248
119 -492248 -238379 134670 443788 537283 404444 115740 -238276 -502401 -524906 -306124
129 -306124 26725 343975 526516 469347 186678 -166111 -425994 -504532 -371893 -67752
139 -67752 268966 471693 462307 265243 -43302 -345335 -493648 -412804 -154465 161451 412410
150 412410 486314 335443 32376 -274681 -454545 -437213 -227972 82947 353029 459791
160 459791 364480 116835 -178399 -399830 -444460 -288958 -10608 267521 432528 408173
170 408173 197881 -100786 -348545 -439597 -338032 -87473 201170 396554 412064 248007
180 248007 -18941 -275020 -412416 -366824 -158717 113932 334834 412603 307846 63965
190 63965 -206388 -381919 -389828 -225183 39804 284552 399199 337267 128485 -134176 -335116
201 -335116 -386920 -269446 -35992 211030 365634 360056 195180 -54528 -279035 -381004
211 -381004 -314783 -107279 146489 331585 370181 245575 11596 -224658 -357511 -332570
221 -332570 -164402 75385 280955 361233 282554 81513 -154213 -322790 -349506 -220272
231 -220272 6333 227383 347296 315036 141894 -94547 -284987 -346638 -258091 -56855
241 -56855 170066 319367 325256 190537 -25261 -231162 -335676 -290186 -116507 105928 281114
252 281114 334044 238159 35165 -181103 -313868 -309356 -169431 46695 240503 324055 265659
263 265659 93776 -120106 -281504 -316370 -211314 -16132 185329 306932 292644 147113
273 147113 -61923 -241198 -314444 -249522 -73293 134822 280254 301026 190829 -2739
283 -2739 -195286 -299901 -271424 -124674 74974 241631 302355 228558 54286 -142692 -275704
294 -275704 -287904 -172435 18834 201129 292516 254865 106311 -88729 -244183 -290524 -208365
305 -208365 -35957 150629 271249 272357 152649 -33506 -203474 -282885 -238717 -88747 100307
316 100307 243573 278370 190976 19990 -159601 -267459 -256677 -132593 48184 207071
326 207071 274645 220216 68958 -111231 -241809 -265574 -172374 -3084 166292 261710 241217
337 241217 115021 -61663 -210215 -265494 -203231 -51659 121450 240693 252978 153606 -12401
348 -12401 -172111 -255186 -225582 -96517 74017 211429 255506 186276 35523 -130067 -237844
359 -237844 -240183 -136515 27053 177321 248754 210483 79791 -86174 -212562 -244591 -169067
370 -169067 -20018 137799 234692 226457 118894 -39591 -179904 -242051 -196497 -63256 95574
381 95574 211100 234737 154636 5166 -145250 -229559 -213136 -104328 51235 184109 233784
392 233784 180032 49064 -103055 -211101 -224777 -137747 7932 148274 225139 202576 88405
403 88405 -63414 -184467 -225288 -167905 -34766 113381 208837 211895 124074 -19025 -154848
414 -154848 -219865 -187243 -74301 71104 186573 218336 152531 20698 -118722 -206747 -203813
425 -203813 -108637 33553 157907 213740 176209 59509 -83759 -186734 -207332 -139274 -8921
436 -8921 127081 204536 190347 95080 -41966 -163127 -210114 -162303 -44844 90737 187429
447 187429 201532 124519 -7078 -131953 -199072 -180706 -80906 55511 164838 200197 150417
458 150417 34082 -100222 -187881 -190278 -111440 15897 139046 198722 167876 65536 -63663
469 -63663 -166490 -195744 -136421 -18265 105057 183549 182960 99811 -28045 -141076 -191514
480 -191514 -159844 -56884 73753 169588 187253 125559 10009 -113074 -184907 -171271 -84530
491 -84530 35573 142624 188448 147790 42399 -77804 -165102 -182329 -116804 1977 117367
502 117367 179950 164864 76920 -45988 -148416 -182142 -136164 -32861 85398 167262 173150
513 173150 102057 -10227 -118570 -176556 -155693 -65191 52813 147306 177620 128734 22644
524 22644 -92695 -166635 -166248 -92296 21430 124225 172960 145092 52577 -60837 -147295 -170003
536 -170003 -117698 -13024 96737 163371 158478 83588 -28375 -128259 -170502 -136517 -42644
547 -42644 68541 150055 165298 105359 314 -101842 -160366 -150168 -71752 38304 128228
558 128228 163081 128211 34902 -75102 -150058 -157945 -97653 6076 107806 161671 141837
569 141837 59175 -46288 -131625 -160119 -116788 -20946 80658 145740 150548 88139 -15425
580 -15425 -110383 -155526 -134477 -53779 53215 135653 155599 107707 13423 -87268 -149121 -143528
592 -143528 -74829 25121 112224 151474 124838 41936 -58614 -131808 -148859 -101403 -6386 91382
604 91382 146494 137893 69256 -32123 -118622 -149870 -115543 -31768 66000 134518 142255 88481
616 88481 -3213 -93026 -142606 -129891 -59394 37336 117326 146057 110004 24488 -72109 -135251
628 -135251 -138174 -80795 13027 100314 141028 120372 48407 -45662 -119331 -138821 -98476 -16286
640 -16286 74635 133300 131849 72132 -18336 -101680 -140448 -115656 -39046 54078 121430 135279
652 135279 90189 4785 -81973 -130846 -122564 -62283 25832 103634 134830 106154 32287 -56238
664 -56238 -121586 -132030 -83156 1789 85620 131561 118567 52860 -34944 -106831 -130649 -97555
676 -97555 -21884 62560 119349 123950 74210 -8065 -86568 -127634 -112322 -47493 39352 108340
688 108340 128225 91749 15363 -68199 -121179 -119061 -64580 16426 89594 124672 103941 37066
700 37066 -43838 -105576 -122705 -85120 -9147 70734 118446 114610 60164 -21991 -93776 -123016
712 -123016 -97285 -29884 50580 108331 117741 74508 619 -73227 -115999 -107394 -50902 27087
724 27087 92837 118968 92316 23211 -55166 -107892 -113840 -69437 6973 79224 114605 100165
736 100165 42753 -34011 -95188 -113988 -82246 -15952 57272 106569 108725 61599 -12012 -79300
748 -79300 -112713 -96368 -35927 40298 96743 110595 76250 7980 -63188 -106025 -101699 -52896
760 -52896 17901 80590 109114 89225 29146 -43213 -95878 -106778 -71381 -3378 66822 105544
772 105544 96857 47155 -22886 -84348 -107695 -81582 -20916 46304 94808 103154 63692 -4360
784 -4360 -67462 -101184 -93141 -42787 28696 85878 103097 76752 17903 -51592 -97943 -97990 -55277
797 -55277 8783 69748 101646 86947 33147 -33076 -84037 -99642 -71682 -10284 55080 94998
809 94998 93365 51474 -14095 -73777 -99457 -80802 -27552 37888 86526 96353 63954 3537
821 3537 -58364 -93871 -88093 -44036 19400 74489 96879 75418 21265 -41396 -86556 -94050 -58198
834 -58198 3144 61509 92341 84001 37848 -25389 -76189 -92544 -69540 -16209 45448 86974
846 86974 88606 51788 -6286 -62480 -92057 -79769 -31633 29048 76162 90758 65470 9776
858 9776 -49480 -85224 -84171 -47149 11103 65186 89198 73693 26604 -31816 -76998 -88071
870 -88071 -59519 -5031 50856 84603 81469 41497 -16498 -66451 -86788 -69422 -21764 35859
882 35859 77477 84048 54117 887 -52736 -83567 -76848 -36124 19793 66827 85082 65084
894 65084 16424 -39318 -76781 -80952 -49101 4214 55432 82087 71764 30613 -23716 -67997
906 -67997 -81808 -59134 -10975 42159 76490 77312 43429 -9366 -57427 -80510 -67600 -25235
918 -25235 28480 69151 79148 53933 5423 -44980 -75748 -73116 -38282 13838 59056 78290
930 78290 63079 20045 -31800 -69126 -75978 -49261 -1013 47754 75182 69042 32744 -17791
942 -17791 -60435 -76466 -58583 -14783 34606 68695 73152 44761 -3452 -49512 -73296 -65392
954 -65392 -28807 21011 61288 73799 53951 11215 -37089 -69174 -69884 -39675 7126 50587
966 50587 72456 62030 23464 -24762 -60668 -71088 -50717 -6710 39939 67677 66101 36030
978 36030 -10372 -52795 -70770 -56926 -19779 26571 61854 69268 45226 2044 -41135 -66739
990 -66739 -63622 -31368 15010 53185 68012 54291 15864 -30624 -62132 -65513 -41476 805
1002 805 44211 66981 58856 26057 -17574 -54562 -67188 -49293 -10104 32422 61449 63519 37256
1015 37256 -6066 -45760 -64709 -56059 -22594 21809 55921 64251 45197 6776 -35498 -61887
1027 -61887 -60159 -32233 9165 47076 64209 52584 17931 -24013 -55697 -62788 -41621 -2695
1039 -2695 37575 61061 57624 28597 -12876 -48155 -62365 -49377 -14344 26987 55715 59903
1051 59903 38342 22 -39049 -60355 -54243 -25025 14372 49023 61736 45822 10276 -28427
1063 -28427 -55357 -58602 -34872 4358 40388 58666 51753 22103 -18039 -49728 -59015 -42361
1075 -42361 -8182 30429 55686 55758 30973 -6772 -41196 -58156 -49115 -18192 20819 49914 57092
1088 57092 39140 4222 -32521 -54979 -52956 -27065 9582 42089 57173 46521 14042 -23245
1100 -23245 -49659 -55205 -36573 -661 35408 54901 49581 23653 -12637 -44125 -55956 -41484
1112 -41484 -10136 24716 49913 53709 32471 -3090 -36135 -53230 -48146 -21225 16333 45119
1124 45119 53663 39060 7236 -28061 -50593 -50417 -28461 5919 37441 52255 44706 17309 -18100
1137 -18100 -45060 -52048 -36459 -4944 29293 50376 48734 25599 -8714 -38359 -51919 -42306
1149 -42306 -13330 20668 44681 49720 33801 1976 -31038 -49071 -45532 -23315 9622 39739
1161 39739 51426 39223 10729 -21754 -45656 -49383 -30301 2277 32394 48130 44217 19862
1173 19862 -13686 -40067 -48099 -36405 -8872 23973 45720 46668 27355 -3313 -33231 -48780
1185 -48780 -41594 -16267 15754 40883 47610 33262 4686 -26069 -45164 -44305 -23903 6677 34188
1198 34188 47022 38974 13830 -17921 -41227 -46259 -31593 -2245 28450 45629 41741 20729
1210 20729 -9105 -35989 -46399 -35537 -9946 19026 40852 44955 28021 -965 -28538 -43846
1222 -43846 -40897 -19234 11816 37045 44691 33506 8349 -21614 -41954 -42436 -24415 2758 29302
1235 29302 43633 38273 15400 -13323 -35643 -43399 -32319 -5589 23372 41144 40902 23363 -5178
1248 -5178 -31662 -43489 -35523 -12818 14972 36502 42463 28603 2693 -23673 -39965 -39385 -20637
1261 -20637 7100 31489 42159 34124 11203 -16719 -37590 -41215 -26639 -594 25269 40162
1273 40162 37232 17764 -9379 -31855 -40531 -31515 -8604 18525 37004 39375 24443 -1402 -26513
1286 -26513 -39821 -35493 -14976 11454 32767 39976 29251 5416 -20454 -36584 -37056 -21656 3506
1299 3506 27377 38833 32942 13088 -12721 -33111 -38864 -26800 -3102 21683 36782 36022 19125
1312 19125 -6579 -28270 -37793 -30979 -10523 14751 33379 36851 24401 1510 -22004 -36368
1324 -36368 -34456 -16961 7506 28642 37186 29463 8226 -16481 -33249 -35456 -22138 550 23305
1337 23305 36100 31825 14830 -8810 -28596 -36282 -27273 -6007 16994 33021 34755 21033 -2632
1350 -2632 -24505 -34878 -30626 -13089 11164 30091 34920 24683 4304 -17997 -33012 -33186 -18298
1363 -18298 4036 24275 34503 29593 10827 -12488 -29690 -33933 -23385 -2505 19944 32752
1375 32752 31054 16225 -5766 -25394 -33745 -26793 -8373 13284 29610 32688 21359 359 -20664
1388 -20664 -32069 -29909 -14440 7729 26079 32769 25164 6450 -14860 -29770 -31240 -18953 1533
1401 1533 21178 31506 28201 12269 -9205 -26373 -31903 -23301 -4708 16281 29786 30143 17119
1414 17119 -3117 -22198 -31077 -26352 -10185 10643 26142 30806 21504 2723 -16923 -29169 -28400
1427 -28400 -15578 4585 22705 30574 24986 8373 -11696 -26535 -29816 -19554 -1195 17775
1439 17775 29003 27465 13443 -5933 -22770 -29809 -23522 -6756 12598 26499 28644 18147 -107
1452 -107 -18837 -28817 -25982 -11966 7314 23288 29079 21417 4799 -13679 -26435 -27442 -16360
1465 -16360 2005 19221 27817 24436 10080 -8757 -23223 -28197 -19953 -3106 14769 26394 26196
1478 26196 14576 -3673 -19694 -27627 -22814 -8035 10190 23554 27190 18283 1481 -15791 -26103
1491 -26103 -24767 -12841 5002 20480 26758 21522 6724 -11055 -23987 -25912 -16802 -188 16256
1504 16256 26129 23913 11124 -6229 -20612 -26049 -20207 -4923 12346 23878 24959 15295 -1422
1517 -1422 -17285 -25187 -22453 -9892 7426 21425 25256 18341 3720 -12784 -23776 -23910 -13660
1530 -13660 2486 17273 25084 21333 8114 -8370 -21146 -24754 -17718 -2274 13945 23225 22481
1543 22481 12583 -3719 -18414 -24429 -19679 -6610 8920 21336 23983 15629 925 -14115 -23143
1556 -23143 -22092 -10702 5010 18370 23688 18875 5157 -10811 -21407 -22759 -14541 142 15216
1569 15216 23028 20422 9287 -5938 -18927 -23496 -17026 -3730 11193 21357 21852 12905 -2145
1582 -2145 -15708 -22629 -19848 -8004 7313 19182 22191 15787 2652 -12325 -21475 -20792 -11345 2764
1596 2764 16120 22234 18016 6120 -8005 -19251 -22228 -14493 -1009 12642 20928 20340 10104
1609 10104 -4289 -16453 -21576 -17175 -5455 9189 19325 20981 13398 19 -13611 -21018 -19216
1622 -19216 -8765 4875 16757 21225 15892 3704 -9776 -18769 -20343 -11927 1161 13689 20259
1635 20259 18312 7585 -6136 -17132 -20574 -14670 -2945 10778 19250 19199 10663 -2240 -14350
1648 -14350 -19923 -17070 -6429 6867 16954 19983 14096 1585 -11330 -18867 -18688 -9963 3153
1661 3153 14804 19650 15643 5232 -7545 -17235 -19191 -12434 -336 11561 18798 17847 8460 -4505
1675 -4505 -14678 -18961 -15070 -4208 8674 17399 18328 11037 -674 -12361 -18783 -16372 -7229 5478
1689 5478 15129 18894 13833 2801 -9425 -17253 -17738 -10490 1549 13076 18466 15549 5935 -6169
1703 -6169 -15386 -18408 -12529 -1549 9854 17066 17099 9422 -2617 -13031 -17577 -14650 -5484 6763
1717 6763 15598 17586 11750 977 -10486 -17100 -16082 -8011 3479 13305 17693 13676 4011 -7507
1731 -7507 -15490 -16893 -10916 -69 10520 16775 15517 7276 -4065 -13660 -16950 -12986 -3335 8304
1745 8304 15793 16078 9537 -970 -11156 -16611 -14371 -5803 4775 13582 16542 12171 2151 -8818
1759 -8818 -15545 -15550 -8894 2137 11804 16097 13364 5017 -5736 -14263 -15736 -10684 -936 9144 15265
1774 15265 14753 7461 -2555 -11670 -15896 -13016 -3989 6455 13850 15314 10041 126 -9796 -15086
1788 -15086 -14141 -6503 3511 12087 15325 11778 3176 -6802 -14014 -14669 -9016 236 9836 15120 13456
1803 13456 5740 -4073 -12315 -15045 -11021 -2063 7580 13726 14142 8179 -1253 -9947 -14564 -12635 -5012
1818 -5012 4710 12048 14507 10473 1527 -7989 -13804 -13624 -7253 1989 10672 14180 11817 3978 -5134
1833 -5134 -12519 -14148 -9544 -587 8465 13378 13232 6474 -2827 -10444 -14021 -11037 -3313 6240 12591
1848 12591 13364 8191 -141 -8836 -13328 -11930 -5502 3297 10833 13579 10280 2551 -6412 -12454 -12811
1863 -12811 -7875 865 9103 13272 11416 4700 -3894 -11148 -13120 -9412 -1500 6907 12127 12366 7006
1878 7006 -1405 -9363 -12895 -10931 -4120 4686 11071 12817 8462 787 -7564 -12258 -11598 -6203 2310
1893 2310 9485 12683 10493 3540 -5034 -11139 -12247 -8008 -396 7290 12067 11398 5499 -2528 -9714
1908 -9714 -12201 -9486 -2593 5331 11109 11856 7284 -37 -7490 -11509 -10598 -4898 2993 9588 12200
1923 12200 8937 1860 -5872 -10935 -11237 -6800 976 7991 11688 9958 4261 -3558 -9698 -11306 -8081
1938 -8081 -1378 5952 10524 10781 5913 -1238 -8263 -11194 -9398 -3774 4282 9730 11244 7399 541
1953 541 -6530 -10525 -9865 -5029 1865 8077 10901 8629 2660 -4493 -9843 -10656 -7063 -142 6809 10654
1969 10654 9517 4450 -2498 -8493 -10596 -8229 -1806 5143 9589 10096 6363 -488 -7186 -10271 -9098
1984 -9098 -3946 2915 8572 10408 7422 1341 -5266 -9769 -9799 -5342 1145 7162 10123 8431 3294
1999 3294 -3344 -8662 -10061 -6939 -1068 5541 9633 9279 5134 -1521 -7167 -10020 -8043 -2736 3700
2014 3700 8644 9560 6619 555 -5912 -9410 -8804 -4442 1557 7249 9542 7785 2240 -4064 -8379
2029 -8379 -9144 -6024 251 6131 9189 8593 3751 -2281 -7598 -9224 -6931 -1681 4488 8485 8994 5209
2045 5209 -570 -5842 -8962 -8357 -3333 2893 7425 8948 6583 837 -4899 -8432 -8374 -4685 1204 6275
2061 6275 8923 7398 2812 -2843 -7321 -8984 -5992 -626 5153 8374 8138 4101 -1564 -6414 -8500
2076 -8500 -6743 -2235 3328 7686 8452 5557 258 -5248 -8186 -7759 -3888 1737 6447 8574 6653
2091 6653 1550 -3617 -7548 -8035 -4944 35 5381 8173 7270 3375 -2339 -6556 -8298 -6126 -1193
2106 -1193 4009 7579 7698 4475 -638 -5702 -7889 -6920 -2814 2473 6796 8002 5683 871 -3944
2121 -3944 -7266 -7516 -3988 1238 5628 7658 6636 2339 -2721 -6765 -7537 -5093 -598 4345 7429
2136 7429 6837 3639 -1516 -5741 -7666 -5912 -1839 3255 6575 7186 4750 -141 -4753 -7038 -6634 -3240
2152 -3240 1839 5722 7233 5463 1495 -3295 -6648 -6979 -4075 462 4722 7275 6341 2608 -1896
2167 -1896 -5871 -7125 -5323 -977 3569 6629 6784 3853 -732 -5002 -6822 -5862 -2328 2181 5810
2182 5810 7011 4723 543 -3693 -6509 -6377 -3310 1014 4895 6787 5620 2051 -2574 -6002 -6594
2197 -6594 -4455 -259 3915 6458 6148 2916 -1366 -4964 -6365 -5109 -1495 2614 5749 6185 3823
2212 3823 -63 -4144 -6244 -5790 -2805 1446 5276 6412 4703 1203 -2995 -6103 -5942 -3817 396
2227 396 4236 6162 5407 2246 -1771 -5211 -6068 -4634 -836 3424 5794 5777 3436 -607 -4590 -6012
2243 -6012 -5305 -1958 2265 5352 5914 4165 382 -3326 -5770 -5260 -3026 959 4441 5793 4945 1366
2259 1366 -2286 -5194 -5668 -3775 -140 3661 5759 5052 2698 -1358 -4605 -5697 -4586 -1239 2470
2274 2470 5127 5499 3545 -177 -3709 -5692 -5106 -2346 1352 4565 5560 4303 774 -2845 -5223 -5141
2290 -5141 -3359 387 3652 5520 4673 2043 -1806 -4552 -5411 -4314 -748 2688 5131 5099 2876 -565
2306 -565 -3871 -5290 -4415 -1560 1814 4451 5072 3732 514 -3051 -5143 -4867 -2591 750 3877 5128
2322 5128 3984 1359 -2023 -4409 -5056 -3286 -21 3040 4943 4681 2208 -1177 -4027 -5091 -3945
2337 -3945 -1387 2243 4537 4949 2994 81 -3024 -4893 -4414 -1657 1350 4100 4859 3857 814 -2557
2353 -2557 -4522 -4579 -2602 284 3203 4917 4168 1643 -1337 -4032 -4625 -3650 -626 2731 4328 4480
2369 4480 2419 -456 -3137 -4601 -3891 -1475 1585 3814 4438 3079 353 -2730 -4547 -4099 -2154 1023
2385 1023 3446 4477 3652 1449 -1414 -3918 -4416 -2848 -108 2601 4383 3913 2059 -841 -3300 -4253
2401 -4253 -3524 -937 1925 3797 4367 2662 -65 -2891 -4202 -3596 -1638 1050 3476 4186 3378 659
2417 659 -1772 -3842 -3915 -2584 288 2762 4214 3370 1427 -1335 -3769 -4156 -2950 -390 2303 3613
2433 3613 3780 2343 -419 -3039 -3928 -3255 -1272 1389 3443 3756 2737 303 -2388 -3617 -3588 -1808
2449 -1808 672 2817 3987 3029 1428 -1384 -3657 -3789 -2656 -312 2269 3977 3267 1762 -808 -2736
2465 -2736 -3619 -2819 -809 1527 3235 3876 2299 -194 -2351 -3502 -3553 -1723 864 2859 3417 3073 696
2482 696 -1560 -3289 -3765 -1846 340 2264 3451 3386 1246 -961 -3126 -3532 -2555 -481 1886 3299
2498 3299 3494 1850 -248 -2507 -3434 -3046 -1041 1238 2969 3483 2461 362 -1934 -3298 -3314 -1547
2514 -1547 546 2415 3316 2661 1007 -1479 -2981 -3409 -2194 -292 1914 2671 3018 1665 -603 -2625
2530 -2625 -3342 -2379 -947 1384 3104 3089 2139 -22 -2219 -3094 -2872 -1323 664 2810 3236 2202 552
2547 552 -1550 -2991 -2919 -1801 235 2161 3124 2684 1188 -704 -2754 -3187 -2046 -607 1764 2767
2563 2767 2946 1485 -225 -2141 -3074 -2615 -1047 1134 2746 3153 2054 463 -1596 -3042 -2764 -1498
2579 -1498 326 1922 2911 2471 1056 -954 -2315 -2970 -2165 -301 1666 2843 2683 1593 -686 -1976
2595 -1976 -2980 -2400 -788 1366 2389 2855 1729 -5 -1522 -2674 -2485 -1142 780 2062 2627 2055
2611 2055 630 -1234 -2391 -2702 -1646 102 1937 2929 2508 828 -876 -2314 -2839 -2015 -481 1515
2627 1515 2378 2547 1668 -42 -1835 -2726 -2465 -904 804 2390 2502 2111 167 -1380 -2299 -2563 -1293
2644 -1293 278 1703 2432 2212 1007 -1099 -2053 -2455 -1828 -388 1304 2501 2154 1316 -514 -1979 -2381
2661 -2381 -2156 -735 1035 2179 2743 1703 -70 -1414 -2412 -2371 -1213 587 1727 2598 1734 527 -818
2678 -818 -1813 -2598 -1489 -239 1314 2322 2106 1111 -757 -1828 -2298 -1657 -553 1068 2293 2214 1242
2695 1242 -59 -1702 -2335 -2173 -1091 405 1845 2193 1556 435 -1157 -2093 -2179 -1248 45 1512 2364
2712 2364 1924 677 -573 -1717 -2236 -1616 -159 1284 2123 2015 1205 -250 -1559 -1938 -1940 -991 600 1969
2730 1969 2207 1617 302 -1211 -2025 -1867 -1221 248 1611 2186 1544 521 -822 -1984 -2092 -1361 -209
2747 -209 1205 2084 1953 974 -307 -1686 -2285 -1712 -608 991 1897 2041 1309 -117 -1391 -2077 -1730 -855
2765 -855 293 1610 2103 1496 571 -798 -1693 -2009 -1207 -122 1075 2052 1752 861 -457 -1446 -2196 -1428
2783 -1428 -339 913 1787 2101 1136 -285 -1377 -1855 -1763 -740 753 1475 1823 1415 265 -1239 -1784
2800 -1784 -1716 -1193 51 1389 1840 1668 572 -650 -1501 -1976 -1475 -210 897 1809 1786 625 -244 -1384
2818 -1384 -2003 -1617 -560 638 1459 1757 1414 120 -854 -1856 -1705 -773 188 1512 1788 1677 420 -819
2836 -819 -1633 -1630 -1317 11 1124 1689 1673 765 -557 -1385 -1616 -1564 -577 806 1445 1675 950 -74 -1107
2855 -1107 -1607 -1549 -800 318 1388 1747 1218 428 -834 -1719 -1601 -1175 184 1375 1806 1279 723 -444
2873 -444 -1108 -1607 -1213 -245 641 1501 1615 1021 -213 -1280 -1720 -1268 -733 502 1463 1785 1088 -3 -787
2892 -787 -1558 -1768 -817 49 1374 1568 1473 223 -513 -1369 -1485 -919 3 932 1605 1574 829 -270 -1183 -1540
2912 -1540 -1331 -484 739 1348 1785 833 138 -855 -1503 -1513 -790 315 1148 1563 1233 317 -703 -1329 -1441
2931 -1441 -1076 7 892 1534 1271 566 -117 -1285 -1382 -1171 -201 675 1270 1483 870 -332 -1121 -1180 -1142 -716
2951 -716 738 1066 1706 1318 429 -642 -1599 -1342 -878 75 1132 1472 1366 445 -353 -1222 -1414 -1149 -246
2970 -246 821 1394 1511 864 -275 -991 -1442 -1178 -330 330 1240 1570 1126 139 -843 -1350 -1187 -714 284
2989 284 1087 1519 1283 463 -533 -1127 -1334 -1065 -81 816 1341 1471 667 -406 -1066 -1273 -1167 -320 533 1182
3009 1182 1582 930 64 -888 -1280 -1439 -606 260 1157 1379 883 401 -597 -1276 -1433 -800 39 811 1506 1254
3029 1254 677 -457 -1303 -1560 -1016 -315 670 1239 1332 779 2 -1042 -1461 -1550 -448 486 868 1266 837
3048 837 -18 -912 -1237 -1496 -565 135 929 1365 1026 404 -540 -1150 -1249 -909 -185 604 1316 1159 596 22
3068 22 -829 -1203 -836 -307 450 1136 1109 1018 32 -614 -1209 -1138 -482 286 1169 1197 1238 250 -408 -1354 -1200 -750
3090 -750 84 974 1358 1247 609 -415 -1059 -1305 -976 -333 592 1170 1111 729 121 -999 -1123 -1272 -573 241
3110 241 932 1230 969 353 -682 -1209 -1220 -634 -93 749 1351 1266 367 -358 -1050 -1258 -917 -345 700 1126
3130 1126 1081 684 -63 -948 -1337 -1013 -496 217 1120 1334 831 88 -874 -1314 -1148 -589 183 719 994 1109
3150 1109 378 -591 -1260 -1002 -1052 -105 758 1253 1371 755 -223 -877 -1219 -831 -367 387 1055 1130 591 -24
3170 -24 -757 -1312 -1035 -517 166 980 1116 1163 67 -415 -1029 -1217 -696 -77 801 984 1042 549 -366 -882 -1265
3191 -1265 -993 -344 385 1106 990 608 -94 -816 -869 -994 -636 635 1127 1098 801 320 -993 -1085 -1145 -684
3211 -684 133 960 1208 1263 392 -353 -848 -1070 -978 -427 945 1094 1116 498 -178 -809 -1252 -1028 -397 387 1168
3232 1168 1228 744 207 -649 -1292 -1081 -544 233 963 1124 1040 435 -265 -1149 -1031 -802 -160 579 1097 1154 488
3253 488 -74 -849 -1234 -893 -39 369 703 1173 828 -108 -866 -1169 -924 -516 334 745 1064 1002 178 -248
3273 -248 -950 -1404 -628 139 834 1195 958 391 -371 -829 -1164 -873 -130 584 1053 1153 707 -122 -788 -1149
3293 -1149 -805 -210 401 848 974 809 27 -659 -951 -1140 -587 30 860 1242 1001 388 -241 -899 -1076 -555
3313 -555 14 381 1044 1062 598 -287 -928 -1081 -794 -265 461 872 891 945 67 -758 -1098 -1163 -481 190 997
3334 997 860 932 212 -620 -861 -956 -512 -60 768 1033 779 447 -366 -733 -1115 -677 -266 503 1165 854 754
3355 754 44 -801 -1161 -1025 -464 402 899 963 465 61 -642 -1203 -1088 -556 66 924 936 978 451 -237 -1044
3376 -1044 -1089 -992 -62 704 970 694 374 -287 -504 -1030 -954 -218 472 799 1218 666 -19 -565 -1080 -877 -276
3397 -276 134 869 1083 674 281 -531 -766 -1164 -725 198 570 991 766 444 -269 -803 -1031 -1000 -46 328
3417 328 1022 718 545 -5 -681 -998 -1082 -300 346 978 919 685 180 -399 -1088 -747 -457 136 804 984 609
3438 609 314 -307 -761 -885 -662 195 656 1047 902 874 -265 -804 -1115 -894 -293 594 810 999 843 -163
3458 -163 -575 -914 -762 -500 351 701 828 855 151 -210 -1113 -950 -706 -20 557 1107 909 164 -180 -735
3478 -735 -922 -967 -117 224 735 812 646 108 -495 -968 -791 -471 301 1039 929 721 -109 -660 -1026 -786 -260
3499 -260 167 869 869 868 364 -414 -851 -988 -810 -59 224 981 940 385 -205 -457 -806 -786 -212 361 631 872
3521 872 621 189 -480 -713 -696 -423 237 692 882 602 294 -581 -781 -688 -624 -373 661 649 749 81 -398
3542 -398 -633 -1047 -578 -371 433 713 821 506 -81 -576 -897 -861 -379 126 618 1046 356 251 -486 -1134
3562 -1134 -832 -332 94 723 754 716 227 -561 -716 -834 -597 -190 300 1045 639 478 -325 -608 -803 -891 -182
3583 -182 208 642 825 658 127 -709 -870 -598 -253 44 597 1003 674 380 -389 -663 -797 -685 -161 778
3603 778 793 806 371 -92 -642 -648 -844 -66 528 869 744 547 -5 -963 -815 -623 -274 322 864 785 402 184
3625 184 -285 -807 -782 -402 327 652 871 655 101 -189 -621 -991 -272 -70 541 1065 845 304 -87 -844
3645 -844 -841 -603 -324 439 832 771 565 31 -149 -788 -664 -318 205 659 1028 515 215 -337 -509 -784 -550
3666 -550 234 652 890 598 477 -222 -677 -650 -608 -354 231 810 653 476 66 -700 -795 -600 -189 177 705
3687 705 940 674 7 -280 -740 -519 -523 337 572 574 645 267 -262 -596 -598 -631 -218 493 576 875 524 -250 -514
3710 -514 -806 -833 -249 263 590 1021 497 77 -303 -883 -677 -297 311 635 695 566 119 -346 -631 -649 -498
3731 -498 28 552 937 647 77 -309 -690 -789 -563 -229 199 868 840 473 -96 -559 -1076 -773 -260 50 680
3752 680 720 668 95 -295 -773 -770 -310 157 406 738 784 213 -454 -487 -752 -576 -43 736 722 633 481 -81 -279
3775 -279 -557 -502 -109 428 662 817 216 128 -420 -417 -679 -304 70 455 791 667 122 -349 -706 -716 -548 -36
3797 -36 597 575 708 132 -18 -737 -743 -601 -172 376 582 849 434 -143 -528 -487 -629 -279 70 587 880 395
3819 395 -17 -304 -685 -654 -473 183 535 743 673 240 -167 -474 -812 -324 -57 366 920 592 267 -152 -423
3840 -423 -710 -632 -148 161 631 482 433 -116 -98 -324 -651 -353 275 503 550 511 167 -381 -764 -683 -379 97
3862 97 201 474 788 324 -47 -531 -723 -511 -133 235 421 727 319 -180 -462 -699 -564 -201 83 631
3882 631 532 611 35 -205 -731 -328 -502 351 610 662 557 -474 -424 -607 -479 -511 -85 490 365 769 201
3903 201 -194 -563 -579 -371 -346 479 593 699 420 13 -484 -550 -551 -346 112 378 644 496 163 -186 -544 -580
3925 -580 -403 113 335 608 496 219 -59 -441 -751 -314 -81 471 718 580 294 -4 -386 -917 -681 -282
3945 -282 103 434 479 388 117 -402 -470 -486 -271 50 496 485 464 163 122 -488 -595 -508 62 525 415 683 363
3968 363 74 -549 -668 -562 -139 256 577 514 367 113 -317 -288 -524 -151 103 514 726 434 202 -186 -395
3989 -395 -728 -525 114 441 481 390 298 -120 -586 -574 -718 -46 399 563 600 321 -240 -532 -410 -553 -149 192
4011 192 451 598 364 -105 -396 -392 -502 -512 -15 429 430 531 416 -317 -508 -692 -321 258 240 401 498 42
4033 42 -189 -571 -568 -245 -121 85 655 626 279 23 -462 -763 -431 -294 -120 367 328 325 31 -242 -502 -557 -191
4056 -191 -79 419 587 460 71 37 -309 -701 -340 -138 330 472 465 -40 -252 -463 -505 -360 -26 192 380
4077 380 819 418 121 -348 -250 -295 -274 146 233 682 374 -137 -398 -443 -662 -272 -69 350 625 516 234 -240
4099 -240 -435 -828 -391 -69 248 632 560 383 201 -328 -485 -287 -79 160 475 494 488 146 -328 -249 -571 -322
4121 -322 20 328 370 360 -166 -92 -404 -426 -489 -289 355 287 708 152 -154 -397 -294 -313 -131 293 296 586 37
4144 37 -141 -190 -450 -443 -140 38 209 495 402 251 -363 -466 -594 -300 3 367 454 466 201 -182 -602 -600 -426
4167 -426 -186 555 490 790 262 -41 -335 -464 -424 -142 190 581 503 403 165 -77 -703 -523 -424 -41 488
4188 488 535 286 118 -218 -619 -333 -261 -104 220 442 395 42 -117 -386 -510 -550 -182 181 394 649 397
4209 397 -7 -100 -367 -350 -221 296 328 345 294 161 -110 -519 -603 -239 97 362 404 445 48 -221 -480 -368 -497
4232 -497 -57 297 634 501 359 98 -440 -41 -548 5 261 292 473 258 58 -292 -527 -406 -608 61
4252 61 459 685 273 434 37 -493 -338 -115 -84 323 323 335 110 36 -178 -382 -237 -63 2 54 557 193 134
4275 134 -350 -424 -179 -147 141 444 606 437 187 -213 -228 -466 -243 -197 416 601 495 -62 -89 -399 -526 -408
4297 -408 -30 233 265 334 198 -25 -277 -689 -353 -62 121 450 336 183 66 -469 -326 -291 -207 180 223 396
4319 396 133 112 -411 -554 -284 -243 40 376 274 304 303 100 -283 -550 -316 -21 0 374 381 378 70 -120 -469
4342 -469 -402 8 -26 294 485 308 5 -242 -557 -448 -141 17 163 137 502 57 -120 -451 -183 -261 247
4363 247 457 450 510 14 -83 -329 -512 -429 -104 45 102 405 470 46 -441 -270 -647 -288 167 458 627 203
4385 203 106 -339 -453 -558 14 -99 328 411 322 388 -86 -293 -492 -274 -242 230 427 392 83 209 -347 -347 -300
4408 -300 55 237 247 344 0 206 -179 -65 -407 91 156 13 280 361 32 -322 -230 -432 -473 -148 214 381
4430 381 179 159 -101 -483 -674 -505 -30 332 406 308 46 25 -92 -162 -475 -82 16 -65 333 208 14 -210
4452 -210 -381 -310 -274 -88 246 492 322 207 -175 -434 -482 -474 -160 94 118 370 95 -73 -315 -326 -306 -42 90
4475 90 291 508 139 193 -496 -342 -431 -284 67 513 412 286 30 -5 -208 -322 -324 37 152 201 287 273 -154
4498 -154 -467 -198 -364 12 297 440 502 366 -38 -102 -256 -270 -190 32 259 444 319 175 -159 -495 -445 -88
4520 -88 65 135 381 437 103 -149 -220 -558 -241 -46 231 353 493 -27 -257 -382 -481 -318 -94 104 162 334
4542 334 236 -7 -199 -438 -340 -244 63 264 272 423 50 -281 -381 -584 -115 -64 324 263 436 149 208 -287 -361
4565 -361 -124 -72 73 426 341 246 19 -73 -307 -252 -249 71 94 279 226 331 -121 -432 -277 -356 177 160 424 211
4589 211 173 -85 -277 -20 -291 -121 397 486 137 219 48 -105 -486 -338 24 276 337 317 111 30 -208 -188
4611 -188 -439 -212 208 232 168 340 7 -488 -152 -353 -110 178 255 491 317 66 252 -234 -477 -379 -63
4632 -63 189 280 485 381 119 -460 -334 -158 -103 88 192 448 287 68 -24 -251 -572 -299 -4 204 236 348
4654 348 -80 -132 -332 -320 -198 -99 53 419 331 185 50 -240 -325 -358 -89 70 110 392 195 22 -134 -321
4676 -321 -314 -150 86 -163 531 97 233 -230 -148 -459 -285 213 453 444 199 203 -134 -216 -365 -480 -57 256 107
4699 107 426 -56 -43 -300 -515 -162 -190 64 306 321 185 12 -246 -333 -278 -6 135 107 384 504 4 -106
4721 -106 -94 -265 -191 37 265 293 444 193 -9 -387 -269 -324 -242 52 221 285 139 -30 -87 -302 -641 -144
4743 -144 292 224 139 226 -93 -272 -239 -312 -194 9 257 52 288 73 -258 -290 -258 -268 -62 162 28 381 137
4766 137 28 -263 -4 -172 -240 98 268 290 128 69 -169 -301 -378 -18 190 87 197 302 -108 -100 -234 -252
4788 -252 -198 104 2 223 478 186 221 -327 -678 -227 -158 328 345 120 137 107 -55 -270 -123 -160 44 267
4810 267 703 113 -54 -324 -291 -181 30 60 225 172 363 194 -274 -332 -321 -6 -67 61 198 244 -30 -45 -264
4833 -264 -245 -263 -200 94 258 300 13 53 -131 -165 -257 -22 14 428 515 366 -2 -148 39 -95 -11 -190 90
4856 90 -79 310 369 57 -179 -498 -430 -26 345 240 105 71 -128 -349 -497 -320 -229 64 421 136 195 152
4878 152 -272 -417 -268 -42 -76 -143 206 220 220 -32 -181 -179 -67 -26 41 252 368 139 -84 -131 -345 -308 94 134
4902 134 307 322 169 17 -158 -308 -110 -261 -46 6 288 209 143 -5 -262 -173 -367 -24 232 339 208 227
4924 227 -109 -400 -413 -218 158 425 156 69 90 -128 -134 -223 34 -265 136 169 270 147 81 -93 -147 -291 198
4947 198 182 256 218 249 93 -86 -153 -275 -222 -26 345 215 -6 177 113 -390 -374 -296 -62 123 418 381 184
4970 184 -68 -12 -153 -297 -177 -35 217 207 284 133 -224 -280 -132 -201 -181 167 171 237 18 -131 -499 -202 -212
4993 -212 -220 -157 105 258 91 44 18 -246 -453 -62 -6 343 340 150 -134 -51 -291 -92 -215 264 388 248 218
5016 218 -75 -132 -179 -368 -219 -142 262 368 157 373 -183 -30 -253 -126 -170 149 104 428 242 50 -192 -208
5038 -208 -159 -114 -38 149 217 57 -23 -74 -219 -275 -135 150 17 129 124 -80 46 -119 -89 -335 -177 282 245 398
5062 398 18 -31 -226 -113 -200 -54 141 40 333 123 -102 -110 -342 -153 -139 205 242 225 291 224 -109 -167 -77 75
5086 75 33 117 -58 111 -87 -229 -22 -246 -335 40 85 309 -66 130 127 125 8 -105 10 -94 0 -15 232 219
5110 219 -87 -234 -292 82 84 7 198 386 111 -11 -389 -279 -222 -39 274 273 178 -66 26 -21 -342 -111 -117 70
5134 70 19 286 81 42 -119 -333 -246 -135 -37 70 147 204 -16 -241 -320 -174 -114 7 126 231 143 60 -60 -177
5158 -177 117 -118 -45 160 311 199 185 -43 -328 -326 -155 -130 -252 -138 374 88 84 269 -269 -166 -95 366 -35
5181 -35 140 279 158 -52 -49 -167 -144 -79 -81 179 220 183 -63 -451 -405 -219 -34 -34 377 291 149 84 -29 -335 -425
5206 -425 -119 156 68 335 109 63 -121 -166 -3 78 254 274 196 134 24 42 -230 6 -64 192 -46 201 229
5229 229 95 265 237 -180 6 55 -100 270 318 66 -162 -179 -177 11 141 239 274 443 79 60 -245 -250 -91 -56
5253 -56 -92 120 99 300 35 -11 -8 -128 -309 -233 -77 281 132 119 -99 -81 -246 -93 -66 42 123 154 103 23 -40
5278 -40 -25 -21 -95 -56 253 105 -179 25 -69 -120 -133 -134 -2 13 302 -7 -17 8 72 -295 -165 -296 154 78 168 65
5304 65 -148 76 -212 -120 -290 4 111 57 179 140 -245 -199 -180 45 119 283 246 73 95 -32 126 0 -74
5327 -74 -174 -177 153 260 136 120 117 -160 -13 50 296 88 243 289 164 -32 -265 -240 -130 13 147 80 120 210
5351 210 -7 10 -259 -94 -28 51 -1 159 142 26 113 -143 -369 -166 -23 108 165 47 15 -108 -210 -105 -93
5374 -93 349 14 238 288 60 -171 -270 -100 -136 -108 48 372 -200 209 -194 -129 -182 -152 300 57 224 257 80
5397 80 -93 -58 -179 -128 85 -289 179 390 40 -100 -79 -168 -55 16 63 15 -24 149 -83 -25 15 -149 -26 96
5421 96 86 204 116 272 153 -62 -294 -34 137 22 38 -15 174 73 166 -307 -108 -228 -179 111 324 218
5443 218 75 -3 -139 -67 -142 -155 -81 40 370 259 -198 -130 -276 -113 31 173 -58 -12 108 20 85 -386 180
5466 180 -167 162 48 149 159 -149 -189 12 -106 94 27 74 287 103 -75 38 -205 -257 3 -99 54 104
5488 104 26 155 66 -261 67 -85 260 188 112 -11 180 -194 131 -280 -205 7 -47 30 116 163 199 -4 -168
5511 -168 -173 -138 -104 55 44 127 83 -14 109 -149 11 -108 109 149 40 176 110 -4 -148 -349 10 -210 -13
5534 -13 -14 -145 40 -41 -115 -152 12 -4 240 12 42 -208 84 -203 -263 -67 -110 39 110 72 178 -155 -9 -23
5558 -23 -63 -18 82 64 159 281 -98 -30 -47 -41 -109 238 411 -25 154 126 -303 -33 -144 -61 -21 19 83 -142 254
5583 254 -24 -58 -168 -179 -30 -64 125 202 73 -20 -175 -17 -111 -107 248 162 195 258 -87 15 -2 -47 -212 18
5607 18 192 -43 2 -163 -117 -52 -396 -337 43 143 174 289 126 -79 -23 -228 -141 -80 -194 -36 389 320 -86
5630 -86 24 -368 -140 -95 -32 11 87 -112 -63 139 -45 -218 0 14 -234 222 281 63 -127 37 88 95 -80 147
5654 147 33 142 -57 40 -245 -379 -19 152 52 72 61 192 110 -34 -78 117 118 213 23 374 262 145 -56
5677 -56 -134 -112 63 4 -11 172 152 -291 -239 -290 -34 -227 47 150 -69 114 104 -78 22 -70 92 -208 -222 34
5701 34 134 147 -21 -73 1 -86 214 110 424 249 142 132 114 -314 -296 -49 88 201 262 65 218 202 -13
5724 -13 -96 -52 -106 47 138 7 84 251 -101 -122 -255 -187 29 160 28 -6 90 -18 -318 -288 -237 32 181 1
5748 1 219 28 44 54 -7 85 -82 -9 224 22 36 -105 -135 110 -21 -118 -145 133 82 67 182 -188 -97 24 -230
5773 -230 -51 105 259 174 7 107 -14 -2 -69 -136 -94 -10 183 75 -2 -226 -291 -240 195 149 -180 149 46
5796 46 -157 -38 -305 -81 135 -25 -35 9 195 91 52 -198 -301 -108 -102 160 243 -29 -109 -174 31 -200 -80
5819 -80 281 337 44 44 31 -136 60 -39 -235 -75 -166 -60 172 200 253 32 -186 -84 42 -62 223 -23 27
5842 27 237 -417 -370 -76 -138 17 195 185 38 21 98 -177 -238 -264 -77 -143 204 50 127 26 137 13 -37 -167
5866 -167 -194 -77 113 265 384 -18 9 -89 -60 -170 46 85 321 113 -106 -40 -304 -128 250 -99 77 240
5888 240 244 -249 87 -166 12 89 71 33 -152 25 3 40 -285 -182 -227 -3 123 65 112 122 -172 58 -163 -64
5912 -64 -3 31 -89 -18 304 90 27 -56 -175 33 44 -18 199 144 102 17 59 -192 -149 -1 6 61 273 33 92 92
5938 92 -9 -53 19 316 27 189 -108 -26 28 -22 -1 8 -61 6 -2 34 -65 196 154 -49 -40 104 87 -16 5 237 -160
5965 -160 -81 120 -90 91 70 90 -218 -62 -42 -10 -113 -68 -184 21 90 260 -28 134 -149 29 -253 93
5987 93 19 118 195 383 10 14 -75 -129 48 1 -24 109 6 -171 -190 -160 -65 -2 156 -129 48 -80 97 -64 64
6012 64 -73 -133 -112 123 110 277 183 63 -11 32 42 -7 28 330 114 -16 100 -83 -296 -8 -84 -213 63 281
6036 281 65 90 -49 146 -35 -171 -231 -38 26 -144 63 -30 -129 -324 -78 -31 -20 178 -114 -20 -65 -77 -14 -174
6060 -174 -70 -65 16 252 179 61 -113 -28 -78 38 180 78 6 20 85 70 -88 -181 -371 78 -183 205 -37 126
6084 126 63 -61 -202 -65 -128 -52 100 -34 -14 102 -29 -100 112 14 283 142 169 56 35 -135 -13 157 -61
6107 -61 37 117 -62 23 312 80 -33 -127 -49 -67 107 -17 0 -121 -37 -80 -28 -291 -124 235 311 286 131 216 -340
6132 -340 152 48 -201 -46 -94 106 201 97 -69 58 -109 -48 -178 73 191 -118 -5 170 -2 29 -134
6153 -134 -76 25 83 -3 42 143 -151 34 -35 -118 -27 1 -51 61 87 186 38 -62 -136 137 99 -38 113 35 -73
6178 -73 -89 -160 131 -69 -157 253 -33 108 57 -108 112 -105 49 -59 -11 -46 -241 127 -38 119 -276 -185 -25
6201 -25 -66 94 -4 87 185 -13 -223 -102 0 19 152 -9 -62 170 -41 -42 1 -178 -26 -122 154 49 -200 -40
6225 -40 28 -80 108 -8 -150 -52 175 -19 -101 -69 -25 -166 39 109 45 283 263 150 -179 -73 75 -152 -70
6248 -70 92 196 105 66 94 -29 -391 -138 29 -64 -5 125 212 34 26 -59 9 -233 -264 90 127 243 254 -38 59
6273 59 -153 -152 3 42 36 -89 -133 -127 -59 94 74 -111 183 117 84 -42 19 -178 7 -38 67 259 -114 291 80
6298 80 41 -171 -114 -85 139 191 236 -53 -43 11 -244 -126 -39 -4 -157 -104 279 67 -90 -143 -167 -10 -142 340
6322 340 80 244 162 48 -127 -66 -114 -327 -36 -111 -40 15 136 74 -1 11 199 190 45 25 -206 -110 151 117 25
6347 25 -39 -269 35 186 346 10 103 -34 75 -179 -101 -41 216 293 21 60 259 -49 -50 60 -164 -94 -108 167
6371 167 349 -26 -150 -88 34 180 37 27 209 184 -30 -68 115 -27 25 59 99 -23 -58 100 -62 205 -61
6394 -61 -77 -288 -8 -80 167 184 -6 86 98 -246 16 -45 -70 -208 76 -110 -54 119 -107 6 54 129 40 207
6418 207 -222 29 -169 -217 111 218 75 48 12 -142 108 14 -174 -10 -79 -62 118 14 30 70 -78 21 -334
6441 -334 -203 60 -34 -143 202 115 -195 -69 -77 -125 343 -174 23 16 -4 1 -42 -187 -85 3 -153 210 157 -104
6465 -104 119 -133 -78 -211 24 -153 -169 30 247 69 59 17 -141 -102 35 -49 -26 262 -94 -121 -521 -183 -137
6488 -137 -249 -61 -280 -40 -19 15 -250 49 -49 -273 207 251 284 123 72 3 -176 -165 -127 -185 -77 -66 271 -11
6512 -11 -96 -296 -37 -54 50 8 -106 185 44 -91 56 -336 -76 135 82 375 73 -62 36 -146 -19 -16 294
6535 294 -95 -70 219 326 88 -24 211 -54 -64 -200 178 169 29 9 -201 79 -67 34 -52 117 199 85
6557 85 49 194 -98 20 -162 -66 -144 14 262 -178 30 4 94 176 -71 -161 156 37 118 84 87 116 -130 125
6581 125 -123 -194 264 115 44 -39 33 -106 -290 18 202 86 -128 149 -27 -216 139 35 -240 -89 58
6602 58 -76 -6 191 -43 146 69 -18 32 48 -85 -154 -38 -235 -16 -134 -99 210 93 49 268 133 -166 177
6625 177 -34 -132 49 116 78 -45 179 37 30 71 -99 109 15 195 17 -38 58 3 78 -30 -24 75 -160 -32 71
6650 71 12 166 1 -47 -151 -138 186 13 -12 23 -62 90 -105 61 -120 38 -18 173 102 -78 -209 -85 -98
6673 -98 -71 25 229 -5 80 -41 -171 -38 -38 64 -46 -242 97 76 51 -94 2 272 -162 -162 -184 4 -163 -139
6697 -139 5 145 -143 -110 -82 62 195 134 124 -27 51 -60 98 129 71 -233 86 245 -76 38 154 48
6719 48 60 -12 -206 -86 50 7 -182 -81 -54 70 -6 184 -5 -5 135 -1 -47 46 -336 64 -130 -36 -150 -245
6743 -245 140 -10 221 -208 165 -26 -116 190 25 -121 -146 -62 -81 -125 -22 78 2 -8 -54 200 19 25 82 -178
6767 -178 80 -133 -43 213 30 207 125 115 27 -86 -75 149 243 -83 -80 -126 -47 29 -55 -117 18 293 -146 -10
6791 -10 139 64 83 98 135 46 173 132 62 -71 -104 230 -4 -271 26 173 -46 -216 -5 -89 -349 -148 168
6814 168 -112 263 141 90 -137 -76 45 10 -95 -1 -20 -48 53 162 86 -197 -100 -169 -119 52 112 48 -93 -143
6838 -143 17 76 11 -188 47 51 160 96 -32 -74 5 103 -213 -72 48 -5 -6 -17 81 -42 -3 -104 -269 -305 41
6863 41 41 53 -58 55 -90 -152 -52 23 -145 -35 -58 100 -100 -198 64 -47 42 30 85 90 -234 -92 -81 38 50
6888 50 63 72 -60 9 -24 -52 65 -185 102 88 68 -242 129 41 36 84 -157 -64 -256 -58 136 -26 -134 74 -175
6913 -175 -118 -65 -97 160 202 203 -52 -22 -23 254 -40 -8 227 4 -15 -70 30 -167 54 144 -2 -38 -30 -48 -62 77
6939 77 -220 93 -283 33 -152 185 41 285 -178 -277 208 50 -105 -17 78 -39 45 333 -142 11 -134 65
6961 65 -260 -125 179 66 -60 25 -126 10 7 -159 144 62 307 72 36 -10 140 -49 -207 -43 -101 14 25
6984 25 -81 68 14 -67 -60 63 -98 8 -45 72 -104 -39 -108 -153 51 -172 -23 -67 8 -60 -106 -21 -42 -269 -24
7009 -24 224 63 249 223 -11 -55 -222 -203 -65 81 51 -204 179 302 -117 223 -4 21 47 -26 -124 102 78
7032 78 32 276 -19 -56 84 25 196 220 -8 -103 107 -158 -71 -107 275 20 -99 -15 -165 -140 -100 -175 81 136
7056 136 24 -99 272 -267 108 -133 -88 -61 170 148 237 47 -4 -66 -147 68 55 75 -98 181 90 64 -179 -97
7080 -97 -98 90 266 85 274 109 -56 -9 96 -67 -165 10 351 -61 100 213 -147 -95 -59 51 -15 -49 71
7103 71 175 81 160 1 -144 -101 182 -61 164 117 -43 127 15 -23 -97 -22 44 -105 -159 -20 -20 -185 -82 24
7127 24 75 228 92 54 124 61 -145 -132 -81 -5 -75 -118 -4 113 -39 130 3 44 5 184 132 25 187 141 76
7152 76 -66 -26 102 -142 -263 146 20 170 64 -137 -112 -231 -113 174 -85 6 220 -58 113 -197 -208 -66
7174 -66 -106 -273 -97 215 109 -24 -53 94 -308 -24 110 110 -21 -88 -66 142 -17 22 -167 -164 18 -9 158 153
7198 153 -140 -159 -124 103 48 1 -19 -136 110 -126 163 -38 -323 -272 -99 86 41 2 136 98 -130 57 -193
7221 -193 18 -61 -54 103 -17 222 8 -32 -240 268 107 64 46 299 49 232 26 -229 -135 166 63 166
7243 166 -196 55 -197 -80 38 -145 -206 61 17 116 236 70 136 74 10 -225 80 54 92 -53 210 -18 231
7266 231 61 -35 -138 154 99 -144 -41 -124 138 -234 7 51 21 161 96 -152 54 -18 -52 113 -76 -175 23
7289 23 132 -89 -11 -42 24 -139 -70 -90 252 107 81 -12 58 85 52 -15 -187 147 89 -36 98 144 -83 -54 38
7314 38 -1 -98 -152 -21 -122 -2 70 -139 -32 94 216 113 207 74 -2 -79 27 116 -357 -111 167 114 53 195
7338 195 130 -169 66 -105 -152 248 232 39 226 -156 -148 -27 11 -93 -41 149 274 44 178 51 42 90 32 -26
7362 -26 58 165 161 100 -72 -33 -3 7 51 78 256 48 -225 155 106 81 -116 32 -150 97 317 231 -66 -142 -105
7387 -105 -198 186 230 85 11 124 7 6 23 25 -10 -118 40 22 -4 -61 -434 -20 51 2 85 -119 36 -46 73
7412 73 50 -143 15 111 76 0 62 78 48 55 32 -127 12 25 -54 301 169 -62 -37 70 -224 -79 -109 -108 -27 40
7438 40 243 94 125 130 -148 -78 -55 -5 41 -13 69 -92 -99 -115 -62 71 51 -63 -68 16 -58 -130 -58 -19 78 34 97 40 60
7467 60 -17 95 3 -167 81 -29 310 2 -119 103 -37 -165 26 -157 -56 -156 -108 163 173 21 57 -108
7489 -108 -7 -27 78 124 66 137 47 -55 -142 -59 94 -269 124 95 -105 -17 -132 -282 -232 -189 95 163 -36 115
7513 115 -56 174 -94 -252 -25 78 -59 -151 -160 13 5 -294 -28 -275 -37 218 131 -22 26 8 -105 189 -67
7536 -67 -93 -17 191 -125 27 44 8 -84 -163 -165 -48 75 110 -131 29 -14 100 -17 -22 58 281 132 -3 -70 61
7561 61 209 -162 -311 -146 -115 -4 94 36 380 -78 -11 -39 53 133 142 222 273 -265 113 -26 20 157 -206 -79
7585 -79 -7 -56 152 100 41 -117 74 189 -138 -36 36 -83 -9 -138 1 38 -201 49 222 -12 -90 -58 39 -116
7609 -116 -49 -124 59 132 90 7 -244 84 95 -74 112 115 -60 23 31 28 -52 -257 -57 85 23 59 93 39 -65 -25
7635 -25 3 -159 -148 -53 -60 63 -49 122 122 86 157 -188 -218 -79 223 21 185 -42 225 29 -222 -116 126 -139
7659 -139 17 199 248 128 -216 147 -296 37 3 -37 -27 4 152 129 -15 -79 19 -249 62 -102 -23 -206 -33
7682 -33 -45 -226 90 39 57 228 165 -158 39 155 -126 -176 37 -82 -13 118 38 68 -92 -142 -26 -239 66
7705 66 266 88 82 82 146 -117 -63 36 102 17 62 177 -29 -67 29 -142 -147 -66 -134 111 37 -63 -65 89 -115 -184 -75
7732 -75 54 51 110 232 110 137 -268 -21 54 -83 -65 218 142 -111 82 61 65 163 -38 -41 53 31 -33 57 211 -69
7758 -69 -1 70 -21 -67 35 83 -195 135 -88 -19 -128 -67 -71 -102 5 -99 9 -148 60 -205 -108 -284 157 18
7782 18 312 384 -135 220 -157 -84 27 -123 257 73 53 -69 -220 -67 94 19 -64 -96 -14 -67 -52 74 -85
7805 -85 -139 142 -30 167 128 -184 -37 151 3 -134 192 -83 40 74 80 -143 -73 -95 58 84 364 260 114
7828 114 30 135 166 -11 -69 6 24 19 -83 -131 110 133 16 -65 -53 63 51 73 -73 -134 16 -12 80 47 -195 -61
7854 -61 68 -153 -80 1 119 -300 -19 59 61 -17 14 7 11 74 -109 51 10 176 172 120 22 82 -3 160 242 -55 44
7881 44 311 69 -11 191 -69 85 -16 -10 -84 -7 98 156 -29 128 -98 -133 -78 -105 61 215 180 -93 -79 -81 -43
7906 -43 129 53 92 -137 156 248 186 79 -361 -41 -60 64 62 58 67 -51 176 25 -43 11 -23 -67 -60 11 -58 219 -53
7933 -53 54 -109 88 -66 30 -79 -168 -89 -106 10 21 -202 -29 169 -26 249 24 -198 -158 -55 1 16 17 54
7957 54 28 148 -178 -77 40 -122 -30 -181 228 90 38 129 113 -118 -44 107 126 150 -185 -60 160 -5 77
7980 77 -59 -37 -42 -109 -95 23 -116 -111 -24 -2 -97 -92 -130 -194 23 183 89 109 76 45 -114 39 91 -27 75 186 32
8007 32 -71 85 -8 -153 117 160 -13 6 -170 -108 -73 -67 -41 26 -72 46 -172 -84 -24 47 49 -50 64 -38 134 220
8033 220 146 -135 -68 38 -231 204 -62 267 -99 140 49 -9 -201 -80 261 84 176 126 153 137 -115 131 57
8056 57 -184 157 193 22 50 -54 -255 -123 107 36 28 28 -37 -18 -4 30 -20 85 89 -6 -121 -61 -126 -23 94 -43
8082 -43 131 74 -197 178 52 -133 58 -117 -82 -52 -53 84 -34 -254 255 285 59 -122 230 16 -109 -113 63
8105 63 -17 237 -149 -96 -25 -304 -44 161 129 136 -48 263 248 -196 18 -289 -53 123 115 112 -126 95 -49 27
8129 27 177 -69 -128 -97 205 28 66 147 -162 8 -151 181 -12 -93 25 56 36 94 146 231 -53 82 67 -60
8153 -60 63 8 -91 -110 17 -52 182 -234 176 -48 -59 77 -47 -135 -94 -36 -175 106 68 -33 56 277 -252 -187
8177 -187 -13 1 -46 212 216 -56 -115 117 -27 145 -92 148 198 -132
8191a32
$$ Imaginary data points
##PAGE= N=2
##DATA TABLE= (X++(I..I)), XYDATA
0 0 0 0 0 0 0 0 0 0 0 -8 8 -8 16 -16 24 -24 32 -40 44 -56 64 -80 96 -112 132 -152 176 -207 233 -273 309
31 309 -353 402 -451 513 -576 647 -727 809 -905 1008 -1119 1243 -1375 1521 -1681 1854 -2048
48 -2048 2252 -2483 2738 -3013 3326 -3667 4052 -4489 4980 -5550 6210 -6988 7927 -9072
62 -9072 10526 -12423 15022 -18821 24924 -36382 65508 -309252 -456676 132016 433175
73 433175 687844 614394 264233 -266217 -565830 -643869 -478891 -121972 365139 646598
83 646598 616737 335849 -43790 -460180 -681209 -563830 -180000 228994 546787 645520
93 645520 446969 25496 -372011 -591091 -564479 -302263 103387 455519 603526 485626
103 485626 162183 -229960 -520817 -589722 -393050 -15845 363228 568024 526361 259095
113 259095 -126830 -458879 -571723 -425155 -109598 241057 500439 541056 326668 -23170
123 -23170 -340096 -519439 -488752 -225508 149183 436429 523992 399338 96837 -265160
133 -265160 -498701 -492466 -278574 41663 348676 507871 431742 162415 -161081 -407695
143 -407695 -488934 -356978 -55593 266012 459016 454626 257452 -61615 -356634 -483355
153 -483355 -390980 -133065 178881 412825 462402 304021 14702 -271982 -435814 -414570
163 -414570 -212586 86830 344640 445966 354732 111166 -186636 -402655 -434601 -272495
173 -272495 5859 278633 428196 386398 171641 -114192 -342882 -419729 -316000 -74402
183 -74402 200592 383596 395989 239422 -21861 -277391 -408784 -355939 -147765 123763
193 123763 341302 405256 288063 45196 -213429 -375335 -370991 -204299 49795 279455
203 279455 384621 322058 119876 -135288 -330355 -378606 -261040 -28687 217206 366103
213 366103 350244 179915 -67123 -284225 -373940 -295978 -89235 152329 325640 356026 229211
224 229211 3155 -222694 -349275 -323435 -155905 81250 282521 356613 272762 70485
234 70485 -163095 -325109 -340182 -202978 19222 230904 341389 300360 125912 -100926
244 -100926 -280138 -337742 -247733 -47536 173782 315829 317997 182285 -34100 -237226 -333189
255 -333189 -279074 -103731 114371 283056 326425 222842 22560 -183252 -308210 -299927 -157561
266 -157561 54442 239082 317509 258441 85596 -126792 -281476 -309816 -202102 -7232
276 -7232 191498 305540 282305 134353 -69996 -242008 -308166 -237979 -62211 138580 276306
287 276306 293464 182070 -10021 -197203 -295911 -263901 -116266 81822 244106 297701 218954
298 218954 44220 -147937 -274166 -279952 -161765 27309 202257 286786 246083 97391 -94052
309 -94052 -243431 -284266 -200097 -28629 154789 270020 265057 142938 -41195 -205783 -279538
320 -279538 -229895 -78206 106482 242824 271404 181271 11198 -163142 -264244 -248485 -123831
331 -123831 54611 208692 270258 211989 60789 -116321 -241195 -259797 -163512 4996 169504
342 169504 258823 233587 105411 -68668 -211149 -260277 -194340 -43277 125572 238762 246227
353 246227 145308 -19533 -174897 -252369 -218306 -88293 80033 212553 250318 177384 27066
364 27066 -134469 -236469 -233337 -127243 34287 178812 245143 203291 71272 -91243 -211879
375 -211879 -239197 -162002 -13329 141462 232500 219723 111710 -44812 -182547 -238736 -187733
386 -187733 -55170 99527 210978 230088 145994 -2383 -146818 -226230 -207615 -97073 57661
397 57661 184563 228990 173764 43003 -108365 -211180 -218321 -130165 13124 151492 223809
408 223809 194340 80065 -66768 -184543 -222623 -160184 -27257 115465 206693 208299 117668
419 117668 -26422 -157113 -216897 -182009 -68023 77529 188076 212949 144628 14730 -122743
430 -122743 -206823 -196746 -100222 37787 158586 212185 170105 51213 -86649 -185758 -205431
441 -205431 -133854 -326 130873 201915 185506 88201 -49642 -165149 -204675 -154483 -38793
452 -38793 94208 187456 195750 116667 -10896 -133197 -199561 -176411 -72784 60174 165251
463 165251 199521 145543 24252 -105129 -184931 -185580 -105370 23398 140976 193340 162122
474 162122 61843 -67145 -167622 -192128 -131114 -15103 107841 185902 179838 91823 -34025
485 -34025 -142015 -189938 -154974 -47724 78128 165454 182711 121571 4252 -115416 -180519
496 -180519 -167076 -82814 39060 146006 186492 142938 38332 -82061 -167771 -179413 -109111
507 -109111 8373 118947 177476 159489 70107 -50614 -146133 -177306 -132928 -29439 88576
518 88576 166129 169749 99568 -14773 -123027 -176431 -151104 -59463 58389 149091 173316 122022
530 122022 17088 -95522 -164544 -160441 -87221 23616 125191 171100 141240 49296 -63549
541 -63549 -148940 -168877 -113541 -6984 101601 163465 153858 77574 -34543 -130761 -165996 -129260
553 -129260 -38607 70748 149817 160133 100327 -378 -102671 -161280 -147204 -66898 41506
564 41506 130846 163701 123693 27644 -80019 -149782 -152826 -90885 11565 110056 157457 134671
576 134671 56304 -46721 -132337 -158101 -112372 -19395 81640 149041 150166 81926 -21196
587 -21196 -113159 -155625 -129322 -45104 58003 133936 150151 101935 9899 -87678 -146491 -138995
599 -138995 -72269 24884 113964 153074 121769 37357 -61722 -135196 -148868 -94201 1491 93590
611 93590 144933 132708 61698 -35911 -116055 -145593 -111725 -29274 66612 133346 141107 86336
623 86336 -5921 -96735 -144832 -127159 -53324 42729 120158 144046 102870 16919 -73749 -132527
635 -132527 -133883 -74965 15732 98069 138648 119256 45503 -48738 -120056 -138791 -96833 -11089
647 -11089 80150 134566 128419 65856 -24473 -103921 -137606 -108853 -33232 54495 119023 132513
659 132513 86985 2144 -81642 -129905 -122363 -59980 30305 106153 134429 103501 26667 -62019
671 -62019 -122154 -127291 -77306 6873 86749 127955 113264 49504 -36148 -105566 -128753 -95483
683 -95483 -20331 63975 120478 123800 71246 -12695 -89831 -127217 -108776 -40907 44161 107676
695 107676 123620 86739 11746 -69492 -117977 -114925 -63011 16689 90737 124181 102100 35078
707 35078 -46598 -108627 -122117 -80464 -3258 73588 117542 110289 54013 -26148 -93099 -118742
719 -118742 -93301 -27309 51756 107154 114956 73271 -957 -76371 -116774 -104944 -47369 30659
731 30659 95923 117737 86436 17554 -57096 -106710 -110239 -64293 9743 77894 111624 97868
743 97868 40642 -35853 -95871 -112637 -80410 -13241 61236 108181 106152 56790 -16275 -81538
755 -81538 -111271 -91489 -31270 41812 95537 107555 73011 6416 -63641 -105408 -99768 -51251
767 -51251 19586 82360 109572 86644 24993 -45901 -95911 -104897 -67444 1432 68463 102589
779 102589 93567 44833 -25049 -84716 -104725 -78476 -20343 47057 96908 102326 59928 -6612
791 -6612 -68413 -102147 -91558 -37520 32570 85097 100697 74030 13633 -53835 -95580 -94382
803 -94382 -53683 10435 71545 100740 83998 31120 -34901 -85866 -99720 -68079 -6141 56982
815 56982 95072 90941 46863 -17840 -73908 -97552 -78203 -24234 39729 85718 94723 61886
827 61886 825 -59769 -93394 -85976 -41429 22459 76703 95323 71946 18169 -43619 -87189
839 -87189 -91050 -54038 5267 61385 91756 81909 34753 -27191 -75691 -91780 -68229 -13775
851 -13775 47656 86388 86617 49644 -8973 -64595 -91187 -76442 -28569 30475 76553 89209
863 89209 62155 7427 -49577 -84490 -82830 -44865 13670 65712 88061 71953 24665 -34071
875 -34071 -77787 -86307 -56682 -2510 51933 83976 79094 38819 -18483 -66388 -85414 -67494
887 -67494 -19296 37561 77121 82328 51798 -1626 -54455 -83151 -74293 -33539 21883 67832
899 67832 83583 61894 13394 -40535 -76580 -78968 -46182 6634 56540 80941 69573 28172
911 28172 -26215 -68836 -80481 -56847 -8225 43793 76370 75144 40283 -11600 -58319 -79368
923 -79368 -65041 -22361 30112 69132 77342 51406 3320 -46220 -75695 -71107 -35219 15614
935 15614 59936 77478 60737 17317 -33568 -68913 -74376 -46894 1266 49064 74348 66823
947 66823 30521 -19124 -60744 -75367 -55995 -12729 35675 68905 71825 42156 -5287 -49750
959 -49750 -72854 -63642 -26442 23014 61300 72256 51958 9124 -38543 -68747 -67654 -37572
971 -37572 8249 51269 72000 59592 21176 -25171 -60863 -71072 -48082 -3950 40562 67049
983 67049 65165 33980 -12835 -53164 -69228 -55533 -17878 28212 62392 67508 42764 723
995 723 -41777 -67522 -62033 -28351 16314 53289 68196 52238 12352 -32100 -61368 -64500 -39538
1008 -39538 3847 45183 65667 57419 24631 -19274 -55089 -65873 -47112 -8378 33930 61913
1020 61913 62573 34171 -8316 -46223 -64212 -54591 -19733 23559 55123 63233 43909 4551 -36645
1033 -36645 -60823 -59017 -30804 11013 47965 63175 50879 16043 -25788 -56116 -61291 -39633
1045 -39633 -855 38267 60657 56092 26642 -13872 -48000 -61675 -48081 -12429 27909 55021
1057 55021 59047 37281 -2359 -40501 -59336 -52782 -23583 16490 49922 60070 43483 9177
1069 9177 -29332 -55615 -56968 -32873 5573 40777 58233 50545 20251 -19523 -49841 -57960 -41254
1082 -41254 -6251 31949 55641 54436 29152 -8734 -42191 -56916 -47212 -16321 22002 49853
1094 49853 55407 37555 3350 -34037 -55314 -51324 -25624 10730 43648 57220 43972 11705
1106 11705 -24355 -49968 -54143 -34268 1660 35763 53285 48018 22580 -14043 -45082 -54680
1118 -54680 -40514 -9418 25973 51124 52494 30062 -4638 -37081 -53528 -46131 -18039 17282
1130 17282 45208 52596 37141 6204 -28327 -50329 -49604 -27190 6607 37617 52613 44079 15756
1143 15756 -19498 -45660 -51140 -34877 -3261 30228 50182 46905 23588 -8812 -38287 -51612
1155 -51612 -40683 -12096 20524 44495 50283 32697 -89 -31666 -48901 -45065 -21907 12103
1167 12103 40497 49925 37093 9500 -22690 -45652 -48019 -28093 2741 31800 48455 43128
1179 43128 18216 -14225 -39901 -48490 -35725 -6474 25348 45381 45527 25565 -5742 -34247
1191 -34247 -47417 -39928 -14745 16689 40662 46714 32318 3762 -26252 -45311 -43712 -22623
1203 -22623 7851 34802 47222 37936 11397 -19230 -40999 -45244 -29475 209 28895 43871
1215 43871 40585 20344 -9773 -36182 -45282 -34566 -9586 20009 41660 44745 26342 -2361
1227 -2361 -29124 -44042 -39661 -16940 13374 36280 43277 32689 7111 -22384 -41035 -41144 -24462
1240 -24462 3014 30170 43899 37290 14417 -14222 -36753 -43666 -30691 -3634 24000 40358
1252 40358 39744 21594 -6371 -31385 -41850 -34482 -12499 15522 36788 41767 27655 2148 -24433
1265 -24433 -40598 -38705 -19132 8520 32194 41433 32605 9600 -17557 -37090 -39576 -25097 328
1278 328 25627 39819 36178 16904 -10064 -32463 -40608 -30652 -7266 19573 37544 38327 22800
1291 22800 -2983 -27332 -39532 -33739 -13533 11919 32887 39071 28072 4512 -20329 -36516
1303 -36516 -36840 -20787 4833 28273 38657 32136 11651 -14137 -33758 -38089 -25180 -2003 21663
1316 21663 36544 34777 17746 -6776 -28182 -37069 -30268 -9735 15649 33526 36667 23655 573
1329 573 -23071 -36574 -33099 -15376 8562 28741 36683 28121 7033 -16341 -32736 -34790 -21774
1342 -21774 1243 23709 35206 31454 13882 -9657 -29676 -35923 -25976 -4875 17699 33108
1354 33108 33774 19153 -3596 -24328 -34281 -29747 -11892 11693 29506 34307 24368 3441 -19086
1367 -19086 -33393 -32199 -17293 4777 24957 34496 28256 9459 -13184 -29477 -32967 -22356 -1190
1380 -1190 19935 32210 30625 15453 -6413 -25706 -33548 -26204 -7551 14433 29791 32112 20193
1393 20193 -698 -20791 -31922 -28944 -13114 8615 25859 32009 24104 5635 -15510 -29664
1405 -29664 -30771 -18338 2073 21597 31522 27516 11004 -9933 -26448 -31327 -22517 -3497 16742
1418 16742 29244 29287 16285 -3794 -22042 -30973 -25738 -9554 11049 26423 30360 20699 1982
1431 1982 -17349 -29259 -28067 -14337 5350 22835 29906 24144 7672 -12090 -26531 -28951 -18980
1444 -18980 -607 18226 28681 26675 12819 -6700 -23172 -29464 -22490 -5936 13153 26466
1456 26466 28045 17409 -1126 -19128 -28269 -25278 -11142 8118 23401 28418 20793 4151 -14171
1469 -14171 -26502 -26817 -15368 2984 19649 27744 23776 9164 -9443 -23620 -27482 -19235 -2518
1482 -2518 15481 26321 25665 13642 -4341 -20373 -27407 -22044 -7481 10449 23889 26476 17328
1495 17328 747 -15873 -25964 -24263 -12001 5689 20716 26431 20782 5838 -11779 -23823
1507 -23823 -25242 -15759 573 16718 25694 22767 10155 -6667 -21056 -26064 -19247 -4293 12331
1520 12331 23664 24764 14356 -2193 -17185 -25024 -21884 -8824 7929 20955 24769 17734 3157
1533 3157 -13282 -23848 -23503 -12748 2805 17923 25210 20440 6997 -8639 -21123 -24524 -16537
1546 -16537 -1097 14015 23027 22629 11831 -4554 -18213 -23811 -19319 -6252 9734 21764 23256
1559 23256 15000 524 -14704 -23254 -21221 -9731 5412 18313 23547 17992 4138 -10828 -20878
1572 -20878 -22333 -13952 1495 15530 22661 20197 8566 -6828 -18930 -23061 -16491 -3382 11823
1585 11823 21343 21592 12021 -2561 -15742 -22346 -19101 -6924 7896 18993 22220 15514 1692
1598 1692 -12433 -21047 -20238 -11062 3599 16390 21682 17787 5994 -8423 -19399 -21527 -13926 -561
1612 -561 12984 21021 19587 9398 -4726 -16353 -21247 -16928 -4421 9507 19149 20439 12689 -810
1626 -810 -13900 -20603 -18436 -8454 5379 17180 20730 15536 3140 -10232 -19486 -19663 -11545 1668
1640 1668 14151 20384 17755 7072 -6808 -17266 -20105 -14257 -2252 11083 19042 18689 10337 -2455
1654 -2455 -14727 -20038 -16479 -6012 7336 17558 20091 13125 731 -11282 -18709 -18121 -9070 3710
1668 3710 15086 19212 15397 4747 -7963 -17473 -18535 -11879 215 12275 18787 17054 7685 -4724
1682 -4724 -15189 -18702 -14249 -3231 9212 17346 17877 10670 -1071 -12537 -18625 -16133 -6599 5327
1696 5327 15278 18433 13559 2303 -9848 -17247 -17421 -10017 2406 13185 18128 14891 5639 -6253
1710 -6253 -15483 -17852 -12105 -1567 9974 17133 16527 8600 -3346 -13295 -17776 -14340 -4439 7186
1724 7186 15605 17254 11227 531 -10646 -16857 -15599 -7568 3918 13423 16936 13325 3582 -7574
1738 -7574 -15488 -16706 -10423 527 11033 16769 15054 6441 -4857 -13555 -16546 -12579 -2406 8283
1752 8283 15161 15835 9577 -1366 -11448 -16554 -14115 -5450 5209 13859 16321 11346 1429 -9044
1766 -9044 -15275 -15240 -8091 2623 11683 15758 12968 4539 -6123 -13847 -15651 -10696 -680 9374
1780 9374 15227 14167 7213 -3261 -12154 -15785 -12269 -3188 6622 14238 15163 9150 -306 -9586 -15042
1795 -15042 -13955 -6196 3968 12273 15177 11543 2524 -7387 -14008 -14207 -8586 917 10114 14945 12803
1810 12803 5207 -4279 -12175 -14586 -10494 -2053 7588 13640 13772 7864 -1677 -10308 -14569 -12106 -4372
1825 -4372 5195 12360 14475 9693 896 -8270 -13411 -13197 -6830 2360 10774 14038 11182 3696 -5579
1840 -5579 -12569 -13878 -8816 -332 8479 13671 12483 5680 -3417 -11014 -13688 -10525 -2764 6158 12399
1855 12399 13243 8233 -447 -8706 -13463 -11741 -5035 3714 11102 13472 9750 2046 -6829 -12302 -12775
1870 -12775 -7109 1250 9252 13044 11292 4392 -4235 -10935 -12749 -9134 -1401 7068 12176 12094 6682
1885 6682 -1939 -9338 -12779 -10533 -3585 4845 11227 12408 8370 628 -7259 -12193 -11423 -5989 2288
1900 2288 9340 12344 10095 2986 -5226 -11102 -12071 -7691 169 7607 11960 10952 5180 -3128 -9595
1915 -9595 -12060 -9093 -2269 5691 10786 11499 6887 -502 -7626 -11864 -10222 -4340 3641 9649 11784
1930 11784 8687 1710 -5970 -10776 -10883 -6221 947 8079 11529 9626 3684 -3763 -9841 -11029 -7821
1945 -7821 -1120 6671 10857 10666 5704 -1933 -8249 -11233 -9003 -3208 4141 9752 10730 6945 210
1960 210 -6359 -10674 -9657 -4677 2390 8377 10840 8335 2385 -4718 -9714 -10410 -6365 286 7028
1975 7028 10456 9112 4116 -2611 -8527 -10447 -7952 -1698 5228 9724 10039 6069 -891 -7120 -10103
1990 -10103 -8878 -3469 3232 8663 10103 7180 1304 -5361 -9835 -9567 -5190 1224 7339 10036 8457
2005 8457 3169 -3661 -8650 -9916 -6800 -869 5861 9180 9100 4838 -1551 -7436 -9792 -7749 -2750
2020 -2750 3863 8673 9569 6363 295 -5938 -9589 -8401 -4226 2136 7551 9468 7119 1932 -4185
2035 -4185 -8462 -9370 -5443 616 5929 9189 8110 3756 -2665 -7457 -9113 -6856 -1629 4661 8516
2050 8516 8724 5034 -649 -6454 -8868 -7826 -2836 2945 7700 9088 6223 967 -4821 -8302 -8245 -4517
2066 -4517 1322 6520 8713 7251 2493 -3271 -7839 -8460 -5532 -257 5103 8275 7826 3993 -1614
2081 -1614 -6906 -8634 -6688 -1914 3469 7629 8385 5031 -89 -5199 -8313 -7327 -3370 2282 6717
2096 6717 8112 6059 1278 -4007 -7592 -8055 -4621 342 5279 7914 7115 2889 -2415 -6743 -7983
2111 -7983 -6108 -809 3932 7439 7669 4259 -854 -5614 -7722 -6791 -2651 2628 6464 7426 5414 457
2127 457 -4248 -7405 -7335 -3625 1052 5769 7620 6320 2011 -3123 -6738 -7453 -4823 21 4626 7123
2143 7123 6871 3398 -1356 -5682 -7621 -5959 -1638 3269 6637 7080 4344 -245 -4584 -7329 -6323
2158 -6323 -3082 1822 5893 7159 5546 1090 -3610 -6502 -6718 -4127 594 4839 7138 6085 2519
2173 2519 -2476 -6104 -7014 -4997 -863 3598 6579 6640 3523 -822 -4942 -6896 -5718 -2197 2534 6132
2189 6132 6670 4729 673 -3822 -6594 -6138 -3239 1087 5200 6638 5454 2033 -2634 -6084 -6305 -3967
2205 -3967 176 4128 6349 6111 3030 -1504 -5231 -6700 -5089 -1380 2650 5979 6094 4000 -374
2220 -374 -4294 -6241 -5837 -2614 1788 5043 6218 4577 1381 -3331 -5839 -5938 -3583 354 4434 6047
2236 6047 5034 2164 -2214 -5068 -6120 -4312 -592 3453 5975 5462 2958 -811 -4360 -5975 -5080
2251 -5080 -1749 2312 5329 5676 4127 273 -3279 -5941 -5642 -2621 1141 4658 5890 4479 1385
2266 1385 -2426 -5179 -5603 -3514 154 3600 5596 5008 2548 -1331 -4693 -5508 -4411 -947 2735 5231
2282 5231 5390 3148 -337 -3762 -5413 -4720 -1858 1408 4643 5408 4185 868 -2888 -5133 -5140 -3158
2298 -3158 564 3795 5314 4647 1844 -1746 -4680 -5265 -3532 -730 2637 5119 4928 2611 -939 -3564
2314 -3564 -5161 -4364 -1523 2011 4624 5156 3446 125 -2991 -4993 -4753 -2458 806 3692 5147 3905
2330 3905 1057 -1970 -4526 -5004 -2871 5 2845 4828 4563 1947 -1232 -4022 -4887 -3648 -985 2254
2346 2254 4757 4730 2740 -55 -3260 -4784 -4392 -2127 1402 3936 4760 3609 419 -2289 -4475 -4669
2362 -4669 -2533 613 3340 4724 3841 1593 -1558 -4296 -4648 -3162 -321 2735 4417 4161 2138 -680
2378 -680 -3365 -4742 -3776 -1287 1690 3963 4573 2946 244 -2906 -4193 -4289 -1999 756 3334 4471
2394 4471 3485 1218 -1970 -3655 -4623 -2838 -212 2738 4376 4009 2085 -1030 -3372 -4389 -3157 -680
2410 -680 2055 3799 4194 2507 -163 -3081 -4336 -3480 -1426 982 3601 4162 3131 927 -2054 -3968
2426 -3968 -3705 -2065 492 2636 4179 3389 1509 -1424 -3256 -4212 -2887 -618 2230 3736 3943 2075
2442 2075 -778 -2839 -3833 -3092 -1047 1662 3400 4037 2588 163 -2213 -3876 -3416 -1892 626 2934
2458 2934 3857 3157 663 -1824 -3554 -3592 -2660 -274 2526 3606 3336 1526 -969 -2879 -3919 -2972 -570
2475 -570 1702 3346 3604 2116 -319 -2093 -3712 -3013 -1422 903 3153 3703 2708 595 -1882 -3334
2491 -3334 -3242 -1981 569 2413 3623 2868 1165 -1002 -2928 -3469 -2303 -333 1921 3465 3477 1884
2507 1884 -453 -2395 -3419 -2767 -1047 1205 2929 3046 2172 344 -1804 -3260 -3319 -1676 571 2535
2523 2535 3304 2592 847 -1562 -3028 -3314 -1939 -30 1942 3121 2890 1156 -868 -2613 -3175 -2413
2539 -2413 -539 1452 3011 2873 1946 -186 -1847 -3124 -2804 -1066 660 2489 3262 2450 654 -1666
2555 -1666 -2945 -2906 -1518 202 1997 2943 2461 1137 -939 -2697 -3047 -2103 -445 1681 2731 2816 1684
2572 1684 -234 -2214 -3041 -2479 -1072 1106 2397 2895 1974 353 -1706 -2967 -2929 -1458 506 2162
2588 2162 2788 2252 787 -1314 -2716 -2969 -1818 72 1764 2874 2575 1501 -600 -2057 -2864 -2192
2604 -2192 -679 1146 2398 2992 1718 53 -1761 -2711 -2535 -1155 606 2292 2810 1994 535 -1430
2620 -1430 -2375 -2375 -1570 168 2087 2834 2582 940 -789 -2347 -2701 -1739 -503 1299 2582 2535 1463 -196
2638 -196 -1632 -2604 -2283 -994 709 2214 2670 1678 527 -1190 -2408 -2284 -1348 333 2071 2380 2084
2655 2084 678 -1052 -2073 -2468 -1617 -64 1400 2534 2334 1206 -271 -1843 -2634 -2048 -631 1044
2671 1044 2105 2533 1507 110 -1584 -2517 -2182 -966 448 1823 2430 1590 689 -1108 -2073 -2266 -1580
2688 -1580 -95 1633 1897 2105 928 -564 -1978 -2227 -1856 -727 1106 2147 2096 1229 -202 -1411 -2345
2705 -2345 -2052 -1013 790 1994 2237 1489 388 -1124 -2104 -2141 -1276 108 1659 2329 1930 652 -779
2722 -779 -1955 -2154 -1630 -295 1381 1998 2100 1119 -398 -1483 -1960 -1607 -467 700 1801 2072 1376
2739 1376 171 -1161 -2203 -1897 -1008 363 1576 2210 1817 645 -757 -1798 -2213 -1317 -136 1051
2755 1051 2139 2061 1055 -367 -1463 -2132 -1694 -469 1134 1884 1748 1267 -43 -1480 -1861 -1794 -684
2772 -684 633 1770 2054 1622 331 -883 -1730 -2002 -1183 67 1361 1833 1925 654 -646 -1825 -1843 -1413
2790 -1413 -300 833 1818 1657 1110 -8 -1397 -1925 -1757 -744 488 1599 1873 1402 204 -1093 -1760
2807 -1760 -1535 -863 104 1476 1849 1445 394 -799 -1586 -1827 -1161 -228 994 1874 1653 990 -362 -1493
2825 -1493 -1839 -1424 -435 682 1926 1778 1190 181 -857 -1822 -1754 -715 352 1517 1690 1197 289 -803
2843 -803 -1632 -1993 -1338 -247 1201 1783 1580 656 -454 -1517 -1802 -1197 -329 687 1681 1861 843 -159
2861 -159 -1280 -1698 -1611 -684 460 1398 1615 1038 244 -797 -1566 -1757 -929 359 1135 1506 1220 622 -572
2880 -572 -1483 -1537 -1392 -246 833 1471 1596 833 -46 -1158 -1516 -1516 -648 520 1624 1616 1142 66 -1011
2899 -1011 -1538 -1436 -785 456 1244 1971 1263 394 -743 -1647 -1568 -1014 -331 991 1578 1453 662 -228 -1327
2918 -1327 -1800 -1135 -662 793 1466 1627 959 -7 -1125 -1303 -1353 -680 351 1155 1498 1157 389 -825 -1180
2937 -1180 -1557 -1075 39 1050 1404 1425 749 -333 -1178 -1335 -841 -125 747 1548 1423 968 -105 -1061 -1550
2956 -1550 -1312 -551 328 1394 1522 881 29 -969 -1541 -1546 -734 244 1171 1334 1365 437 -498 -1326 -1709 -1156
2976 -1156 -85 623 1541 1391 925 24 -1108 -1594 -1458 -333 613 1398 1513 1188 52 -769 -1340 -1559
2994 -1559 -722 74 1023 1552 1220 482 -468 -1280 -1219 -923 -50 936 1527 1276 767 -381 -1170 -1281 -1133 -331
3014 -331 421 1485 1645 748 -183 -687 -1221 -1227 -668 300 1075 1397 1032 289 -939 -1442 -1313 -851 245 889
3034 889 1280 1341 470 -305 -923 -1473 -953 -279 525 1399 1351 825 -45 -1137 -1118 -979 -443 244 1060 1568 1089
3055 1089 235 -777 -1246 -1374 -664 199 879 1525 1176 463 -599 -1237 -1177 -972 -311 747 1290 1265 789
3074 789 -201 -863 -1333 -1097 -519 292 1215 1180 870 162 -1006 -1292 -1165 -555 542 1161 1096 1082 255 -448
3094 -448 -968 -1228 -800 163 620 1339 1048 443 -265 -1225 -1401 -1044 -147 549 1185 1085 575 14 -940 -1298
3114 -1298 -1157 -573 510 892 1211 804 225 -545 -1044 -1092 -681 3 938 1061 961 319 -247 -836 -1181 -1019
3134 -1019 -376 639 1069 1137 601 -69 -926 -1063 -1159 -524 394 1017 1210 938 72 -689 -1150 -1051 -698 296
3154 296 804 1402 1275 564 -550 -831 -993 -813 -105 565 1087 1062 516 -303 -1000 -1320 -957 -306 645 1388
3174 1388 1150 657 -47 -649 -1144 -1369 -619 359 998 1191 935 123 -778 -1104 -1042 -676 -118 720 1198 1018
3194 1018 507 -229 -858 -1375 -851 -183 589 983 1017 717 -5 -693 -1262 -1019 -435 325 983 1240 801 105
3214 105 -616 -1154 -1222 -470 -63 962 1106 1068 414 -488 -952 -1221 -772 27 835 1249 1254 753 11 -873 -1274
3235 -1274 -1007 -219 371 1045 1169 797 213 -397 -1047 -1096 -545 85 983 1153 776 100 -695 -1115 -1054 -651
3255 -651 -85 990 1291 1125 540 -259 -997 -1189 -703 -288 694 851 1053 495 -18 -742 -1129 -1096 -423 532
3275 532 791 979 694 90 -616 -883 -902 -534 -54 738 1101 801 215 -237 -910 -984 -818 -168 617 885 1274
3296 1274 493 -100 -691 -900 -851 -238 329 983 842 793 177 -703 -1081 -1011 -603 381 721 1008 805 83 -575
3317 -575 -1138 -954 -475 27 527 921 1139 540 -189 -832 -1118 -715 -69 297 703 920 662 -90 -638 -1046
3337 -1046 -1004 -417 384 954 1151 935 203 -491 -1123 -980 -378 135 715 1117 945 474 -324 -934 -1234 -794
3357 -794 -31 373 1060 878 388 144 -739 -866 -737 -387 432 993 769 756 151 -468 -857 -802 -449 61 931
3378 931 1024 729 506 -232 -884 -1168 -518 -44 825 1161 1098 546 -117 -877 -1102 -733 -457 579 809 1079
3398 1079 584 -134 -394 -1113 -998 -529 172 841 933 648 212 -730 -884 -929 -591 40 748 1000 874 345
3418 345 -170 -908 -1158 -830 -297 623 925 1024 513 -5 -673 -891 -791 -189 271 858 785 701 575 -668 -866
3439 -866 -1105 -470 314 707 837 938 328 -505 -910 -1301 -1115 -171 474 785 959 384 -386 -633 -947 -835
3459 -835 -417 324 527 877 617 -51 -670 -1134 -792 -173 425 822 1015 672 21 -548 -1045 -749 -609 114
3479 114 404 759 914 251 -306 -543 -837 -507 -187 480 781 1028 387 -203 -455 -1189 -760 22 262 874
3499 874 887 673 -29 -620 -785 -1115 -480 -20 610 924 661 184 -344 -1014 -746 -616 -84 429 939 1086
3519 1086 460 -211 -559 -1064 -565 -262 469 808 812 756 177 -731 -875 -833 -465 136 658 828 627 126 -361
3540 -361 -925 -781 -550 106 384 762 709 468 -256 -544 -1086 -811 -461 632 611 933 537 -54 -632 -918
3560 -918 -888 -213 453 775 1006 729 202 -575 -886 -910 -404 63 628 931 828 251 -209 -949 -844 -876 -7
3581 -7 456 902 901 422 35 -755 -931 -768 -276 444 742 708 399 -59 -391 -1067 -941 -451 153 673 874 451
3603 451 10 -508 -953 -807 -594 60 588 546 675 270 -203 -665 -478 -990 -248 527 724 782 123 189 -416
3624 -416 -560 -729 -279 312 884 845 409 99 -358 -629 -1143 -401 93 622 855 489 219 -274 -804 -1122
3644 -1122 -543 -123 541 790 538 484 -194 -507 -874 -630 -154 550 835 657 401 -32 -553 -809 -885 -207
3664 -207 319 675 834 656 279 -391 -676 -706 -636 -65 440 756 886 588 30 -681 -872 -583 -366 476 752
3685 752 807 307 -331 -522 -622 -793 -456 289 521 761 580 -12 -276 -730 -924 -358 104 655 895 584
3705 584 258 -223 -1017 -679 -395 17 649 750 733 409 -110 -472 -902 -682 -185 341 657 538 467 -223 -504
3726 -504 -829 -726 -379 303 502 699 464 52 -264 -768 -696 -304 -25 401 676 671 341 -91 -630 -807 -528
3747 -528 1 258 931 617 309 -166 -840 -817 -478 -220 307 318 905 576 21 -233 -773 -804 -555 331 434
3768 434 798 439 504 -414 -852 -775 -724 -39 602 847 349 280 -299 -430 -672 -601 -190 472 555 840 721 -153
3790 -153 -463 -756 -721 -272 320 716 754 393 196 -329 -627 -927 -285 286 590 613 797 328 -86 -564 -905
3811 -905 -462 -224 434 505 658 601 -105 -777 -773 -745 -107 384 444 723 477 19 -434 -688 -713 -392 332 409 532
3834 532 665 205 -308 -755 -551 -352 -51 600 691 609 376 -315 -549 -794 -548 -96 153 521 688 282 -115
3855 -115 -360 -891 -675 -514 -59 534 638 276 -28 -230 -577 -745 -453 106 256 494 595 242 -213 -544
3875 -544 -747 -612 120 661 496 434 240 -159 -459 -728 -526 -261 277 763 500 444 197 -494 -587 -724 -377
3896 -377 248 368 911 599 173 -355 -339 -898 -409 -126 335 548 543 113 -146 -523 -350 -427 -377 417 465 678
3918 678 359 -122 -373 -383 -807 19 243 743 786 434 327 -384 -820 -618 -302 100 477 749 810 353 -258
3939 -258 -476 -684 -500 -9 449 723 544 270 -120 -652 -486 -704 -149 181 565 405 188 91 -227 -478
3959 -478 -715 -331 -49 608 582 668 111 -163 -597 -514 -202 156 459 708 723 240 -270 -446 -544 -448 -35 210
3981 210 635 643 292 142 -609 -709 -424 -264 51 625 660 702 249 -123 -630 -641 -102 152 840 669 422 216
4003 216 -367 -531 -476 -518 -63 315 411 269 405 -163 -470 -608 -467 -178 188 531 639 328 212 -327 -478
4024 -478 -445 -314 141 258 726 346 219 -260 -775 -710 -250 77 583 726 495 141 -126 -297 -612 -382 -145
4045 -145 155 533 652 430 -164 -216 -529 -690 -273 305 463 714 297 -31 -212 -544 -258 -104 104 462
4065 462 713 561 423 -310 -281 -552 -448 -70 213 377 421 328 -53 -432 -546 -426 -100 98 376 605 503
4086 503 46 -236 -700 -624 -246 215 365 344 391 165 -178 -425 -777 -316 -124 284 435 432 236 -262 -494 -527
4108 -527 -417 -38 377 559 497 413 102 -375 -368 -414 -114 65 585 557 458 187 -169 -556 -422 -168 122 348
4130 348 395 461 -47 -147 -611 -667 -252 -101 206 373 295 415 -27 -335 -491 -455 -109 90 677 577 315 -1
4152 -1 -316 -497 -398 -408 112 433 246 436 68 -381 -620 -529 -309 212 252 713 329 197 -136 -492 -577 -278
4174 -278 257 139 582 368 266 5 -351 -573 -526 -5 420 431 593 375 50 -210 -338 -639 -460 167 380
4195 380 522 195 164 -242 -454 -266 -464 -163 501 524 481 538 -389 -391 -603 -299 -212 -22 384 370 216 2 -198
4218 -198 -708 -225 -305 29 461 403 337 48 -255 -606 -447 -313 128 533 204 471 23 -176 -291 -502 -190
4239 -190 -112 242 443 293 273 -50 -125 -438 -353 -107 81 355 461 195 -50 -117 -495 -270 191 24 376 542
4261 542 377 40 -171 -531 -536 -282 26 249 273 313 384 7 -589 -668 -336 82 316 484 353 300 -5 -244
4283 -244 -462 -394 65 40 502 654 97 21 -37 -438 -521 -112 122 398 326 462 273 31 -490 -301 -421 9
4305 9 126 242 260 243 -315 -778 -494 -319 -331 220 387 588 352 -86 -45 -376 -322 -11 222 422 480 483 331
4328 331 -174 -353 -283 -416 72 422 405 349 190 -136 -276 -590 -326 -121 279 245 316 343 -95 6 -568 -450
4350 -450 -330 -43 452 360 232 -216 -160 -281 -450 -216 48 344 474 371 106 -117 -285 -327 -234 41 268
4371 268 305 433 56 -166 -416 -357 -449 -270 297 132 116 132 120 -316 -362 -373 -240 95 124 219 92 155 -136 -659
4395 -659 -428 -452 129 403 311 412 199 -34 -472 -522 -221 -44 364 394 200 182 72 -189 -241 -299 -103 31
4417 31 316 446 226 -47 -431 -201 -231 -231 -59 396 435 364 97 -216 -609 -234 -320 -14 211 310 435 224 -123
4440 -123 -432 -396 -231 53 132 316 327 129 -8 -106 -551 -207 -123 65 460 373 193 73 -156 -215 -369 -99
4462 -99 79 317 328 344 -148 -169 -275 -357 -349 -12 160 117 355 86 140 -223 -299 -108 -72 81 400 237 157 -111
4486 -111 -184 -552 -415 -242 -92 440 550 463 -67 -174 -181 -532 -312 6 234 480 209 190 -61 -340 -380 -152
4508 -152 -101 260 283 409 233 -46 -217 -53 -230 -143 77 167 398 232 39 85 -643 -436 -293 84 268 250
4530 250 329 101 12 -602 -11 -330 -197 147 472 337 22 10 -324 -234 -512 -220 27 343 327 178 122 -232
4552 -232 -246 -385 -179 15 117 204 216 201 38 -330 -478 -313 237 362 233 263 134 -190 -410 -434 -209 -152
4574 -152 237 378 381 238 -108 -163 -133 -276 -87 26 318 430 417 -138 -209 -102 -402 -209 175 209 413 111
4596 111 162 -266 -321 -342 -102 274 140 233 165 22 -30 -347 -520 -414 -32 91 285 253 287 206 -199 -264 -78
4619 -78 -251 228 77 238 626 127 -437 -274 -354 -205 -84 233 360 17 257 -207 -456 -353 -192 11 199
4640 199 380 238 235 -105 -196 -289 -414 -432 -29 406 331 268 17 -262 -351 -333 -380 -50 335 173 310 179 -17
4663 -17 -225 112 6 -194 -16 170 486 57 9 -272 -199 -312 -65 328 373 157 54 70 -47 -383 -419 -210
4685 -210 153 224 237 120 122 -193 -203 -118 -295 -6 77 421 438 241 22 -414 -441 -118 -169 143 97 369 207 -68
4709 -68 -306 -380 -193 -168 183 324 309 122 -196 -203 -416 -206 -238 253 155 534 258 -135 -317 -366 -201 -370 -19
4732 -19 272 187 152 475 -262 -274 -24 -137 -76 227 240 396 326 -125 -197 -463 -267 -185 273 324 354 74 -43 30
4756 30 -138 -333 -270 -135 248 368 333 -4 -146 -387 -370 -88 30 -34 347 351 134 58 -484 -15 -302 -79 196
4779 196 -15 336 51 104 -151 -199 -157 -335 235 120 245 403 -35 -359 -201 -178 -87 -42 86 295 349 62
4801 62 25 -504 -289 -247 74 87 149 185 49 -142 -306 -351 -438 -200 -23 125 359 225 68 -102 -218 -328 -398
4824 -398 69 295 296 522 128 -224 -38 -516 -115 -252 -160 186 411 -1 -53 -271 -261 -202 -7 268 126 296
4846 296 148 119 -220 -457 -194 -262 -49 49 490 253 166 -261 -320 -151 273 -10 -75 204 7 93 -138 -546
4868 -546 -84 -12 14 160 247 370 -114 -133 -186 -139 -424 -65 88 97 325 166 -19 90 -347 -200 -100 71 295
4891 295 292 127 255 -16 -320 -217 -241 -15 87 49 122 111 -24 -307 -168 -278 141 154 222 382 -96 192 -48
4914 -48 -143 -207 -51 -84 176 294 175 369 -131 -147 -184 -122 -105 156 376 207 106 59 -367 -104 -153 65 106 366
4938 366 253 313 -94 -218 -321 -32 -174 104 509 421 386 155 -198 -220 -255 -96 -159 142 174 170 129 -242 -222 -289
4962 -289 -113 93 261 343 230 -91 -210 -184 -214 -323 70 49 319 232 56 10 -400 63 -359 0 57 252
4984 252 373 423 -138 -243 -212 -454 -227 244 22 192 170 227 79 -242 -146 -367 -121 226 376 355 80 -228
5006 -228 -254 -404 -256 -170 144 440 170 48 343 -165 -345 -95 117 96 280 -55 269 -99 -74 -162 -5 55
5028 55 -86 33 377 283 108 -76 -106 -245 -81 104 56 202 250 245 9 -302 -430 -206 -81 166 40 179
5050 179 254 193 89 -106 -253 -60 39 377 320 521 217 -302 -102 -267 25 -44 -55 306 150 27 199 -11
5072 -11 -388 -200 -89 -45 123 378 275 60 -64 -557 -252 25 223 305 250 -16 -146 -214 -397 -280 -93 -24
5094 -24 61 60 371 216 -42 -424 -380 -208 -201 184 277 274 187 28 -65 -185 -316 86 -17 250 309 39 19 -50 -488
5119 -488 -406 -84 39 115 96 -63 -204 -214 -30 37 -12 152 155 305 281 -39 -103 -287 -214 -297 -141 133 79 138 58
5144 58 -36 -144 -39 -214 303 65 90 121 -93 16 -93 -48 -210 -351 114 44 274 108 -24 -201 -161 -310
5166 -310 -288 -82 -14 205 58 97 -56 -185 59 -82 120 100 167 430 159 -41 -16 -13 -157 42 48 140 392 96
5190 96 51 -68 -134 -344 -9 -32 -190 128 276 309 -68 -76 -200 47 -165 54 321 146 231 -66 83 -220 -120
5213 -120 -123 173 117 249 285 -148 49 -241 -476 3 -86 124 103 164 66 -107 -339 -123 -183 -26 -174 305 -55
5236 -55 -12 -152 19 -67 -261 54 342 311 281 26 -40 -191 -507 -257 -439 -128 264 272 242 158 -247 39 -186
5259 -186 85 221 99 139 330 -62 -184 -344 -14 -328 -133 167 346 107 181 87 126 -114 -59 -58 108 201 232
5282 232 217 -72 -101 -192 -307 1 18 187 127 84 -81 17 -373 -172 -122 -329 185 231 202 103 -67 -24 -376 -342
5306 -342 -29 152 158 266 87 60 21 -15 -294 -161 77 137 384 20 55 -179 -231 -440 -26 -171 27 99 90 46
5330 46 110 79 -155 -125 8 411 220 227 238 7 38 -211 -159 112 2 276 58 203 -52 -54 -157 -110 31 80
5354 80 61 62 187 10 -131 -203 -237 -214 -166 161 52 72 5 101 -39 -339 -34 -4 104 255 239 195 -163 -60 -210
5379 -210 -102 21 99 36 89 152 26 101 -44 -125 -125 19 194 214 36 163 58 -14 -233 -241 -229 10 136 145 176
5404 176 -161 -281 -90 -349 50 -69 277 159 -50 369 -213 -292 -70 -295 -56 33 136 283 -24 64 -164
5425 -164 -463 -4 -337 201 340 -7 138 128 -68 -56 -106 49 -157 103 277 145 56 33 -119 -350 -94 114
5447 114 168 232 -114 -139 -131 19 -210 -218 -70 14 84 83 72 35 -97 -201 51 -223 63 34 -53 230 -20 -26 -334 -48
5473 -48 17 -97 190 95 104 -126 -205 -106 -7 71 89 8 161 201 188 16 -191 -6 -188 -62 195 -150 135 96 -377
5498 -377 14 -181 -123 11 222 182 -106 6 -75 -113 -180 -123 -86 152 202 161 264 -27 -143 -63 1 -240 -66 54
5522 54 69 143 196 -114 -381 -484 -167 -58 137 124 209 -170 355 40 -293 -204 -194 -13 110 338 54 18 95
5545 95 70 -330 -308 44 118 74 105 73 -69 -99 93 -160 147 74 96 94 -67 -136 21 -298 -90 -54 208 9 133
5570 133 147 148 29 -143 -403 -251 161 292 276 37 127 -431 -361 208 47 19 235 214 79 7 -166 -54 13
5593 13 0 85 114 140 -1 200 76 -99 -138 -96 -7 -72 105 118 128 26 -250 -99 -72 -59 117 -268 -35 357
5617 357 -142 -1 -157 -80 -83 -23 106 16 65 -139 -40 -3 -95 237 -206 -149 180 179 179 -180 -74 -133 -182 222 -221
5642 -221 -224 142 4 -31 -23 -274 -68 165 58 -62 -80 115 74 47 -81 -143 -277 33 19 220 -40 61 140 -265
5666 -265 34 75 -52 -154 173 66 163 -66 64 -280 -117 -65 -43 29 -24 290 -5 18 -181 -219 -172 171 56
5689 56 -1 174 301 -46 -57 -93 15 91 -101 171 -161 57 98 66 66 -33 -13 -9 85 95 294 188 199 -62 -88 -131
5715 -131 -182 -42 196 -37 8 -98 -125 29 10 185 -82 169 283 -52 179 23 -92 -230 -145 -185 -7 226
5737 226 -105 -17 222 -265 -47 -50 111 150 249 -188 114 -144 -251 0 1 220 268 35 200 76 -131 -5 -32
5760 -32 -185 -4 54 341 264 239 14 -253 -75 6 -271 13 77 -172 263 44 0 -231 -15 -223 59 55 216
5783 216 33 66 115 -58 -50 -182 -145 88 161 239 197 -97 -284 -123 22 -158 94 122 63 139 45 -46 -98 -140 -1
5808 -1 -100 198 116 84 -1 30 -117 21 -162 197 64 209 98 152 -89 47 -71 -228 107 45 163 121 205 -143
5832 -143 -194 -124 -68 -167 189 147 125 166 184 74 -57 -83 -8 176 68 72 114 53 -40 -15 -102 -114 37 39 198 136 2
5859 2 126 -182 52 -195 -230 -276 -75 116 136 93 -173 -178 -118 -50 79 194 38 -25 18 -93 100 -137 -213 2
5883 2 107 54 214 150 138 98 -59 -48 -97 92 230 270 226 134 -188 -96 -370 -162 -37 13 246 83 -102 91
5907 91 139 -94 -109 -227 20 194 -42 447 -113 -122 -98 -106 -214 -200 28 194 360 -73 60 -89 6 22 -85 36
5931 36 354 -74 154 51 -213 33 117 -227 107 385 342 -32 153 -242 -35 -38 -56 -26 106 30 -12 -89 80
5954 80 -39 96 -57 219 212 16 121 -22 246 69 39 137 -324 138 211 59 135 6 -276 -163 -253 108 193
5977 193 55 256 78 -104 -92 217 -58 46 -45 -53 24 340 -49 -46 1 15 31 36 36 242 167 -141 7 62 -141
6002 -141 -2 155 -26 80 245 81 -234 32 -99 -1 254 -104 -4 7 41 -35 -102 254 57 -136 -351 25
6024 25 284 182 -125 54 -232 27 95 -92 38 -215 28 11 -23 -135 36 -123 -75 122 12 72 109 -3
6046 -3 -115 -3 -198 -91 110 396 58 -60 -48 7 -1 -70 36 -97 109 53 36 26 96 -25 -129 -217 -61 264
6070 264 148 29 109 -135 -252 -180 -215 40 -70 13 213 325 187 -15 -17 -278 20 -25 -42 -10 -134 37 -49
6093 -49 -202 68 -152 -3 -96 183 14 26 110 -138 62 242 -69 50 294 106 4 -172 -88 -311 -113 -78
6115 -78 -172 224 221 -13 -56 55 50 -192 110 73 122 -26 145 176 139 -313 14 42 292 98 -52 254 110 -109
6139 -109 -58 36 3 -191 -125 25 -7 193 -106 -77 100 -238 -186 46 -43 322 -49 97 79 -117 143 -184 92
6162 92 17 -54 -189 -38 -79 -238 -214 -86 -40 84 255 133 51 38 -277 -75 -222 34 -15 73 184 5 186
6185 186 -32 -77 -455 140 112 -26 23 142 -158 -139 -67 -102 -52 -143 -47 26 163 -89 -206 -206 73 33 2 -60 63
6210 63 -14 -25 77 -23 -221 -136 -129 285 248 87 -19 89 -32 199 -249 96 70 167 129 -20 -54 -117 -231 72
6234 72 -81 70 142 -8 135 159 3 -16 -183 86 -201 -198 17 97 -2 -51 -140 68 -12 29 -208 93 102 125 127 12
6260 12 -42 -103 42 -61 -8 176 138 -90 -78 -299 60 104 -58 48 82 167 143 -45 85 -5 -141 -71 69 -293
6284 -293 -137 185 209 -84 65 -92 -153 16 -104 30 -185 263 0 -101 -48 -68 105 68 -71 290 -1 100
6306 100 330 -100 -19 -118 96 173 298 28 -47 -167 103 -152 -71 1 -59 -5 -189 -4 38 -106 -11 -74 -109 -12
6330 -12 190 -151 -58 95 -28 32 -7 68 63 88 250 33 199 12 -8 -13 165 -140 100 195 14 129 134 14 -31
6355 -31 130 -28 113 160 181 -300 -130 -109 -72 -133 132 7 -84 129 203 -117 58 144 -104 -191 -109 17 262 198
6379 198 10 19 26 -136 19 42 -38 -33 175 158 91 55 -73 18 -244 40 184 65 27 -106 -36 -142 -106 104 -10
6404 -10 218 -77 -159 -191 8 54 -429 22 -128 -16 20 -150 -152 4 -115 -178 46 -173 -119 -49 136 129 -77 7
6428 7 -60 -242 54 -73 5 21 88 103 97 -90 -267 -74 -4 197 327 182 57 -95 -158 -186 -115 71 169 50 139
6453 139 327 -18 -94 -190 -170 -135 -314 142 -79 174 99 22 -281 19 -54 104 145 -8 142 3 -170 -7 -85
6476 -85 -121 -76 115 60 -27 55 -43 -159 -30 89 62 74 -26 40 -55 -197 -139 -75 74 -16 -186 -71 96 -26 56
6501 56 -185 -240 -12 192 -71 -45 92 15 8 -121 -36 -142 -67 -199 153 7 25 204 -36 26 -31 24 13 -165
6525 -165 -9 196 201 -227 -33 -260 -101 120 -242 99 -136 125 192 -159 -188 65 -360 -68 322 62 -74
6546 -74 -110 -175 -138 60 47 -86 39 -31 -7 197 130 -144 -42 -134 -320 -36 429 5 76 -220 95 -114 -10
6569 -10 134 282 -10 -148 58 67 71 -105 48 -31 81 -16 209 -92 -86 -56 -65 -316 62 34 130 244 69 -127 -212
6594 -212 17 56 -229 -86 -57 -237 88 44 113 -160 -36 -125 -162 9 77 51 163 -45 -37 -159 -71 -177 -29 237
6618 237 10 41 15 119 10 59 211 -73 -96 4 50 71 -295 -2 -207 -93 -18 13 -61 210 114 -90 112
6641 112 -43 -251 -212 12 -20 6 86 -7 -108 2 15 -131 -146 -61 128 105 79 93 60 -95 -130 -17 0 262 114
6666 114 -109 56 171 -6 243 -4 -36 3 -79 -39 15 -162 -112 -98 -170 -224 -34 128 144 -92 -21 -44 -108 -14 -108
6691 -108 291 43 -69 31 -47 36 -214 190 -72 48 187 105 -16 36 -213 -250 -39 58 137 -29 96 -75
6713 -75 222 -100 -99 -144 -75 -139 -91 164 209 60 6 -109 -103 -81 -110 -187 -60 100 -68 -171 -148 99 -82 40 -46
6738 -46 -153 119 118 -84 84 -68 -84 -12 -4 60 98 321 -8 -52 -84 -16 90 -96 -141 198 445 99 -209 -27
6762 -27 -105 -117 -248 62 57 102 12 -58 169 -12 23 -31 7 -93 177 90 127 79 -200 -86 -108 64 430 -54 -41
6787 -41 166 4 -109 -245 204 -175 -31 -87 -61 13 40 17 14 17 34 84 -108 -5 -50 5 -280 3 -149 48 111
6812 111 211 81 109 -322 -65 -259 -98 -143 -25 40 24 111 305 -12 -31 -80 75 -38 25 59 90 13 -6 -137
6836 -137 -166 117 124 66 8 238 -2 87 -100 -169 -103 38 -64 -39 -46 4 -225 35 -56 -9 -63 -143 131 -262 77
6861 77 82 80 137 -6 -100 -6 34 -48 193 -90 -38 -100 108 -71 45 65 -49 60 -45 175 -176 146 123 -128 -106
6886 -106 -121 -81 54 65 3 66 -130 -187 158 46 5 120 19 -25 127 -95 -122 -113 -285 145 49 110 112 -68 -145
6911 -145 -342 -130 -286 -61 49 -34 157 -132 -300 79 -125 294 156 -114 33 190 -13 -295 56 -298
6931 -298 -42 240 92 3 140 -100 27 -176 -240 -147 16 226 5 30 139 -213 65 22 -57 -96 24 153
6953 153 182 -116 18 154 -16 -37 64 -5 -20 70 14 -152 -15 -25 -182 -63 -2 144 2 58 228 -90 -85 192
6977 192 61 23 -48 -167 158 -80 -35 264 -123 -113 152 121 -126 -30 119 70 -187 -78 7 -116 74 3 7 181
7001 181 -8 -52 -16 -390 -162 -149 -30 100 -17 19 6 6 184 -117 -37 -48 -134 -206 -96 -104 -118 -146 -114 61 -54
7026 -54 -55 10 111 -123 31 -123 55 161 53 -1 -116 -135 -47 -194 -160 -200 35 91 -115 62 111 184 131 18
7050 18 38 -13 -221 -111 -133 -14 287 3 56 65 -15 31 135 -130 205 -113 -14 239 -43 98 -146 123 119 186
7074 186 -168 -144 51 -215 -68 -7 -60 88 1 338 59 -83 -44 104 -117 -35 45 33 103 -114 87 120 -58
7097 -58 30 42 110 -11 27 62 -110 34 -136 -251 -131 -44 65 107 4 81 -112 116 -5 206 37 38 8 338
7121 338 37 -117 -68 -252 -82 -137 -75 -118 -222 124 -117 -128 -41 -45 -52 239 15 -59 38 -206 24 -12 -92 -111 87
7146 87 143 249 93 -38 -248 220 -229 -97 0 145 102 66 44 7 69 -150 -76 -34 38 120 138 -127 53 -35 28
7171 28 -216 -60 -235 -130 -79 216 31 -65 -401 -105 20 105 38 -13 232 184 -8 -136 -46 70 -308 36 -118
7194 -118 12 -121 -278 157 -68 144 -109 -47 9 147 -115 -49 -73 -145 223 161 47 -27 -125 41 208 117 9
7217 9 57 22 -274 133 24 -3 48 56 -18 -74 -93 1 36 3 67 -64 93 -78 279 -69 -125 -94 92 106 -7 -277
7243 -277 -61 -25 -138 -232 31 116 160 101 -180 -174 59 -153 69 197 55 -114 29 152 -190 110 -93 -38 -198
7266 -198 -10 115 151 30 4 144 -269 -41 -255 -36 261 88 -83 144 -88 -57 51 42 -64 -105 55 -146
7288 -146 -40 -157 -44 -197 44 -49 -130 -6 239 107 -110 -61 95 -18 -240 43 -27 220 -55 -39 -8 -1 3
7311 3 30 50 128 118 216 144 14 -120 92 -157 227 -33 17 -57 -22 -95 -93 95 61 -95 -46 -156 -14 84 253 -38
7337 -38 90 -80 59 192 -1 18 110 -31 -35 47 25 272 181 31 24 147 44 -142 27 41 80 151 -20 33 0
7362 0 -258 62 -159 7 119 3 -65 6 199 7 -73 -59 32 -278 -139 74 44 115 -89 59 75 218 -100
7385 -100 -121 129 64 318 148 332 -107 134 -244 -106 -122 91 65 -101 -76 152 -60 -276 31 -42 -34 -95 159
7408 159 160 0 -21 103 91 82 -98 29 -32 80 46 -106 -67 73 -77 -110 -23 -240 189 80 242 -33 -187 -308
7432 -308 127 264 -23 -33 -119 3 -202 -41 -120 -235 56 -3 277 32 80 212 -19 117 -202 -66 107 -51
7454 -51 -33 188 1 36 -89 -205 165 -48 -154 -96 0 143 -121 -50 -42 5 -221 148 -3 -36 53 -100 215 -91
7478 -91 162 -65 146 38 -114 242 -157 -118 6 -37 -228 163 71 -111 -119 30 -159 -38 196 -404 -45 -35
7500 -35 209 79 210 -247 -33 -154 -17 8 12 145 122 14 73 9 173 -144 -17 69 35 97 -104 -131 38 -138
7524 -138 -157 -19 155 43 111 -16 52 111 -58 -37 47 -46 181 49 -85 219 26 -45 -118 61 73 240 24
7547 24 -4 -17 -62 -282 -150 -28 6 -68 -158 232 186 -82 6 -42 117 -121 366 -13 117 -123 -132 10 171 29
7571 29 95 -239 -68 -101 213 -140 -211 35 111 -142 -83 32 -10 311 -63 174 -247 -82 -185 7 98 134 -9
7594 -9 30 -10 -51 -19 -41 -14 -41 82 -80 146 -179 69 -24 100 148 34 110 -48 -171 179 -161 -34 -240 54
7618 54 73 -76 29 32 -29 -281 -57 -162 -125 111 104 -12 -55 4 -19 -91 -17 -175 -172 -208 -41 -85 -74 -149 -12 -26 -264
7645 -264 -156 -126 -77 47 135 -255 -227 -42 37 -142 142 -21 237 118 -77 126 34 194 -116 -177 -130 66 156
7668 156 99 165 -62 55 -155 -153 -91 -145 -19 54 -163 29 -19 -114 19 179 -83 101 10 117 -29 13 -166 71
7692 71 -138 40 -62 135 162 148 23 17 -79 -223 130 -44 -87 172 -63 -196 156 -99 204 -140 -9 89 -137
7715 -137 -42 -59 -11 -10 -235 158 57 104 -6 -28 -45 -64 65 -53 -131 170 184 94 261 -49 -98 -57 -34 204 -58
7740 -58 -27 -39 117 102 52 -189 -82 -121 108 120 65 -160 166 64 67 117 109 90 61 -329 -33 109 32 69 -135 -181
7766 -181 109 31 -123 -2 -67 63 278 9 -91 156 -308 48 94 199 211 96 -57 78 21 -59 20 121
7788 121 62 104 -146 99 18 -42 -26 -301 -150 -111 122 -78 -108 -232 81 -59 -9 -20 59 155 -182 -203 224 -36
7812 -36 140 242 8 207 144 -42 -57 -163 -94 221 -148 38 207 56 -28 28 -301 -304 -125 -133 -93 155 79 -91
7836 -91 43 134 -24 -110 -87 -62 -183 56 -12 131 -40 22 -67 -11 2 -233 -77 -49 -76 4 -10 -91 146 -25 88
7861 88 6 -66 -2 101 -85 -173 -174 24 176 -63 7 29 -84 -95 21 -105 -115 62 -4 279 72 -4 77 -11 -109
7886 -109 35 141 -132 -40 128 20 108 -52 -41 -125 -11 41 -80 51 119 43 -45 113 135 -79 179 71 16
7909 16 150 -169 -139 21 -30 -5 -148 93 -49 -135 169 -22 36 -159 -110 -35 104 -45 19 300 103 247 -58
7932 -58 -243 -38 -65 60 -199 61 249 204 126 129 201 63 241 227 102 -123 83 -232 -44 -110 -134 55 -109
7955 -109 -215 -28 104 43 73 -100 -112 257 -47 136 -66 313 15 250 -166 -21 -43 -250 11 -96 37
7976 37 190 -144 -188 -67 -163 -99 38 -14 -20 68 -343 115 -25 39 -118 254 -198 126 92 144 -177 -41 -39 -165
8000 -165 -32 -188 -34 18 -258 -56 -173 -87 -116 227 148 172 231 -8 15 -127 25 43 4 -185 286 109 -52
8023 -52 70 43 22 241 -66 219 161 61 234 5 -51 -47 177 101 -11 8 28 -94 67 70 223 -4 -123 190
8047 190 44 -23 21 -69 -233 -146 -20 113 -140 -218 -63 120 -53 191 -76 -279 99 42 96 -139 -7 -86 61
8070 61 33 -111 102 -110 -78 -45 121 167 -49 66 -57 -20 -16 -113 84 -40 -88 -79 139 87 -128 141 26 238
8094 238 195 92 -99 -40 -170 20 -104 -67 66 -61 88 -389 -117 31 77 173 -13 84 136 -211 47 109 150
8117 150 -123 1 -18 8 -10 200 128 -86 58 202 86 203 -50 50 41 -43 109 -82 -49 104 -25 1 67
8140 67 -4 -213 -105 -5 63 -64 -214 -82 -173 50 -65 250 0 8 76 62 -144 -157 -157 109 -207 -59 256 8
8164 8 -60 44 -257 -8 71 134 9 9 80 -23 29 -137 16 -28 157 -38 -41 -97 29 81 -119 259 164 176 123 36
8190 36 133
8191A33
##END NTUPLES=NMR FID
##END=
