##TITLE=1H_AP-17HK2_HCl
 D2O
 8 sc, 
 2.11.2023
##JCAMPDX= 6.0         $$ Bruker NMR JCAMP-DX V2.0
##DATA TYPE= NMR FID
##DATA CLASS= NTUPLES
##ORIGIN= UXNMR, Bruker Analytische Messtechnik GmbH
##OWNER= root
$$ XWIN-NMR		Version 3.5
$$ Thu Nov  2 14:16:51 2023 Russian Standard Time (UT+4h)  she@DPX200
##.OBSERVE FREQUENCY= 200.13135
##.OBSERVE NUCLEUS= ^1H
##.DELAY= (6, 6)
##.ACQUISITION MODE= SIMULTANEOUS
##.ACQUISITION SCHEME= undefined
##.AVERAGES= 8
##.DIGITISER RES= 18
##SPECTROMETER/DATA SYSTEM= spect
##.PULSE SEQUENCE= zg30
##.SOLVENT NAME= CDCl3
##.SHIFT REFERENCE= (INTERNAL, CDCl3, 0, 15.7039)
##AUDIT TRAIL= $$ (NUMBER, WHEN, WHO, WHERE, WHAT)
$$ ##TITLE= Audit trail, XWIN-NMR		Version 3.5
$$ ##JCAMPDX= 5.01
$$ ##ORIGIN= Bruker BioSpin GmbH
$$ ##OWNER= she
$$ F:/spectra/data/she/nmr/H-F/1/audita.txt
$$ ##AUDIT TRAIL=  $$ (NUMBER, WHEN, WHO, WHERE, WHAT)
(   1,<2023-11-02 14:15:53.95 +0400>,<she>,<DPX200>,
      <created by zg, POWCHK disabled, PULCHK disabled
       configuration hash MD5:
       00 E9 B6 7A A2 85 ED C7 34 08 36 98 17 FE 4E 26
       data hash MD5: 16K
       A8 B4 E2 9A F6 01 AC BA 73 28 5C 47 70 71 96 9A>)
$$ ##END=
$$ 
$$ hash MD5
$$ 4D 98 D9 D6 51 50 AF 6D 4C 3E 60 C0 10 89 1F 61
##$RELAX= 
##$RELAX= 
##$RELAX= 
##$RELAX= 
##$RELAX= 
##$RELAX= 
$$ Bruker specific parameters
$$ --------------------------
##$DU= <F:/spectra>
##$EXPNO= 1
##$NAME= <H-F>
##$PROCNO= 1
##$TYPE= <nmr>
##$USER= <she>
##$AMP= (0..31)
100 100 100 100 100 100 100 100 100 100 100 100 100 100 100 100 100 100 
100 100 100 100 100 100 100 100 100 100 100 100 100 100 
##$AQSEQ= 0
##$AQ_mod= 1
##$AUNM= <au_zg>
##$AUTOPOS= <>
##$BF1= 200.13
##$BF2= 200.13
##$BF3= 200.13
##$BF4= 200.13
##$BF5= 200.13
##$BF6= 200.13
##$BF7= 200.13
##$BF8= 200.13
##$BYTORDA= 1
##$CFDGTYP= 0
##$CFRGTYP= 5
##$CHEMSTR= <none>
##$CNST= (0..31)
1 1 145 1 1 1 1 1 1 1 1 1 1 1 1 1 1 1 1 1 1 1 1 1 1 1 1 1 1 1 1 1 
##$CPDPRG= <>
##$CPDPRG1= <>
##$CPDPRG2= <>
##$CPDPRG3= <>
##$CPDPRG4= <mlev>
##$CPDPRG5= <mlev>
##$CPDPRG6= <mlev>
##$CPDPRG7= <mlev>
##$CPDPRG8= <mlev>
##$CPDPRGB= <>
##$CPDPRGT= <>
##$D= (0..31)
0 1.2 0 0 0 0 0 0 0 0.06 0 0.03 0 0 0 0 0.0002 0 0 0 0 0 0 0 0 0 0 0 0 
0 0 0 
##$DATE= 1698920153
##$DBL= (0..7)
120 120 120 120 120 120 120 120 
##$DBP= (0..7)
150 150 150 150 150 150 150 150 
##$DBP07= 0
##$DBPNAM0= <>
##$DBPNAM1= <>
##$DBPNAM2= <>
##$DBPNAM3= <>
##$DBPNAM4= <>
##$DBPNAM5= <>
##$DBPNAM6= <>
##$DBPNAM7= <>
##$DBPOAL= (0..7)
0.5 0.5 0.5 0.5 0.5 0.5 0.5 0.5 
##$DBPOFFS= (0..7)
0 0 0 0 0 0 0 0 
##$DE= 6
##$DECBNUC= <off>
##$DECIM= 32
##$DECNUC= <off>
##$DECSTAT= 4
##$DIGMOD= 1
##$DIGTYP= 9
##$DL= (0..7)
0 120 120 120 120 120 120 120 
##$DP= (0..7)
150 150 150 150 150 150 150 150 
##$DP07= 0
##$DPNAME0= <>
##$DPNAME1= <>
##$DPNAME2= <>
##$DPNAME3= <>
##$DPNAME4= <>
##$DPNAME5= <>
##$DPNAME6= <>
##$DPNAME7= <>
##$DPOAL= (0..7)
0.5 0.5 0.5 0.5 0.5 0.5 0.5 0.5 
##$DPOFFS= (0..7)
0 0 0 0 0 0 0 0 
##$DQDMODE= 0
##$DR= 18
##$DS= 0
##$DSLIST= <SSSSSSSSSSSSSSS>
$$ [...]
##$SUBNAM2= <"">
##$SUBNAM3= <"">
##$SUBNAM4= <"">
##$SUBNAM5= <"">
##$SUBNAM6= <"">
##$SUBNAM7= <"">
##$SUBNAM8= <"">
##$SUBNAM9= <"">
##$SW= 18.05172834244
##$SWIBOX= (0..15)
0 0 2 0 0 0 0 0 0 0 0 0 0 0 0 0 
##$SW_h= 3612.71676300578
##$TD= 16384
##$TD0= 1
##$TE= 0
##$TE2= 300
##$TE3= 300
##$TEG= 300
##$TL= (0..7)
0 120 120 120 120 120 120 120 
##$TP= (0..7)
150 150 150 150 150 150 150 150 
##$TP07= 0
##$TPNAME0= <>
##$TPNAME1= <>
##$TPNAME2= <>
##$TPNAME3= <>
##$TPNAME4= <>
##$TPNAME5= <>
##$TPNAME6= <>
##$TPNAME7= <>
##$TPOAL= (0..7)
0.5 0.5 0.5 0.5 0.5 0.5 0.5 0.5 
##$TPOFFS= (0..7)
0 0 0 0 0 0 0 0 
##$TUNHIN= 0
##$TUNHOUT= 0
##$TUNXOUT= 0
##$USERA1= <user>
##$USERA2= <user>
##$USERA3= <user>
##$USERA4= <user>
##$USERA5= <user>
##$V9= 5
##$VALIST= <valist>
##$VCLIST= <CCCCCCCCCCCCCCC>
##$VD= 0
##$VDLIST= <DDDDDDDDDDDDDDD>
##$VPLIST= <PPPPPPPPPPPPPPP>
##$VTLIST= <TTTTTTTTTTTTTTT>
##$WBST= 1024
##$WBSW= 4
##$XGAIN= (0..3)
0 0 0 0 
##$XL= 0
##$YL= 0
##$YMAX_a= 501341
##$YMIN_a= -480029
##$ZGOPTNS= <>
##$ZL1= 120
##$ZL2= 120
##$ZL3= 120
##$ZL4= 120
##$ABSF1= 10
##$ABSF2= 0
##$ABSG= 5
##$ABSL= 3
##$ALPHA= 0
##$AQORDER= 0
##$ASSFAC= 0
##$ASSFACI= 0
##$ASSFACX= 0
##$ASSWID= 0
##$AUNMP= <proc_1d>
##$AZFE= 0.1
##$AZFW= 0.1
##$BCFW= 1
##$BC_mod= 2
##$BYTORDP= 1
##$COROFFS= 0
##$CY= 11.3945322036743
##$DATMOD= 1
##$DC= 2
##$DFILT= <>
##$DTYPP= 0
##$F1P= 15.7292609196834
##$F2P= 12.9074282941183
##$FCOR= 0.5
##$FTSIZE= 0
##$FT_mod= 4
##$GAMMA= 1
##$GB= 0.15
##$INTBC= 1
##$INTSCL= 1
##$ISEN= 128
##$LB= 0.24
##$LEV0= 0
##$LPBIN= 0
##$MAXI= 10000
##$MC2= 0
##$MEAN= 0
##$ME_mod= 0
##$MI= 1.114404
##$NCOEF= 0
##$NC_proc= 0
##$NLEV= 6
##$NOISF1= 3.799351
##$NOISF2= 2.8
##$NSP= 1
##$NTH_PI= 0
##$NZP= 0
##$OFFSET= 15.70392
##$PC= 1
##$PHC0= -23877.7
##$PHC1= 5.452701
##$PH_mod= 1
##$PKNL= yes
##$PPARMOD= 0
##$PSCAL= 0
##$PSIGN= 0
##$REVERSE= no
##$SF= 200.130013532006
##$SI= 16384
##$SIGF1= 3
##$SIGF2= 2
##$SINO= 400
##$SIOLD= 16384
##$SREGLST= <1H.CDCl3>
##$SSB= 0
##$STSI= 0
##$STSR= 0
##$SW_p= 3612.71676300578
##$SYMM= 0
##$S_DEV= 0
##$TDeff= 0
##$TDoff= 0
##$TI= <>
##$TILT= no
##$TM1= 0
##$TM2= 0
##$TOPLEV= 0
##$USERP1= <user>
##$USERP2= <user>
##$USERP3= <user>
##$USERP4= <user>
##$USERP5= <user>
##$WDW= 1
##$XDIM= 8192
##$YMAX_p= 0
##$YMIN_p= 0
$$ End of Bruker specific parameters
$$ ---------------------------------
##NTUPLES= NMR FID
##VAR_NAME=  TIME,          FID/REAL,        FID/IMAG
##SYMBOL=    X,             R,               I
##VAR_TYPE=  INDEPENDENT,   DEPENDENT,       DEPENDENT
##VAR_FORM=  AFFN,          ASDF,            ASDF
##VAR_DIM=   8192,          8192,            8192
##UNITS=     SECONDS,       ARBITRARY UNITS, ARBITRARY UNITS
##FACTOR=    0.0002768,     1,               1
##FIRST=     0,             0,               0
##LAST=      2.2672688,     0,               0
##MIN=       0,             -480029,         0
##MAX=       2.2672688,     501341,          0
$$ Real data points
##PAGE= N=1
##DATA TABLE= (X++(R..R)), XYDATA
0@%%%%%%%%%%%qQqJ6j6J6j6K4l2L2m0N0n8P2q2R5j11J27j48J68j90K17k46K79
35A49l15L53l94M37m90N47o08O76p45Q27r15J007j111J222j346J484j637J806
53I47j991K200k438K706l014L372l794M304m928N716o747Q160j0226J3542j9751
68a1942L5364j51200l52251K8845J61810K59686L05313K25716p4064k74762k85709
79a33194k10164j19997J01570L08236L15986J51277k626j58542l04181l06654
89c58289j05652J16820K44340K86612K29525L0061j92893k95373k54269j24305
99d23423O2139K27305K87200K11109M4834j39593k54686k55960j53416J8559J97349
110a78583K83840K24594P0571r9532k36032k79813j77665K1292J85967K49531
$$ plain form
0 0 0 0 0 0 0 0 0 0 0 0 0 -8 0 -8 8 -8 8 -8 16 -16 16 -24 26 -32 40 -42 53 -58 69 -79 89 -101 116 -130 149
35 149 -166 187 -207 230 -260 287 -321 355 -390 437 -478 529 -582 640 -706 778 -859 947
53 947 -1044 1156 -1282 1424 -1590 1782 -2012 2292 -2636 3080 -3667 4493 -5733 7809 -11942
68 -11942 23422 -127778 -480029 -451184 -289374 -29688 275625 501341 427277 152515 -133194
79 -133194 -343358 -463355 -361785 -53549 262437 413714 411088 252546 -51635 -358289
89 -358289 -463941 -347121 -102781 183831 413356 443417 250524 -44849 -299118 -423423
99 -423423 -361284 -133979 153221 364330 409164 269571 14885 -241075 -394491 -375932 -178583
110 -178583 105257 329851 400422 300890 64858 -214955 -392620 -371328 -185361 64170
120F4170K24436J06919q6933k37118k47082j55018k6480J27938K50450K38404
130B59686J01762n5005j76489k44765k06782m9196J31638K28795K24589J36757
140C50990k0049j83092k50565j87676n2793R0996K04141K32518J43165j3196j47670
151A66769k14487j97627r2116O4730J91464K23779J56692K4238j20967k17703
161a5228k11836j02163N1210J72598K17126J68462L9039j10973k00685j97135
171a89585j11277K0160J47876K09141J71354N7711p7326j78585k04144j35549
181b90224J21J33351K01935J80049P9081o1882j74521k01623j36256j4428J12995
192a71402J90736J79194Q6805m1176j49148j91905j47566l7266R0409J76292J83476
$$ plain form
120 64170 288606 395525 308592 71474 -175608 -330626 -357106 -229168 21282 259686
130 259686 361448 306443 129954 -114811 -321593 -370789 -239151 -10356 214233 350990
140 350990 330941 147849 -102716 -290392 -343185 -252189 -48048 184470 327635 314439 166769
151 166769 -47718 -245345 -337461 -272731 -81267 142512 299204 323442 202475 -15228
161 -15228 -227064 -329227 -278017 -105419 111707 280169 319208 208235 7550 -189585
171 -189585 -300862 -280702 -132826 76315 247669 305380 228054 49469 -154675 -290224
181 -290224 -290103 -156752 45183 225232 304313 242431 67910 -133713 -269969 -284397 -171402
192 -171402 19334 198528 285333 244157 95009 -96896 -244462 -281728 -191319 -15027 168449
203A68449J07127j8655j36237j91046j57321n3038P5072J69298J83909J13537
213B61095n432j19382j80671j59699o4267N6264J49663J77511J26720J6206j01451
224A56557j70909j63499q4268L4833J39568J79756J35478L0669q5107j63815j68177
235a58914r3910K3457J25165J69401J40556M7521o9046j51072j63423j04510n45
246b35320J07144J66670J47590O1468m9476j38600j67497j18047j2265R6094J57933
257A5694J50421P5987l5876j30280j61448j20727k9032P7258J49920J52598Q4975
268B29490j8143j12036j58030j32084m4122O3694J40318J52924R8754j966j03180
279A15619j54689j34579n5479M7607J30328J53249J05427J0289q6953j45621j38922
$$ plain form
203 168449 275576 256921 120684 -70362 -227683 -280721 -205649 -36351 147558 261095
213 261095 255663 136281 -44390 -204089 -268356 -212092 -62429 115082 241802 258008 156557
224 156557 -14352 -177851 -262119 -227286 -87718 92038 227516 258185 173078 9263 -158914
235 -158914 -252824 -229367 -104202 65199 205755 253276 184230 33158 -130265 -234775 -235320
246 -235320 -128176 38494 186084 247552 198076 59476 -108021 -226068 -238333 -142239 15694
257 15694 166115 242102 206226 75946 -85502 -206229 -235261 -158003 -8083 144515 229490
268 229490 211347 99311 -58719 -190803 -234925 -171231 -30913 122011 220765 218799 115619
279 115619 -39070 -173649 -229128 -181521 -51193 102056 207483 217772 130819 -14802 -153724
290a53724o9074L2494J18880J50029J13984K6782p2855j39673j41925q0058J8041
301a97099J07385J47174J20903L9160n9980j30725j41664q9182L281R4066J42254
312C5573J25019N1756m3868j19856j42143r9043j0916Q1066J35775J29279O4764
323B07406l0093j10398j39847j06131k4758O7576J29505J31321P4290j5967r8285
334H4619j36385j12383l7286N3598J20221J32607Q4265j570q6778j31898j17364
345a48354m9909M0180J11855J31690R2911J1675p5017j26863j20338o0050K6919
356a65301J01762J30336R9235K3397o2406j19157j22662p0565J4724R1628J26493
367D7484J04637L6246n0063j13052j23506p7599J135Q0316J23760J09910M5106
$$ plain form
290 -153724 -222798 -190304 -71424 78605 192589 219371 146516 6843 -135082 -215140 -197099
301 -197099 -89714 57460 178363 217523 157543 26818 -114846 -204028 -200747 -106681 35573
312 35573 160592 212348 168480 48624 -93519 -192562 -203478 -122412 13363 142642 207406
323 207406 177313 66915 -72932 -179063 -203821 -136245 -6740 124581 198871 182904 84619
334 84619 -51766 -164149 -201435 -147837 -27616 104991 189256 187686 100908 -30990 -148354
345 -148354 -198263 -158083 -46228 85462 178373 190048 115031 -11832 -132170 -192220 -165301
356 -165301 -63539 66797 166032 189429 127023 7866 -114796 -185361 -170637 -79009 47484
367 47484 152121 188367 138304 25252 -98254 -175853 -174718 -94402 29358 139268 184374
378A84374l8243j03145j22628q7147j0277P1163J17113J11007N7208k4659r6348
389E8418j21444r0871k2623N6597J12701J15997O4298j4462q4454j18453r9653
400a43949l2559M8780J04388J14151P3899o65p6877j15564j00266m3127L3363
411a38426R7665J16317P9899R187o3379j10071j07319n2602K4726Q8263J13054
422E7314Q8283K1228n5979j04612j05556o1710J0366Q0503J12032R0897L0819
433A63585m1101r7546j10421o9614K188O8846J07242R8413M2249l4709r1608j06669
445f9145p6924j0758O2450J04819R7043M9241k0178q3229j08524q1035j8746M9392
457a05594R7344J03493N9057j3296p5672j03483q8687l1183M4372R4898R9455
$$ plain form
378 184374 146131 42986 -79642 -166789 -177066 -105903 11210 122217 179425 154766 58418
389 58418 -63026 -153897 -176520 -119923 -7222 108775 173073 158611 74157 -44296 -143949
400 -143949 -176508 -127728 -23340 90811 164710 164045 87168 -28396 -128662 -171789 -138426
411 -138426 -40761 75556 155455 164642 101263 -8808 -116127 -168729 -144003 -55740 57314
422 57314 145597 166825 110846 6234 -99322 -161032 -150666 -70163 41869 132766 163585
433 163585 122484 24938 -85483 -155097 -152909 -84063 23179 121592 163841 129132 37524 -69145
445 -69145 -146069 -156827 -94377 10442 107485 156726 136548 53319 -55205 -136240 -154986 -105594
457 -105594 -8250 95243 154300 141004 65332 -38151 -126838 -158021 -113649 -18751 80704
468H0704O4299J139o8498j04593q8084l5783K8862Q5080J04459P1775O033n7044
480H8349r5676r5074m9687K3028Q2004R9275P6831K0509m9381r7564r4974n0583
492a42943J0774O9729J01403Q2389K3963l9772q5053r6077o3673J946O4571R5588
504B2845Q5468L7634k9150q3663r8013o7096p631N5483R3870Q9354M3018k1653
516A20466p5101r5299p2557j6805M6041Q7714R0392N1938j0682o6980r3486p9135
528a13494k7635L8436Q4066R1511N9470q93o2400r2976p9992l3155K8069P7992
540c1001R1947O2975O337n0942q6632q4478m2626J9128P1312Q9555O9640J9566
552A34781m3981q6418q6508m7836R414O4464R1920P3310K2045l6085p7585q6535
$$ plain form
468 80704 145003 146142 77644 -26949 -115033 -150816 -121954 -36874 67585 139360 145393 88349
480 88349 -7327 -102401 -152088 -129060 -47056 52219 129050 149559 100178 2614 -92360 -142943
492 -142943 -132169 -62440 38963 121352 145315 105543 20490 -75587 -139260 -137314 -72743 22845
504 22845 108313 145947 116797 33134 -64879 -131975 -139606 -84123 9747 99101 142119 120466
516 120466 45365 -49934 -122491 -139296 -93255 -5541 84851 136789 126107 59127 -34359 -113494
528 -113494 -141129 -102693 -18627 72884 132354 131461 69061 -23915 -103907 -137062 -108993 -31001
540 -31001 60946 123921 130258 79316 -7316 -91794 -134420 -115292 -43980 45575 115215 134781
552 134781 90800 4382 -82126 -129962 -120548 -56084 35836 109146 131191 95106 17521 -69014
564f9014n5104K251N7334Q4452P6242L3879k5734p3797q7122o0964q339M8769
576g7147Q5011Q1863L8791j9730o7938q6624o6357j3129M3647P8385P9614M5947
588A22333j0190o1069q2384o8743k4551L2174P4952Q2402N2981k28n3949q3626
600a9898p4783k9928K6773P0362Q2400N7734N429m8786p8004p3091l7673J6575
612a02890O4132Q0223O0532J6482l7066p5769p8316m3788P876N7015Q1525O8215
624I8171K1799l3617p1193p7611n0038K063N2959P7388O6556K8625k2146o5975
636B6981p7948n3032p106M1649P4674P3433L6814j7061o0188p7738o1004j3765
648a14291L9119P2747P2538M0293r092n5809p6005o0704j9419K9699O5776P3487
$$ plain form
564 -69014 -124118 -121867 -64533 19919 96161 130040 104306 30509 -56613 -117577 -125916 -77147
576 -77147 7864 89727 128518 108788 40850 -45774 -112131 -125260 -81613 -3228 76386 122333
588 122333 112143 51074 -31310 -100053 -124604 -92430 -17478 64924 117905 117677 63728 -19898
600 -19898 -94681 -124609 -97836 -27474 54926 112660 118089 69303 -8701 -81792 -119465 -102890
612 -102890 -38758 41465 101997 118479 81413 5644 -72672 -116460 -108584 -51569 29956 98171
624 98171 119970 86353 15160 -62451 -112489 -110426 -57467 19921 86477 115102 92956 26981
636 26981 -50967 -103999 -111105 -69456 5218 78651 115465 98404 38216 -39522 -100526 -114291
648 -114291 -75172 -2425 70113 110406 101314 45505 -30500 -91204 -110623 -80924 -15148 58339
660E8339M6642j040m7752p3223o6072k8639K2959O3160P5203N2538M929m3660
672F3384p1861o7587l2864J7337N9053P1891N3911J2553l5523o7462o8179l8047
684a03394P639N0793P2007O0180K0000k9229o4241p0555m5225J896M8739P0686
696A9296O1050K4627k2529o0541o9827m6435m727L9373O6637O3777L1004j4682
708H7023n3286o9172n4007j2761L4248O4544O6025L7924q376n1209o8933n5081
720h3061j7672K7670O1374O6202L9833k578m2403o5102n9242k4106K1039N5361
732b2685O5321M7301O728l9070o4821o0386l0125J4145N2590O7279M9323R613
744I5213l2906o0213o1617l4558Q815M7432O3390N1359J7800k5226n7148o2924
$$ plain form
660 58339 104981 103941 56189 -17034 -83106 -111745 -88786 -25626 49577 102115 107044 63384
672 63384 -8477 -76064 -108928 -91591 -32538 39353 93264 105817 70294 2832 -65347 -103394
684 -103394 -95755 -44962 27045 87225 107225 77996 13755 -56800 -102025 -100129 -51390 19296
696 19296 80346 104973 82444 21903 -47924 -94359 -99086 -59713 6924 70701 101705 87023
708 87023 33737 -35435 -89442 -102203 -67955 -3411 62614 100538 92162 40953 -27980 -83061
720 -83061 -100733 -73063 -11689 54513 94346 91768 49365 -15737 -74979 -99085 -78046 -22685
732 -22685 42636 89937 96665 57595 -7226 -67612 -97737 -83592 -31002 36277 85600 95213
744 95213 62307 2094 -59523 -94081 -85266 -37834 25556 76915 94715 69489 12341 -50583
756e0583l9831K069M1520O2437N6514K3435k1469n5194o1513m2744m950L7295
768e3014O1941N5799K5573j3684m7180o2513m7457r081L1012N5548N7800L4866
780H9610p206m6257o1257m8335j6917K4043N6268N9700L5537k796l8931n9057
792a5598n2311k0701K0039M9788N7930M1040M520l4080n6593n3982k6835J2920
804g3863M6582N8367M4373J0704k9472n5633n4541k9836O769M1762N8489M6379
816G0080J3500k3111m9263n6013l6160K439L7980N4380M8573K2027j7443m9393
828A7596n5954l7131m334L1119N4995N2396K3088j3502m2810n4483m3067q819
840h0906K8937N1030N0303K9361o159m0275n4856m3108j3925K1470M8292N3394
$$ plain form
756 -50583 -90414 -88345 -46825 15612 72126 95561 74092 18898 -42615 -85359 -90309 -53014
768 -53014 8927 64726 90299 76615 29435 -33078 -80535 -89616 -58604 -3056 54744 89610
780 89610 82404 36147 -25110 -73445 -90362 -66319 -10051 49649 85186 82390 43459 -15598
792 -15598 -67909 -88610 -68571 -18783 39147 80187 84707 50627 -5966 -59948 -86783 -73863
804 -73863 -27281 31086 75459 86163 56691 1058 -53483 -83319 -76550 -34788 23701 70080
816 70080 83580 60469 11206 -44807 -80967 -78528 -40548 13832 62405 84432 66989 17596
828 17596 -38358 -75489 -79823 -48704 6291 58687 81775 68273 25463 -29020 -72087 -80906
840 -80906 -51969 -939 49364 78725 72566 32291 -22565 -65673 -79598 -58128 -9836 43558
852D3558L3097k977l5291n2208m7041j8944J8270M5698N2231L5394L554l0866
864D4475n1520m7634k2534J2183M1698N1883L9493P964k6302m8700m8958k7173
876g5125O792L8195N1844M1186J2733k1288m5913m9693l0590K004L3580M9830
888A3555M3724J7484j6508m2715m9608l4092l488K9623M8078M5565K1694j1318
900F1994l9745m9546l6980p626K4795M6194M6569K5390o510l6122m8241l9673
912e9501j2356K0483M3187M6896K9400j952l1515m7626m1225j6533J5639M0618
924a4485M7295L1976K687k7931m5908m2689k0183J1090L7333M6921L4962O919
936F7987k3997m3389m3538k4520O606L4812M5813L6606J1362j9264m1696m4648
$$ plain form
852 43558 76655 73678 38387 -13821 -60862 -79806 -61536 -15838 36393 71787 75341 44475
864 44475 -7045 -54679 -77213 -65030 -23332 28551 68044 76008 49706 1006 -47952 -75125
876 -75125 -68333 -30138 21706 62892 75625 54337 8424 -41269 -71859 -69855 -36275 13555
888 13555 57279 74763 58255 15540 -34068 -68160 -71648 -42025 6053 51618 73312 61994
900 61994 22249 -27297 -64277 -71903 -47108 -914 45655 71045 64535 28413 -19828 -59501
912 -59501 -71857 -51374 -8187 38709 68109 66157 34642 -12984 -54209 -70742 -55103 -14485
924 -14485 32810 64786 67473 39542 -6366 -49055 -69238 -58148 -20815 26106 61068 67987
936 67987 43990 601 -42937 -67457 -60851 -26039 19774 56380 67742 48478 6782 -37866
948c7866k6643J979L0316M4792L9616J5049j5481l8584m4254l0652k241K7272
960c6697M3507L9774J8632r815l6056m4510l2753o139K2373M1146M2180K2628
972F4270p263l2444m2893l5169j1129J9383L9398M1139K5518j481k8545m3538
984a2754l6442j3590J3531L6335M2747K8998J357k5366m0375l8562j8439J0505
996e2055L4189M1602L0634O534k1091l9803l9167k1136O027K9995M1648L3812
1008E1189R443j7544l6507l9942k5074K342K7722L9677L5141J4423j4277l5011
1020A1582m0082k6421k456K4330L9143L6245J6555r806l1747m0336k9216n276
1032e7485K0781L6763L7352K0590o683k9899l8427l1212r901J7342L6244L7194
$$ plain form
948 -37866 -64509 -62530 -32214 12578 52194 67243 51762 13178 -31076 -61728 -63969 -36697
960 -36697 6810 46584 65216 55401 19345 -25165 -57918 -64057 -41684 -538 41642 64270
972 64270 57007 24563 -18330 -53499 -64628 -45245 -5847 35292 60810 59329 30784 -12754
984 -12754 -49196 -62786 -49255 -12920 29827 58825 60182 34816 -5559 -44121 -62560 -52055
996 -52055 -17866 23736 54370 60904 39813 10 -39157 -60293 -54266 -24271 17377 51189
1008 51189 60632 43088 6581 -33361 -58435 -56093 -28371 11306 46447 60870 46593 11582
1020 11582 -28500 -54921 -57377 -33047 6096 42341 58896 49090 17343 -22993 -52209 -57485
1032 -57485 -36704 59 37411 58001 51318 21419 -17008 -48220 -58121 -40779 -4535 32659
1044C2659K2291j970k6182l8932l3170j1419J3370L2690L7885K5755J454k3711
1056C0720l7049l3836j5921R362L0847L8329K7741M703k0227l5381l5370j8767
1068e4849O252K8298L7499K9032Q118j5786l3545l6545k0946K752K4620L5857
1080A0757L2026J2366j3784l1907l5475k4254j793K2741L6175L2064J4453r445
1092D3924k8966l6239k6569l583J8980L2796L3380J8607n905k6981l5297k8209
1104d4062q693J5633L2750L4489K0486k554k4533l4947k9589j0897J2578L0919
1116h420L3673K2446P08k0717l3480l1246j3671R230K7442L4296K5072M843j8847
1129C1329l2932l1278j6510M909K6130L5037K6190N989j5069k9903l2856j9315
$$ plain form
1044 32659 54950 52980 26798 -12134 -45304 -56723 -43353 -10663 27222 52977 54431 30720
1056 30720 -6329 -40165 -56086 -46724 -15877 22452 50193 54896 34669 -712 -36082 -54849
1068 -54849 -48597 -20299 17200 46232 54350 38564 5019 -31526 -52472 -49720 -25100 10757
1080 10757 42783 55149 41365 9458 -26017 -50271 -52064 -29323 6852 38916 53369 43924
1092 43924 14958 -21281 -47850 -51433 -32453 343 33723 52330 46425 19444 -15853 -44062
1104 -44062 -52755 -37122 -4372 30117 50603 48049 23516 -11431 -41020 -51917 -39339 -8420
1116 -8420 25253 47699 48407 27690 -5790 -37036 -50707 -41477 -14035 20261 45333 50176 31329
1129 31329 -1603 -32881 -49391 -44482 -18352 16685 42875 48864 33795 3892 -28964 -48279
1141d8279L557K3003L2264K7867J0903j1542k9704l2442k1147j238K0105L2798
1153F145K9894J2668r105k7092l2827k3413l435J8028L0887K9818J5442n871k3989
1166A7150l2404k4958o861J4513K8830L0636J9000k215k2256l2383k6327r481
1178d6756J1109K7761L1969J9958m18j9264l0032k8127j2934R570K6033K9839
1190A8708K1649M808j6640l0255k8603j3878M705K2737L1684K4534N737j4823
1202C0363k7523k8908j7985K810K2196K9991K4170R160j0966k6578k9312j8439
1214d1021k28J7701K8810K7548J1261q575k4164k9776k1130l273J6830K8358K6900
1227B9241J3904o263k2635k8947k2003n481J3520K6561K7078J6042k338j9963
$$ plain form
1141 -48279 -44722 -21719 10545 38412 49315 37773 8069 -24373 -45520 -46758 -26653 6145
1153 6145 36039 48707 39602 12510 -20317 -43730 -47165 -29137 1750 31568 47010 41139 17150
1166 17150 -15254 -40212 -47073 -32560 -3730 26906 45906 43691 21435 -10948 -37275 -46756
1178 -46756 -35647 -7886 24083 44041 43623 24359 -5673 -33800 -46734 -37164 -11131 18708
1190 18708 40357 45165 28525 -1730 -30333 -44211 -39506 -16769 14915 39449 45186 30363
1202 30363 2840 -26068 -44053 -41243 -19047 10944 35114 44274 33308 6730 -22582 -41021
1214 -41021 -41249 -23548 5262 32810 44071 35496 11332 -18444 -39574 -42847 -26017 2341 29241
1227 29241 43145 36882 14247 -14700 -36703 -42184 -28664 -2103 24975 41017 38679 18716
1239A8716k9000k3838q010J0513K4816K8582J8695m56j8686k7622k4537j1416
1251d2243Q489K4122K7974J9024K618j5376k6632k5830j2895N720K0886K7221
1263A3078K2264N745j3496k5839k5916j5356J973K0033K8165K2262P241j0476
1275B9678k3746k6872j7084P59J7342K5633K3282J0856p714k2676k6482j8117
1287c5141l161J4440K5529K5211J2297n633k0599k6719k0323m706J3250K3998
1299a557K4743J4454k862j8854k5687k1074o936R349K2411K5699J6798o73j6626
1312A9185k4790k2750r727P904K1613K5521J7350K112j4344k4836k3130j1041
1324c6933N582J9432K4655J9356M677j2497k2937k3346j3846K407J7677K5372
$$ plain form
1239 18716 -10284 -34122 -42132 -31619 -6803 21779 40474 40018 21332 -6290 -30827 -42243
1251 -42243 -33754 -9632 18342 37366 39984 24608 -2024 -27854 -40749 -35029 -14143 13078
1263 13078 35342 41087 27591 1752 -24164 -39520 -37547 -17514 10651 32913 40154 29678
1275 29678 5932 -20940 -38024 -37265 -19923 5710 28992 39848 32134 9458 -17024 -35141
1287 -35141 -38302 -23862 1667 26878 39175 33542 12943 -13776 -34099 -38805 -25555 -1557
1299 -1557 23186 37640 34778 15924 -9763 -30837 -37773 -28424 -6013 19686 36484 35811 19185
1312 19185 -5605 -28355 -38082 -30178 -8565 16956 34306 36418 22074 -2762 -25892 -36933
1324 -36933 -31351 -11919 12736 32092 36769 24272 1335 -22011 -35857 -33450 -15773 9599
1336I599K0260O870r886k1866k4337j5426Q48J5862K4331K1046Q720p527k0445
1349H049k3706j6420k554J3767K3078K1901J1077n039j8692k4151j8059m182J1481
1362b3450K2532K2679J2549l068j6935k3361j9302o247R451K0527K2675J4441
1374C2491J33j5253k2996k0140q169O371J9505K3362J6111J574j3105k1969k1430
1387b3515j0470N328J8130K2501J7259L940j1267k1143k1118j1970K348J6068
1399a3909K2667J8468N729q758k0140k1476j3971M74J4592K1794J9274Q111o906
1412B5949j8945k1556j5034j876J2899K0889K0115R595m793j6999k1523j6513
1424b7792l880J0768K0165K0461J1679k804j5786k1384j7515n496Q653J9371K0642
$$ plain form
1336 9599 29859 36729 26843 4977 -19360 -34786 -33938 -18076 6255 27301 36021 28494 8049
1349 8049 -15657 -32077 -34631 -20864 2214 24115 35192 30153 11461 -12690 -30749 -34931 -23450
1362 -23450 -918 21761 34310 31242 14307 -9054 -28356 -34603 -25152 -4625 18050 32491
1374 32491 32624 17371 -5625 -25765 -33934 -27563 -8058 15304 31415 32989 19884 -2085 -23515
1387 -23515 -33985 -28657 -10527 11974 29233 33173 21906 763 -20355 -32325 -29977 -13909
1399 -13909 8758 27226 32955 24197 4057 -17419 -31390 -30916 -16324 5470 24744 32855 25949
1412 25949 7004 -14552 -29586 -31462 -18563 2326 22441 32036 27243 10244 -11279 -27792
1424 -27792 -31672 -20904 -739 19722 31401 28597 12811 -8573 -26088 -31584 -22931 -3560 17082
1437A7082J2842o89j3844k0664j8434p540O808J7824K0589J4199J638j1991k0013
1450b193j9037r373M763J6408K0493J5738L456j0680j8830j9405j1005K669J4780
1463a2216K0307J6852N057q407j7837j9795j2547O57J3365J9414J7701P340o508
1476B3383j6975j9674j3735j445J1489J9125J8303Q741m388j5444j9817j5094
1488b5531l112R835J8070J8457J0613k376j4154j9412j5895n154P620J7319J9465
1501A5745J1420o68j2440j9000j6793o607O330J6129J8529J3357R40j0977j8109
1514b144j7241q415M072J5186J9042J3770L008r034j7353j7951j0009K807J3152
1527a1110J8580J5058N245q071j6294j7747j1569L15J2223J7995J5455O936n764
$$ plain form
1437 17082 29924 29235 15391 -5273 -23707 -31247 -24439 -6615 13974 28173 29811 17820 -2193
1450 -2193 -21230 -30603 -25840 -9432 11061 26799 30255 19575 745 -18660 -29665 -26996 -12216
1463 -12216 8091 24943 30000 21593 3756 -16039 -28586 -27929 -14564 4850 22551 29891 23383
1476 23383 6408 -13266 -27001 -28446 -16957 2168 20471 29212 24824 9380 -10437 -25531
1488 -25531 -28643 -18808 -738 17719 28332 25956 11802 -7610 -23505 -28659 -21039 -3720 15745
1501 15745 27165 26497 14057 -4943 -21736 -28343 -22013 -5884 12645 26002 26942 15965 -2144
1514 -2144 -19385 -27800 -23728 -8542 10500 24270 27278 18244 891 -17060 -27069 -24262 -11110
1527 -11110 7470 22528 27773 19702 3408 -14339 -25908 -25593 -13370 4625 20080 27016 21252
1540B1252j5561j8010j2618r48J0345J7280J6997P851m269j4243j7409j3698l474
1553b6505R612J6695J6436R296j909j3043j8256j3898m047O907J5579J7224J1024
1566B5115j113j1486j6696j5483o283N654J5110J6684J1786J551r894j7195j5315
1579a7565p498L786J3243J7266J2884K618q207j5586j6069r708K485J2425J6691
1592F765J3541M697o839j5419j6036j0058K09J0964J6436J4523N677n003j3863
1605E594j6598j1433j539J0129J5591J4827P603l332j3356j6364j1983k821P641
1618a6041J5398J5664Q465k215j1544j6209j3107m315O935J4021J5560R997m35
1631B2174j0795j5562j3571n641M669J3625J5838J0641J503r168j5535j4540o730
$$ plain form
1540 21252 5691 -12319 -24937 -25885 -15540 1740 18737 26588 22319 8076 -9333 -23031 -26505
1553 -26505 -16893 -198 16238 25534 23625 10582 -7674 -21572 -25619 -18712 -3133 14091 25115
1566 25115 24002 12516 -4180 -19663 -25946 -20292 -5182 11502 23288 24839 14945 -2250 -17565
1579 -17565 -25063 -21277 -8034 9232 22116 24734 16527 941 -15128 -24836 -22351 -9926 6765
1592 6765 20306 25003 18164 2745 -13291 -23349 -23140 -12176 4260 18783 24460 19457 5594
1605 5594 -11004 -22437 -23976 -13847 1744 16571 24174 20842 7486 -8878 -20861 -23682 -16041
1618 -16041 -643 15021 23486 21271 9727 -6482 -19589 -23904 -16969 -2948 12612 22609 22174
1631 22174 11379 -4183 -17754 -23395 -18726 -5101 10737 21378 22881 13713 -1822 -16362 -23092
1644b3092L545J2572J5503J1405K640p776j4672j4250p992J600J1406J5426J2487
1657A8802L906o489j3510j4712r758P10J0216J4895J3172N446n235j2789j4913
1670a0259j0328r38Q899J4505J3430O746l689j1451j4983j1165k328P290J3700
1683e71J4344P899j953j1189j4151j2250l801O046J3289J3963Q956n78r381j4269
1697c646j2697n061M495J2434J4143R823J383q645j4010j2837o420L215J1416
1710f407J4369J0699K126p152j3338j3217p415J709J0382J4049J1118L915n547
1723A5291j2905j3827q065J78R070J3756J2195M956m763j1416j3710r626r11Q437
1737a1340J2947J2160O241k872j1098j3160j0439k260O675J2774J2798O961j505
$$ plain form
1644 -23092 -19547 -6975 8528 19933 22573 14797 125 -14125 -22117 -20517 -9111 6315 18802
1657 18802 22708 16219 2709 -12003 -21761 -21051 -10835 4060 17232 22678 17443 4654 -10259
1670 -10259 -20587 -21525 -12626 1879 15309 22055 18366 6915 -8068 -19233 -21561 -14271 -571
1683 -571 13773 21672 19719 8530 -5621 -17871 -21672 -15626 -2337 11626 20582 20004 10623 -3646
1697 -3646 -16343 -21404 -16909 -4475 9668 19491 20874 12229 -1781 -14618 -21038 -17823 -6407
1710 -6407 7962 18661 20787 13635 297 -12920 -20335 -18626 -8244 5805 16923 20838 15291
1723 15291 2386 -11441 -19506 -19328 -10258 3498 15693 20649 15886 4470 -9240 -18866 -19777 -11340
1737 -11340 1607 13767 20008 17136 6038 -7122 -17561 -19821 -13146 -372 12426 19387 17882
1750A7882r852j3246j1342l388N575J2011J2853Q308k69q938j3295j0922m989
1763a9612M164J1428J2960Q844O26p233j2271j2193n947L319J0014J2573J0166
1776A6838K496p112j2177j1877o509J290R623J2753J0473K857n080j1438j2116
1789i979q019N83Q410J2254J1102M292l999j0658j2363q662o59P182J1928J1620
1803A3032N326k932j0056j2011q925k162N956J1457J1680N999j446q597j2174
1816d853r800k971M783J0723J1694P288j62q041j1713j0448m401M079J0052J1652
1830G882Q278O38o801j1628j0539m939K432R079J2063Q531K007n398j1194j1188
1844a0777o274J551Q462J1418R611L140m762j0497j1179o912M53P473J1306J0035
$$ plain form
1750 17882 8030 -5216 -16558 -19946 -14371 -2360 10493 18801 18532 9594 -3701 -14623 -19612
1763 -19612 -15448 -4020 8940 17784 18410 11177 -1094 -13287 -19234 -15915 -5901 6672 16838
1776 16838 19334 12222 45 -11832 -18341 -17051 -7428 5325 15798 18655 13575 2137 -9979
1789 -9979 -17998 -17415 -9005 3249 14351 18643 14644 3986 -8377 -17039 -17698 -10516 1412 13032
1803 13032 18358 15426 5370 -6641 -15566 -17728 -11772 -315 11365 17364 15918 7321 -4853
1816 -4853 -14653 -17624 -12841 -2118 9576 16864 16702 8661 -3052 -13500 -17901 -13822 -3770 7882
1830 7882 16160 16798 9997 -1631 -12170 -17109 -14677 -5598 6465 14996 17003 11605 411 -10777
1844 -10777 -17051 -15500 -7038 4380 13991 17131 12369 1872 -9307 -16219 -15766 -8293 3013 13048
1858A3048L545l245r544j1324p868q97O663J0950J0050N119k164r218j1356q294
1872a4535j668N453J0541J0241O110j614q227j0712q917k693M208R790J0790O629
1886A5396n10o842j0828r409m114L352R506J0967P067Q32n979j0748r883m615
1900a5808K469Q577J0473P823K078n298r853r830n952J139P592J0592Q761K800
1914A5563l955r604j0342o526L18P072R953Q918M052l237q905j0045p264p61N551
1929i212J0196R467M585j962q076j0257p809j991N269R585R427N326q82p668r979
1944c981q109k848M076Q726R934O523m86o415j0085q287l691K739Q386J0225O740
1959A3447Q90n584r625q967m933K254P665J0038P302J835m714r209q947n519J154
$$ plain form
1858 13048 16593 13348 3804 -7520 -15388 -16285 -9622 1328 11378 16497 14333 5115 -6241 -14535
1872 -14535 -16203 -10750 -209 10032 16142 14528 6301 -4411 -13328 -16021 -11813 -2023 8767 15396
1886 15396 14886 8044 -2784 -12193 -16307 -12955 -3449 7518 14585 15417 9438 -1310 -11193 -15808
1900 -15808 -13339 -4762 5711 13534 15612 10314 461 -9369 -15321 -14182 -6590 4002 12763 15563
1914 15563 11608 2004 -8338 -14864 -14546 -7474 2479 11397 15449 12212 3307 -6738 -14002 -14763 -9212
1929 -9212 984 10451 15036 13074 4998 -5259 -13068 -15059 -9790 -205 9222 14548 13666 5998 -3981
1944 -3981 -12090 -14938 -10862 -2136 7798 14321 13835 7420 -2665 -10952 -14643 -11904 -3518 6707 13447
1959 13447 14337 8753 -872 -9839 -14772 -12518 -4853 5185 12487 14322 9608 399 -8548 -14067 -12913
1974a2913O892R896P900K573l739q392r610o170R9O186R613Q368L544l070p832
1989C345r409o533q45M957R175Q622M675k022p257r240p395j959M536Q742Q758
2004H150N280r27o535r471p724k397L317Q232R049N967m3o165q465q025l855K759
2020a0853P115R010O669J336n020q935q136m276J510O942R031O882J924m088q422
2035F89q316n113P76N914R020P508K693l278p810q492n710m45N740Q673P537L711
2051A3097k258p373q748o130j295M730Q090Q107M494j544o656q470o911j889L648
2066i108Q264Q217M804p19n608q510p289k435K912P254Q350N467K62n044q159
2081a342p522l752K286P157P777O469R00m177q147p822l744R81O165Q637O562
$$ plain form
1974 -12913 -6021 3875 11775 14348 10609 2217 -7393 -13563 -13464 -7278 2335 10703 14247 11177 3345
1989 3345 -6064 -12597 -13442 -8485 690 9312 13987 11965 4708 -4532 -11927 -13886 -9350 -608 8150
2004 8150 13430 12503 5968 -3503 -11227 -13624 -10307 -2075 6974 12941 12898 6733 -1732 -9757 -13612 -10853
2020 -10853 -3738 5272 11941 13277 8257 -678 -8814 -13090 -11580 -4638 4393 11275 13199 9111 689
2035 689 -7627 -12740 -11964 -6050 2970 10478 13171 9893 2083 -6409 -12119 -12564 -6824 1849 9386 13097
2051 13097 10839 3466 -5282 -11412 -12707 -7977 113 8220 12714 11170 4514 -3956 -10867 -12756 -9108
2066 -9108 -844 7373 12177 11458 5850 -2660 -9949 -12384 -9472 -2218 6132 11599 11861 6817 -1342
2081 -1342 -8864 -12616 -10330 -3173 4604 11073 11973 7796 -351 -8173 -11917 -10936 -4771 3866 10428
2096A0428J883l865p488p790m913P16N442Q110O822K655k794p110p771n746k2
2111a1443M681Q215P073L208j879o318q107o004j034M393P095P582L947j066o039
2126D304p741o356k055L586P076P645M797m76n110p737p050k615K635O776P885
2141E564N153K94m748p321o836l255J405O500P532N737J024l671p220p327l766
2156a0935J051N443P493O277J713k921o970p244m434K14M970P448O402K734k439
2171H802o349p512m962l69M122P302O646L319j856n820p255n539j172L599O925
2186a19O848L924j068n361p356n813j720L126O172O922M664k67m884p015o030
2201g977k672K269O382O956M564P68m344o900o333l115J476N728P143N204J445
$$ plain form
2096 10428 12311 8446 958 -6832 -11745 -11029 -5587 2523 9345 12000 9206 2096 -5675 -11421 -11443
2111 -11443 -6762 1453 8526 11734 9855 3537 -4570 -10574 -11608 -7215 -120 7462 11409 10343 4304
2126 4304 -3437 -9793 -11848 -8262 -1186 6459 11256 10780 5670 -2067 -9117 -11732 -9097 -2321 5564
2141 5564 10717 11011 6263 -1058 -7894 -11149 -9744 -3244 4288 10025 11049 7378 158 -7169 -10935
2156 -10935 -9884 -4441 3052 9329 11042 8121 1151 -6093 -10527 -10313 -5343 2105 8507 11241 8802
2171 8802 2453 -5059 -10021 -10390 -6268 1034 7680 10999 9143 3323 -3932 -9471 -10643 -7044 -119
2186 -119 6729 10653 9585 4224 -3132 -8945 -10665 -7539 -1367 5555 10219 9952 5068 -1947 -7977
2201 -7977 -10649 -8380 -1998 4958 9522 10290 5946 -954 -7287 -10402 -8926 -3198 3945 9149 10594
2216A0594l694o538o917l523P73N203O844N949J413k729o033o753m293L6M581
2231e087P005N704K619k104n887o527n106n06L980O629O273L155j719n448o621
2246c640n028j451L412O254O549L680q61m640o778n598j962L041N830O257M490
2261I555m16m199o361o003k166J816N318O525M895N32l748o485n649l203J364
2276h225N122O278M877J617l344n925n962l878R50M388O072N613J996k551n626
2291A402o114l934j11L755O274N888K246k148m847o475m304p31L465N953N679
2306E998L215j459m601o368m611q00K424N725N879L563o57m607n865m912j903
2321h979K094N540N556M048K68l640o078n213k609J670M972O084M103Q30l292
$$ plain form
2216 10594 6900 362 -6555 -10078 -9305 -4102 2742 8691 10104 7375 1342 -5411 -9704 -9668 -5087
2231 -5087 1918 7622 10241 8137 2250 -4277 -9383 -9889 -5909 720 6993 10148 8429 2981 -3640
2246 -3640 -8668 -10119 -6707 -453 6096 9776 8915 4275 -2503 -8101 -10063 -7022 -1192 5065 9555
2261 9555 9139 4940 -1421 -7424 -9590 -7774 -2456 4069 8964 9496 5748 -737 -6386 -9589 -8225
2276 -8225 -3103 3175 8052 9669 6325 400 -5562 -9440 -8490 -4102 1970 7583 9579 7028 1402
2291 1402 -4712 -8646 -8757 -5002 1272 7160 9406 7258 2411 -4064 -8368 -9099 -5634 319 5998
2306 5998 9213 7754 3153 -3215 -7826 -8626 -6202 -477 5402 8965 8308 3701 -2164 -7076 -8979
2321 -8979 -6885 -1345 4211 8259 8527 4887 -1191 -6404 -9013 -7343 -2371 3713 7816 8646 5354
2336E354n672n307k873R90M378N923M658J279k676n438n902l088N41L960N947
2351B074M670J859k089n199n403l924k84L576N622N201K138j359m584n587l926
2366g215j159L374N193N259K891j090m320n486m510j362K637N008N357L375k69
2381G683l886n569m758j512J680M916N753L560j80l156n253n055k450J327M606
2396b294N282M170P74k758n100n134k705P02L904N272M476J281k221m807n082
2411d240l148J29L485N005M511K210j583m551n446l532m59L148N133M909K055
2426G626r47m264n480l511q64K453M795M899K748o72l700n102m455j508K333M709
2442i40M976L202o0l497n183m234j726J665M026M847L983P3k743m821m369k516
$$ plain form
2336 5354 -318 -5625 -8498 -7508 -3130 2793 7451 8730 6054 616 -5286 -8374 -7833 -3873 2074
2351 2074 6744 8603 6514 1315 -4088 -8012 -8296 -4720 902 6103 8241 6882 2298 -3289 -7215
2366 -7215 -8374 -5000 193 5452 8343 7253 2933 -2553 -7063 -8425 -5788 -780 4577 7952 7683
2381 7683 3797 -1772 -6530 -8042 -6362 -1446 4307 7867 7687 4531 -722 -5777 -8227 -6900 -2294
2396 -2294 2988 7158 7932 5174 74 -5060 -7765 -7063 -3159 2113 6589 7870 5649 842 -4240
2411 -4240 -7388 -7259 -3774 1231 5742 7952 6369 1818 -3628 -7160 -7619 -4471 662 5571 7626
2426 7626 6679 2415 -3065 -6576 -7440 -4987 -192 4707 7455 6783 3083 -2019 -6474 -7982 -5649 -940
2442 -940 4036 7238 7178 3681 -1502 -5736 -7462 -5797 -1771 3076 7059 7132 4389 -432 -4801 -7317
2458g317Q70M039N194L668J027k469m576m941k741N39L461M967M182J378j795
2473E486m412m690l148l48L300M922M313J676j208l743n063l394o41K558M730
2488C38M487K392q92l716m905m117p34K165M351M709K759k14l191n114l855j596
2504g133J879L801M732L519k62k522m843m170j939J202L726M966L129R31k649
2519D367m494m766k051J003L212M889L587J167j928m379m527k709M08L229M575
2534A583L794J547j797l920m297l551n1K947M348M432J828j021l658m882l330
2549f028p23K579M065M145K590q68l112m621l458j345J723M387M351K483m5k862
2565C261m478m107j415J489L968M276K989J74k262m478m265j766J091L475M573
$$ plain form
2458 -7317 -6447 -2408 2786 6454 7481 5012 436 -4505 -7246 -6707 -3246 1721 5903 7281 5486
2473 5486 1074 -3616 -6764 -7112 -3812 1110 5423 7099 5891 2148 -2915 -6309 -6950 -4392 338
2488 338 4825 7217 6325 2609 -2296 -6413 -7147 -4982 -631 4078 6837 6623 3432 -1682 -5537 -7133
2504 -7133 -5254 -1453 3279 6798 6536 4014 -829 -4999 -6938 -5736 -2010 2956 6085 7016 4367
2519 4367 -127 -4893 -6944 -5941 -2729 2160 5747 6914 4986 607 -3920 -6629 -6221 -2992 1583
2534 1583 5377 6924 5127 1207 -3090 -6641 -6692 -3745 603 5035 6863 5842 2184 -2698 -6028
2549 -6028 -6751 -4172 -107 4038 6628 5760 2648 -1973 -5431 -6776 -5053 -666 3685 6168 6123 3261
2565 3261 -1217 -5324 -6739 -5250 -1282 2994 5983 6157 3895 -583 -4848 -6614 -5523 -2048 2525
2580B525L212P49k328m093m166k246O55L030M233L763J285j735l915m448k340
2595e819l97L075M244L700J594j231l424m709l064M7K081M305M174K008r84l532
2611B068m147l333o97J723M212L755K597n29k884m459l396j322J677L846M069
2626C180K753R9k640m071l727j693R90L545M397K984L64k434m179l770k039O07
2642e634L605M217L235R86k156m028l807k533L20L141M145L288J545j475l530
2657A319m344k664r6K655L932L816J513j170l154m336k819p30K331L914L791J867
2673E825l15l047m146l198j045J526L917L666K737k65k841l713l669j584J530
2688d622L231M270K733J12k356l856l784j737J169K848M301L102L81k072l638
$$ plain form
2580 2525 5737 6486 4158 65 -4101 -6347 -5692 -2662 1571 5334 6619 4884 969 -3479 -5819
2595 -5819 -6216 -3141 1103 4803 6397 5166 1742 -2967 -6031 -5984 -3903 402 4576 6584 5600 2068
2611 2068 -2079 -5412 -6109 -4386 -174 3581 6178 5649 2765 -1694 -5090 -6412 -4735 -889 3180
2626 3180 5933 6032 3392 -679 -4406 -6099 -5109 -1564 2833 5817 6181 3747 -432 -4202 -6241 -5634
2642 -5634 -2029 2188 5423 6409 4253 225 -3582 -6115 -5795 -2654 1491 4779 6324 4849 1319
2657 1319 -3025 -5689 -5785 -3130 802 4618 6131 4961 1807 -2529 -5348 -6078 -3747 167 3958 5825
2673 5825 5510 2463 -1683 -4881 -5926 -4400 -483 3183 5920 5655 2814 -899 -4568 -6152 -4622
2688 -4622 -1391 2879 5612 5724 3368 -488 -4272 -6009 -4840 -1992 2309 5411 5792 3720 82
2703H2l792j969L64K780M344L141P72j514l483m124k316J50K559M028L281J580
2719E883j284l210m194k445m97K337M114L245J849r54k938m037k934p22J984L640
2735a63L882J929m60k767l838l197j156J820L405L637K279j83k325l843l454j154
2751e588J082L356L701K587K71k102l888l260k022J122L116L598L000O58j945
2766C686l638l451j875L11K628L701L130J134j542l369l660k135o2K309L749L246
2782D162J342j102l057l933k422k26J766M004L190J549n21k936l665k827r56J922
2798c710L426L418K456p38k248l770l343r17J229L337L577K086M42k269l633l265
2814c922j405R07K987L698K542N47j978l512l255k003P39K722L597K894O55j802
$$ plain form
2703 82 -3710 -5679 -5315 -2535 1809 4950 5722 4208 725 -3399 -5715 -5565 -3006 1022 4303 5883
2719 5883 4599 1389 -2805 -5250 -5747 -3410 704 3949 5798 4844 1906 -2131 -5065 -5787 -3803 -163
2735 -163 3719 5648 5188 2421 -1417 -4614 -5770 -3950 -545 3092 5371 5188 2863 -980 -4434 -5588
2751 -5588 -4506 -1150 2551 5138 5409 3307 -581 -3841 -5863 -4741 -1625 1973 4973 5631 3686
2766 3686 48 -3403 -5278 -4967 -2339 1362 4492 5626 4084 715 -2945 -5080 -5142 -2833 916 4162
2782 4162 5504 4402 1345 -2588 -5010 -5236 -3470 534 3724 5273 4752 1816 -1849 -4676 -5632 -3710
2798 -3710 -284 3134 5590 4852 2604 -1166 -4509 -5426 -4197 -860 2717 4803 5245 2976 -657 -3922
2814 -3922 -5327 -4420 -1433 2265 4807 5354 3376 -136 -3391 -5394 -4655 -1933 1664 4558 5213 3411
2830C411k987l213k258J85K461L647L149P37r89l297l452k266j7K066L424L251
2846C852J586j015l069l483k526l19J783L365L056J784n63k563l581k653p64J201
2862c909L511L252K260l95k027l614l066j305J379K761L488K273K60k018l320
2877d70l124j326M20L132L125K734Q51j918l356l193j895M70K734L198K709J055
2893E146j546l126l186k175K12K200L259L063J186j070k944l322k038j50J525
2908b966L274L393J403p75k646l529k611o14J768L001L529J806m87k311l456k794
2924d015r25J104K951L597K096N7k125l573k793j504J207K576L243K560M83j777
2940C162l342l442j437P29K642L252K628L97j250l021l214j711pK561L466K665
$$ plain form
2830 3411 424 -2789 -5047 -4862 -2401 1246 4395 5132 4143 846 -2606 -4872 -4889 -2823 601 3852
2846 3852 5438 4423 1354 -2129 -4655 -4974 -3191 174 3230 5014 4451 1888 -1693 -4346 -5110 -3909
2862 -3909 -398 2854 5114 4719 2692 -922 -3988 -5293 -3914 -1153 2335 4608 4868 2850 -470
2877 -470 -3594 -4920 -4500 -1368 1757 4491 5342 3424 68 -3125 -5020 -4550 -1816 1382 4091 5146
2893 5146 3600 474 -2712 -4887 -4675 -2475 784 3847 5033 3963 1019 -2303 -4341 -4491 -2966
2908 -2966 308 3701 5104 4329 1683 -1846 -4457 -5071 -3303 -302 3227 5033 4546 2235 -1221 -4015
2924 -4015 -4940 -3836 -885 2712 4808 4865 2740 -833 -3626 -5130 -3923 -1347 1896 4456 4939 3162
2940 3162 -180 -3622 -5059 -4330 -1688 1564 4192 4589 3339 318 -2896 -4607 -4614 -2053 1413 4078
2956D078O65j033k792l483k099P5J865L386K910J349r69k681l461k286k40J817
2972b899L018L263J598o35k602l217k705o98J644L070L217J673m58k288k945l024
2988c988o79Q75K781L574K052J12k064l230l023j244Q73K668L298K155M34j520
3004C074l266l028j437M56K412L332K443Q91j257l316l072j709K13J870L465K780
3020C851Q36r01k973k974k193k21J955L207K765J321q10k342l213k459o61J856
3036b956K825L229J680n11k240l384k708o70J294L045K954J973l18j993l193k612
3052c585j162J099K879K748K292J50j623l117l021j273O81K444L244K342N46j719
3068B925k687l091j616N27K099L222K402Q89j272k968l231j849O08J676L405K569
$$ plain form
2956 4078 4743 3710 918 -2565 -4664 -4589 -2724 662 3572 4921 3952 1271 -2190 -4476 -4716 -2899
2972 -2899 119 3382 4980 4345 1743 -1474 -4179 -4877 -3233 -163 3054 4727 4269 1981 -964 -3988
2988 -3988 -4667 -3792 -1011 2563 4615 4727 2663 -567 -3590 -4834 -3961 -1293 2005 4160 4594 3074
3004 3074 -192 -3220 -4657 -4201 -1789 1543 3986 4877 3620 304 -2768 -4477 -4264 -2394 1071 3851
3020 3851 4687 3786 813 -2161 -4354 -4575 -2620 587 3352 4673 3863 1521 -1692 -4151 -4812 -2956
3036 -2956 -131 3098 4778 4267 2027 -1357 -4065 -4735 -3441 -396 2558 4531 4213 2220 -973 -3585
3052 -3585 -4747 -3648 -769 1979 4271 4421 2798 -319 -3340 -4613 -3932 -1488 1756 4098 4644 2925
3068 2925 238 -2853 -4469 -3942 -1843 1379 3781 4670 3398 430 -2801 -4650 -4042 -2366 1039 3608
3084C608J169j114l032k763k171l04J970L125K708J483o42k632k900k496o26J491
3100c126L179K972J542l45k474l013k570r22J219K981L001K102j14k156l003k778
3116c505j270R13K707L361K136J03j799k836l018j353M25K829L236K085M81j404
3132C091k976k863j615J92K156L381K388P93j148k897k946k065L40J686L276K598
3148C391J310j099k423l164k273%J298L393K785J390m06k721l028k386o77J647
3164b963K766K693J889j91k388l084k290q86J232K645L021J943j26j876k924k755
3180c294j480J281K612L116K048O0j675k683l062j661R54K171K981K530O40j649
3196B889k609k801j761L2K203L275K361Q57j003k710l169j649J78J561K902K782
$$ plain form
3084 3608 4777 3663 631 -2132 -4303 -4607 -2637 488 3196 4679 4037 1405 -1495 -3991 -4617 -3126
3100 -3126 53 3025 4567 4222 1748 -1265 -3835 -4757 -3538 -557 2444 4546 4432 2276 -727 -3505
3116 -3505 -4775 -3862 -1155 2206 4342 4445 2646 -190 -3208 -4561 -4136 -1307 1929 4014 4495 3091
3132 3091 115 -2748 -4363 -4171 -2015 1366 3754 4547 3399 502 -2444 -4509 -4169 -2483 793 3391
3148 3391 4701 3602 1179 -1985 -4258 -4258 -2960 433 3218 4608 4202 1481 -1547 -3933 -4610 -2963
3164 -2963 -197 2496 4385 4194 1806 -1278 -3568 -4454 -3222 -577 2444 4387 4261 2385 -539 -3294
3180 -3294 -4774 -3493 -881 2235 4283 4343 2668 -15 -3077 -4738 -3784 -1613 1368 3898 4538 2889
3196 2889 280 -2521 -4282 -4250 -2047 1228 3589 4446 3443 733 -2436 -4085 -3907 -2346 556 3338
3212C338J402q85k693l021k240l35J659K899L048J406o40k254l158k472n24J684
3228b786K655K807J766l04k058l375k275r67J238K776K854J796K07k106k946k360
3244c078j371J007K206L197K032J31j329k914k947j253L60K246L391K102O89j441
3260C028k799k718j786K85J853L144K591R01r69k791k877k006l44J998L222K685
3276C417R86r47k107l368k152k83J718K844K988J565j051k136k871k360m76J249
3292b984K648K770J663k3j987l293k349q12J083K653K683J819J24j696k843k599
3308c143j360R58K300L198K141J30j491k648k808j418M53K029L099K127Q97j294
3324C170k901k700j610l4K261K868K240J189j169k386l068k007K97J481L032K547
$$ plain form
3212 3338 4740 3855 1162 -1859 -4099 -4434 -2775 124 3172 4578 3938 1684 -1474 -3946 -4470 -2786
3228 -2786 -131 2676 4442 4138 2080 -1295 -3570 -4537 -3299 -523 2331 4127 4334 2228 -718 -3078
3244 -3078 -4449 -3442 -1236 1961 3993 4124 2795 -119 -3066 -4319 -3959 -1713 1678 3780 4469 3028
3260 3028 229 -2489 -4275 -3990 -2137 1007 3598 4499 3530 739 -2138 -4144 -4488 -2490 732 3417
3276 3417 4403 3456 1349 -2019 -4171 -4454 -2736 108 3096 4661 3610 1474 -1397 -3757 -4233 -2984
3292 -2984 -336 2434 4097 4074 2087 -1206 -3555 -4367 -3284 -631 2052 3871 3995 2299 -544 -3143
3308 -3143 -4503 -3545 -1245 1953 4094 4224 2733 85 -2723 -4141 -3688 -1659 1440 3567 4464 3170
3324 3170 269 -2431 -4041 -4075 -1814 1054 3294 4483 3314 928 -2140 -4147 -3850 -2369 663 3210
3340C210R13p01k074l293j922l75J669K537K738J550o09k203k844k353n03J136
3356c124K782K960J074M56k247k890k566o69J018K586K785J745l1j502k959k654
3372c236j066O83K673K539K162M82j696k646k667j623N49K207K994K310O59j282
3388C042k586k911j638J34K153K644K200J248j133k182l043j817n8J791K559K732
3404C135R00o06k630k549j630q14J478K685K590J502m98j934l019k373l47J089
3420c021K832K616J508k32j724k901k077j165J146K522K676J630K43j645k908
3435e00k374j133O43K310K770J744K96j360k512k591j501M69K248K688K121P79
3451D097j141k800k512j372j82J917K866K618N22p93k354k706k077L10J364K807
$$ plain form
3340 3210 4123 3422 1348 -1945 -3867 -4242 -2573 -36 2702 4252 3643 1440 -1404 -3757 -4260 -3124
3356 -3124 -342 2618 3692 4148 1901 -989 -3555 -4224 -3206 -620 2165 3910 3879 2377 -582 -3236
3372 -3236 -4302 -3619 -946 1593 3755 4237 2541 -105 -2772 -4395 -3846 -1639 1355 3665 4324 3042
3388 3042 456 -2455 -4093 -3959 -1806 838 3038 4286 3153 971 -2072 -3889 -3947 -2156 403 3135
3404 3135 4035 3429 799 -1750 -3380 -4194 -2716 -31 2559 4061 3563 1629 -1390 -3763 -4110 -3021
3420 -3021 -189 2427 3935 3703 1979 -922 -2999 -4164 -3018 -496 2180 3810 4053 2408 -500
3435 -500 -2874 -4007 -3364 -1054 1716 3460 3756 2396 -116 -2707 -4208 -3739 -1491 1197 3318 4097
3451 4097 2956 156 -2356 -3728 -3910 -1993 873 3491 4013 3220 866 -1840 -3917 -3607 -2243 564
3467E64K337J201n79k868k278j990k81J217K776K526J253l11k166k525k189p23
3483d036J024K505K938J455k2k140k785k252o01Q63K240K833J582N12j844k706
3499d34k453j097O46K252K758K017L52j578k582k681j069O15J969K307K376O35
3515D033j365k042k702j534r5J841K658K315Q52r60k439k218j871k95J575K491
3531B44K566J149o20k156k775j848m24J271K814K140J623m17k261k360k095p93
3547c942J092K372K850J386k57j605k617k136j295Q46K669K779J358J45j700k437
3563d92k429r02Q22K091K496J979J74j467k234k537j266K05K164K654J888Q63
3579D009j308k338k183j885J06J810K692J887R04o41k365k374j956k8J410K766
$$ plain form
3467 564 2901 4102 3523 655 -1623 -3613 -3894 -2677 99 2625 3878 3567 1401 -1124 -3313 -4036
3483 -4036 -3012 -507 2431 3886 3864 1724 -1061 -3313 -3914 -3051 -811 2022 3604 4116 2272 -434
3499 -434 -2887 -3984 -3338 -1086 1672 3689 4041 2463 -119 -2800 -3869 -3254 -1285 1022 3398 4033
3515 4033 2668 626 -2076 -3610 -3705 -1864 794 3109 3961 3001 562 -1656 -3527 -3822 -2247 244
3531 244 2810 3959 3339 1183 -1592 -3440 -3864 -2593 221 2361 3984 3567 1306 -1054 -3149 -3942
3547 -3942 -2850 -478 2372 3758 3501 1896 -721 -2857 -4152 -3306 -637 2142 3500 3645 1945 -492
3563 -492 -2921 -3823 -3001 -910 1586 3565 3739 2272 38 -2499 -3765 -3560 -1396 1258 3146 4009
3579 4009 2701 363 -1820 -3705 -3599 -1789 903 2790 3694 3053 688 -1686 -3642 -3670 -2260 506
3595E06K234J337r40j983k698j919k72J221K614K401J138m85j578k716k040p84
3611c964J258K494K358J510N3j982k551j951r46Q52K160K684J578O4j433k526
3627c42k521j055Q74J839K560J869K79j048k317k795r58L51K018K251K024Q80
3643C909j156k600k045j805Q3J841K645J952J091r72k427k322j763K40J260K426
3659C57K458Q76m60k016k547k107j72J197K438K301J114k25j679k311k565n20
3675c861J338K198K267J955m61j670k442k101q03R44J859K604J424N28j844k274
3691c39k411p54M46K046K273J752Q23j353k288k621j260O47J723K402K286P3o73
3708B772k701j996j603J91J602K656J936M39o98k081k330j285j63J207K389K110
$$ plain form
3595 506 2740 4077 3137 1154 -1544 -3463 -3735 -2514 100 2501 3639 3154 1576 -1140 -3180 -3964
3611 -3964 -2706 -212 2146 3656 3709 1727 -824 -2775 -3721 -2869 -709 1975 3553 3617 2184 -342
3627 -342 -2863 -3918 -3044 -1205 1355 3224 3503 2455 138 -2657 -3615 -3264 -1246 1005 3029 3909
3643 3909 2753 153 -1892 -3697 -3614 -1773 872 2824 3915 2943 516 -1806 -3569 -3329 -2069 357
3659 357 2815 3691 3231 1215 -1332 -3439 -3611 -2414 24 2325 3439 3214 1535 -776 -3341 -3861
3675 -3861 -2523 -325 1942 3897 3436 1766 -676 -2777 -3580 -2636 -777 1827 3251 3779 1935 -339
3691 -339 -2750 -3504 -3058 -1012 1261 3013 3836 2483 195 -2426 -3686 -3039 -1316 1086 3372 3445 2772
3708 2772 71 -1925 -3528 -3337 -1735 921 2857 3296 2598 517 -1813 -3098 -3261 -2054 335 2445
3724B445J240o58j979k542j559l97J204K339K586P63l89j794k453j686r10J179
3740b611K228K652J265k78j591k425k150o50P61K279K388J589j79j224k331k274
3756b551r42P08K064K208J698L95j042k590k177j355M90K020K102J896O22j088
3772B458k223k115j529o6J875K122K333Q87j015k047k539j404l5J645K112K111
3788B570J054r32j812k460j673k25J287K335K267J220m78j626k497j929p12J041
3804b570K450K324J125K3j786k334j926p30J066J739K433J280K92j396k557j791
3820b358j152Q12J838K119J765N36j646j806k424j053M56J801K237J837N30j037
3836B455k054k321j339J13J940J910K133P77j209j829k421j303l6J449K218J841
$$ plain form
3724 2445 3685 3027 1048 -1494 -3053 -3450 -2246 93 2679 3442 3053 1259 -1194 -2880 -3790 -2611
3740 -2611 -383 2269 3534 3256 1665 -760 -2910 -3560 -2799 -520 1868 3457 3278 2054 -277 -2551
3756 -2551 -3493 -2785 -721 1487 3185 3580 2538 -52 -2229 -3584 -3094 -1074 1028 2924 3546 2458
3772 2458 235 -1880 -3409 -3475 -1600 522 2855 3742 2727 680 -1859 -3263 -3298 -1653 459 2570
3788 2570 3624 2692 880 -1580 -3253 -3478 -2191 144 2411 3631 3153 1527 -970 -2899 -3611 -2570
3804 -2570 -120 2204 3329 3352 1566 -768 -2694 -3424 -2358 -619 1814 3094 3386 1990 -567 -2358
3820 -2358 -3510 -2698 -860 1259 3024 3560 1914 108 -2316 -3369 -2913 -1112 1125 2962 3492 2455
3836 2455 401 -1920 -3259 -3146 -1206 704 2837 3614 2405 576 -1845 -3148 -3184 -1735 483 2324
3852B324Q23n45j660k160j728k60P52K604K087Q27j53j698k169k044k72Q35K360
3869g7K019J361k82j527k223k036o78J021J901K300J343P0j317k303k002p45M67
3886b708J787K419J320K69r72k321k010j223O20J842K215J491P37j323j897k174
3902a928j403M40J320K363J757O22p81j620k400j170o36J843K108J857Q29n55
3918B646j679k350j593k41J319J996K092J169o00j637k306j473p50J105K149J771
3934A618J597l23j454k046j968o23P80J885K050J508J32j589k107j667j002O01
3950b608J738K066J532J11q24k138j813j331M27J772K072J465P39j017j953j821
3966a583j409J10J656J889J883M61p57j663k111j468J08J292K105J472J486o07
$$ plain form
3852 2324 3147 2602 942 -1218 -2946 -3206 -2454 150 2237 3064 2911 1213 -956 -3000 -3272 -2437 -77
3869 -77 1942 3303 3021 1494 -729 -2765 -3443 -2422 -521 1779 3122 3192 1875 -428 -2430 -3175 -2708
3886 -2708 -921 1498 2818 3087 2115 -206 -2216 -3439 -2819 -977 1238 2729 3466 2143 246 -1928
3902 -1928 -3331 -2891 -1571 792 2549 3171 2390 770 -1630 -2800 -3436 -1593 515 2372 3201 2646
3918 2646 967 -1383 -2976 -3217 -1898 98 2190 3359 2759 1122 -1184 -2657 -3407 -2302 -153 1618
3934 1618 3215 2892 1438 -608 -2576 -3199 -2419 -534 1516 3024 3156 1567 -540 -2207 -3209 -2608
3950 -2608 -870 1196 2728 2839 2015 -123 -1936 -3267 -2840 -1068 1004 2469 3208 2191 238 -1583
3966 -1583 -2992 -2882 -1226 663 2546 3007 2250 587 -1524 -2992 -2884 -1592 513 1985 3471 2864
3982B864k014j935j729k43Q86K087K075J286o58j700j746j897o91J291J788K033
3998A697J492m36j484j770j800r73Q28J917K061J265K2j046j865k297m78J68K109
4015e90J704J732K95j228j827k229r35K82J651J999J803L19p81j733k353o98j74
4032b763J438J905J836O98o64k145j786j369j66J517J791K028O10m22j621k071
4048a184j461l07J216J823J805J066k49j272k271j787m18J034J600K101J140k54
4064B582j174k043j806n11O86J686K295Q68L11j223j893j756p95L24J661J982
4080A194J321M72j156j880j816r92L47J308K073J737L37r24j756j865j390L95
4096b595J131K098J632O33p66j709j692j498j73J288K125J844P39o01j767j869
$$ plain form
3982 2864 850 -1085 -2814 -3057 -2171 -84 1991 3277 2619 919 -827 -2724 -3415 -2124 -336 1697
3998 1697 3189 2753 1269 -501 -2301 -3274 -2446 -529 1532 2797 2819 1773 -92 -2389 -2867 -2699 -590
4015 -590 1114 2846 3141 1913 86 -2143 -3078 -2796 -1145 854 2657 2976 2195 462 -1891 -2589 -2763
4032 -2763 -1325 580 2416 3114 2450 305 -1481 -2850 -3016 -1499 292 2320 2930 2508 887 -1184
4048 -1184 -2645 -2952 -1736 87 1892 2958 2709 1437 -834 -2621 -3039 -2005 -405 1696 2836 2582
4064 2582 1408 -635 -2441 -2952 -2266 -580 1715 2583 2894 1671 -222 -1978 -2773 -2449 -788 1194
4080 1194 2515 2987 1831 -49 -1865 -2857 -2510 -1202 871 2608 2945 2021 265 -1600 -2990 -2595
4096 -2595 -1464 634 2266 2899 2133 424 -1268 -2766 -2939 -1651 474 2318 3057 2456 689 -1180
4112a180j299m40J094J956J587J220k74j496k025j552l70J036J516J768J569n72
4128B538j221j676k067l00P10J642J537J513l3j041k004j356j259O87J502J841
4144A013J615K12j321j506j909j116P23J363J794J816J66q15j963j559j127j70
4160b784J882J667J829K64n35j960j914j161K4J383J745J690P03o70j536j537
4176i10j614k00J045J825J585Q98m01j145k036j327o90J149J724J735J190l41
4192B487j190j970j356p93Q93J599J813J262m8j327j784j891p7K58J488J920J159
4209B443J06q65j768j496j166M59J345J948J329K84p73j740j822r09K61J290J915
4226H41J413M03o86j520j665j328R0J152J594J617N74k42j849j730j226j32R98
$$ plain form
4112 -1180 -2479 -2919 -1825 131 1718 2938 2664 1168 -857 -2409 -2779 -1743 -227 1541 3110 2538
4128 2538 1317 -359 -2426 -2726 -2016 -374 1163 2676 2643 1602 -402 -1758 -3017 -2330 -828 1013
4144 1013 2628 2840 1519 13 -1896 -3012 -2289 -926 868 2684 2850 2035 72 -1487 -2614 -2784
4160 -2784 -902 765 2594 2858 2323 363 -1551 -2712 -2688 -1305 440 2130 2833 2163 627 -910
4176 -910 -2524 -2724 -1679 146 1731 2629 2228 1083 -953 -2280 -2970 -1821 -97 1638 2828 2487
4192 2487 1297 -673 -2029 -2822 -1929 -330 1483 2745 2697 1370 -414 -2305 -2382 -2124 -636 1284 2443
4209 2443 2549 1684 -84 -1580 -2746 -2287 -942 1006 2335 2619 1846 106 -1716 -2625 -2364 -1074 841
4226 841 2254 2657 1971 451 -1214 -2542 -2452 -1300 294 1911 2485 2243 394 -1336 -2562 -2694 -1696
4243a696J708J728R70m08j527j734j300m18R67J710J697Q79j59r99k179j167q16
4260b744Q75J408J703J446l98q33j670j734p85O93J309J852J493K1q91j984j496
4277a735o77K31J409J509J805J54r94j479j831j087K64J244K055J252N59p43j534
4294D02j752j067J62J134J504J626O69n18j488j757j222m79J390J576J428J083
4310B691m72j454j877j034k82N80J809J774Q11l85j163j913j332q1O75J465J528
4327A340J330k83q25k213j169q39N87J643J697J233n2j244j254j843l94K97J075
4344i14J858J403J20q69j704j379q48K31J102J492J645K93o33j360j542j259J82
4361b182J128J552J376M02m00j433j385j219j49R21J559J372R32l17j269k023
$$ plain form
4243 -1696 12 1740 2710 2302 775 -959 -2259 -2677 -1710 0 1697 2576 2417 1418 -761 -1928 -2744
4260 -2744 -1869 -461 1242 2688 2290 1457 -213 -1947 -2732 -2039 -730 1122 2615 2636 1745 -239 -1735
4277 -1735 -2412 -2181 -772 737 2542 2696 1702 223 -1608 -2695 -2431 -1187 868 2120 2679 1936 402
4294 402 -1350 -2417 -2255 -1121 383 2009 2678 2160 672 -1085 -2307 -2786 -1396 180 1608 2691
4310 2691 2219 765 -1112 -2146 -2428 -1848 -39 1735 2546 2161 998 -915 -2247 -2328 -1653 -188 1340
4327 1340 2670 2387 1562 -651 -1820 -2659 -2072 -429 1268 2501 2449 1205 -49 -1892 -2286 -1989 -914
4344 -914 944 2347 2467 1598 -106 -1485 -2333 -2102 -1000 492 2137 2430 1797 437 -1105 -2364 -2182
4361 -2182 -1054 498 1874 2276 1876 443 -942 -2161 -2310 -1389 170 1542 2474 2157 888 -1135
4377a135j165j35J045R73K057Q47m83q75j577j554k97O00J309J875O71M2j115
4394A083j511j427n61M79J409J420J398K05j112j607j166j257L98J419J848J103
4410B121M28p71j725j418q56J28J270J728J046K31o52j344j670p91J37R65J627
4427D54J243P09n77j255j823q03l73J036J661J271O15j13j264j459j385k91R70
4444a384J430J547P61l23q23j848j394k45O22J426J605J005l69p91j671j145p01
4461b298O05J365J390J161%r42j519j418n44J78J082J765J209N09q84j683j369
4478a393q12K37J038J375J585J90l67j906j283q70R4J015J718J242L87o80j050
4495E20j457j160j47J119J140J757N83l82j317j390j261j97O59J662J147J264
$$ plain form
4377 -1135 -2300 -2435 -1390 -417 1640 2487 2004 1129 -448 -2002 -2299 -1699 -390 1485 2156 2198 1083
4394 1083 -428 -1855 -2416 -1937 -528 892 2290 2495 1383 -224 -1390 -2647 -2249 -830 1018 2121
4410 2121 2549 1778 53 -1365 -2221 -2093 -823 905 1951 2182 1530 186 -1484 -2275 -2138 -1173 454
4427 454 1697 2406 1829 574 -1249 -2052 -2425 -1389 272 1543 2158 2045 781 -678 -2063 -2354 -1384
4444 -1384 46 1593 2354 2031 1208 -640 -2034 -2279 -1657 -231 1374 2379 2010 1219 -452 -1597 -2298
4461 -2298 -1693 -328 1062 2223 2223 1281 -238 -1656 -2200 -2022 -940 825 2034 2543 1659 -24 -1393
4478 -1393 -2205 -1968 -930 445 2030 2220 1853 -53 -1336 -2206 -2112 -1097 621 1863 2250 1570 520
4495 520 -937 -2097 -2244 -1125 15 1772 2355 1973 656 -734 -1995 -2192 -1533 129 1276 2540
4511B540m72j159j538j306l92R09J329J224J091l77o78j384j513n59L18J700J147
4528H80J116L94j336j413j519m38M76J114J449J240J92o52j639j244p39K67J155
4545f97J434J211J65o08j361j443o36q8R85J507J158P69p36j170j570p05k57Q02
4563a240J242J389R80m98j008j789j218NP12J333J536M95Lj103j558j330p2O63
4581a458J388J255Q93k65q86j181j471l52M42J309J364J183k55r14j271j368m84
4598b071O5J625J025J234K16r55j255j480n36K46R06J764R71L43m71j329j376
4615a078j102L41Q88J331J156M98j78j491j291j110j52J064J348J202P45o92j089
4632C90j158j100j95O82J581R17Q74j55j014j527r15m93L97J535J370R60k18j115
$$ plain form
4511 2540 2068 909 -629 -1935 -2327 -1418 -89 1135 2226 1849 1171 -213 -1726 -2285 -1967 -267 880
4528 880 1996 2390 1054 -359 -1878 -2316 -1840 -726 723 1963 2155 1503 -136 -1380 -2119 -1852 -697
4545 -697 737 1948 2113 1505 144 -1299 -1935 -2023 -1038 469 1627 2396 1660 490 -1080 -1785 -2042 -1240
4563 -1240 2 1391 2371 1873 865 -924 -2142 -2137 -1425 -92 1444 1939 1942 839 -719 -2049 -2121 -1458
4581 -1458 -70 1185 2078 1813 927 -254 -1725 -2077 -1635 -326 1038 2221 1966 1052 -219 -1587 -2071
4598 -2071 -2006 -381 644 1878 2094 1139 -116 -1596 -2132 -1886 -980 784 1755 2098 1627 298 -1078
4615 -1078 -2180 -1839 -951 380 1536 2034 1856 365 -926 -2036 -2188 -1124 224 1426 2171 1479 390
4632 390 -768 -1868 -2063 -1381 200 1117 1991 1836 822 -705 -1620 -2113 -1716 -181 1189 2149 1931 816
4650H16j165j186m80L28J352J259R56K14r74j378j232p13M95J197J615R90j04
4667A990p03j194j522p37L07J116J439J194N0k97j300j466p85K40O02J474J341
4684A749K34m31j062j562q20K51O69R29J631N06l94j117j484j114j90J136J156
4701H7J257M69l28n63j799q15m71P30J347J566L00J08j006j536q90l65L93J250
4719b66J371O84L62j168j148j481l18K36J014J523J204L3r79j285j053r05J13
4736b063J423J109J240L68o49j199j294o53k69J025J348J306M85m84j068j692
4752a067q64Q9R56J154J343L21k56j068j503j014j04Q96J275J167O44k68r31j609
4770h39j067j78Q88J093J350O82j85r40j400r86n04M04J439J350P86l19o33j335
$$ plain form
4650 816 -349 -1535 -2015 -1687 -335 924 1880 2094 1120 -258 -1490 -2203 -1708 -511 1104 2094 1990
4667 1990 1287 93 -1429 -2166 -1859 -743 696 1890 1940 1643 343 -1123 -1908 -1668 -1066 408 1749
4684 1749 1983 1552 490 -1072 -1892 -1641 -972 -43 1588 2094 1700 583 -901 -2015 -2205 -1069 87
4701 87 1344 1813 1485 922 -877 -1692 -2163 -1433 -86 1480 1780 1888 882 -654 -1544 -1909 -1516 -266
4719 -266 1105 1789 2151 983 -165 -1646 -1964 -1728 -714 809 2013 2046 1067 -218 -1271 -2176 -2063
4736 -2063 -640 469 1709 2077 1428 229 -1065 -1718 -1987 -962 386 1692 2177 1693 625 -1067
4752 -1067 -1931 -1842 -886 268 1611 1932 1676 608 -895 -1909 -2013 -1117 158 1325 1969 1701 770 -839
4770 -839 -1906 -2084 -1196 -103 1247 1929 1744 804 -596 -1582 -2086 -1682 -243 1107 1893 1574 941 -394
4788c94j089m97L73J271J371P99j58n02j398j223m33K97R76J385O57N23p51j295
4806h8j292n56Q2J120J070J388J85n09j092j349o44%Q31J200J123N44n92j107
4824C14j124p85j00N28J200J561N00m64r19j574p04k12O37J214J187M05K2q07
4842H79j708q04j15K76J087J243J195l58p55j245j057l59K1J286J174J069r3o91
4860A045j060j358j14J5J005J139J126k59j05j432j202l01k22J147J096R52M80
4877A952o58j058j078q53K7R53J313R48M46p53r60j133p40j99Q21J075J087P79
4895A969k06j227j273r65Q6O17R26J216N58j68q14j359p28m04L44J389J063P36
4913A760l09m77j314j035o53O53J164R95R72k24o70j133r69n27N62O64J027R79
$$ plain form
4788 -394 -1483 -1980 -1607 -336 1035 1834 1676 1174 -224 -1447 -1880 -1583 -607 778 1435 1958 1207 -88
4806 -88 -1380 -1936 -1854 -734 336 1724 1909 1400 308 -1041 -1685 -1685 -854 346 1469 2013 1421 314
4824 314 -810 -1595 -1695 -1167 33 1594 2094 1630 711 -863 -1567 -1779 -1142 72 1259 1664 1686 879
4842 879 -829 -1633 -1748 -1472 -385 858 2053 1695 940 -305 -1362 -1721 -1700 -414 760 1829 1736 1045
4860 1045 -15 -1373 -1487 -1472 -467 672 1798 1539 1434 2 -1200 -1501 -1723 -576 520 1472 1952
4877 1952 1294 236 -842 -1695 -1668 -715 598 1546 1992 1239 279 -854 -1594 -1793 -972 103 1190 1969
4895 1969 1763 536 -737 -1702 -1616 -999 -73 1143 1701 1533 719 -640 -1368 -1772 -1428 -39 1024 1760
4913 1760 1451 974 -340 -1375 -2028 -1375 -211 784 1756 1532 862 -271 -1240 -1767 -1205 -541 486 1465
4931A465M73j110o66j181o29J18P32J584R62J49n20j268j188o99K8R13J085J110
4949A358M51n34r09j226q98L9P75R50J186N59l82r60j086q22k57P37J249R12N68
4968A710l38r85q27r42n32O96J130J211P68o7j262q00j227l33L51J275J186Q27
4986A841l55n66j423q99l04R1J196J091P67L27j027p96r50p53J64P16J410R66
5004A496K50p06p79j132p87Q6O20J282J205K97m43q09j270r33k1O09J358P69O04
5023A696m34p26j272j027J81M99J066J109O67k12r37j096r60j48N71J104R16P17
5041A714Q9r88r59j355k25M24J027J496M57O4j056q55j273k82M43Q21J463M10
5059A415J68m74q72j229o47j24J183J031J090P7n73j059j157m93K40R86P64R31
$$ plain form
4931 1465 1938 828 162 -1019 -1648 -1530 -798 786 1748 1897 1377 109 -1079 -1778 -1750 -837 248 1358
4949 1358 1809 1275 366 -860 -1758 -1719 -944 6 1192 1751 1369 409 -677 -1499 -1756 -1019 230 1142 1710
4968 1710 1372 387 -440 -1382 -1914 -1218 -88 1123 1891 1824 562 -238 -1465 -1798 -1447 -172 1014 1841
4986 1841 1486 920 -503 -1402 -1706 -1615 -419 672 1439 1766 739 -57 -1007 -1760 -1596 -880 530 1496
5004 1496 1746 1040 261 -871 -1658 -1572 -952 330 1535 1832 1389 580 -690 -1623 -1644 -1035 323 1092 1696
5023 1696 1262 536 -736 -1763 -1582 -1083 -17 1092 1759 1547 610 -486 -1446 -1594 -1023 81 997 1714
5041 1714 1803 815 -144 -1499 -1724 -1300 -273 1223 1680 1744 688 -167 -1440 -1722 -1279 -458 1005 1415
5059 1415 1583 1109 237 -992 -1639 -1763 -580 451 1541 1618 1045 -14 -1171 -1664 -1424 -438 326 1257
5077A257L09k29j186j119o67K21L70J453P83N16n75q44q95j051j73R84R36J165
5095A255M36l72j105o46j065k77N04J332Q88P49j6q08j299j084J39J10Q64J240
5113H45P59Q3p77j015j066n36L32R79J094P48L45r04j071r59n53M36P11J129R56
5132A536M6n61q67j207m64r1Q06J081Q70L02l64q22j285m93R8P54R97R36L96k52
5152A416r59j227o07l70Q72P02J242M90j48j026j075p26o2M19Q97R50P91l97o91
5171D91r16q15m29N21Q54J229N59J76j075j042o80o74P89Q00J060O63k30o13o86
5190a8r90p55M93M90J245Q73J50k21j158j032n78J0P71J416O53K01l13j018j041
5209h22o28J61N17J077Q85M81o50n24r44j009J06O14O92J247L80j44j007r17p83
$$ plain form
5077 1257 1566 1337 151 -968 -1635 -1414 -1044 409 1192 1708 1133 289 -606 -1657 -1830 -846 90 1255
5095 1255 1691 1319 214 -432 -1497 -1774 -1270 62 950 1699 1683 875 -424 -1508 -1369 -1259 -395 845
5113 845 1604 1687 910 -105 -1171 -1707 -1375 -396 698 1446 1791 887 -184 -1143 -1696 -1260 -549 580 1536
5132 1536 1582 1021 154 -1053 -1517 -1608 -802 279 1149 1451 1087 265 -1020 -1513 -1415 -661 336 1272 1668 1416
5152 1416 457 -770 -1377 -1747 -875 -173 1069 1559 1411 385 -690 -1416 -1478 -1059 -162 788 1579 1182 491
5171 491 -425 -1240 -1669 -1148 -294 935 1494 1670 595 -447 -1127 -1801 -1012 -212 848 1511 1281 668 -18
5190 -18 -1008 -1763 -1270 -780 465 1338 1488 1267 109 -923 -1501 -1491 -720 696 1349 1550 1237 219 -822
5209 -822 -1450 -1289 -772 305 1190 1671 1021 497 -447 -1456 -1350 -736 -44 1203 1583 1439 432 -485 -1268
5228a268j83M96P91J127L83J5n35j556m66k97L50R03J087P24k4r67r37q66l45
5247a568L66Q68Q88R22p5n89r20j029k86O2Q28J040O25M86p57r12q34o46J21O27
5267g83J183Q28K93m31j080p77n18l23R42P96R18M87k67p84r71r00j75Q94O87
5286A9J064N58m47m44j384q59p3L70R81J188N47m63m57r95j007l8K61J218J077
5305A116L93p9p26p73q86o65O35P34Q97Q60o1m18j107p89m02K15O83R05Q68j5
5325A385l07r23r29r11M45O05R64J107k6j80r70j243m33J29L90R67J062N88o40
5344A080n89j293o08j77Q30Q05J185L31k22q41j058l49o93M02J083Q42O12K0p86
5363E74j045o79k31M41R86R29L80k12o18p61r59l63M49R40R20O16k1m59r40q30
$$ plain form
5228 -1268 -1451 -955 -164 963 1346 1361 826 -730 -1196 -1493 -1143 -240 847 1571 1547 580 -357 -1223 -1568
5247 -1568 -1202 -334 554 1476 1401 812 -108 -1137 -1423 -1361 -533 507 1132 1618 861 -51 -885 -1531 -1410 -783
5267 -783 400 1228 1521 1090 10 -767 -1285 -1608 -666 130 1048 1535 1268 484 -487 -1387 -1562 -668 19
5286 19 1083 1641 1194 750 -634 -1493 -1566 -1196 -215 973 1520 1057 600 -395 -1402 -1440 -1179 39 1116
5305 1116 1509 1430 704 -69 -955 -1620 -985 -251 646 1506 1445 1027 -80 -869 -1271 -1056 -373 532 1400 1385
5325 1385 1078 155 -774 -1685 -1240 -635 329 1436 1410 1230 260 -983 -1416 -1287 -897 70 1132 1720 1080
5344 1080 491 -802 -1410 -1587 -757 48 1233 1564 1342 501 -557 -906 -1599 -1197 -114 728 1340 1360 574
5363 574 -471 -1150 -1381 -940 46 975 1355 1143 525 -236 -1195 -1558 -1109 -169 751 1367 1346 887 -53 -883
5383h83n50j68J397Q93O80J51n96j006n45o99J22P79R22O81J90m87q28p76r68
5402a691K57O54J244P27J30m08o74j133l55l34Q76J040P45L56r8r35j100m61k52
5421a412J76J407P23O66k79r71p08p72l88N24R34P04P88k39o25r97q08J05L3R73
5441a66Q27O23K00r26p02q05l97J62O07J216P14m1n27q13r55l95K48L39J179Q55
5461A243J25m84q00j190k23J06O52P45J169o2l41p38r10n68mN59P25Q16L01J94
5481A315q20q56j076K22N17Q33Q21L02J51q97j030p45P8N4J016P29Q00j90q33
5500C91q30m91l08L37N30P65Q38Qn32r19r20O1m4Q19P73J048j29n50q96j077j47
5521a273p7R19Q30O85j6l45o63j093m59J81Q11R25P68R8k35n28r97o88Q6J59R58
$$ plain form
5383 -883 -1433 -1601 -204 689 1369 1520 924 -82 -627 -1326 -1204 -425 497 1178 1368 881 53 -723 -1691
5402 -1691 -1434 -780 464 1191 1321 913 239 -894 -1249 -1583 -707 333 1078 1434 1336 401 -699 -1160 -1412
5421 -1412 -1236 171 894 1560 1281 310 -398 -1170 -1558 -1034 -100 604 1392 1153 528 -469 -1277 -1172 -1139 -166
5441 -166 661 1284 1484 558 -144 -949 -1346 -1184 -577 639 1353 1312 785 -28 -983 -1378 -1130 -791 388 1243
5461 1243 1368 884 84 -1106 -1329 -1223 -571 174 1343 1281 940 202 -708 -1276 -1280 -721 4 820 1121 1315
5481 1315 495 -361 -1437 -1215 -698 135 956 1258 1409 512 -518 -1263 -1185 -1131 -115 614 1414 1224 391
5500 391 -439 -930 -1238 -901 -371 394 1232 1240 708 -211 -1131 -1070 -1114 -295 478 1526 1397 847 -49 -1126 -1273
5521 -1273 -1350 -431 399 1084 1068 723 60 -1033 -1492 -1311 -500 425 1193 1291 1056 528 -469 -1157 -1071 -912 46
5542D6R46J73p6r64m99q53k11O52O46R99M08j35q52o85p01l61N98J021O53N81
5562A386l9p57p01r70k33O10M53Q11R62m78m59q09p84m01N40N28R02P06P6n92
5582G51q26q15k71m7N33J237L23M55k97r08q66l78o1N71J143K79M32k30r86p21
5602f82n37o3P55Q28P26L03k43m47j287m85k08P78P64Q03K62O7q25r00q75O0J64
5623a042J074P97L58K92j024p51p97k24L18R99P03N71Ln59r67o68l79N67L80Q59
5643E10Q14k79j73q78r60l96K00P80O33O71M14o72o67q71p15K52J001P30P01K68
5663A363m45q34p66m97l1O44R20Q87j14o1n85j039m71j96O57P36L60P29j42p50
5683C65q14p43k11M05J036P07O93l18n01o60j071l70N90O98N35R51j77l84j106
$$ plain form
5542 46 992 1165 1089 125 -374 -1227 -1438 -786 -140 859 1267 1132 280 -405 -1106 -1467 -869 152 805 1386
5562 1386 1347 590 -111 -1081 -1314 -704 -251 560 1522 1044 585 -224 -1008 -1409 -869 -341 561 1267 1343 751
5582 751 -75 -890 -1161 -1208 -675 562 885 1340 1043 135 -731 -1109 -1170 -599 544 823 1255 1025 39 -682
5602 -682 -1219 -1282 -527 301 1027 1330 1087 640 -647 -1132 -1340 -562 202 1005 1267 1334 509 -391 -1266 -1206 -1042
5623 -1042 32 829 1187 1479 455 -296 -1093 -1317 -999 0 703 1274 1277 718 -249 -917 -1296 -729 -349 510
5643 510 1324 1045 872 -6 -966 -1362 -1162 -382 251 922 1336 664 -3 -874 -1589 -1337 -336 394 1095 1363
5663 1363 918 84 -682 -1179 -1210 -566 354 1241 1127 1066 481 -558 -1029 -1225 -568 168 528 1257 1115 365
5683 365 -449 -1192 -1403 -998 38 745 1438 1120 619 -41 -1112 -1482 -892 -194 341 1292 1115 731 -375
5702c75p76j01L65P11N94O58O0l80p80o71l47j96P83Q71P32L10o09q01p09n03
5722a164M4M17J065O90K29l90p50r00m25J39O75L50R39K65k11p07j169k74M7J23
5742a007J202M52Q55n02n60q31o88j25M03O90Q04N97l16p62o76n34k68N99K64
5761d03J228L12K80r68o71r55O8R1M64J178N33L1n59q07j016l23N19N94J099O10
5781A305j60k75q14p58m15J16P62O72O04m4K84j160p12n93j3O92O20R01L14l45
5801I81p98n36p07j64N08P29O37O15m06l97j048l82j45K79R39Q92J27J32o12j002
5821c58n91j51K54P50Q76M92l42l81q36o83m44K94Q73P88M56R8l11q35q85k2j36
5842a094P24N67R43Q0m27p07n01q36K95N35R03N70J29j32p80j000m60L16J64Q30
$$ plain form
5702 -375 -1151 -1252 -887 -176 418 1076 1136 756 -24 -695 -1042 -1238 -455 416 1148 1458 849 48 -661 -1164
5722 -1164 -1120 -703 362 1052 1281 891 141 -759 -1184 -1045 -370 -20 919 1184 973 266 -903 -1177 -1130 -1007
5742 -1007 195 647 1502 1000 440 -391 -1079 -1204 -801 -111 693 1290 974 212 -464 -998 -1266 -667 -403
5761 -403 825 1137 1417 449 -222 -1177 -1109 -1018 -554 624 1157 1188 629 -178 -1194 -1517 -998 -404 695 1305
5781 1305 1145 870 56 -702 -1117 -1001 -239 433 1037 993 1277 117 -595 -1188 -1201 -509 111 1012 1326 981
5801 981 183 -353 -1060 -1224 -716 13 650 1265 859 462 -586 -968 -1113 -834 105 997 1124 1256 644 -358
5821 -358 -949 -1100 -846 -96 780 1272 930 549 -287 -970 -1414 -1120 -247 541 997 1095 784 -51 -936 -958 -1094
5842 -1094 -370 197 1140 1220 793 86 -415 -1251 -956 -421 482 1052 1181 1049 269 -731 -1191 -875 -711 119
5862A19Q71J90j05o36j065n40J36L82R13O79K88q3o60q49o75l51Q90L39N81P30
5882A154o7o03o52o27l32L69P08N45P05j38l61r09o10k95N2O93R59L27K19k78
5902H59p17r39m83L61O43R65K39M1Oj082p42k97KP54N39R43K21l66o43o75o92
5923a063j53N25O52J011K82m14o77o00o84p0M55P10P87M76j80o03q21n76j90L74
5943g59P06Q29L75Pn40q39o32J2M6O63N14Q37l62l75p83n95k00L43N30O52N53
5964I82l2l88n19r74k35J96O87N77P72K07o92n14q94o01M02K20J170N57J99k84
5984H36o42q12k96j28K49R65O21J48Ln37p87o23l8L39R86K48N12K6p73l46j014
6005a063j25L94P61M78O66J10n68j084m25k41l9J017O97N06O3o93l86r43l77K10
$$ plain form
5862 119 990 1180 1075 439 -626 -1166 -1030 -648 265 944 1232 1149 489 -360 -1035 -1386 -496 -157 424 1154
5882 1154 1087 484 -168 -795 -1127 -758 -50 495 1200 1062 701 -208 -818 -1113 -1061 -368 591 918 1137 859
5902 859 142 -797 -1280 -919 -276 689 928 969 975 -107 -849 -1146 -1144 -390 149 1092 1313 947 304 -371 -1063
5923 -1063 -1216 -691 -39 972 1254 840 163 -437 -1121 -1191 -736 -26 761 1237 1057 454 -367 -943 -1133 -759
5943 -759 -53 776 1151 1158 618 -221 -853 -841 -795 -132 382 1219 857 482 -301 -896 -1096 -753 -223 429 982
5964 982 950 562 43 -931 -1166 -970 -283 294 1066 1273 581 67 -827 -1428 -1026 -806 364 921 1120 836
5984 836 194 -618 -914 -1042 -793 172 793 941 944 407 -380 -1003 -1041 -702 284 532 1044 1070 297 -49 -1063
6005 -1063 -1188 -794 -33 445 1111 1221 653 -431 -856 -1097 -1136 -119 578 1084 1147 454 68 -875 -1252 -1042
6025a042Q77N67O57K07p71o84n70m19J22Q19P62M32R5j72o35j055k43L55J96Q42
6045C40N84K84j63p35n32q08j31N94N81M68O19k47n68q12m95P9J5J002M46P41
6065A262j7o97j045m81K27r7R24O53K67Ml85j065j82m35K98N78O84O76k41k67
6085F61n80r18l73L01P26N06R25k47j03r98p18n08N63L31O59Q29j31k2q88o70
6105f55l63M1L88Q44P14K46m08k89j127l68J4J98Q65P11J95M4n82o41o94oK72
6126f01O60N15N77j86o05m85q26l38K46Q84P82M61l9m27r76p04J21q3O57J128
6146G61J81j83j79o46p05k52K96L38P88P22J4l84p81o63l98J75O71O53M54l4J05
6167I33p88o43l52P3R0Q06O39K57k34n36o96n55Q5K38Q76L82N43m76j96r47l86
$$ plain form
6025 -1042 -165 402 1059 1266 495 -189 -759 -1178 -1056 -237 525 957 1052 880 245 -810 -1053 -698 -502 340
6045 340 924 1208 1045 310 -222 -1030 -1161 -567 14 482 1101 854 286 -526 -1021 -942 -927 75 521 1262
6065 1262 1245 548 -497 -978 -751 -848 76 729 996 1000 615 -450 -632 -1067 -769 -191 493 1169 928 661
6085 661 81 -837 -1210 -909 -183 323 1248 1001 898 -100 -818 -1326 -763 -432 227 1056 925 903 15 -655
6105 -655 -1018 -977 -589 255 969 1215 807 518 -609 -977 -963 -765 100 811 1006 1050 468 -173 -867 -873 -601
6126 -601 59 574 1151 965 360 -125 -951 -1289 -1043 -159 623 1084 1045 618 -358 -1062 -941 -1024 -367 761
6146 761 942 759 580 -66 -771 -1023 -727 -389 399 1121 1135 751 -30 -693 -1091 -916 -245 408 862 828 933
6167 933 145 -498 -850 -777 -687 119 758 1015 781 245 -451 -1006 -921 -683 193 575 1118 642 446 -501 -887
6188h87j42L44M88J002K89r4n22p56o57m30P20O55M28M75o1l51p48n68k25K23
6208h17O37P33M33j3k50m57j146k68L47N14N29Q38K1j15r23p12o04L39L03O49
6228C8N43L53k35r36m98j14j67L04R25L99O10l31q36n10m12r4L81P05M55L69N1
6249A000n07r29l96k9K95M60P20N82j55o25p96m03l34L15N24N05P69J1m60p42
6269a95n63l63K64P65M61M14R1l01n69p09m74L49N39P56M74r9n3o26p19l44L3
6290h69K81Q61M14K28j11n94p30n98O7N38N61P69J85K0p60m97o66l58P38M94P26
6311F99K38O0o40o02l49l00J91O75O98L23k23l84o90o90N9K59N42M19N26R2m57
6332D46o11m69k35L1N83N66P09k19k15o74l39l29j56L28P58P44j3Rq72m09p73
$$ plain form
6188 -887 -1029 -685 -197 805 1094 1000 478 -278 -935 -1365 -645 10 438 913 852 501 -247 -815 -1040 -817
6208 -817 -180 553 986 973 723 266 -880 -1148 -801 -287 242 1080 1101 986 63 -649 -1253 -914 -611 38
6228 38 581 934 699 -237 -735 -849 -1016 -712 213 612 1222 891 55 -455 -867 -961 -580 125 580 949 1000
6249 1000 493 -436 -832 -861 -566 -106 614 1196 1041 416 -380 -783 -1117 -802 -278 227 996 1007 547 -195
6269 -195 -758 -1121 -857 -92 369 783 874 573 4 -705 -1179 -830 -291 465 939 840 787 161 -558 -902 -869
6290 -869 -588 273 687 915 804 210 -520 -1118 -1051 -513 48 817 1002 1022 262 -235 -901 -1259 -521 -27 699
6311 699 937 997 357 -245 -594 -894 -703 -28 670 993 770 386 -304 -994 -935 -676 -134 285 811 903 446
6332 446 -165 -634 -869 -838 -255 311 1020 801 586 -88 -427 -756 -912 -584 174 918 905 914 42 -367 -1140
6353a140K17O66M85P90r7m9p64l27m47l77M56N35O62L40k69k36p76o18pL84N82
6374A0M08M65j43k89p70m75j92K29Q70L83K63K00m55p92l44j59j55O37Q36L58
6394H85J68l01q07m54o83K33N73Q18L19K37n40m80o52j91J12M23M46O66j14j23
6414E35l22p30l04O7L58N99N20L79m09n56m87m67P0k0M28R02M47j05n01q63l56
6435h15j58M91M65O44J75n2m63l39r42q3K67N26O43M58n8l40o73m18k12oL90Q21
6457C21M67K16l90l82r47k63K32K97O90N30J82j45m97o43m79oL26P83N83o6k07
6478F02l66o49l21m3K05R30K88J26k25k89p57m13J6Q0R13O19K62l66n16o33k12
6499g49M6M0O26M04O61p9n18p90m17p6R8Q08L40L55L83o45o82j75l32k02O44N06
$$ plain form
6353 -1140 -923 -257 228 1018 921 872 108 -219 -666 -1043 -587 -52 610 950 681 445 -331 -949 -956 -572 10
6374 10 418 883 740 451 -319 -794 -986 -757 113 496 759 959 504 -288 -632 -791 -946 -309 527 885
6394 885 1053 752 -55 -509 -1192 -959 -386 432 751 988 448 -32 -684 -875 -763 -340 106 772 658 535
6414 535 213 -517 -821 -754 -396 203 723 1102 693 137 -350 -817 -747 -767 -339 563 1010 905 404 -459 -815
6435 -815 -973 -482 -17 627 802 750 287 -52 -994 -1077 -810 -284 359 817 759 419 -254 -672 -884 -890 -500 321
6457 321 788 1004 614 232 -715 -978 -746 -449 241 771 953 808 311 -332 -811 -817 -491 292 875 809 602
6478 602 236 -413 -734 -777 -572 358 646 772 547 258 -499 -912 -896 -816 97 716 978 612 96 -537 -749
6499 -749 -703 -663 -37 367 1028 949 431 -359 -776 -852 -754 54 394 749 1132 487 -195 -370 -702 -904 -260 246
6521B46O75j4l78p30k20n19J87M26M37N23L02l42l82p70l26O6L41O15M68K56j89
6542F72n90o17o4k63N94L81M18M97l75n59n32l52j98N52O72L33N39m67k85m15
6562e9n74j88K64M67N91N05j65o24m07j46p34M55K70N64Q32j46n06m99o28k57
6582i85M98M67K28L94J37k03l31m88m67j39L22Q05M35M06o80j0q72m25L07M0P88
6603B27M09R3J48n39p70k84j39K60O58M58K81k15n01m12o19r9M07M54Q92J1J10
6624H30l68o98n16m6R3L70P01K42J67m52m96l47n77K33O64N82L81R5l14n30o70
6645f56m9J2M02N78N59m9k67q26k48k21k54Q95O15J35J52l28m54l89n08J73J43
6666e85O52O13J6K9n36k91n11k13J57Q07M24M05j11p47n16K7m62K76M17Q03J99
$$ plain form
6521 246 921 907 529 -201 -421 -940 -753 -327 110 633 935 593 211 -559 -885 -819 -478 137 605 861 672
6542 672 82 -535 -599 -862 -268 113 531 1028 653 94 -438 -790 -988 -436 236 569 1108 641 356 -59
6562 -59 -633 -821 -557 -90 501 1006 841 217 -190 -336 -1070 -615 -345 219 1051 905 399 -100 -728 -985
6582 -985 -487 -20 208 602 739 536 205 -283 -750 -889 -567 238 673 1079 399 389 -483 -908 -601 -561 227
6603 227 636 729 877 338 -432 -716 -855 -595 63 521 802 587 86 -326 -945 -1044 -637 -183 709 720 830
6624 830 462 -236 -752 -798 -705 -335 366 608 775 323 -173 -520 -1097 -864 -200 382 763 858 544 14 -656
6645 -656 -705 -693 -291 287 846 797 530 -296 -544 -765 -1019 -124 491 626 778 450 -4 -393 -901 -728 -585
6666 -585 67 680 696 725 189 -102 -613 -826 -669 138 562 967 856 109 -407 -380 -842 -566 -149 654 853
6687H53k54k68o29k00m11J28P06N44M58j25n22k78o04j94K10O41K08O65l07l89
6707B32l14l43l74j69P64M39P00l0k92m38n93n49K09J72P87L78K66k6p55l43o15
6728h94J43L72N81M56m5L0p34j23n38j62L58N04P89N8j06m31l33p32j01L37N90
6749A9N01K76l7o54k06m91m00K36O15O04L26j7k19q18k51j92o0N73L12N76l8k47
6771D08k37q87r5q2L91Q69J74K45l07l33n81m82L66J94O55J92K18j73Nr39k07
6792f06j65L95K67O07K85l21j19l50o35k38K60N91L88L51R8o75l99m21k66N45
6812d08K43L43M86P3k13q17k15n17M32L02O69qK78k00j79q81k36J72N22O04K15
6833F65J17m14k82m87l13J25K30N49P22l7m36m91l33o45L02K71N20N01J56k5n52
$$ plain form
6687 853 599 331 -298 -498 -909 -781 -75 469 927 802 280 2 -602 -796 -586 55 263 928 621 232
6707 232 -82 -425 -799 -968 -204 235 935 905 613 175 -418 -967 -758 -586 201 579 845 819 64 -279 -894
6728 -894 -751 -379 202 658 613 643 -91 -214 -752 -914 -556 -52 737 795 689 258 -75 -807 -908 -571 19
6749 19 520 796 759 105 -101 -592 -992 -756 -141 463 789 772 553 -265 -516 -708 -768 -195 117 693 655 408
6771 408 171 -716 -811 -893 -502 367 541 786 479 146 -435 -917 -551 -357 298 490 708 535 540 -399 -606
6792 -606 -771 -376 -109 498 783 462 343 -7 -642 -880 -620 -29 359 710 808 133 -266 -687 -953 -408
6812 -408 -165 178 664 737 524 -293 -508 -1025 -593 -291 378 370 648 448 269 -612 -848 -676 -154 450 665
6833 665 782 368 86 -401 -714 -589 -359 190 912 875 439 -52 -385 -1030 -728 -457 63 564 720 695 143
6854A43m70n51q5O62N16K35O1J68m26n34l99j68R4R24L45J90L9l78n12q17P9L83
6876e01O21L61J67o6l65m69k56m15L71N06L76K91j3j63k78o52m79J50O98K64P03
6897H51j70l17m20o65j6p0M59L56M56K90l03k85m30l76j37L42M48N21K14j07n02
6918A39o79k53j37K82P75N11M9no18m20l54j82N15M01M87N7k3l23m41o90L29L64
6940b16L29M43M02l50k35m68o48P6J12J95N45M48p7j03k69m51k27k26L17J039
6960F36p2r7J72o84m65j22j38N73O05M8O03m76m75m10l64K06J23K65P15Q6l45
6981C84L3o71m88J1L34M11N06K04l8l66n94l88m3J00N80L09N45k49j99m47n76
7002f42L4J86L93M94K59j63l0p97l99j36J28L96L45N48O9k2o78o05N2K07N7M24
$$ plain form
6854 143 -327 -878 -963 -301 215 450 511 679 253 -281 -680 -848 -754 170 515 705 744 366 -146 -963 -884 -501
6876 -501 120 481 648 582 217 -252 -508 -923 -552 -46 330 621 608 445 167 -485 -964 -814 -116 148 851
6897 851 681 364 -56 -721 -737 -807 -348 8 464 754 451 166 -264 -640 -777 -435 13 534 748 641 139
6918 139 -540 -793 -930 -648 127 638 687 682 64 -356 -710 -892 -377 24 511 568 545 222 -219 -909 -580 -216
6940 -216 113 556 958 608 373 -95 -743 -667 -555 -360 185 633 556 453 184 -267 -494 -720 -403 636
6960 636 564 467 639 -45 -510 -632 -770 -197 408 456 1059 583 108 -302 -666 -460 -337 -72 643 729 384
6981 384 417 -254 -742 -731 -397 14 520 724 686 320 -274 -662 -705 -605 -25 284 829 580 381 -66 -642
7002 -642 -608 -422 -29 465 724 561 531 -266 -665 -801 -673 -277 68 616 685 663 -15 -620 -568 -361 -304 120
7024A20N00J90l45m33k70p27K56L93L89O80j2k99j64m46l77P7R8O70R0K58m9m37
7046A62o51n3k84L73O05L20L57m21j00m01n17j79M97O5P52L55j22l71n39m42j24
7067g18K31M17M16K57M02o92n74q7n10M65K17O02M34j08n6n27p01m05M40K41N14
7088B58R3L48r2m01n52p8OJ56J98Q58j54p9k45o90k57J64J41J53P96K23j86o33
7110B7p1o55J39J71M68N15o8l5k59m12l40k40L51M28L45N07m98j42m99k09m8j68
7132f93N05N95L83k01k67k69o60k73K90L02N81K59j09o6m24l83k86L22K65M85
7152C56L39m7j73n20l68q4J37J7M57M54J93l7m18n63j55k19m2R40K95K87k11k25
7174D13o51j78j98K49N85L8N12k32m54m1l71m49M52J62L20K93J66l98m08l26l15
$$ plain form
7024 120 620 810 465 32 -238 -965 -709 -316 73 753 741 442 278 -168 -545 -468 -370 300 390 648 599 162
7046 162 -489 -542 -826 -453 152 472 829 408 308 -93 -610 -789 -292 -227 525 880 758 387 -152 -594 -718
7067 -718 -487 -70 346 603 1005 313 -261 -348 -858 -393 -176 426 860 752 696 169 -532 -937 -497 -256 258
7088 258 351 699 607 206 -346 -424 -418 -262 -64 794 640 561 316 -374 -631 -467 -326 -173 623 846 660 27
7110 27 -44 -699 -560 -389 79 594 526 491 232 -180 -520 -760 -409 19 364 871 373 231 -268 -477 -525 -693
7132 -693 -188 407 790 589 322 53 -607 -880 -590 -288 293 552 443 377 -47 -430 -716 -394 -129 356
7152 356 695 648 475 -45 -413 -497 -360 -343 114 568 761 724 306 -257 -412 -631 -673 267 562 849 638 413
7174 413 -238 -416 -614 -365 220 258 770 538 84 43 -328 -777 -325 -163 157 450 616 218 -190 -516 -831
7195h31L03L27O71K14j42n0l88o38j36O4M23L35L91mj96j6o85k96K67K32M46J49
7217D40M31l30l03p02o8j97L11N39N47J55k01m77o46l82L60L31L06L01L20m47
7237B88o5n43m76K62K77K40M01K96J39o80k54n42j47K73K79N34K88J91m12O6q59
7258d44k72L39L0O81L81q2m34k12m75k52J80L68M40M56J59l10m59n83j81l2M99
7279b03M99J31Q4j58n7o08l39J60J27N29L17M68l42n27n06m3K00j74N37M99J80
7300G74l18m63j47l71K14j41N94J62J93K37q24J13o67j6K1O62N63N2j90l96j92
7321a40j95q2k43M35M62N45j66k45k21m98l22L53k19R09P6L12m34l38k24k19J13
7342c41KO28J28K05Kp00j91k06j16K37N38J42J34P8l40n55l45j0L35L19O10q8
$$ plain form
7195 -831 -528 -201 470 684 542 492 104 -534 -670 -606 -183 152 543 539 343 327 -358 -654 -387 -155 291 440
7217 440 871 541 238 -464 -532 -729 -418 121 668 823 622 145 -501 -883 -523 -192 114 415 735 288
7237 288 223 -320 -796 -534 -257 -17 384 680 819 139 -115 -657 -804 -531 -252 282 570 761 349 415 -444
7258 -444 -716 -377 -347 334 715 633 199 -13 -488 -740 -560 -192 248 704 863 553 94 -489 -670 -702 -203
7279 -203 296 427 511 353 296 -312 -651 -491 -364 165 482 950 608 81 -425 -468 -268 -442 95 594 774
7300 774 456 -7 -154 -525 -311 -452 142 304 497 734 -90 23 -644 -660 -639 23 586 638 448 52 -140
7321 -140 -335 -417 -660 -225 237 782 616 371 150 -348 -670 -317 -536 373 449 761 327 -11 -235 -454 -341
7342 -341 -339 289 417 622 624 -76 -267 -473 -589 -352 186 328 462 540 200 -355 -700 -710 -375 -56 554 466
7364D66J96l00m05l59j28K62J36N24K16K06o58k71k12l96L57K37L99M04J44n74
7384B44l64l45K1j51N14L78J80J84k61l65p50j41J04N67K74K80L08l34k94m44
7404c95k42j19L68O22J06K88N3p29j02m75J79J3N12O12J86l76k92o01j33j10O1
7425e74N33M60K04K04m02q70Rl91O20J36M57K05l7k46k96n65k1J65L03M49K74
7446F17N5m21k42m98l2KL75O39L73j15n29q4p24j51J04L44L29N33Q3q1m45n55
7468d23j69M8L96J13P46q5j25k92n95k58M1L08M47L06Q1N3m88l52k07j55J95M88
7490G3L15L56j44m11m55l14j71N49N0M13L37j33l53m05j08j21k4N55J79M88j00
7511E76k32k99m80q9q3L45M31L89m3k2m48m30l74J95J80N00K07L85k23o15k1m53
$$ plain form
7364 466 662 362 -43 -402 -530 -268 -132 392 608 814 156 -115 -327 -723 -366 -129 270 674 818 244
7384 244 -120 -465 -444 -595 -81 297 477 661 400 35 -715 -856 -752 -185 89 369 677 343 49 -395
7404 -395 -637 -756 -388 234 340 628 681 -48 -150 -625 -446 -433 79 691 877 501 209 -392 -525 -635 -574
7425 -574 -41 419 623 827 425 -445 -436 -827 -207 -71 386 591 554 308 12 -553 -574 -409 -106 343 617
7446 617 672 251 9 -489 -521 -519 -144 495 868 753 224 140 -584 -735 -631 -287 42 575 658 577 132 -423
7468 -423 -592 -544 -148 -35 711 626 501 209 -386 -644 -603 -295 152 458 539 592 104 -248 -455 -610 -415 73
7490 73 388 744 600 189 -266 -580 -751 -202 -152 261 598 465 112 -293 -401 -522 -546 9 188 676 576
7511 576 344 45 -435 -524 -607 -262 169 558 515 493 45 -385 -759 -564 -384 116 323 708 485 -130 -151 -604
7533f04J83L76J22M35q0m0l44l86k24j38O81J59O0N19k26m64k50k43J2K10N3M56
7555B67J93J55l89m17l42l5p4N53M85n5J50K0p10l48j59J30L21N72K84j2m27k36
7577g4k29k01J29J21N65M8J59l16l28k55l58N64j91K59P37Kj97m34m56m08L78
7598d85K29N38L93N2m17j57k54n87J29L76K30L85L38l58k96l13l90j00L04M52
7618F9M13j31M9k96k04o12L4J13L87M25L67j35k55m60k9m23M43J41R7N79m8j62
7640C62k91o95j06K18N17M14J46k19J0j81o50p2K87K42K18K24J78k94j95n49j53
7661e89J25M21J59M05Q5J22o32l86m07j3K71L98L73M76n13l90j09n77L84j7N72
7682A58J81n2o5J6n22l45l4L71K12M67J61m8k73l81l20k58K77K49M71M22k41n
$$ plain form
7533 -604 -421 -45 77 512 432 392 48 -338 -562 -700 -19 140 200 719 493 29 -221 -464 -452 -242 -189 267
7555 267 460 615 226 -191 -533 -568 -642 -89 396 341 491 511 -199 -547 -706 -576 -255 317 601 589 162 -74
7577 -74 -303 -504 -375 -254 311 359 518 202 -126 -381 -739 -175 -366 -107 630 632 435 1 -455 -863 -485
7598 -485 -256 282 675 727 310 153 -101 -688 -559 -183 47 432 770 412 116 -197 -587 -687 -383 69
7618 69 482 351 400 104 -100 -712 -678 -565 -178 247 614 479 224 -236 -265 -688 -245 -104 -7 572 524 362
7640 362 71 -624 -730 -512 5 419 565 346 356 175 -475 -547 -260 -18 200 424 602 308 113 -436 -589
7661 -589 -464 -43 116 521 606 728 96 -290 -697 -710 -439 -41 332 808 295 -95 -204 -781 -397 -414 158
7682 158 339 287 222 238 -284 -629 -663 -292 -80 387 548 500 227 -154 -474 -732 -455 -206 265 687 446 441
7704D41n51m32k7L10O7N08j12N44n15l94k58q8KK17N23K21J29l2l70n25k00J72
7726c70m0M92K02M17m57j83m01r5m3R7M34M90K35l39k96l81l73n5K60M12M85o9
7748D22J28m76k47m03o8J50M30L14M08j93l52j39l51k56L82j18O34J77P5m06N3
7769A64o61j23k5K26O86K07L00n00k19n19M8j37L00L89M30j44k7k96l83l56rL29
7791c20M61M15j85K28m98k73m20K60K35j30P29jJ49m34n38k29n5K43K81O97J35
7812G50j69n99l90q4J0K34K62K40J90K6k09n47k54J23M6N52J96J28J13n51j01
7833c4q9l74k2M78K19K92J88r0o82k36n03K35N65L62L76k3l36l65o92J87k5J55
7855d14N87K00J06n9l05m03k26Q9J62L89L03r6O6l66j48n37L45n7K90L72L34k16
$$ plain form
7704 441 -110 -542 -569 -259 -192 316 204 748 233 -161 -419 -507 -505 -288 235 456 585 553 183 -342 -542 -370
7726 -370 -410 82 284 701 244 61 -340 -435 -478 -381 53 543 778 439 143 -238 -611 -666 -406 6 491 422
7748 422 550 74 -173 -576 -644 -494 -64 250 658 465 113 -26 -377 -633 -251 -369 265 442 517 111 164
7769 164 -497 -620 -645 -419 267 474 774 274 55 -464 -416 -553 -253 136 566 422 395 99 -284 -640 -649 -320
7791 -320 141 556 371 599 101 -172 -592 -332 -97 -227 502 501 650 216 -322 -551 -606 -363 -82 615 750
7812 750 581 -18 -408 -492 -482 -248 14 254 444 470 261 -286 -540 -417 -371 181 377 505 618 67 -34
7833 -34 -123 -497 -519 -41 178 470 658 568 -114 -350 -853 -618 -53 309 685 662 326 -39 -731 -544 -569 -414
7855 -414 173 373 479 420 115 -288 -514 -425 -263 126 429 333 399 33 -115 -652 -307 -364 -74 298 632 416
7877D16k23l00l38o8J66L75J86K96j22k06l20l82Q9m2L04P73j75K06l58m94k29
7898d46j52P5M99K88K20l7J48m75m33l09J71K57L63L71K28l14m78l86j41K0K21
7919c10M17L71N7j25l55k68l76NK11P42R2J57j2m01o02o3J04j45N24N66r3J12
7941F08m03k83k44j21m0M24L10J15J7l5m34l77k93L18M60M53M8Rk07m00k31m52
7963g58K63N01N85p4j32l6k85m25k42K73K04J58M26L13m19j74p15J6k59O63K49
7984A32K92O5l67P7n55k71J80K89O9O59j09L5r2n32m06j01M85M7M47R6N7l87j34
8007b4m64k62M74L58P9K36J35n21q8l92j25J41J88M30L93k60o8k54l12j1pK98
8029e6J70N60l3l72l03l29k04j28L49L66M48J14p1n46m16j38O0L73K52K82L37
$$ plain form
7877 416 193 -107 -445 -513 -347 28 214 510 388 182 -138 -520 -431 -473 -169 604 429 635 277 -217 -446
7898 -446 -598 -523 -24 264 484 447 595 120 -313 -622 -451 -194 169 540 768 454 -24 -410 -551 -531 -310
7919 -310 107 478 535 410 55 -213 -589 -584 -373 369 461 618 606 205 -397 -460 -356 -501 23 589 496 608
7941 608 205 -78 -322 -443 -483 -59 251 366 383 348 -86 -463 -756 -438 22 475 523 532 325 -75 -306 -758
7963 -758 -495 6 591 517 385 349 64 -361 -603 -330 -126 32 458 771 352 178 -537 -521 -780 -117 132
7984 132 424 489 122 199 -356 -627 -447 -158 -89 570 461 496 404 -128 -534 -635 -150 -103 344 440 497 110 -24
8007 -24 -488 -750 -276 82 161 397 532 11 -77 -469 -594 -453 -265 165 558 298 230 -24 -336 -347 -354 -56
8029 -56 114 674 641 269 -34 -363 -567 -695 -346 20 468 582 511 -35 -451 -589 -529 -156 96 378 715
8050G15k32k10j95n51O2K61L82K72L9p2r0o21j03j64J43K49N32N4j67L0o19l32
8072f17Q2N5M58N72k31K43k68l36o43K73NJ31M27K48K43j47o48k24q9P9K83L02
8094A98N61k11j60n78j51o21L29N06M56O2j9r2j10o35n9Q1K24K40M09K26l55k9
8116B72k62n25j32K27N57ML05N4m64j53n24M4K80J77K83N31k13l08r6q06L42Q8
8138c19L29K93K59o4j81m23m06J55n9L07K80K42K74m44k14m35j00r6M81M39L4
8159C52K70k24l96m46J30j51J68N44K58k02L19n85l29j77l4L84J62K50L55j54
8179D94n48m39J19k47jM61O25P1j7l22j21o71
$$ plain form
8050 715 483 273 78 -473 -411 -150 232 504 543 471 381 -240 -343 -507 -364 -115 417 471 304 334 -285 -617
8072 -617 -535 -480 -22 550 319 562 294 -42 -685 -412 -407 -276 151 399 642 495 -153 -377 -466 -387 -104 198
8094 198 759 548 388 -190 -341 -962 -633 -127 329 391 372 280 170 -465 -524 -443 -219 21 430 656 301 272
8116 272 10 -515 -647 -420 137 141 446 500 36 -117 -641 -597 -317 -140 143 674 461 153 57 -749 -407 -319
8138 -319 10 303 562 498 317 -106 -512 -357 -416 -109 171 413 687 243 29 -406 -506 -602 -121 318 352
8159 352 622 398 2 -444 -314 -465 -297 247 505 303 622 37 -292 -469 -503 -119 43 293 648 494
8179 494 -54 -493 -374 -621 -622 -161 464 535 518 196 75 -596
8191e96
$$ Imaginary data points
##PAGE= N=2
##DATA TABLE= (X++(I..I)), XYDATA
0@%%%%%%%%%qQqJ6j6K4l2M0m9N7p2Q8j04J21j39J64j95K26k64L06l50M03m60N24
33B80n94O69p58Q54r57J070j193J330j479J641j818K013k228K459k712K990l293
50a726L629l999M406m860N368n940O583p316Q171r172J0362j1809J3612j5933
64h624J9043k3463L0295m2372P0140k56954o2564M20561J80620J43651p6051k71046
76A23236l81234j71583J2056J57816K56223L26064J52381r5476k52507k61326
86a34350k42225r1700J49044L19216K78214J48853k2219k05197l24008k50189
96c74561o1393J30776K52392K81303J75766r639j88835k76224k39939r5894P9829
107c26419K22083K75694K04464K3372j62156k58686k45281j36640M9596K27306
$$ plain form
0 0 0 0 0 0 0 0 0 0 0 -8 0 -8 8 -8 16 -16 24 -25 32 -40 48 -56 65 -74 90 -105 121 -143 163 -187 216 -244 280
33 280 -314 355 -403 451 -506 564 -629 701 -778 863 -955 1058 -1170 1289 -1423 1567 -1726
50 -1726 1903 -2096 2310 -2550 2818 -3122 3461 -3855 4316 -4856 5506 -6303 7309 -8624
64 -8624 10419 -13044 17251 -25121 45019 -211935 -274499 146062 326682 470333 394282 123236
76 123236 -257998 -429581 -417525 -259709 -3486 322578 474959 379483 126976 -134350
86 -134350 -376575 -468275 -319231 -15 278199 427052 404833 199636 -124372 -374561
96 -374561 -435954 -305178 -52786 228517 404283 394644 205809 -70415 -310354 -406248 -326419
107 -326419 -104336 171358 375822 399194 237038 -21648 -266929 -403569 -353973 -126667
117a26667K80386J88604L6351j19022k44619k62462j30755N2406J77359K33422
127H5003K14489Q1237j09966k27321k28204j52717j5474J55740K58200K18076
137B79063Q0802p2901j97302k48201j76958r104J48659K22701K07284J09984m8701
148B95326j88793k29288j65405m0514J00519K07923K20848J25560k4778j57659
158A43739k20508j89575o9506Q8852K03930K16900J33223k783j40102k17666j88912
169b42408p2294O8221J72979K06165J48657J8931j17662j96878j88602r9524L5849
180b66566J60099K10205J59341L7693r6373j90132j98171j10783K7515J46076
190a21096J97053J62433N3144p9895j73911j87233j19876R00J22042J87936J68670
$$ plain form
117 -126667 153719 342323 378674 259652 15033 -247429 -378184 -325778 -148419 85003
127 85003 299492 380729 270763 43442 -184762 -337479 -352953 -197213 60987 279063
137 279063 359865 286964 89662 -158539 -335497 -344601 -195942 26759 234043 344027 295326
148 295326 106533 -122755 -288160 -328674 -228155 -20232 200616 326176 301398 143739
158 143739 -76769 -266344 -335850 -246998 -43068 173832 307055 304272 164170 -53496 -242408
169 -242408 -314702 -246481 -73502 132663 281320 300251 182589 -14289 -202891 -302415 -266566
180 -266566 -106467 103738 263079 300772 204399 14267 -183904 -294687 -267172 -121096
190 -121096 75957 238390 291534 211639 37728 -149505 -269381 -268481 -146439 41497 210167
201B10167P3581n4676j59099j91428j35481j7283J07933J82712J74588Q6175m1794
212B35395j48247j84243j39374l2153R0720J69674J70457R6577j8507j27584j78744
223f6029j48213m9942O8392J57268J75540J13242k388j15825j73931j53813o5010
234b60709N4263J49299J72393J17107J2583r6254j64771j56731p5529L6033J29226
245h3090J67737J30630L1824q1723j55236j58689r2510J6903J21014J67532J35028
256A99420M3988o4913j46187j61671j00166O043J04401J56796J41168N9547n0300
267A88126j34580j56138j10701j5650R0222J53698J45051P1287l2613j22679j58113
278h2090j19839k6198P7308J44008J46572Q3571j9282j11569j52013j23925m1004
$$ plain form
201 210167 283748 229072 69973 -121455 -256936 -274219 -166286 16426 191014 277189 235395
212 235395 87148 -97095 -236469 -268622 -177902 -8228 162229 258806 240299 112715 -66029
223 -66029 -214242 -264184 -195792 -38524 137016 250258 247870 132045 -41886 -195699 -260709
234 -260709 -206446 -57147 115246 232353 244936 148682 -16089 -172820 -248349 -212316 -83090
245 -83090 84647 215277 247101 165378 10142 -148547 -241057 -224154 -103140 64392 199420
256 199420 243408 178495 32308 -129363 -229529 -223486 -119085 37711 178879 238426 188126
267 188126 53546 -102592 -213293 -228943 -138721 14977 160028 231315 198702 76023 -82090
278 -82090 -201929 -228127 -150819 -6811 139761 223332 204050 92481 -59532 -183457 -224461
289b24461O0563J34548J47823R3144l007r7311j47361j31049n4920M6714J26102
300d9215J47367J02072J1223q5010j42142j33975o5194L2666J13585J45054J09766
311A86197K4453p0936j33430j35584p7152J6440J02829J42047J15524L8688n5851
322A53225j25555j37766q6838K688R0597J36685J21826N0956m3156j15674j36323
333h9335r5615j1423P7644J31416J24106O2558k8172j05508j34661j02799k4940
344a96729O4535J24186J27507P2506j4753r4629j31632j09108l6742N2120J16122
355b6617J27687Q1619j578q4095j27129j12615m8092L8567J07615J27805Q8928
366A72095J0524p1544j21682j17589n8055K7421R8096J24832R6375K3566o1481
$$ plain form
289 -224461 -163898 -29350 118473 211617 208610 111299 -36062 -167111 -222031 -175317 -49215
300 -49215 98152 200224 211447 126437 -15705 -149680 -214874 -182208 -68623 76431 186197
311 186197 210650 139714 6284 -129300 -206452 -190012 -87183 54864 170388 209076 153225
322 153225 27670 -110096 -196934 -194246 -103649 33036 154862 205818 162662 46988 -89335
333 -89335 -184950 -196373 -118729 12687 136793 199351 171179 65671 -68990 -171789 -196729
344 -196729 -132194 -8008 119499 192005 177252 82623 -49009 -158117 -194859 -142739 -26617
355 -26617 101070 182689 181111 97016 -30113 -142728 -190820 -152253 -44638 83167 172095
366 172095 182619 111075 -10607 -128196 -186251 -158830 -60734 64098 160473 184039 122558
377A22558j16388j17273o6865J2527Q8440J24281J00423L2722m7478j07401j20244
388i4698p6345L078P7837J17392J06198M6118l7322j01899j18112q2534j1076
399a71363O7349J15758J08288N2751k4144r0994j18288r0334j9614N6682J06154
410g755J11022O5028j3604q3796j13251r4682l4107M5129J03594J11140P0203
421A58921k37p2321j12763r9563m0569L3870R2126J11862P9884R314o3676j04675
433g827j02013n4026K2411Q7275J09842Q3391K2890n1444j03575j05379n8074
444a56529J1196P6506J08869R0722K8702m3005r3632j04835o8483J303O9705J03543
456B4062R2294M1815l0972r0731j05693p2091j0005N7765J03645R8065M5333k3267
$$ plain form
377 122558 6170 -111103 -177968 -165441 -77001 47280 147703 180425 132947 25546 -94698
388 -94698 -171043 -167965 -90128 27264 133462 179580 142258 40359 -77753 -160287 -171363
399 -171363 -104014 11744 120032 172783 148639 57645 -60643 -150977 -170591 -113909 -7755
410 -7755 103267 168295 154691 70895 -42356 -137038 -171145 -126016 -22422 88718 158921
421 158921 158684 86363 -26400 -125963 -166532 -132662 -40536 71326 151210 160524 96848 -7827
433 -7827 -109840 -163866 -141455 -54180 55662 139053 161943 110499 6924 -98455 -156529
444 -156529 -145333 -68827 40042 130764 159466 116461 22829 -82006 -150489 -149186 -79481 24062
456 24062 116356 158171 127199 36468 -69225 -141316 -151321 -93556 10089 108154 153487 130220
468A30220p9121j04611q1552j6429N2442R3573R5887N8317j0361p6008j01882
479c9525q1248k9860L7369R2274J02404O1365l282o3097r9548r1623l6078L4692
491a16157Q3798R6492P0602R247n9244r6055q7549m5052J8123P7395J00254P4300
503A26154J6971m6302r0545r4952n3728J2205P1281R6916P9417K6823l9702q7027
515A7511r3471n8324J661O1921R3772Q2323L4817k7996p9401r3775o6130r014
527a36106N2294R1986Q7742M2571j9472p2946r5277p2372j4839M6439Q5846Q7578
539H3444N0408j1221o7290r0468p3757k5635L4341Q1407Q9589N6246p78n6695
551F9591q9479q1783l3881K9057P5705Q9312O4016P463n3777q6198p9712m0328
$$ plain form
468 130220 51099 -53512 -135064 -151493 -99051 -5478 90409 148726 138365 62357 -39525
479 -39525 -120773 -150633 -113264 -20990 81414 142779 139497 76400 -23148 -114771 -150849 -116157
491 -116157 -32359 64133 134735 143982 84738 -11317 -98866 -143918 -125795 -48400 51854 126154
503 126154 143125 96823 6278 -88674 -142402 -130197 -58916 38000 117417 144240 104538 17511
515 17511 -75960 -134284 -132623 -70702 23070 105393 140210 112214 32813 -60962 -127092 -136106
527 -136106 -83812 8174 95916 138487 119015 46069 -49208 -121580 -136419 -89980 -4134 83444
539 83444 133852 122631 55341 -35127 -108884 -134519 -100178 -18771 70818 127064 126286 69591
551 69591 -19888 -101671 -135552 -106495 -30790 58522 122538 130001 76224 -9974 -89686 -130014
563a30014J8322O9912Q7916O5862J5780m1030q0525q4074m8485R298O2394Q6553
575C1909P3547K5185l5788p9041q4180n3463J462N7582Q5814P2652K9470k5802
587I9347p0800q4633n7463o166M6015Q0286P7642L9538j7116o5173q4225o5171
599a07919j6528M1740P9984P8933M4054r930o0012q3489o6352k0700L2552P1183
611a6484Q0125N0159j982n0584p8249p1966l1929K4521O8061P9892N7463Q517
623A17544m6907p9211p3530l5296J6671O2851Q0320N9807J2051l8324p1058p4557
635f9639m3364R626N5418P5656O4189K4304l0119p0093p6112m8821K41N0077P8057
648A9420O8102K6839k4902o4665p5689n2494m884M4551P1822O7569L4387j5237
$$ plain form
563 -130014 -111692 -41780 46136 111998 127778 86748 6223 -77851 -126336 -117038 -54644 31909
575 31909 105456 130641 94853 15812 -68368 -121831 -120369 -62787 23027 95679 125149 99347
587 99347 28547 -56086 -113549 -119715 -73700 6586 84228 123766 106650 41477 -42748 -107919
599 -107919 -124447 -82707 -2723 76210 120264 110334 50322 -33167 -99519 -120219 -87667 -16484
611 -16484 63641 113800 111818 61234 -17015 -88981 -120910 -96389 -28328 51564 109027 117544
623 117544 70637 -8574 -82104 -117400 -100729 -37878 42442 102249 114300 75976 4918 -69639
635 -69639 -113003 -103377 -47959 27697 91886 116190 86071 15978 -60134 -108955 -108714 -58637 19420
648 19420 87522 114361 89459 24794 -50895 -103389 -108273 -63722 8100 75669 110056 94819
660I4819n8537p4994n6732j4449L5716O9667P2144M1172q673n4949p4692o1092
672i0600j9230L0668O6345P2372M3641l312m7319p0527o3176k5978K2883O0218
684b4015P0432N0584O922m1159p0040o6259l2471J5038N6961P2683N4791J0752
696A04219l6057o6092o7171l7337J0098N1181O8385N6588J9268k8253o1785o7093
708e4049m2871J41M4307O9197O0936K5133k1070n8972o9510m7645l185L9954O5085
721G451O2255L0426j6128n3495o5968m9953j2600L2077O2965O3074L5249o656
733H8697m6740o7426n5526j7850K7318N9018O4811M1385k128m4683o4573n5706
745g3403k2744K0346N5135O4205M3505M276l6664o0746n8701k9825J3793N1021
$$ plain form
660 94819 36282 -38712 -95444 -109893 -74177 -4510 67634 108806 100133 45184 -29508 -90600
672 -90600 -109830 -79162 -12817 59555 103196 99884 52565 -17962 -81138 -107116 -84233 -24015
684 -24015 46417 97001 103923 62764 -7276 -73535 -106006 -90968 -34007 38676 93467 104219
696 104219 68162 2070 -65101 -102438 -92340 -41159 27226 83814 103082 74829 13044 -54049
708 -54049 -96920 -96779 -52472 16725 77661 102794 81724 22752 -46758 -94403 -97588 -57634 7451
721 7451 69706 100132 84004 30509 -35459 -85412 -98012 -65935 -2970 60104 95353 88697
733 88697 41957 -25469 -80995 -98845 -71527 -12509 52302 93687 91559 46876 -17697 -73403
745 -73403 -96147 -75801 -20666 43539 87044 91320 54656 -6090 -64791 -94616 -80823 -29802
757b9802O3856M7610J1879l1315o0385o1251l2591R521M5177O2642N2294J5275
769I2910k7988n5030n8546l8089N94M1553O1282N1847K1512j7256n2085o2501
781d1797m2191k838L4860N8292N6482K7660j4960m9055n9174m4643j0269L0120
793e7513N6587N5712L0813p553m2472n8896m8024j5982K3625N2466N8122L5804
$$ plain form
757 -29802 34054 81664 93543 62228 1843 -59408 -91999 -82478 -37301 25341 77635 92910
769 92910 64922 9892 -48654 -86743 -86149 -44596 16686 68533 90045 72789 20704 -41797
781 -41797 -83988 -86826 -51966 6326 62808 90468 75508 26453 -32721 -77364 -87633 -57513
793 -57513 -926 54786 85599 78046 35574 -23322 -71346 -87328 -63703 -11237 46885 82689
$$ [...]
8191f7
##END NTUPLES=NMR FID
##END=
