##TITLE=1H_AP-13_HCl
D2O
 8 sc, 
 2.11.2023
##JCAMPDX= 6.0         $$ Bruker NMR JCAMP-DX V2.0
##DATA TYPE= NMR FID
##DATA CLASS= NTUPLES
##ORIGIN= UXNMR, Bruker Analytische Messtechnik GmbH
##OWNER= root
$$ XWIN-NMR		Version 3.5
$$ Thu Nov  2 17:38:27 2023 Russian Standard Time (UT+4h)  she@DPX200
##.OBSERVE FREQUENCY= 200.1305
##.OBSERVE NUCLEUS= ^1H
##.DELAY= (6, 6)
##.ACQUISITION MODE= SIMULTANEOUS
##.ACQUISITION SCHEME= undefined
##.AVERAGES= 8
##.DIGITISER RES= 18
##SPECTROMETER/DATA SYSTEM= spect
##.PULSE SEQUENCE= zg30
##.SOLVENT NAME= D2O
##.SHIFT REFERENCE= (INTERNAL, D2O, 0, 15.7039)
##AUDIT TRAIL= $$ (NUMBER, WHEN, WHO, WHERE, WHAT)
$$ ##TITLE= Audit trail, XWIN-NMR		Version 3.5
$$ ##JCAMPDX= 5.01
$$ ##ORIGIN= Bruker BioSpin GmbH
$$ ##OWNER= she
$$ F:/spectra/data/she/nmr/H-F/1/audita.txt
$$ ##AUDIT TRAIL=  $$ (NUMBER, WHEN, WHO, WHERE, WHAT)
(   1,<2023-11-02 17:36:45.28 +0400>,<she>,<DPX200>,
      <created by zg, POWCHK disabled, PULCHK disabled
       configuration hash MD5:
       00 E9 B6 7A A2 85 ED C7 34 08 36 98 17 FE 4E 26
       data hash MD5: 16K
       37 B4 32 84 5A 97 BF 2F F1 53 09 C9 79 B9 87 8F>)
$$ ##END=
$$ 
$$ hash MD5
$$ E4 00 A9 2D E6 2B 6D 4E 33 8B 0B B9 DC D3 EB FC
##$RELAX= 
##$RELAX= 
##$RELAX= 
##$RELAX= 
##$RELAX= 
##$RELAX= 
$$ Bruker specific parameters
$$ --------------------------
##$DU= <F:/spectra>
##$EXPNO= 1
##$NAME= <H-F>
##$PROCNO= 1
##$TYPE= <nmr>
##$USER= <she>
##$AMP= (0..31)
100 100 100 100 100 100 100 100 100 100 100 100 100 100 100 100 100 100 
100 100 100 100 100 100 100 100 100 100 100 100 100 100 
##$AQSEQ= 0
##$AQ_mod= 1
##$AUNM= <au_zg>
##$AUTOPOS= <>
##$BF1= 200.13
##$BF2= 200.13
##$BF3= 200.13
##$BF4= 200.13
##$BF5= 200.13
##$BF6= 200.13
##$BF7= 200.13
##$BF8= 200.13
##$BYTORDA= 1
##$CFDGTYP= 0
##$CFRGTYP= 5
##$CHEMSTR= <none>
##$CNST= (0..31)
1 1 145 1 1 1 1 1 1 1 1 1 1 1 1 1 1 1 1 1 1 1 1 1 1 1 1 1 1 1 1 1 
##$CPDPRG= <>
##$CPDPRG1= <>
##$CPDPRG2= <>
##$CPDPRG3= <>
##$CPDPRG4= <mlev>
##$CPDPRG5= <mlev>
##$CPDPRG6= <mlev>
##$CPDPRG7= <mlev>
##$CPDPRG8= <mlev>
##$CPDPRGB= <>
##$CPDPRGT= <>
##$D= (0..31)
0 1.2 0 0 0 0 0 0 0 0.06 0 0.03 0 0 0 0 0.0002 0 0 0 0 0 0 0 0 0 0 0 0 
0 0 0 
##$DATE= 1698932204
##$DBL= (0..7)
120 120 120 120 120 120 120 120 
##$DBP= (0..7)
150 150 150 150 150 150 150 150 
##$DBP07= 0
##$DBPNAM0= <>
##$DBPNAM1= <>
##$DBPNAM2= <>
##$DBPNAM3= <>
##$DBPNAM4= <>
##$DBPNAM5= <>
##$DBPNAM6= <>
##$DBPNAM7= <>
##$DBPOAL= (0..7)
0.5 0.5 0.5 0.5 0.5 0.5 0.5 0.5 
##$DBPOFFS= (0..7)
0 0 0 0 0 0 0 0 
##$DE= 6
##$DECBNUC= <off>
##$DECIM= 32
##$DECNUC= <off>
##$DECSTAT= 4
##$DIGMOD= 1
##$DIGTYP= 9
##$DL= (0..7)
0 120 120 120 120 120 120 120 
##$DP= (0..7)
150 150 150 150 150 150 150 150 
##$DP07= 0
##$DPNAME0= <>
##$DPNAME1= <>
##$DPNAME2= <>
##$DPNAME3= <>
##$DPNAME4= <>
##$DPNAME5= <>
##$DPNAME6= <>
##$DPNAME7= <>
##$DPOAL= (0..7)
0.5 0.5 0.5 0.5 0.5 0.5 0.5 0.5 
##$DPOFFS= (0..7)
0 0 0 0 0 0 0 0 
##$DQDMODE= 0
##$DR= 18
##$DS= 0
##$DSLIST= <SSSSSSSSSSSSSSS>
##$DSPFIRM= 0
$$ [...]
##$SUBNAM2= <"">
##$SUBNAM3= <"">
##$SUBNAM4= <"">
##$SUBNAM5= <"">
##$SUBNAM6= <"">
##$SUBNAM7= <"">
##$SUBNAM8= <"">
##$SUBNAM9= <"">
##$SW= 18.0518050122584
##$SWIBOX= (0..15)
0 0 2 0 0 0 0 0 0 0 0 0 0 0 0 0 
##$SW_h= 3612.71676300578
##$TD= 16384
##$TD0= 1
##$TE= 0
##$TE2= 300
##$TE3= 300
##$TEG= 300
##$TL= (0..7)
0 120 120 120 120 120 120 120 
##$TP= (0..7)
150 150 150 150 150 150 150 150 
##$TP07= 0
##$TPNAME0= <>
##$TPNAME1= <>
##$TPNAME2= <>
##$TPNAME3= <>
##$TPNAME4= <>
##$TPNAME5= <>
##$TPNAME6= <>
##$TPNAME7= <>
##$TPOAL= (0..7)
0.5 0.5 0.5 0.5 0.5 0.5 0.5 0.5 
##$TPOFFS= (0..7)
0 0 0 0 0 0 0 0 
##$TUNHIN= 0
##$TUNHOUT= 0
##$TUNXOUT= 0
##$USERA1= <user>
##$USERA2= <user>
##$USERA3= <user>
##$USERA4= <user>
##$USERA5= <user>
##$V9= 5
##$VALIST= <valist>
##$VCLIST= <CCCCCCCCCCCCCCC>
##$VD= 0
##$VDLIST= <DDDDDDDDDDDDDDD>
##$VPLIST= <PPPPPPPPPPPPPPP>
##$VTLIST= <TTTTTTTTTTTTTTT>
##$WBST= 1024
##$WBSW= 4
##$XGAIN= (0..3)
0 0 0 0 
##$XL= 0
##$YL= 0
##$YMAX_a= 406945
##$YMIN_a= -493504
##$ZGOPTNS= <>
##$ZL1= 120
##$ZL2= 120
##$ZL3= 120
##$ZL4= 120
##$ABSF1= 10
##$ABSF2= 0
##$ABSG= 5
##$ABSL= 3
##$ALPHA= 0
##$AQORDER= 0
##$ASSFAC= 0
##$ASSFACI= 0
##$ASSFACX= 0
##$ASSWID= 0
##$AUNMP= <proc_1d>
##$AZFE= 0.1
##$AZFW= 0.1
##$BCFW= 1
##$BC_mod= 2
##$BYTORDP= 1
##$COROFFS= 0
##$CY= 11.3945322036743
##$DATMOD= 1
##$DC= 2
##$DFILT= <>
##$DTYPP= 0
##$F1P= 15.7292609196834
##$F2P= 12.9074282941183
##$FCOR= 0.5
##$FTSIZE= 0
##$FT_mod= 4
##$GAMMA= 1
##$GB= 0.15
##$INTBC= 1
##$INTSCL= 1
##$ISEN= 128
##$LB= 0.24
##$LEV0= 0
##$LPBIN= 0
##$MAXI= 10000
##$MC2= 0
##$MEAN= 0
##$ME_mod= 0
##$MI= 1.114404
##$NCOEF= 0
##$NC_proc= 0
##$NLEV= 6
##$NOISF1= 3.799351
##$NOISF2= 2.8
##$NSP= 1
##$NTH_PI= 0
##$NZP= 0
##$OFFSET= 15.70392
##$PC= 1
##$PHC0= -23877.94
##$PHC1= 10.05269
##$PH_mod= 1
##$PKNL= yes
##$PPARMOD= 0
##$PSCAL= 0
##$PSIGN= 0
##$REVERSE= no
##$SF= 200.130013532006
##$SI= 16384
##$SIGF1= 3
##$SIGF2= 2
##$SINO= 400
##$SIOLD= 16384
##$SREGLST= <1H.CDCl3>
##$SSB= 0
##$STSI= 0
##$STSR= 0
##$SW_p= 3612.71676300578
##$SYMM= 0
##$S_DEV= 0
##$TDeff= 0
##$TDoff= 0
##$TI= <>
##$TILT= no
##$TM1= 0
##$TM2= 0
##$TOPLEV= 0
##$USERP1= <user>
##$USERP2= <user>
##$USERP3= <user>
##$USERP4= <user>
##$USERP5= <user>
##$WDW= 1
##$XDIM= 8192
##$YMAX_p= 0
##$YMIN_p= 0
$$ End of Bruker specific parameters
$$ ---------------------------------
##NTUPLES= NMR FID
##VAR_NAME=  TIME,          FID/REAL,        FID/IMAG
##SYMBOL=    X,             R,               I
##VAR_TYPE=  INDEPENDENT,   DEPENDENT,       DEPENDENT
##VAR_FORM=  AFFN,          ASDF,            ASDF
##VAR_DIM=   8192,          8192,            8192
##UNITS=     SECONDS,       ARBITRARY UNITS, ARBITRARY UNITS
##FACTOR=    0.0002768,     1,               1
##FIRST=     0,             0,               0
##LAST=      2.2672688,     0,               0
##MIN=       0,             -493504,         0
##MAX=       2.2672688,     406945,          0
$$ Real data points
##PAGE= N=1
##DATA TABLE= (X++(R..R)), XYDATA
0@%%%%%%%%%%%%QqQj6J6j6J6k2L0l2M0n2O0p2Q0q8J04j20J38j62J84k08K37k65
36a40K99l36L74m18M66n21N81o42P11p86Q69r62J059j164J283j413J558j718J894
55I94k094K320k578K875l219L630m127M736n514O542p974J0119j3721K1280o5742
70e2473J71300K55834k4690k19294l35881k23613q431K29395L13573K34811P415
81C47946k04247k99007k04475N845K23847L04785K14809k702k13808l05235k14019
92c46261m311K07148K94505K13574N212k01027k91399k11962j4308J89679K78636
103A19486K05537J3584j82329k69180j95885r931J81447K64447J90700M209j84854
114A37231k68133j97148j2655J77115K62105J95067J6310j70083k56522j92088
$$ y = [0, 0, 0, 0, 0, 0, 0, 0, 0, 0, 0, 0, 0, 8, 0, 8, -8, 8, -8, 8, -14, 16, -16, 24, -28, 32, -40, 40, -48, 56, -64, 74, -88, 96, -112, 125, -140, 159, -177, 197, -221, 245, -276, 305, -337, 374, -412, 457, -505, 554, -610, 673, -740, 818, -900, 994, -1100, 1220, -1358, 1517, -1702, 1928, -2199, 2537, -2977, 3565, -4409, 5710, -8011, 13269, -52473, 118827, 374661, 349971, 130677, -205204, -428817, -437248, -207853, 105720, 340531, 347946, 143699, -155308, -359783, -353938, -130091, 174694, 389503, 386801, 172993, -132242, -346261, -350572, -143424, 151081, 364655, 369867, 168840, -122559, -334521, -348829, -159150, 119486, 325023, 338607, 156278, -112902, -308787, -318718, -137271, 127176, 317876, 322085, 137231, -130902, -328050, -340705, -163590, 98515, 293582, 309892, 139809, -116713, -308801]
124c08801j8360J64891K50961J91888K3564j54431k37644j79591j5748J57386
134a25885K37572J78873J5100j57994k37848j79920j8953J52197K34428J79656
144B77226K0292j48823k31891j81135k7422J39735K23170J75248K6807j35301
154A37906k16831j70521k4669J34272K13477J67395K3896j33951k12394j67236
164b48656k3885J32870K12715J69609L0019j27199k07988j68537l2044J20897
174a42199K02775J66262L3298j16976j96978j61838l2804J14728J93262J58135
184B17665L0233j15036j93196j58491l2105J13319J92791J59246L5211j09639
194A39998j89522j59919l7779J05284J85163J57751L9363j01083j80840j54257
$$ y = [-308801, -327161, -162270, 88691, 280579, 304143, 149712, -87932, -267523, -283271, -125885, 111687, 290560, 305660, 147666, -90182, -270102, -289055, -136858, 97570, 277226, 297518, 148695, -83196, -264331, -291753, -152018, 71152, 246400, 273207, 137906, -78925, -249446, -274115, -139843, 73634, 241029, 264925, 130974, -81420, -248656, -272541, -139671, 73044, 242653, 272672, 145473, -62515, -231052, -263096, -142199, 60576, 226838, 260136, 143160, -53818, -215656, -248460, -133732, 59530, 217665, 247898, 132862, -60334, -218825, -250930, -137611, 55180, 214426, 249637, 139998, -49524, -209443, -247222, -141938, 43225, 200976, 240339, 139256, -41584, -195841]
204a95841l8224R9147J77558J51666L7016r9207j77296j50904l7419R8297J76249
215D1042J52684L9603r5581j73891j51888m2213R1707J71567J50796M2845q8210
226A38461j67340j48256m2809Q6852J64631J45511M1444q6916j63801j45389m1820
237b19432Q5625J62560J45324M3118q3597j61334j45093m4628Q0798J58486J45042
248A66869M6587p7677j55308j41927m6167P5897J53431J40462M5796p5579j51956
259a9572j39933m6409P3800J50543J39338M7186p2312j49839j39723m8701P0143
270a35479J47677J38441N0191o7050j44803j37029m9702O5801J42802J35706M9885
281A96440o5121j41105j34601n0099O3804J40046J34350M9934o2612j38452j33618
$$ y = [-195841, -234065, -134918, 42640, 194306, 231322, 132115, -45181, -196085, -233504, -135207, 41042, 193726, 233329, 137748, -36143, -188031, -230244, -138537, 33030, 183826, 226671, 138461, -28879, -177135, -219944, -133092, 31539, 177050, 218494, 131578, -32223, -177612, -219432, -133807, 28753, 174077, 217195, 133598, -27736, -172829, -217457, -136659, 21827, 166869, 213456, 135779, -19529, -161456, -207623, -131726, 21705, 162167, 207963, 132384, -19572, -159505, -205914, -132114, 18429, 157767, 204953, 132641, -17198, -156921, -205622, -135479, 12198, 150639, 200830, 133780, -11023, -148052, -197754, -131953, 10849, 146555, 196440, 131319, -9786, -144387, -194486, -130682, 9364, 143714, 193648, 131036, -7416, -141034]
292a41034n1487O0443J37241J33192N2173n8933j35050j31774n2199N7449J33078
303C099J29955N1921n6432j31111j29562n2021N5474J29845J28840N2303n4121
314A28190j28789j27669n2592N3218J26890J26949N3252n1818j25316j25686n3206
325a76577M9814J23432J25148N2961m9057j21819j23641n3856M8019J20837J22834
336A18095N3268m6353j18845j22052n4185M5541J18245J20948N4178m4153j16597
347H090j20160n4895M3309J14148J19126N4972m1732j13313j18265n4622M0597
358a22745J11326J17861N4722l9382j10018j16268n5040L8413J09300J16061N5185
369A59415l7397j07695j15238n5655L6097J05936J13970N5458l5279j04995j13593
$$ y = [-141034, -192521, -132078, 5163, 138355, 190528, 131595, -3455, -135229, -187428, -129979, 3099, 133054, 184975, 128543, -2568, -132130, -184151, -128677, 1168, 130008, 182311, 128190, -599, -128268, -180860, -127642, -752, 126197, 179449, 127631, 2315, -123371, -176577, -126763, -3331, 121817, 174778, 125721, 3902, -119739, -173595, -125576, -4739, 118095, 171363, 125010, 6165, -115887, -170072, -124531, -6286, 114662, 168840, 124687, 8090, -112070, -166965, -123656, -9508, 109618, 164590, 122858, 9545, -108720, -163342, -122745, -11419, 106442, 161164, 121782, 11764, -104504, -159544, -121131, -11831, 104230, 159415, 122018, 14323, -100915, -156570, -120473, -14537, 99433, 154891, 119612, 14617, -98976]
380i8976n5891L4322J03488J12662N5689l2783j01846j11659n5683L2768J01302
391a6607J11135N6581l1486j00215j10281n6718K9554R8350J09526N6630k9524
402A16945r7426j08818n6759K8236R6300J07969N6615k7277r4501j06676n6877
413a42269K6971R4353J06290N7128k5304r3069j06281n7878K4136R1088J04948
424H0113N7564k3520r0035j04325n7554K2196Q9149J03834N8239k0997q7861j02640
436g5837n7567K0743Q7049J02328N8806j9916q6445j02814n9333J7723Q4070J01138
448F9945N8912j7413q3007j00729n9170J7054Q2674R9949N9866j5209q0710r8508
460f6346n8763J5904Q0530R9023N9406j4358p9892r9405o0805J2364P7090R7236
$$ y = [-98976, -154867, -120545, -17057, 95605, 151294, 118511, 16665, -94994, -150677, -117909, -16607, 94528, 151109, 119623, 19408, -90873, -147591, -118037, -19687, 89839, 146469, 116945, 19519, -89299, -146058, -117822, -21522, 86447, 143062, 115785, 21284, -85392, -142269, -115298, -20945, 85345, 142473, 117169, 24100, -82181, -140059, -115923, -24835, 80113, 137677, 114157, 24122, -80203, -137757, -115561, -26412, 77422, 135661, 114664, 26803, -75837, -133404, -112661, -25612, 76716, 135522, 115606, 29161, -73653, -132986, -115263, -31193, 69945, 128857, 111444, 28437, -72292, -131462, -114408, -31734, 68215, 128081, 112872, 32162, -66346, -125109, -109205, -28675, 70348, 129754, 115396, 35504, -63901, -124706, -112342, -35252, 61984]
472F1984N9976j2432p6889r7191o0198J1170P6216R6194O0265j0543p4543r4426
484f0417n9406J1103P5390R5253N9817r520p3919r4931o1522Q208P1945R3722
496E5723O0798p505p0852r2930o0681O970P0063R1593O0675o164o9330r1244n9601
509a12485O174O9237R1034O0226n637o8635r1669o1600L594O6846R0214O1806
521A09105l263o4733q9081o1078K633O4860Q8297O0662k400o3640q6975o0071
533a05684K459O3441Q7351O0336j364o3146q8126o1652m9O1146Q6660O1903J110
546A04385n9829q5350o1064j344N8708Q4229O0303J562n8349q3444n9943j306
558a01442N8209Q3873O0573J405n8001q4092o1213l091N6809Q3141O2033M248
$$ y = [61984, 121960, 109528, 32639, -64552, -124750, -113580, -37364, 58830, 119095, 108552, 34009, -60417, -119823, -108720, -33330, 61923, 121740, 112220, 38301, -56630, -118152, -109944, -37999, 55723, 116521, 109016, 38164, -54766, -115447, -108477, -38414, 53179, 113854, 107690, 38360, -52884, -112485, -106311, -37074, 53960, 114186, 108549, 39914, -51755, -113355, -109761, -42915, 47299, 109105, 105842, 41109, -47972, -109050, -106417, -41557, 46740, 107402, 105002, 41362, -45613, -105684, -103225, -39784, 47567, 107903, 106539, 43393, -44733, -106385, -106434, -45288, 41372, 103275, 104385, 44556, -40794, -101858, -103202, -44494, 39735, 100038, 101600, 43251, -40193, -100136, -101442, -43233, 40640, 101213, 102618, 44617, -39475, -100688, -103779, -46970, 36171, 98204, 102452]
570A02452n4608q2067o0523m728N3912Q0185N9890M966n3523q0064n9629m301
582i8038N3298P9671N9489M503n3532q0248o0871n975N2112P9838O0989P762n0108
595D8890p8242o0148p639M9697P6834N9788P632m8610p6160n8849p100M8453P5834
608C0380N8652P186m8683p6969o0181q910M7157P5910O0831J0300m5696p4498
620b4521n9992j0353M4843P2990N9826J0480m3686p2285n8284r771M3577P2460
632B5284N7935J0223m4056p2871n9336j1570M2690P2699N9493J2588m0931p1271
644a9123n9240j3222L9560O9939N8251J3452l9245o8793n7685j2633L9395O8450
656A9106N7642J2390l9506o9225n7977j3702L9112O8740N9006J4957l7290o7275
$$ y = [102452, 47844, -34223, -94746, -99474, -45562, 34623, 94513, 99479, 45956, -34108, -93737, -98038, -44740, 34931, 94420, 98923, 45391, -34857, -95728, -101703, -49591, 30247, 91236, 98998, 48890, -29352, -89500, -97139, -47442, 29392, 89180, 96812, 48202, -27958, -86807, -93907, -45454, 30380, 89032, 96218, 47535, -29434, -89615, -98525, -51368, 24542, 85373, 95673, 49977, -24521, -84513, -94866, -50023, 22967, 82793, 93273, 49587, -22698, -80982, -90753, -47176, 25284, 83219, 93442, 49386, -23485, -82821, -94391, -51701, 20998, 80491, 93079, 52148, -19123, -78363, -91585, -52025, 17914, 76165, 89617, 50372, -18421, -76106, -88739, -49344, 19106, 76748, 89138, 49632, -19593, -77570, -91272, -52160, 16580, 75586, 90543, 53253, -14022]
668a4022n8355j5766L5966O6201N7658J5250l5386o4744n6947j5367L5467O4745
680A4700N6037J4906l5391o5331n6782j5556L5212O4835N7560J6807l3304o4048
692a0355n7255j7213L2332O2292N6314J7153l1441o2034n5149j7226L1550O1084
704A0052N5077J6605l1665o1615n5582j6851L1437O1583N6170J8017k9530o0306
716f608n5944j8595K8406N9173N5023J9290k7937n7947n4635j8770K7607N7563
728F626N4095J8430k7636n7991n3998j9083K7158N7548N4780J9891k6359n7028
740c567n4476k0794K4942N5958N3362K0526k4283n4570n3238k0329K4521N4408
752B460N2554K0291k4453n3690n2665j9937K4216N3746N2968K1062k3162n3461
$$ y = [-14022, -72377, -88143, -52177, 14024, 71682, 86932, 51546, -13198, -70145, -85512, -50045, 14700, 70737, 85643, 50252, -15079, -71861, -87417, -52205, 12630, 70190, 86997, 53693, -10355, -67610, -84823, -52491, 9801, 66115, 83268, 51827, -10207, -65356, -82582, -51032, 10052, 65129, 81734, 50069, -11546, -67128, -83979, -52542, 9041, 65211, 83228, 53698, -6608, -62552, -81147, -52741, 6432, 61455, 80745, 52808, -5139, -59774, -78544, -50937, 6626, 60721, 79151, 51515, -6476, -60474, -79557, -52399, 5149, 59929, 79820, 53461, -3567, -58043, -78837, -53895, 2063, 55425, 75951, 51668, -2902, -56140, -76469, -51948, 2460, 55014, 75305, 50852, -2838, -55503, -75440, -51224, 2522, 55490, 76552, 53390, -71]
764g1n2796k1691K2347N2390N2181K1489k1497n1580n1296k1220K1050N1074N0932
777E1312K1116k1179n0859n1077k1533K0801N0343N0886K1293k0039n0430n1239
789e0605k2524J9103M9480N1155K2434j8291m7791m9727k2163J8608M8230M9834
801D7743K2486j7856m7581m9325k2778J7618M7485M9186K2559j7906m7097m9893
813d5359k3353J6136M6269M8884K3502j5523m5406m8513k3084J5248M5121M8498
825D2420K3350j5342m4163m7704k3751J4637M4267M7967K3574j4389m3938m8034
837d1106k4414J3886M3312M7524K4502j2813m2193m7193k4340J2785M1932M7205
849C9087K4073j2503m1782m6358k4167J1827M1623M6172K4069j1751m1229m6478
$$ y = [-71, -52867, -74558, -52211, 179, 52360, 73849, 52352, 772, -50524, -71744, -50694, 380, 51312, 72428, 51249, 390, -50687, -72220, -51419, -1076, 49810, 71103, 51064, 634, -50605, -73129, -54026, -4546, 46609, 69043, 50752, 2961, -46766, -68929, -50321, -2091, 47743, 70229, 52373, 4792, -44533, -67311, -49693, -2208, 46978, 69537, 51631, 4534, -45359, -68712, -52576, -6307, 42577, 66079, 50556, 5150, -43363, -66447, -51199, -6078, 42420, 65770, 50428, 6265, -41439, -65190, -50553, -6286, 41681, 65255, 50866, 6928, -41106, -65520, -51634, -8322, 39202, 63704, 50891, 8698, -38495, -62835, -50050, -8118, 39087, 63160, 50657, 8875, -37483, -61650, -49823, -8200, 37972, 62041, 50290, 9061, -37417]
861c7417k4683J1420M0482M5846K4416j0721m0083m4882k4820J0674L9185M5449
873C4866K4576j0290l9003m4369k4787J0179L8869M4786K4390r893l8189m4428
885c3293k4534R082L7739M3998K4748r055l6914m4283k4725Q235L7173M3308K4587
898E6066p936l6510m3177k4778P943L6159M2913K4760p332l5691m2544k4868P092
911d7903L5078M2698K4802o530l4739m2189k5236O220L4151M1986K5723o496l3938
924A3627m1605k5142N604L3638M1504K5022n333l3254m1102k5175M868L2735M0672
937B6059K5383m967l1839m0742k5308M639L1253M0526K5510m275l1006l9849k5376
950d9992M181L0850L9505K5451l568l0633l9194k5524L253K9987L8939K5414k903
$$ y = [-37417, -62100, -50680, -10198, 35648, 60064, 49343, 9260, -35622, -60442, -49768, -10583, 34866, 59442, 49152, 10149, -34220, -59007, -48828, -9959, 34827, 59217, 49324, 11135, -33293, -57827, -48745, -11006, 32992, 57740, 48685, 11771, -32512, -57237, -49002, -11829, 31479, 56066, 48130, 11620, -31557, -56335, -48392, -12233, 30680, 55440, 48108, 12417, -30127, -54995, -47903, -12825, 29873, 54675, 48145, 13406, -28783, -54019, -47799, -13648, 28338, 54061, 47565, 13627, -27978, -53120, -47516, -13878, 27626, 52648, 47315, 14061, -27041, -52216, -47348, -14613, 26059, 51442, 46475, 14636, -26106, -51414, -46775, -15522, 25004, 50514, 46239, 15233, -24616, -49992, -45811, -14961, 24544, 49995, 46427, 15794, -23400, -48924, -45671, -15684, 23255, 48669, 45766]
963D5766k9912l8937k5539K784K8988L8653K5626k392k8655l8220k5406K041K9019
976a6184L7943K5567k209k8217l7508k5530J453K7911L7280K5581j853k6926l7515
989b0207k5758J083K7140L6964K5395o51k6280l6449k5528P71K5991L6461K5461
1002D4393n2k5747l6371k5658p8K5280L5874K5259K64k4965l5553k5961p69K4729
1016a9355L5319K6083Q92k4259l4776k5635r57K4266L4563K5470J453k3698l4394
1029a5028k5474j622K3065L4310K5415J845k3609l3932k5586j980K2587L3849
1041A3840K5580K350k2085l3262k5290k055K1641L3478K4777K468k1631l3047
1053a3236k5145k880K1583L2564K5177K659k1368l2355k5524k986K0665L2573
$$ y = [45766, 15854, -23083, -48622, -45838, -16850, 21803, 47429, 45037, 16382, -21838, -47244, -45203, -16184, 21759, 47326, 45117, 16900, -20608, -46138, -44685, -16774, 20506, 46087, 44234, 17308, -20207, -45965, -44882, -17742, 19222, 44617, 43966, 17686, -18763, -44291, -43520, -17529, 18932, 44393, 44341, 18594, -17777, -43435, -43513, -18233, 17641, 42900, 43164, 18199, -17354, -43315, -44084, -19355, 15964, 42047, 42939, 18680, -16096, -41731, -42688, -18422, 16141, 41611, 43064, 19366, -15028, -40502, -42124, -19059, 15251, 40666, 42511, 18902, -15030, -40616, -42596, -20009, 13840, 39420, 41770, 19685, -13577, -38867, -40922, -19281, 14197, 38974, 41442, 19811, -13236, -38381, -41261, -19678, 12886, 38063, 40722, 19354, -13001, -38525, -41511, -20846, 11727]
1065A1727K5346L271k0093l1812k4738l536J9969L1432K5036L446j9686l1754
1077a1392k4580l697J9417L1432K4884L565j9069l1139k4874m015J8847L0713
1089A0092K5083M649j8537l0413k4739m548J7699L0010K4490M488j7991k9664
1101i381k4242n259J7616K9764K4353N161j7252k9657k4351n467J6931K9328K4725
1114C2269N620j5866k9195k4229o181J6292K8635K3848N851j6026k7760k4218
1126c0960n330J5591K8588K3840N761j5514k7938k4450o084J5308K7315K4091
1138C0218O521j5320k6983k3955p052J4281K7089K3530O272j4343k6478k3283
1150b9503o381J4339K6782K3704O450j3808k6802k3328o769J3806K6533K3913
$$ y = [11727, 37073, 40344, 20251, -11561, -36299, -39835, -19866, 11566, 36602, 40048, 20362, -11392, -35972, -39669, -20252, 11180, 36064, 39629, 20560, -10579, -35453, -39468, -20621, 10092, 35175, 39824, 21287, -9126, -33865, -38413, -20714, 9296, 33786, 38274, 20283, -9381, -33623, -38882, -21266, 8498, 32851, 38012, 20760, -8897, -33248, -38715, -21784, 7544, 32269, 37889, 22023, -7172, -31401, -37582, -21290, 7345, 31193, 37044, 21018, -6742, -30960, -36290, -20699, 7889, 31729, 37490, 21976, -5962, -30412, -36496, -21188, 6127, 30218, 36739, 21419, -5564, -29519, -36571, -22290, 4799, 28329, 34601, 20258, -6220, -29503, -35884, -21545, 5237, 28941, 35391, 21583, -5219, -28547, -35316, -21510, 5023, 28936]
1162B8936O585j3317k5817k3613o825J2560K5753K2603P313j2591k5205k3107
1174b6725o991J3134K4984K2984P043j3012k4967k3064p696J2240K4989K2988
1186B5907P700j1992k4581k3021q393J1754K3874K2808Q054j1381k3671k2085
1198b5027p409J1310K4245K2305Q119j1060k3459k2601q142J0781K3296K2463
1210B4821Q293j0817k3121k2132r004R568K2968K1488Q308r647k2203k1797q366
1223c1641R747K2525K1863Q643r918k1971k1741q807J0173K1516K2117Q817r330
1236B1993k1531k2071r053Q964K1386K1416Q620q236k1045k1016r008Q769K1120
1249C08K0836Q743q547k1066k1151q871Q317K1089K0989R132q175k0486k1068
$$ y = [28936, 35521, 22204, -3613, -27226, -34051, -21491, 4262, 26865, 34178, 21587, -3618, -26725, -33716, -20582, 4402, 27386, 34429, 21417, -3550, -26614, -34310, -22070, 2919, 25907, 33607, 21615, -2966, -25987, -34380, -22626, 1248, 24056, 32110, 20729, -2942, -25027, -32436, -21126, 3119, 25424, 33543, 22483, -976, -23577, -31719, -20938, 2358, 24821, 33114, 22297, -824, -22956, -31960, -22392, 576, 22064, 30372, 20725, -1478, -23275, -31641, -21894, 631, 22494, 31137, 21219, -752, -22493, -31300, -21127, 389, 22506, 31323, 21993, 462, -21609, -30662, -21698, -312, 21104, 29724, 21488, 443, -20573, -29581, -20812, 308, 21144, 29887, 21340, 274, -20877, -29748, -21431, -342, 20647, 29779, 21604, 1118, -19950]
1262a9950r356P405K0102K0742R219p166j9932k0459r465P857J9679K0323R649
1275B8648p711j9459k0433r214P216J9612K0461R570o777j9447k0580r838O456
1288b1496J9004K0194R756o419j8688j9935r561O046J8508J9842R630o446j8251
1301B184j9831r819O413J8280J9881R862n731j7766k0160r819N109J7834J9407
1314A5844J0380n235j7249j9522r787M963J7251J9424R742n346j6851j9420r972
1327b5778N403J6828J9014J0353m703j7390j9024j0256M297J6770J9221R939m128
1340B0546j6489j8598j0102M500J6222J8421J0232m453j5929j8843j0155M594
1352b0054J5957J8493J0080l942j5889j8532j0231L811J5476J8412J0007l421
$$ y = [-19950, -29306, -21901, -1799, 18943, 28162, 20996, 1064, -19395, -28860, -21003, -1324, 18999, 28648, 20937, 1478, -18955, -28169, -20953, -1341, 19120, 28690, 21913, 2466, -18114, -27952, -21496, -2492, 17702, 27458, 21039, 2351, -17584, -27145, -21099, -2591, 17251, 26881, 20435, 2184, -17647, -27466, -21053, -2773, 17108, 26970, 21239, 3473, -16687, -26506, -21397, -3563, 15844, 26224, 20989, 3740, -15782, -25569, -20606, -3355, 16069, 25811, 20465, 3614, -15806, -25778, -20375, -3547, 15467, 25820, 21117, 3727, -15297, -25553, -21256, -4486, 14735, 24674, 20546, 4057, -14541, -24643, -20143, -3921, 14500, 24732, 20279, 4350, -14493, -24648, -20054, -4097, 14396, 24476, 20534, 4645, -13887, -24118, -20307, -4831, 13581, 23588, 20167]
1364B0167j5139j8231j0250L887J4743J7992J0027l261j4735j8374r960L314J4805
1377e015J7714J0383l051j4941j7742j0395K817J4623J7418J0848k638j4413j7433
1390a1825j0442K643J4065J7327J0580k776j3976j7272j0505K898J3939J6723
1402A1379J0664k379j3975j7020j0077J812J3773J6722J0436k001j3526j6284
1414a0476j0861K346J2892J6696J0522k261j2612j6559j0668J839J3268J6288
1426A0414J0105j487j2891j6062j0853J765J2423J6584J0364j558j2296j6088
1438i580j0605J553J2203J5829J0396j291j2341j5751j0148J192J1991J5753J0464
1451A9665j712j1443j5955j0341J295J1935J5692R842n98j1600j5492j0235J047
$$ y = [20167, 5028, -13203, -23453, -19566, -4823, 13169, 23196, 19935, 5200, -13174, -23134, -19820, -5015, 12699, 23082, 20031, 5090, -12652, -23047, -20230, -5607, 11811, 22659, 20021, 5608, -11825, -22267, -19624, -5559, 11768, 22348, 19572, 5596, -11676, -22181, -19283, -5344, 11379, 22043, 19664, 5689, -11331, -21408, -19596, -5823, 10899, 21335, 19334, 5808, -10476, -21337, -18991, -6099, 10597, 21119, 18858, 6246, -10313, -20981, -19142, -5874, 10414, 20519, 19032, 6141, -9921, -20774, -19009, -6586, 9998, 20362, 18804, 6508, -9580, -20185, -18632, -6429, 9400, 19796, 18505, 6164, -9587, -19735, -18543, -6552, 9201, 19665, 17953, 6510, -9445, -19786, -18491, -6556, 9136, 18978, 18380, 6780, -8712, -18947, -17900]
1464a7900J1336J5084J0257r51j1180j4985j0260O45J1143J4998J0206o22j1107
1477F664j4931j0034O19J0605J5119R843k50j0733j4714j0169M87J0410J4681
1490G597J0478p00j0489j4604r633O7J0424J4526R605m7j0235j4364r867k13J0088
1505g367J4594R706J61j0264j3575r832k98R962J3650J0095M18r910j3853r922
1519a6435l1R220J3767R648K60r415j3778r752m90R717J3357J0069K06r028j3331
1534f016r773l69Q963J3323R959J13r062j3062r675m62Q846J3045R494N20q665
1549G179j3278r336q38Q929J2821R414R92q640j2541r791o45Q428J2875R525O42
1564A5736q161j2716r459r09Q071J2284R314J160q270j2143j0021o13Q361J2197
$$ y = [-17900, -6564, 8520, 18777, 17826, 6646, -8339, -18599, -17954, -6811, 8187, 18393, 17771, 6664, -8267, -18301, -17682, -7077, 8042, 17885, 17635, 6902, -7812, -17981, -17494, -7084, 7597, 18075, 17375, 6886, -7718, -17351, -17284, -6860, 7666, 17271, 17224, 6989, -7375, -17242, -17455, -7367, 7227, 16933, 17094, 6830, -6745, -16577, -16875, -6913, 6737, 16832, 17250, 7340, -6513, -16435, -16466, -7246, 6521, 16169, 16429, 7014, -6764, -16516, -17006, -7289, 6068, 16137, 16343, 7315, -6016, -15789, -16158, -7195, 6128, 16087, 16200, 7138, -5924, -15599, -16061, -7215, 5830, 15324, 15844, 7179, -6099, -15435, -16273, -7344, 5477, 14891, 15883, 7243, -5298, -15089, -15734, -7306, 5569, 15094, 15736, 7575, -5141, -14600, -15509, -7438, 4846, 14160, 15320, 7050, -5093, -15114, -15727, -7366, 4831]
1578D831R208J319q052j1695r863o30P415J2088R410J252p599j2068r309j263
1592a4956P828J1445R359P64p230j1702r261j148P232J2001Q932J425p561j1350
1606d222r000j420P372J1573R205J023p032j1303q884j650O965J1201Q990J441
1620A4259o922j1224r031j384O734J1166R045J400o555j1088q767j601O164J1215
1634C411Q699J894o688j0656r030j368O451J0553R109J599o549j0630q798j693
1648a3696O220J0755R034J301o261j0456q799j744O187J0579Q497K136o372j0379
1662b998q844j743O018J0397Q523J946o028j0050q739j555N708J0319P990K476
1676A3420n976r954q467j955N407R922Q704K001n607r920q350k034N389R638Q524
$$ y = [4831, 14039, 15358, 7306, -4389, -14252, -14882, -7467, 4621, 14031, 15283, 7684, -4384, -13693, -14956, -7128, 4317, 13676, 14440, 7210, -4492, -13753, -14901, -7669, 4332, 13264, 14689, 7128, -4222, -13222, -14642, -7270, 4303, 13508, 14531, 7499, -3804, -12688, -14338, -7373, 3828, 12818, 14259, 7337, -3887, -12918, -14302, -7568, 3598, 12643, 14043, 7488, -3600, -12367, -13968, -7804, 3411, 12110, 14004, 7316, -3340, -12370, -13738, -7287, 3266, 12375, 13974, 7425, -3205, -12003, -13696, -7476, 3279, 12313, 13614, 7353, -3103, -11902, -13646, -7459, 3120, 11617, 13753, 7381, -2998, -11842, -13585, -7567, 2830, 11353, 13299, 7271, -2779, -11518, -13073, -7365, 2954, 10944, 13420, 7444, -2510, -10977, -12932, -7525, 2397, 11101, 13102, 7495, -2425, -10775, -12809, -7420, 2218, 10742]
1691A0742J833n430r469q452j989N437R507Q349K264n423r590q178k375N497R279
1706B002Q275K071m830r445q189k129M878R126Q460J691m832r129p907j927M711
1721g174Q969Q063K410n049r049p716k276M368R111Q161J901m428q930p724k576
1736a1939M835Q593P780K102m184q878p537k288M577Q720P538K492m577q703p630
1751i099k240M323Q504P726K050m381q386p382k695M372Q118P940K171m058q296
1766a333p452k349M076Q577O953K785m316p926p507k445L727Q267P636K219l927
1781F985q076p302k533M136P946P319K144l862p492p519k360M111P556P396K118
1796A0567l893p596p320k407L837P589P366K270l667p500p310k459L573P694P114
$$ y = [10742, 12575, 7145, -2324, -10776, -12765, -7328, 2179, 10528, 12792, 7369, -2221, -10399, -12774, -7277, 2002, 10277, 12348, 7518, -1927, -10116, -12245, -7367, 1759, 10219, 11910, 7078, -2051, -9958, -11885, -7174, 1795, 9858, 12268, 7219, -1830, -9546, -11822, -7454, 1657, 9818, 11719, 7291, -1639, -9363, -11939, -7104, 1489, 9269, 11371, 7187, -1691, -9228, -11516, -6939, 1781, 9319, 11811, 7234, -1469, -9099, -11339, -7016, 1488, 9214, 11264, 6883, -1503, -8885, -11580, -7208, 910, 8850, 11021, 6963, -1333, -8785, -11134, -7058, 1519, 8472, 11257, 6941, -985, -8492, -10937, -7210, 1057, 8693, 10912, 6985, -1091, -8393, -10926, -6790, 1156, 8475, 10619, 6757, -735, -8254, -10614, -6503, 1053, 8449, 10567, 6674, -922, -8242, -10649, -6812, 777, 8143, 10413, 6746, -754, -8064, -10523, -6950, 744, 7858]
1811G858K174l592p183o878k385L452P458O786K530l754p147p242k095L445P239
1826F66O937K501l123p616o740k614L475P002O677K793l556p010o624k305L144
1841f393O773O756K733l173p283o712k697L594O831O835K818l200p362o673k419
1856i572K987O964O525K862l606o818o408k335K870P034O387K421k916o683o576
1871f864k548K995O747O626K415l009o653o331k556K935O661O155K763l168o252
1886h4o288k376K669O275O415K869l107o607o510k259K796O493O085K493k556
1901F308o485o238k592K930O014O253K880l229n805o062k556K735N936O125K305
1916H519k562n891n922k444K312O065O086K436k561n821o173k524K581N968N755
$$ y = [7858, 10032, 6440, -743, -7621, -10006, -6554, 904, 7690, 10220, 6466, -681, -7923, -10018, -6573, 666, 7603, 10104, 6981, -635, -7375, -9989, -6514, 488, 7165, 9958, 6402, -608, -7232, -9537, -6393, 380, 7136, 9869, 6696, -587, -7299, -9996, -6402, 429, 7264, 10082, 6882, -480, -7153, -9572, -6585, 379, 6904, 9766, 6160, -658, -7066, -9401, -6531, 503, 6890, 9311, 6395, -288, -6864, -9412, -6417, 330, 6956, 9371, 6362, -291, -6622, -9178, -6243, 418, 6573, 9336, 6168, -84, -6372, -8748, -6079, 196, 6611, 9480, 6373, -234, -6744, -9003, -6207, 286, 6371, 8864, 6308, -177, -6415, -9007, -6077, -63, 6190, 9070, 5841, 36, -6026, -8582, -5847, 89, 6214, 8519, 5957, 66, -5856, -8300, -5988, 77, 6163, 8599, 6038, 217, -5956, -8480, -5899, 69, 5824]
1931E824K497k090o212n855k444K305N844N940K541k575n589n904k532K503N680
1946f7O069K467k752n606n873k409K182N779N932K244k284n477n581k918K617
1961e677N144O226K291k267n464n814k417K338N761N349K403k196n590n353k691
1976g957K266N320N589K512k261n130n851k171J922N339N752K177j851n291n562
1991e197k395K378M887N570K585k377n356n148k615K116N176N263K827j927n217
2006E70n458k644J955N320N215K246j752n177n340k305J811N411M989K718k182
2021E377m851n587k335J912N274M873K741k025m779n390k664K092M745N469K690
2036G542k314m905m991k427J790M701N298K313j697n171m836k299J502M978N125
$$ y = [5824, 8321, 6231, 19, -5836, -8280, -5975, -131, 5809, 8350, 5775, 186, -5718, -8250, -5747, -67, 6002, 8469, 5717, 111, -5762, -8171, -5989, -210, 5722, 7966, 5682, 205, -5376, -8294, -5677, -533, 5693, 7984, 5717, 253, -5561, -7978, -5640, 121, 5470, 7873, 5677, 87, -5266, -7957, -5691, -371, 5218, 7730, 5469, 339, -5512, -7683, -5761, -422, 5330, 7507, 5656, 365, -5197, -7592, -5214, -327, 5243, 7828, 5451, 95, -5053, -7668, -5552, -376, 4887, 7714, 5787, 570, -4888, -7532, -5577, -257, 4958, 7204, 5452, 275, -5065, -7370, -5559, -148, 4841, 7559, 5377, 526, -5061, -7396, -5484, -210, 4663, 7404, 5379, 600, -4790, -7454, -5362, -617, 4852, 7542, 5228, 323, -4668, -7095, -5305, -604, 4694, 7007, 5310, 139, -4697, -6996, -5494, -516, 4609]
2051D609K537j565m946n022k552J774M664N046K326j212n178n111k275J453N074
2066c78N031K068j648m704m837k389J601M707N159K152j722m577m883k728J915
2081e233M802M949K422j969m537m823k311J225N181M803K179j650m547m819k301
2096f629J284M937M830K336j463m640m871k602J620M526M883K419j899m232m668
2111d169k458J622M629M731K133j456m471m888k241J545M603M703K442j948m302
2126D75m872k059J409M600M917K055j692m138m837k409J546M260M905K048j230
2141D978m582m457k623J775M389M574K105j298m322m459k476J574M516M402K312
2156F408j394m677m421k124J357M144M770K226j359m614m442k139J523M152M759
$$ y = [4609, 7146, 5581, 635, -4387, -6939, -5165, -501, 4545, 6871, 5659, 481, -4630, -6905, -5452, -378, 4653, 6721, 5073, 369, -4468, -6857, -5256, -549, 4610, 6762, 5040, 463, -4420, -7148, -5233, -431, 4518, 6940, 4971, 434, -4389, -6700, -5475, -294, 4509, 6688, 5038, 491, -4328, -6629, -5345, -408, 4422, 6758, 5295, 655, -4216, -6818, -5198, -672, 4211, 6630, 4731, 499, -4169, -6627, -5005, -376, 4355, 6488, 5032, 561, -4327, -6568, -5023, -420, 4283, 6725, 4777, 475, -4397, -6456, -5047, -447, 4470, 6525, 4833, 695, -4142, -6551, -5005, -745, 4160, 6208, 4978, 396, -4061, -6684, -4909, -520, 4054, 6159, 4861, 539, -3920, -6396, -4822, -306, 4096, 6408, 5014, 337, -4084, -6208, -4851, -707, 4063, 6289, 4930, 316, -4126, -6265, -4742, -590, 4169]
2171D169K251j424m506m201k589J748M097M320K182j117m482m507k003J102M345
2186f15M457K365j817l847m420k106J225L830M712K507j535m153m516k126J319
2201d720M157M486K018j122m159m475k273J428L755M873J621r66m067m360j890
2216e694N95M595M132K390j359l693m813k162J241L885M501K500j621l839m021
2231c363k714J626L889M271K152j299l571m623k253J315L802M225K376j183l775
2246H75m220k335P94M249M421J980j129l992m278k007J044L921M382K004q06l965
2262I38m365k331J435L716L932K567j519l470m423k213R97M025M278K117j069
2277D615l518m332k239R40L527M304K139r73l596l835k532Q99L646M156K441j028
$$ y = [4169, 6420, 4996, 490, -3711, -6300, -4552, -455, 3865, 6047, 4930, 448, -4059, -6062, -4960, -615, 3842, 6207, 4390, 543, -3877, -5983, -4758, -928, 3784, 6291, 4756, 603, -3913, -6039, -4720, -563, 3923, 5941, 4819, 660, -3815, -6088, -4660, -905, 3968, 5589, 4623, 556, -3804, -5694, -5099, -504, 3628, 6018, 4659, 966, -3847, -6009, -4768, -883, 3618, 6118, 4497, 658, -3363, -6077, -4451, -562, 3709, 5861, 4562, 991, -3632, -5885, -4570, -768, 3457, 5833, 4650, 875, -3345, -5680, -4886, -637, 3784, 5764, 4635, 643, -3635, -5642, -4598, -677, 3705, 5709, 4903, 938, -3427, -5758, -4323, -607, 3325, 5892, 4373, 903, -3520, -5733, -4736, -711, 3567, 5684, 4615, 1097, -3235, -5474, -4534, -1007, 3297, 5436, 4463, 867, -2968, -5500, -4601, -955, 3201, 5642, 4614]
2293D614l793l981k736J215L579M053K608q07l838m173k019L09L806M402K297
2308E536j048l334m347k359Q82L553M435K075p43l385m400k126M79L609M454K264
2324E545p99l479m373k291P21L520M037K540r50l164m442k190R65L316M106K125
2340E187m54l468m416k244R32L296M179K517j101l574l743k342N37L632M029K411
2356E378p08l417l965k398P05L031M286K517q83k995m396k330N55L599L814K383
2372E176n33l725l579k796P55L597L972K290n55l211m289k281N95L595M111K083
2388E205n93l356l946k502O29L305M183K164l35l727l764k495O69L241L919K383
2404D980l80k941m483k124L62L441L782K248m28l176m042k310L58L383L778K538
$$ y = [4614, 821, -3160, -5896, -4681, -1102, 2951, 5559, 4752, 914, -3259, -5278, -4969, -1163, 3239, 5536, 4488, 1154, -3193, -5552, -4670, -1117, 3318, 5393, 4650, 1265, -3135, -5261, -4782, -1173, 3281, 5545, 4746, 1267, -3106, -5397, -4676, -1156, 2881, 5421, 4471, 1307, -3135, -5325, -4360, -1044, 3062, 5187, 4733, 1265, -3151, -5395, -4463, -1167, 3012, 5529, 4428, 854, -2889, -5231, -4694, -1062, 2967, 5378, 4670, 1253, -2712, -5110, -4405, -1374, 2912, 5429, 4546, 1551, -2845, -5175, -4620, -1021, 2793, 5176, 4643, 918, -2661, -5457, -4702, -1105, 2867, 5157, 4602, 1391, -2898, -5179, -4584, -989, 3122, 5205, 4612, 1256, -2690, -5192, -4563, -1258, 2925, 5089, 4754, 1027, -2737, -5232, -4563, -1322, 2597, 4980, 4600, 1659, -2824, -4948, -4586, -1145, 2637, 4885, 4457, 1281, -2761, -5071, -4713, -1330, 2448, 4986]
2420D986n24l067l602k914O04L012M001K706m25l226l944k362k9L234M051K205
2436D706k7l202l931k668M50L069L968K468k87l143l824k370K16L106L910K296
2452D737k18k861m035k633L17L005L788K893l25k885m091k880N48L088L874K712
2468E034m10k852l864k567K0K825L989K911o75k791l811k713M57K856L772K796
2484D977k31l086l925k606K58K929L854K518M6k962m033k468Q4K919L794K754
2500D822l58k659l602l001L43K516L886K557K04k818l951k623L6K946L763K606
2516D667J37l028m014k419k7K848L830K650k17k493l950k491m8K811L741K678
2532D675M4k834l945k382j76K976L436K667J09k888l779k513N2K473L921K911
$$ y = [4986, 4462, 1395, -2207, -5121, -4517, -1505, 2496, 5202, 4777, 1551, -2393, -4755, -4784, -1550, 2501, 4706, 4679, 1477, -2454, -5122, -4672, -1603, 2365, 4833, 4546, 1403, -2421, -4791, -4575, -1469, 2441, 4737, 4519, 1658, -2377, -5010, -4693, -1688, 2100, 4993, 4668, 1783, -2308, -5188, -4640, -1552, 2322, 5034, 4624, 1772, -2092, -4659, -4639, -1814, 2175, 5086, 4411, 1620, -2191, -4904, -4447, -1591, 2181, 4977, 4746, 1660, -2265, -4871, -4613, -1684, 2170, 4688, 4734, 1772, -2261, -4729, -4645, -1726, 2068, 4822, 4464, 1805, -1797, -4798, -4455, -1939, 1947, 4504, 4708, 1890, -2061, -4684, -4648, -1702, 2061, 4667, 4804, 1776, -2238, -4657, -4684, -1836, 1994, 4644, 4427, 1934, -2016, -4507, -4555, -1744, 1997, 4675, 4719, 1885, -2060, -4442, -4618, -1642, 1794, 4461, 4570, 1682, -2097, -4610, -4558, -2085, 1836, 4747]
2548D747j15k611l569l004j69K880L656K700J85l224l355k450k32K464L932K567
2564D402K19k793l819k543j23K643L539K885L42k697l716k671k26K462L775K850
2580D529j10k390l719k744l61K626L748K657M18k573l912k404l36K415L728K918
2596D490J52k493l846k415k74K247L835K552M28k383l679k889OK163L368K892
2612D154N11k456l784k583n55K436L718K837N77k550l555k695o41K374L528L059
2628D375J13k285l359l161j80K102L979K449M98k255l496k828r05K779L576K528
2644C930N80k257l514k719n31J958L676K951N17k451l549k422p49K297L459K913
2660D089N62k264l501l040k74K012L568K781N00k081l343k836o70J953L830K712
$$ y = [4747, 4632, 2021, -1548, -4552, -4721, -1841, 1815, 4515, 4700, 1476, -1879, -4329, -4561, -2097, 1835, 4402, 4621, 1828, -1991, -4534, -4657, -2014, 1525, 4410, 4752, 2055, -1661, -4332, -4558, -2096, 1679, 4529, 4419, 2029, -1690, -4434, -4795, -2169, 1579, 4236, 4654, 2081, -1831, -4235, -4571, -2156, 1572, 4490, 4642, 2149, -1697, -4112, -4386, -2139, 1696, 4248, 4676, 2293, -1386, -4275, -4269, -2106, 1262, 4154, 4665, 2209, -1575, -4158, -4713, -2277, 1441, 4278, 4855, 2305, -1250, -3945, -4586, -2212, 1316, 4375, 4488, 2203, -1156, -4317, -4497, -2395, 1584, 4033, 4531, 2276, -1220, -4048, -4953, -2174, 1402, 3930, 4510, 2253, -1261, -3980, -4511, -2553, 1123, 4074, 4591, 2140, -1409, -3831, -4580, -2283, 1176, 4089, 4651, 2387, -1114, -4154, -4428, -2416, 1152, 3933, 4433, 2352, -991, -3827, -4497, -2544, 1286, 3998]
2676C998N72j959l476k805r41J971L892K396R06k001l474k991p34K160L291K802
2692C607N08j372l612l278l55J825L432L125P65k155l408k943p27J889L592K913
2708C806Q21j934l457k981m88J548L403L027Q00j892l371l035q72J972L372L258
2724C977M00j792l136l064j161K000L294L271Q99j872l538k966o87J582L499K944
2740C650P64j655l611k888p94J908L176L125P73j917l122l082p33J452L766K831
2756C643Q82j588l398l031j069J722L397L096R39j815l353k778j174J438L641
2771E52L045P80j564l152l241r74J785L110L109J045j566l131l005j271J402L627
2787E51K865J079j827k986l115j112J719L392K815R19j244l220k965j338J679
$$ y = [3998, 4570, 2611, -865, -3670, -4611, -2640, 1252, 3648, 4554, 2553, -921, -3912, -4646, -2486, 805, 3607, 4115, 2743, -869, -4147, -4502, -2677, 755, 3880, 4645, 2490, -918, -3861, -4588, -2699, 893, 3806, 4627, 2693, -764, -3745, -4233, -2685, 718, 3745, 4545, 2653, -718, -3753, -4625, -2653, 719, 3977, 4377, 2585, -551, -3615, -4776, -2776, 518, 3789, 4688, 2816, -722, -3688, -4375, -2793, 706, 3650, 4414, 2759, -852, -3740, -4534, -2626, 550, 3675, 4448, 2531, -591, -3673, -4406, -2954, 812, 3643, 4525, 2937, -461, -3492, -4561, -2839, 558, 3654, 4593, 2778, -575, -3353, -4527, -3089, 552, 3597, 4377, 2813, -339, -3580, -4554, -2769, 341, 3450, 4495, 2929, -202, -3207, -4478, -3076, 551, 3416, 4495, 2668, -318, -3433, -4545, -2826, 566, 3381, 4300, 3056, -164, -3129, -4467, -2788]
2802b788K966L150J135j328l389k948j267J454L487K608J366j390l401k976j306
2817d627J736K985L197R46j149l347l060j136J383L222L227R37r82l519l247p52
2833d186J046L394K660J667j623l024l035j032R91L097L189J196j436k904l153
2848c153j080J225L094L041J164j111l288l061j047J308K911K893J516j094l158
2863A60l183j290J171L205K993J347j416k944k835j318J139L007L042J009q04
2878C283l022l200j325R37L146K857J520j132k965l092j237Q91K816L519J112
2893D108j037k826k915j610J298K650L206J436j236k886k961j360J086K839K913
2908B705J428j107k788l013j469Q42K942L124J788j452k797k711j673Q58K836
$$ y = [-2788, 178, 3328, 4463, 3135, -254, -3202, -4469, -3015, 472, 3080, 4446, 3056, -345, -3321, -4627, -2891, 94, 3291, 4237, 3088, -259, -3319, -4455, -3072, 150, 3377, 4314, 3332, -187, -3434, -4186, -3140, 254, 2914, 4581, 2958, -66, -3101, -4133, -3142, -45, 3144, 4340, 2904, 0, -3153, -4233, -3008, 86, 3127, 4291, 3180, -108, -3169, -4216, -2908, 3, 2896, 4412, 3318, 160, -3023, -4313, -3142, 63, 3056, 4403, 2987, 43, -2792, -4110, -2971, 36, 3078, 4087, 3283, 261, -2939, -4264, -3327, -181, 2676, 4196, 3064, 99, -2993, -4230, -3339, -523, 2996, 4108, 3071, 245, -2670, -4280, -2982, -332, 2874, 4310, 3074, 188, -2773, -4133, -3047, -208, 2705, 4133, 3026, 238, -2775, -4244, -3402, -460, 2664, 4452, 3000, 203, -2508, -4181, -3323, -487]
2923d87K959J557r78k616k800j760Q83K864K897J494r33k562l019j547R18K636
2939d94L092J371o04k806l054j605P45K863K799J843p46l040l001j348Q21K760
2955d04L014J174o58k399l203j716Q58K739L098J581r23k512k920j848R90K551
2971e78L028J660q74k567l111j612P52K615K980J818q96k630k892j687K18L247
2987e29K683J779p00k378l115j284L10K497K833J539l18k437k909j800M84K283
3003a062L174J684m36k603k951j799Q79K426K834J642n70k471k836j731O24K290
3019i06L003J778o12k559k777j551K56K388L046J773o09k210l141j399L90K138
3035i92K969J757l61k253k923j909M86K420K780J716m47k017l149j735N27K083
$$ y = [-487, 2472, 4029, 3051, 435, -2365, -4125, -3242, -378, 2519, 4013, 3080, 518, -2501, -4048, -3130, -494, 2598, 3969, 3365, 559, -2495, -4100, -3355, -492, 2307, 4150, 3404, 364, -2637, -3985, -3164, -404, 2610, 3784, 3126, 727, -2476, -4192, -3334, -595, 2503, 4084, 3161, 649, -2271, -4119, -3129, -578, 2450, 4110, 3236, 669, -2442, -4054, -3302, -687, 2293, 4111, 3215, 585, -2307, -3994, -3776, -529, 2154, 3933, 3233, 855, -2260, -3544, -3234, -737, 2096, 3635, 3317, 880, -2029, -3829, -3345, -1062, 2112, 3796, 3360, 757, -2194, -3993, -3114, -688, 2146, 3788, 3218, 747, -2089, -3820, -3196, -906, 2097, 3875, 3263, 704, -2073, -3624, -3368, -980, 2066, 3839, 3230, 1020, -2121, -3520, -3130, -992, 1977, 3734, 3373, 1120, -1803, -3712, -3226, -806, 1974, 3690, 3243, 1226, -1923, -3658, -3131, -1048]
3051a048K834J854l85k438k663j559k2K223L049J718k4k439k823j965M89K099
3067a100K670K059l96k302k696j814N4K211L011J841k54k305k724j360P6J772
3083a257L017J653J43k317k650k150K44K275K567J996l86j850l010j821L49J839
3099a358K812J876k09j908k796k050L30K050K724J716j77j599k937k004K75J641
3115a614L211J881n36j529k790j850j60K017K919J597J99k180k854j492j34J896
3131a419K634K048J30k087k740j978K8J715L010J908J48j965k864j928j1K069
3147a302K652J947M9j748k979j691o7J568K642K016K40j843k732j791k75J775
3163a539K656K042J63j697k884j711J2J582K656J807L62j885k448k267m11J972
$$ y = [-1048, 1786, 3640, 3255, 817, -1846, -3405, -3427, -1204, 1845, 3563, 3539, 1100, -1723, -3688, -3199, -1100, 1570, 3629, 3233, 931, -1765, -3579, -3525, -1314, 1697, 3538, 3284, 979, -1745, -3105, -3029, -1257, 1760, 3413, 3556, 1239, -1411, -3561, -3317, -1042, 1525, 3521, 3135, 1285, -1725, -3546, -3197, -1358, 1454, 3330, 3121, 1213, -1583, -3633, -3303, -1253, 1471, 3187, 3010, 1411, -1526, -3530, -3255, -1614, 1597, 3478, 2942, 1413, -1377, -3227, -3387, -1370, 1549, 3146, 3345, 1165, -1689, -3181, -3315, -1419, 1215, 3263, 3393, 1306, -1434, -3412, -3384, -1669, 1341, 3249, 3397, 1432, -1432, -3360, -3371, -1302, 1350, 3297, 3346, 1598, -1381, -3072, -3139, -1571, 1071, 3087, 3327, 1484, -1248, -3039, -3314, -1539, 1117, 3159, 3322, 1625, -1259, -2970, -2958, -1376, 1280, 3087, 3449, 1564, -884, -3151, -3562, -1590]
3179a590K777K065J82j914k706j890l68J824K545J857M30j501k628k264LJ737
3195a441K435K029J50j512k599k215k30J740K801J743N09j665k494k210j24J538
3211a545K520J997M41j779k285k181m64J460K720K025N19j728k390k015o52J706
3227a651K355K027O38j366k453k229o46J564K411K161N78j611k466j781q66J392
3243a943K768J913N86j759k032k199o86J657K232K431M29j485k601k238k78J004
3259b201K510K364N50j230k692j778q25J266K572K058N61j266k437k056m67J319
3275a752K207K205L73j037k617j948l54J058K077K289N98j142k341k240n77J210
3291a991K315K207P41j675k062j829m84P57K634J886Q03j098k551j978o98J090
$$ y = [-1590, 1187, 3252, 3434, 1520, -1186, -3076, -3444, -1620, 925, 2782, 3212, 1711, -917, -3181, -3178, -1441, 994, 3023, 3173, 1661, -938, -3153, -3383, -1643, 1158, 2901, 3410, 1745, -749, -2959, -3083, -1545, 975, 2972, 3413, 1634, -651, -2832, -3296, -1836, 884, 2909, 3428, 1700, -690, -2705, -3357, -1651, 704, 2731, 3369, 2003, -450, -2679, -3325, -1761, 650, 2811, 3389, 1778, -688, -2469, -3335, -1943, 825, 2738, 3324, 1565, -467, -2666, -3352, -1695, 537, 2968, 3397, 1912, -689, -2927, -3205, -2201, 309, 2673, 3223, 1993, -699, -2477, -3302, -2036, 536, 2594, 3155, 1889, -548, -2604, -3071, -1752, 455, 2660, 3033, 1996, -621, -2569, -2923, -1865, 212, 2501, 3099, 1957, -384, -2624, -3201, -1991, 324, 2531, 3272, 1597, -465, -2294, -2778, -2021, 613, 2499, 3302, 2204, -347, -2325, -3023, -1933]
3307a933K112K096Q11j112k258k195m19J025K359K232L32j034k236j981r91J232
3323a960K320K004Q76j299k117k313m92J119K062K016Q94r92k314k195m91P40
3339b142K425J984Q33j167k323j638q00Q68J954K202Q40j004k108k169q76J149
3355a972K021K084R51r60k203k367m73P17K281K132Q90q12k343k082o64Q80K035
3372A15K137P00p73k261k032o99P38J979J835J170p28k129k085j027R46K144J949
3389A979R10o69k012k120r00P41K107J761J156p88k192j996q04O38K231J836R34
3406B812p68k009j977j152R95J694K480P81r66j743j852j201P91J953J920Q86
3422B644n70j862j934j216P02K198J870Q63n32j877j957r76N82J748K119J002
$$ y = [-1933, 179, 2275, 3086, 1974, -284, -2479, -2898, -1873, 486, 2718, 3050, 2016, -220, -2201, -3192, -1960, 360, 2364, 3240, 1941, -176, -2489, -2981, -1862, 200, 2216, 3110, 2118, -196, -2391, -2882, -2142, 283, 2267, 3100, 1933, -390, -2028, -2828, -1960, -6, 2196, 3036, 2032, -76, -2245, -3121, -1972, 49, 2133, 3084, 2124, -79, -2446, -2919, -2202, 79, 2211, 3101, 2289, -54, -2136, -2800, -1920, 115, 2252, 2952, 2179, -82, -2114, -2813, -2075, -96, 1739, 2909, 2181, 52, -2033, -3060, -2114, 30, 1979, 2889, 2220, 208, -1912, -2812, -2071, 36, 1797, 2953, 2165, -27, -2023, -2827, -2189, 42, 1878, 2812, 2044, 35, -1942, -3094, -2099, -405, 2075, 2856, 1890, 147, -1705, -2906, -2115, -162, 1758, 2644, 2074, 212, -1722, -2938, -2236, -38, 1832, 2695, 2163, 286, -1671, -2647, -2065, -317, 1802, 2804]
3438B804p54k082j479j178O08J856K129P85o69j725j921j111M60J967J858Q86
3454B434l07j838j885j031L94J667K437Q82n72j703j980j423N04J994K016J023
3470B612n29j427k316q18L17J669K051R21k91j632k301p70M60J518K100J049l87
3487B226j827j903q94J35J676K000J211n46j589k157q47N31J513J937J348p38
3503B076j654k066q22J76J877J899J064k80j820j875j022K67J722J719J212l54
3519B119j765j762j065L92J606K009R61k61j700j888j255K69J561J799J561m19
3535B162j574j981j141M16J600J830J252m29j332k078j298L46J388K230J113l64
3551B140j698j757j170K51J732J674J309l83j472j762j348L88J411K008R26pj883
$$ y = [2804, 2050, -32, -1511, -2689, -2081, -225, 1904, 2689, 2020, 295, -1626, -2737, -2277, -310, 1548, 2434, 2127, 289, -1596, -2627, -2233, -566, 1871, 2753, 2181, 478, -1502, -2925, -2421, -427, 1589, 2612, 2083, 656, -1660, -2478, -2161, -492, 1559, 2480, 2189, 557, -1744, -2514, -2054, -536, 1564, 2613, 2226, 399, -1504, -2398, -2263, -587, 1413, 2624, 2078, 489, -1668, -2515, -1984, -471, 1466, 2814, 2076, 422, -1644, -2466, -2290, -413, 1486, 2550, 2270, 450, -1425, -2447, -2180, -458, 1261, 2473, 2119, 354, -1408, -2473, -2081, -475, 1534, 2495, 2234, 534, -1354, -2609, -2340, -779, 1020, 2581, 2162, 588, -1393, -2534, -2118, -518, 1312, 2564, 2135, 803, -1275, -2573, -2227, -839, 1391, 2504, 2140, 442, -1315, -2485, -2234, -502, 1172, 2481, 2098, 626, -1136, -2484, -2096, -685, 1323, 2249, 2242, 359]
3568C59j556j334J72J776J609J296p6j560j849j324J93J500J566J542j16j468
3584G30j723j109O3J599J538J321m64j120k063r91r3J484J956J047J06j469k041
3601a229r57l7J757J388J543j74j474j870j061J17R57J997J316j12j429j580j371
3618b219J33J335J503J558j16j401j562j219rJ332J554J297j19j072j912j242
3634b159P0J440J710J171q0j282j795j181MJ246J689J289q3j219j737j197O9J173
3652h72J896O92N54j505j553j052j80J092J675R74N54j384j587j154k78J317J576
3669G65J371K7j260j820r76l79J393J617J352J49j075j961j058l06J162J762J173
3686A936r8r65j426j466j2J129J603J346k8j145j818p53o67J325J480J372Q4p90
$$ y = [359, -1197, -2531, -2359, -583, 1026, 2322, 2246, 686, -1163, -2487, -2294, -794, 772, 2314, 2198, 730, -993, -2102, -2039, -440, 1098, 2419, 1955, 835, -1228, -2219, -2312, -828, 1128, 2175, 2281, 812, -1229, -2186, -2223, -466, 922, 2465, 2291, 817, -1053, -2114, -1997, -1040, 957, 2273, 2161, 732, -848, -2219, -2086, -751, 752, 2310, 2194, 793, -769, -1988, -1997, -665, 889, 2186, 2067, 995, -917, -2159, -2089, -649, 1061, 2232, 2152, 870, -925, -2106, -2102, -856, 833, 2122, 2039, 820, -917, -2114, -2045, -872, 1024, 1716, 2270, 765, -788, -1840, -2020, -928, 747, 1721, 2275, 891, -696, -1850, -2128, -811, 765, 2136, 2163, 903, -917, -1893, -2272, -879, 738, 2090, 2239, 1164, -797, -1855, -2161, -999, 763, 1936, 1838, 873, -553, -2019, -2031, -902, 701, 2047, 2019, 874, -944, -1697, -2364, -1039, 441, 1813, 1897, 1107]
3704A107j817j337j10J078J719J132J52j012j491j444Q0R86J583J115L58j092
3720A007j556j497j16R53J789J101M27j007j758j354j01J005J583J741l97p89
3736A031j641j006m51J152J501J389J9o86j855j273k07J092J423J309R0j035j176
3753c24j472l62J134J537J442K48j227j446j517J67Q14J461J134M17j069j413
3769d76j260l34O63J815J335K68q16j727j161k34P91J505J416J36r55j321j455
3786a810l78R25J782J304q2n60j512j244l46O62J406J696K76p28j581j746K2M21
3804a493J706J456K49q77j324j105o68Q34J812R77L48o44j697j095n09P23J572
3821B65J580K99j225j027j348o18P93J673J342J70o47j542j006n93O02J524J314
$$ y = [1107, -710, -2047, -2157, -1079, 640, 1772, 1924, 912, -579, -2023, -1943, -957, 626, 1741, 2099, 1007, -549, -2046, -2162, -1209, 580, 1681, 2108, 1101, -657, -2011, -2112, -1107, 476, 2217, 1820, 1031, -610, -1616, -2067, -915, 586, 1975, 1994, 1308, -547, -1820, -2027, -935, 488, 1797, 1887, 852, -324, -1796, -2158, -1024, 513, 1955, 2203, 976, -470, -1987, -1820, -1006, 455, 1589, 2006, 937, -476, -1736, -2070, -1407, 408, 1743, 2011, 1195, -532, -1693, -1927, -1136, 369, 1785, 1921, 966, -355, -1810, -2188, -1263, 519, 1823, 1741, 1181, -331, -1575, -1921, -1259, 147, 1843, 2119, 1391, -190, -1936, -1914, -1493, 213, 1669, 1918, 1041, -283, -1388, -2056, -1222, 590, 1567, 1915, 1271, -426, -1521, -2030, -1307, 265, 1845, 2144, 919, -108, -1456, -2074, -1281, 392, 1734, 1904, 1257, -285, -1291, -1884, -1282, 242, 1556]
3838A556L44p45j347j704j35P59J419J381K42o04j526j087m95J051J026J137N03
3855A775n43j366j058j048J069J323J440M99o29j537j520m46Q75J372J344L29
3871A879n54j538j220k78L41J411J426P54p14j614j060p20P01J299J499K25n75
3888A262j344j675k44J070J221J021N18n76j427j163n26P23J138J460M00n24j458
3905a24j310n27O15J319J539K47n30j283j053o79K62J475J451M67p21j234j309
3922a395o12P25J106J743M42r77j099j342l92N46J503J109N17o03j141j299o82
3939a851O45J107J322O48l48j381j560n80P50J201J363M15l69j268j304p87P81
3956a216J343J369N26q13r47j683l59K09J552J218M57j39j638j276m30M94J244
$$ y = [1556, 1900, 1155, -192, -1896, -2031, -1272, 147, 1528, 1770, 1166, -360, -1447, -1942, -891, 135, 1272, 1775, 1232, -134, -1192, -2240, -1171, 152, 1592, 2091, 1462, -75, -1595, -2041, -1166, 206, 1550, 1879, 1325, -213, -1433, -1711, -1370, 41, 1467, 2221, 1507, -107, -1167, -1887, -1186, 113, 1612, 1837, 1262, -82, -1757, -2001, -931, 290, 1311, 1829, 1253, -174, -1337, -1863, -1140, -2, 1458, 1858, 1334, -124, -1434, -1961, -1346, -27, 1512, 1759, 1229, -54, -1107, -1786, -1524, -49, 1402, 1869, 1148, -86, -1395, -2007, -1282, -176, 1567, 2009, 1032, -67, -1409, -1801, -1255, 248, 1357, 1874, 1271, 130, -1169, -1851, -1206, -99, 1223, 1871, 1523, 142, -1418, -1998, -1248, -47, 1316, 1731, 1362, 94, -1210, -1997, -1216, 127, 1496, 2022, 1209, 262, -1421, -1780, -1571, -19, 1199, 1656, 1517, -121, -1397, -1827, -1333, -89]
3973h9J406M88m58j159j562n70N68J131J617L72k94j328j393m47N68P67J219Q26
3991A662j52j215j523m82Q5J574J032O85l67r47j496m99L35J264J106M72J1j385
4009A60j346n33J23J494J039Q96p5j563j193q42K22J420J540O61o29j009j517
4026a152p54L35J278J427P89l86j222j411r14N84J319J091N70l0j391j274l64
4043a505J66P61J346J204m21j363j286p54N49Q04J694P13k01j297j659n50M54
4060a345J046J600M63l07j155j291o64j70J696J181N83k56j058j335q25K59J355
4077b23J279Q12l13j310j331o53K07P65J723R26o01r78j037j154L45J141J083
4094F81J061j94j351j041j126M49Q92J558Q89k37j415j222p09o7J381J605L71
$$ y = [-89, 1317, 1805, 1347, 188, -1374, -1944, -1376, -245, 1372, 1744, 1450, 122, -1271, -1718, -1150, -383, 836, 1662, 1510, 295, -1228, -1710, -1625, -51, 981, 1666, 1299, 352, -1144, -1643, -1308, -44, 1062, 1534, 1545, 160, -1186, -1719, -1596, -102, 937, 1833, 1758, 195, -998, -1840, -1618, -198, 1342, 2003, 1374, 365, -1152, -1906, -1571, -293, 1134, 1923, 1537, 315, -1096, -2010, -1426, -107, 984, 1554, 1524, 133, -1141, -1505, -1339, -578, 768, 1972, 1551, 188, -1098, -1852, -1303, -499, 1195, 1908, 1707, 410, -1249, -1799, -1345, -299, 1301, 1764, 1457, 302, -989, -1653, -1823, -127, 1054, 1637, 1381, 323, -1012, -1837, -1578, -223, 1056, 1868, 1555, 245, -1086, -1739, -1532, -767, 956, 1882, 1281, 303, -734, -1888, -1543, -402, 681, 1742, 1548, 197, -844, -1970, -1521, -629, 929, 1818, 1581, 166, -1056, -1765, -1832, -451, 1154, 1525]
4111A525m6j140j369o34K45J186R65R48m0j164j655l85j02J308R91J210l43j059
4129D41j263o73j04J158J231N72P2r33j197r79L51P79J426P55l47p70j163j074
4147a718J13J065J560P02k01j004j457p79J23J223J094Q26l2j066j260r96N88
4164a219Q83J342N91P7j321j237q43J16J133J364P16q8q97j304p92L08P17J129
4182F75R45j07j185j141o00k03J029J175P80Q5n98j628r59J84R00J368J107m06
4200A421p55j160r33J93Q59J167P24N6j290q13r63JQ44J323J123j95r70j026j392
4219a786K39P16J272J062K30q44j415r64k41P11J802R01k86p43j075j008j52P72
4237h09J268J360j80n28j730j040J42Q17J354Q32n1l49j647j040Q9O38J714O81
$$ y = [1525, 1479, 339, -1030, -1664, -1419, -233, 732, 1680, 1640, 476, -1179, -1564, -1666, -358, 633, 1843, 1500, 441, -822, -1495, -1599, -441, 790, 1362, 1434, 501, -696, -1675, -1324, -545, 881, 1636, 1289, 519, -644, -1718, -1605, -540, 1020, 1722, 1521, 517, -940, -1719, -1596, -373, 721, 1547, 1515, 449, -811, -1807, -1219, -336, 1006, 1597, 1674, 353, -884, -1727, -1611, -478, 886, 1602, 1514, 617, -687, -1479, -1171, -454, 675, 1620, 1513, 328, -813, -1413, -1616, -587, 588, 1368, 1453, 855, -773, -1732, -1548, -648, 720, 1827, 1421, 666, -494, -1427, -1234, -375, 792, 1516, 1572, 282, -531, -1494, -1493, -649, 674, 1797, 1602, 632, -394, -1786, -1547, -831, 441, 1503, 1733, 889, -526, -1490, -1731, -1020, 782, 1683, 1397, 654, -421, -1429, -1581, -809, 459, 1819, 1639, 1111, -619, -1659, -1517, -700, 654, 1486, 1435, 1086, -561, -1601, -1512, -874, 840, 1521]
4255A521K70j198r96r02n09J283J143R82l5p86j408o36k89R12J197J016J51j033
4273F83j223j019j4Q61J323Q16M5q32j408p95J8N56J387J316k83q03r35j492K41
4292a558P19J384Q94J41p96j059j039l75Q42J422R48J9p33j536o68p5Q17J005
4310C52J276K28j263j130j195K04P92J087J356k33p47j058j093j33P92R60J173
4327A368M37j024j160j031j87P96J226Q00M38o71j418j096Q3N80J291Q08J89m64
4345I65j170j049m14Q81J224Q82J21n67j351n99p66N24J612J176K0n59j294r14
4363a278o11Q36J578Q62J22p30j230r34k56P93J400R13l0o68j081j047m46R70
4381h37J300R74J37l90j494j003j58N66J638N19K92m36j452r29j0K63J090J475
$$ y = [1521, 1791, 593, -403, -1305, -1814, -531, 612, 1594, 1559, 773, -635, -1271, -1560, -648, 549, 1565, 1716, 683, -540, -1559, -1573, -712, 611, 1427, 1472, 640, -768, -1563, -1545, -989, 398, 1714, 1431, 628, -307, -1799, -1558, -839, 545, 1439, 1580, 784, -275, -1314, -1689, -847, 575, 1523, 1542, 809, -727, -1395, -1470, -653, 352, 1628, 1856, 593, -537, -1732, -1528, -736, 351, 1707, 1474, 727, -331, -1424, -1557, -765, 195, 1368, 1805, 781, -379, -1410, -1597, -801, 425, 1225, 1663, 992, -426, -1522, -1439, -859, 432, 1240, 1429, 965, -205, -1254, -1668, -787, 437, 1319, 1440, 873, -478, -1077, -1843, -1319, 293, 1469, 1489, 930, -364, -1278, -1889, -1053, 525, 1387, 1509, 779, -451, -1385, -1641, -848, 552, 1465, 1435, 767, -314, -1361, -1807, -837, 463, 1437, 1574, 1184, -310, -1313, -1471, -905, 733, 1252, 1544, 1108, -344, -1273, -1283, -1020, 70, 1545]
4399A545M5n47j458j097K53M18J040J117N28r19j053j618R0P66J098J110J91l15
4417A194j527r16l83O95J173J042J77m48j435q11m16O94J180J024K34l27j398
4434b48q98l48L71J311J031N64p25q73j344n25O59J179J063M67j076o59j176m90
4452a717Q45J099Q84O21r00r97j026j95O22O74J268M01o38p84j357pJ42J309J025
4471A269L70m49j245r83n62O28J179J289j3m93j027j016l61L12J033J317J87p84
4489F51o99r92l57K91J040J119N09n23j143j062l01K77J113J311K01k03j007j328
4507a103m29O73R25J217J97m48q38j187n68K80J262J114M53n21j028q85p20N74
4525a032J016J185M46o77j047j070l15M45J063R73N74m43j045j086o49L34J397
$$ y = [1545, 1590, 1043, -415, -1512, -1259, -841, 199, 1316, 1844, 925, -128, -1746, -1656, -890, 208, 1318, 1509, 1194, -333, -1249, -1632, -937, 236, 1278, 1455, 1007, -428, -1239, -1655, -961, 219, 1243, 1477, 1150, -248, -1146, -1494, -1123, 188, 1219, 1783, 1058, 185, -1159, -1684, -1025, 154, 1217, 1684, 608, -51, -1227, -1717, -872, 227, 1111, 1732, 832, -165, -1191, -1386, -764, -90, 1178, 1579, 941, 157, -1200, -1207, -1065, 244, 1269, 1639, 1190, -55, -1038, -1600, -972, 207, 1496, 1483, 990, -37, -1053, -1414, -1102, -69, 1248, 1435, 651, -48, -1040, -1397, -1106, -66, 1053, 1562, 1039, -104, -1166, -1467, -1190, -77, 1234, 1435, 1232, 225, -1103, -1532, -859, 66, 1283, 1480, 1032, 194, -993, -1561, -1281, -19, 1095, 1548, 1027, -1, -886, -1606, -1032, -16, 1169, 1615, 938, -109, -1179, -1494, -1049, 14, 987, 1561, 1118, 73, -1013, -1662, -1328, 69]
4542F9J199K41m45j158r39o40L47J424Q83M92j97j181q52o45L32J319R24M06m20
4561A159j049j396l03K35J476Q13N14l74r98j332j42Q7J246J335M2k58j041j030
4579a016o65L54J186J153L67k64j161j002n72M64J353P20M96l49q25j360m52N77
4597i96P17J195N84j1j073j393n49L98Q07J505J15j65q25j230n26M5J240J078
4615I16L79j47q34j503j09L04R29R49O71m70n34j345p62J50J184J026Q32n92j069
4634b5n06q26j20J303R88L97j4j015r71p32M35Q60R24P72j98r87r88n80K50M03
4654f30J315R29n76q30q59j000P03O52J016O14k73r21j050n09J46J082J064M02
4672A275j02p84j035q56L37Q46J044P45m30o58r07p24K38L63J271Q30l61o18j083
$$ y = [69, 1268, 1509, 1064, -94, -1033, -1673, -1326, 98, 981, 1473, 1276, 95, -757, -1402, -1070, 249, 1173, 1579, 1159, 110, -1286, -1589, -1354, 122, 935, 1449, 1075, 77, -1255, -1397, -1310, -64, 1271, 1313, 1055, 14, -1016, -1681, -1327, -141, 1012, 1379, 1115, -46, -1048, -1620, -1156, 197, 917, 1413, 1064, 239, -1121, -1573, -996, -279, 916, 1500, 1489, 416, -977, -1526, -1128, -321, 1184, 1299, 1134, 309, -921, -1447, -1402, -162, 916, 1295, 1148, 314, -1189, -1298, -994, -65, 884, 1555, 1085, 551, -794, -1556, -1406, -222, 804, 1636, 1044, -25, -531, -1357, -1477, -174, 814, 1211, 1197, 182, -789, -1521, -1086, -226, 698, 1470, 1272, 285, -703, -1283, -1033, -630, 685, 1614, 1038, 208, -651, -1651, -948, -296, 720, 1334, 1061, 140, -910, -1419, -1273, -191, 873, 1275, 1173, 389, -646, -1502, -1165, -319, 725, 1470, 1040, 382, -525, -1249, -1011, -648, 623, 1453, 1092, 474, -609]
4691f09q10K55P45J198M72q2j117o91o82q6R95J131O03r6r85r15n31j89Q20J203
4711F29Q13n27o52j064l83L37N38R80Q67l57q35j135m90M2P92J075O41P8j072
4730B77o59r27Q2Q16J049O41j63m49j288o65r1J067R25O52k5p29j211o30L3P70
4750e25J001R22m21m14j315p46K87Q14R88M88O5o40j167o41j75J059R09Q60N4
4769A403q35j174q40M17M90J107P96k99o85j166m93j82J094R64P14p7q80q58o20
4788a124j91P09J262N83j51k56j247q43J19R00O80J081k50r69q25m80k39O00R99
4807C58J061k08p78q42q30L0O67R98P15j89m37j019q33j57R19J130N14J94o95
4826E98j026j181L26O56J000Q29K60p62j139o58k19P58J170N48p8m16j414m28
$$ y = [-609, -1419, -1164, -419, 779, 1251, 1169, 52, -639, -1321, -1407, -412, 719, 1322, 1226, 241, -674, -1205, -1394, -574, 629, 1442, 915, 263, -801, -1184, -847, -309, 671, 1538, 1181, 346, -789, -1279, -1237, -445, 630, 1271, 1349, 277, -382, -1309, -1227, -411, 638, 1279, 1116, 667, -621, -1286, -1377, -310, 615, 1267, 1242, 513, -698, -1328, -1295, -525, 476, 1398, 977, 563, -752, -1498, -1211, -397, 591, 1079, 1144, 504, -663, -1304, -1479, -420, 489, 1349, 1403, 568, -606, -1446, -1029, -539, 568, 1364, 1065, 380, -786, -1279, -1461, -367, 597, 1311, 1234, 354, -504, -1124, -1315, -606, 656, 1239, 1088, 832, -415, -1258, -1139, -239, 441, 1522, 1272, 303, -522, -1002, -1241, -641, 358, 1419, 1211, 433, -409, -1239, -1209, -542, 456, 1171, 982, 545, -474, -1307, -1464, -545, 585, 1099, 1293, 598, -428, -1609, -1283, -627, 373, 1202, 1462, 700, -439, -1097, -1316, -558, 612, 1160, 1082, 666, -748, -1176]
4844a176J02M32J247O22J30q99r55p86j32P37R53O04N89q42q94j176N02K98Q84
4863B40Q61O7n97q58q51P1O37P40O01K14k64j471l29k23L93J186N50L49o86r00
4883b70p46k09M55J088P52R1o63q92o47r8L54J188O85M8m73j142m93n04R12P68
4903B04J024q1l74j215o28qN95O54P30K85m74r86q27J1M07Q42J069n8m84r61o43
4924i18l5M44R51P58R9l79q79j239Q8L33J107P48O9n01j000o65J46K95R17P69
4944A108J10n37r82n23k42M78P47Q08K42m62j010q15j68Q25Q57N78J25m40q21
4963a22q50k74N84R28R56R3p39q53o24R5J62P48R50K5l4j108p60l36P49N32J083
4984A205jm32q69q68k89O17Q29P88J21l45q24q84j66L62J013P29M06m40j204q08
$$ y = [-1176, -1074, -642, 605, 1227, 1357, 458, -497, -1283, -1415, -678, 275, 879, 1468, 626, -268, -1444, -942, -644, 240, 1101, 1168, 571, -287, -1138, -1067, -430, 310, 911, 1125, 861, -610, -939, -1162, -769, 417, 967, 1316, 630, -270, -1016, -1225, -770, 318, 1070, 1161, 498, -394, -1041, -1139, -785, 403, 1088, 1136, 663, -479, -972, -1476, -564, 204, 1228, 1147, 773, -442, -1070, -1078, -483, 171, 901, 1186, 712, -274, -1101, -1090, -683, 159, 1228, 1170, 686, -275, -918, -953, -509, 442, 1200, 1299, 920, 41, -1198, -1110, -777, 330, 1078, 1147, 646, -354, -1019, -873, -578, 339, 1108, 1218, 681, -301, -824, -1066, -588, 159, 967, 1209, 747, -263, -1078, -1246, -421, 436, 1014, 1139, 699, -122, -972, -1246, -662, 266, 1222, 1315, 576, -277, -901, -806, -644, 104, 1054, 1079, 1045, -63, -823, -1159, -410, 122, 1205, 1204, 772, -97, -965, -1254, -637, 192, 980, 1101, 756, -68, -952, -1118, -756, 257, 986, 1392, 952, -252, -1060]
5004a060k58N57J002M96M89n49p65p46q8K35N74J237j9k34p67j101oK75Q45N49
5024F66N99m35j013q71j95M91Q52P78K61o08m13q43l62N39R85M25L43j98j140
5043a39o05l52K08Q80P87J96k98n70o53o38L26J241K60K84l0j018o30l96K91J213
5063C57M00M65l86r20q94l8J15O21J107J28p7p55p14o79O77N00P22M94m67p86
5083a30o74k64L66O02O40O48m48p65o50n23O18M80P74J31K96q54r04l00J69Q36
5103D8M57L91k92m57q93m98O73N65N99M28m60k34o76o30K68O36P42L42j86p46
5123G7q58j75J66R34L43P02m12p14m78m55J22N42R12R4j86o80o60k84L90M44O70
5144D94O47l27r49m21l13M0Q05O09N07k53m30j149j88J92O15M17O01j20n61r72
$$ y = [-1060, -1318, -761, 241, 737, 1226, 677, -88, -834, -922, -687, -113, 1124, 1105, 871, 104, -997, -1003, -728, 117, 666, 1265, 830, -183, -1054, -1249, -758, 94, 872, 1133, 525, 112, -731, -1093, -554, 431, 856, 1199, 1001, -139, -744, -1096, -888, -8, 779, 975, 677, 107, -546, -1184, -858, 383, 643, 927, 897, -121, -751, -1147, -856, 357, 757, 1222, 836, -84, -978, -1016, -901, -280, 827, 955, 878, 123, -591, -1270, -593, -93, 629, 1123, 656, -130, -804, -1068, -702, -100, 540, 1188, 740, -25, -675, -1198, -580, -100, 674, 805, 1101, 247, -657, -957, -788, 48, 505, 896, 604, 147, -746, -1244, -571, -6, 593, 1021, 561, 327, -349, -979, -711, -75, 667, 1009, 823, 77, -781, -956, -790, 144, 487, 1189, 777, 63, -415, -870, -748, -206, 706, 800, 614, -66, -726, -1010, -620, -176, 494, 1141, 814, -135, -556, -869, -829, -24, 585, 1092, 839, 409, -740, -928, -736, -121, 296, 897, 777, 216, -756]
5164g56n2J16M99R32J3J03p71p90l2N2P08N93K94l85m47n56m47J24P88O11L88
5185I85m18m57q38J21J9O04N76M89qj030o87j57P7M99O51N79L5o14j099m52M64
5206f61L69Q80J94m9p24l83p02L12N45R87J19j12l52j021m05K49N29M86M11K31
5226I03m65r25n22M88M09O78K70r5q93j06n96J10Q08M99J28k8k99q51n04K16N58
5247b17O79M13k95k31r07n41K79M25R66M30k53m33q43n59K90P14M60M85N8q96
5267B4m49l79q7O74N51N54k81n64n07m04O3M61P39P08j75l86j172k43J66K55J027
5288E75L30k45l14p04p18N65K51M66L23Q3j35r28p7j16K68Q44L81k7m82o17o74
5309i51J25O46O29M62q1l80j031j60n2O86O96K41j74o24o94l6J11L77N55K93J51
$$ y = [-756, -808, -692, -193, 739, 752, 855, 84, -706, -738, -686, 22, 615, 909, 524, 77, -479, -926, -802, -14, 597, 985, 567, 110, -728, -607, -588, 16, 592, 1081, 1073, 43, -644, -801, -724, -225, 426, 1005, 1040, 426, -673, -1125, -661, -292, 588, 782, 733, 9, -374, -1076, -764, -219, 768, 887, 775, 423, -598, -1003, -754, -225, 261, 672, 903, 438, -487, -1009, -521, -112, 566, 836, 741, -152, -258, -854, -744, 64, 563, 691, 663, 364, -487, -991, -775, -217, 462, 875, 580, 349, -558, -1099, -820, -395, 571, 1001, 748, 315, -528, -1087, -797, -83, 377, 862, 920, 24, -425, -804, -891, -217, 334, 888, 607, 43, -464, -868, -805, -344, 395, 1103, 928, 542, -630, -873, -707, -452, 575, 905, 660, 346, -358, -1076, -511, -260, 206, 529, 612, 477, -451, -528, -644, -376, 468, 849, 822, 340, -277, -951, -826, -180, 449, 911, 830, 450, -581, -741, -793, -107, 589, 830, 656, 32, -662, -698, -587, -210, 345, 638, 789]
5330G89o18n01o03J81M79N48O97j86n29o02l41p3O02N30O16l21m17n24o55K89
5350f39K10O53N93k29l64q52l39K17N50P56kj8m42n87k51q7O00N43J87O2k6r97
5372d62l10Q6N05P10L51O0o57m75n40r8N14N22N42ll97o63m66J10L02N40P83l98
5394E56j36q83k89J39M83K75O14k8n60l42m71j75M49Q96J6J98o15m08j60j22M81
5415h2L45N83k08l85p59l53J23M19N64M96j42k61n33l66j46N15N09M54pk98p11
5436b43l60l25O98O38L34n3l59n41m19J43J01N80K67L53m35o80k90k86M40O83
5456B46N15j7n80m38k43Pj8J241k5po36l10l77qJ68O89N60k61k28n36l89k52P17
5479a82K85M45k5k62l83m71p2L98M08K96j7l4o97l78J7J63O49O12q3m72l27o44
$$ y = [789, 171, -330, -933, -752, -273, 275, 972, 786, 257, -345, -686, -759, -157, 373, 989, 668, 251, -273, -928, -639, -429, 224, 817, 588, 224, -628, -967, -750, -200, 556, 554, 536, 94, -493, -744, -831, -231, 312, 499, 561, 535, -462, -772, -686, -181, 529, 880, 940, 283, -192, -732, -830, -316, 206, 748, 745, 348, -315, -781, -671, -369, 171, 954, 556, 420, -463, -752, -613, -130, 145, 759, 731, 171, -171, -642, -817, -368, 528, 544, 742, 127, -281, -441, -563, -82, 263, 846, 638, 253, -506, -859, -736, -317, 247, 743, 601, 340, -193, -559, -705, -190, 319, 773, 766, 468, -243, -603, -928, -230, 408, 742, 689, 330, -211, -630, -487, -386, 194, 461, 814, 379, -301, -591, -877, -437, 246, 761, 744, 164, -274, -517, -510, -528, 713, 688, 681, 45, -265, -642, -650, -482, 207, 767, 506, 278, -258, -647, -899, -182, 103, 548, 523, 261, -122, -593, -665, -267, 141, 437, 420, 386, -311, -689, -672, -509, 140, 752, 669, 197, -130, -774]
5501g74J41L57N92J96M54q24k80l16l69M48P78K15Ql30m15n44L96pN43N19p8j60
5523E50q04l10L6j55R02N13K4m36q63k19J03K66P08K50P3l26j42q04m3L30O25
5544B78L19J83k45p57l42j04M73J57M97J56k04o68k30k09M55M56J33K57r5r43
5564d33kj01n4O93N94J53n34n29m17r4M56L42L23L24k58o28l42k03L22N32J88
5585C32L34k32p48j93j25K35N45K68K79j47p34m70k79N50P63K43j07l40Ko92k16
5606g32J58Q64L70k82N0m20m92M6J64M57L85N7k98p04j84k7J93M85K61K97o82
5627c4lm58j04N1N86Q28n14n3n22j66j75K09O07K35J71k97k84p27J38K04P14P
5649D13J24k29o62R4j22L39J32L59K34k24n48k79j06K5K56M21J96j61l87l98l25
$$ y = [-774, -633, -276, 316, 512, 966, 142, -138, -454, -823, -375, 403, 618, 626, 296, -119, -663, -267, -274, 269, 788, 710, 550, -254, -564, -528, -683, 219, 732, 756, 320, -543, -762, -659, -393, 315, 565, 638, 312, 170, -634, -677, -347, 278, 597, 780, 535, -222, -564, -668, -195, -38, 459, 615, 411, -257, -487, -696, -241, 215, 348, 605, 510, -433, -435, -536, -590, 103, 697, 850, 316, -213, -630, -724, -268, 74, 397, 721, 463, -165, -507, -710, -388, 144, 332, 666, 434, -314, -507, -632, -397, 148, 416, 695, 548, -186, -656, -935, -385, 378, 621, 514, 174, 176, -516, -732, -574, 290, 660, 378, 428, 8, -484, -438, -274, 183, 568, 625, 327, -377, -561, -588, -395, 90, 351, 648, -34, -37, -495, -599, -548, 38, 866, 352, 299, -223, -389, -564, -355, 252, 487, 658, 361, 77, -650, -512, -308, 406, 413, 537, 308, -354, -260, -382, -43, 89, 448, 682, 458, -90, -369, -475, -450, -194, 227, 423, 262, -125, -523, -848]
5670h48M13O99L12q5j2n36l29j34J47M08M64o2k60l85l00q2M67L62J14K71j42
5691D82m38o23j21N58K8M75J50m27k99j68r3q8O29L34J07l55p4l22k65K04L58
5712E2K16K91o0l12p29O4J47L27M50J40k73l25j99k49J91L63M17K21m11n46nj59
5734c89K4O48mK99k95n01n88K9N72P5L74L79k94m54o1o1J5J81M03L89l75p17j39
5757d90J23j91Q21K13j08p1k51m41k8L64j84M58N80m68n42m10J44L8O71M88n11
5778B05M5m74j04j36%M60K38L18l05l07m27P4J34M15K28p9Q3l63o09L52M7ML16
5801A15N33k77o07l29L18R2L52k11P17n34l14l89j19N63K04J76M11m32l95j15
5821b41k82K84L09K08jP2l98j91l44K60K02O32l7l41l90j08m6J03M55r5K63j87
$$ y = [-848, -435, 264, 576, 491, 479, -57, -386, -520, -373, 35, 499, 437, 177, -208, -508, -590, -123, 239, 353, 624, 482, 44, -579, -700, -142, -114, 361, 511, 84, -215, -383, -476, -564, 65, 399, 506, 151, 77, -245, -510, -306, 52, 268, 559, 499, 187, -542, -478, -331, -4, 446, 586, 313, -12, -211, -460, -269, 94, 511, 732, 321, -225, -230, -389, -365, 283, 279, 578, 283, -218, -806, -777, -205, -130, 244, 623, 329, -125, -186, -247, -232, -51, 352, 741, 366, -351, -490, -367, -558, 263, 476, 368, 297, 46, -395, -423, -59, -243, 215, 795, 327, -215, -625, -481, -443, 228, 716, 205, 250, -224, -328, -464, -464, -4, 234, 552, 247, -60, -487, -413, -279, 136, 364, 285, 368, 5, -604, -252, -205, -201, 115, 648, 371, -236, -565, -247, -155, 197, -14, 703, 169, -145, -534, -653, -90, 114, 290, 701, 269, -126, -241, -523, -239, 70, 278, 277, 349, -49, -240, -584, -324, -122, 510, 473, 132, -258, -366, -412, -309, 146, 51, 314, 127]
5843A27l66r5oJ98M13R3Mj40l16m62J98K16Q1L45K29j61m00n12n0N61K06K67J78
5866F08l46m12k13k3K57N3N01J07m20k7m59k38L52J56N55K40n21k95j15k72L17
5887a95J86K12J13j57j33l30j20J46L07J36J89K9n08n22qK21N35J36k1O6k97k71
5909b86q5P6M84q9L37j87l59k11j4r4M75L65m0j10l65k43j95K84N58J19M6j87
5931B79l31m03kJ94L78L79N9m06m0k99m09J83N64J01M69m62m92j25r9K22K70K91
5953C21J77l71j98k88LJ64L3M71j81K38k62l63l18M70pL37L31l51l08l83M1L57
5975h7j0M66j75Q1n85J58k21l4L44M07J92j74l57k60j34L5L34K13L20m58l36k6
5997c07j81qM82L74k34K65k55m48l05M54L64k24L73m9k79n8j67l11N77J28mj0
$$ y = [127, -239, -334, -340, -142, 271, 364, 368, 228, -88, -550, -352, -136, -55, 290, 519, 358, -42, -554, -604, -43, 163, 430, 608, 262, -150, -363, -386, -129, -76, 425, 532, 112, 85, -374, -612, -260, -104, 451, 691, 170, -125, -240, -512, -195, -9, 203, 316, 159, 26, -304, -424, -278, 29, 165, 354, 383, -125, -647, -655, -434, 101, 237, 216, 282, -15, -286, -371, -295, 189, 100, 437, 250, -109, -320, -334, -428, 47, 412, 372, 262, -103, -346, -541, -257, 301, 420, 466, 279, -52, -455, -457, -263, 115, 494, 553, 147, 107, -192, -601, -418, 146, 247, 716, 254, -238, -363, -462, -240, 30, 321, 498, 127, -71, -359, -356, -192, -159, 312, 131, 369, 107, -256, -574, -104, -111, 226, 557, 206, -102, -485, -444, -87, -97, 369, 194, 275, -310, -152, -373, -407, -63, 344, 536, 362, 5, -255, -389, -354, -20, 193, 513, 55, -281, -307, -488, -496, -14, 360, 126, 391, 136, -312, -617, -163, 201, -23, 350, 301, 22, -36, -203, -514, 63, 191, 187, 177]
6019A77l5l28Q1k55K91L18K43k82m87l0q8J45K47K99J72k82j70k56j20Q8K58L33
6041C19k1K7l46k76N3p3L09L94J10j58p00J97l73L26M7N92m2k08j95k49ql0M73
6064A68J37J16k03r0m16j8LL28K54J44j49m7m70k54K58L65J20J21Mj70l21m61
6086e81K22M12L28K36l38j83o44k9M49J49M31KJ02m76l70j96K49J17L64K68m11
6107A01p1l78l11K93O57K37p3l47j15m39j21M85KJ88o8J11l95O7k69L31J40K27
6129B52O0J40n80j74J38j27L95J08M48k98m86l02J89j92L59j1M05J78n12o0l60
6150d30oN43K47J22j70k94l43pK1M05K49Q1j7l12m21j70K62K53K13K26k28l20
6172i6k75K34j21L61kK80n4m20m0n81J85N14N29Q0l86K98q70j40M42l09P37m7
$$ y = [177, 142, -186, -105, -360, -69, 249, 492, 210, -277, -307, -395, -250, -3, 296, 468, 186, 16, -240, -360, -272, -14, 319, 298, 325, -21, -297, -244, -317, -8, 386, 496, 338, -362, -165, -538, -212, -165, 427, 385, 177, -18, -267, -275, -305, 168, 305, 421, 218, 128, -288, -306, -303, 25, 279, 423, 274, 227, -243, -497, -239, 126, 246, 367, 371, 201, -120, -581, -359, 53, 381, 617, 279, 96, -548, -577, -128, 21, 452, 454, 556, 80, -290, -486, -237, -120, 244, 512, 101, 30, -348, -659, -366, 291, 528, 455, 108, -7, -446, -567, -82, -80, 108, 40, 151, -244, -177, -446, -115, 25, 252, 312, 452, -128, -302, -164, -291, 104, 212, 660, 362, -124, -426, -237, -429, -70, -81, 324, 502, -10, -70, -430, -436, 107, 354, 476, 306, 12, -331, -338, -317, 88, 337, 418, 401, 89, -332, -502, -240, 13, 226, 452, 224, -96, -371, -137, -258, 103, 101, 381, 327, -93, -133, -714, -529, -15, 514, 594, 208, 506, -364, -504, -62, -371, 366, 319]
6194C19j10J02n70K13l29K27M98r7R8m35r2l29J73N16J79K4M4l34k24p9l01K21
6216b86N20K33j47j10n87p3J27L12J79J71j70j80j67nl13N30K28K98l00k66k13
6237b19k45M38m3K72J45M8l99q3m68L01k2O75O7k42j98l55L0J07L30K48J1M1k49
6260A90m35j74J82O2N18j9k93l6k31j56J40r9Q20N5o8m97k62J0K61oK34K13j10
6283B99l21q2k88r0N77n9K76j01j25j96j00m4M7N84J9J6j32n67q5M6K56L38j61
6306A07L91l76m32N7j91O35j36K44M9l83k57j94K23M73J54q0ml53n23K47J79J39
6328c1J09J65o5k38k39j88K00N17m5N04m25k91j18q8J88J9J87M44l97q6l53m3
6350b74j31L35L05J37o3p8l83o3k10M17K40j78K25Pn37j13J4K01K38L72K50n92
$$ y = [319, 209, 311, -259, -46, -375, -148, 350, 253, 351, -84, -176, -505, -332, 184, 363, 387, 431, 97, -127, -206, -507, -286, 234, 467, 320, 210, -377, -450, -323, -11, 168, 339, 169, -11, -178, -183, -496, 34, 262, 560, 260, -6, -219, -464, -26, -69, 203, 348, 396, -3, -86, -554, -253, -275, 400, 467, 225, 27, -328, -298, -191, 139, 387, 398, 439, 190, -245, -419, -237, -175, 343, 324, 31, -5, -236, -392, -252, -351, 469, 524, 456, -41, -303, -293, -32, -38, 196, 409, 299, -22, -104, -392, -482, 95, 36, 312, 211, 86, -110, -210, -254, -207, 377, 396, 412, 280, -287, -372, -326, -70, 268, 107, 498, 122, -310, -253, -444, 191, 55, 299, 348, -35, -292, -486, -263, 210, 364, 284, 280, -73, -596, -349, -170, -31, 78, 243, 178, -60, -299, -487, -287, 230, 185, 689, 264, -27, -145, -233, -45, -26, 161, 605, 208, 122, -231, -274, -405, -70, 235, 372, 309, 231, -152, -215, -425, -8, 232, 54, 279, 286, -251, -364, -350, -149, 89, 461, 711, 119]
6372A19l67j4J05J05K55M0M8m49J7l44R0L46K75l5R6k82m15k3J08K32L26q9J84
6395C28l10n17P1J02J32K63J75P1k42j94j21j03MP69m1rl85j47k64J10M8M42K09
6418C91j53k56k2k86q5L83O2M05q9j69k51l13L07l16O89k5r8j47j05N6l43M29
6440F4K12K54rl26m34O1l43M85K99J56J01n12k58k65K90J78Q7L57L34m25m53k18
6462c65K24J09L98J8j84r1k59k54j48O29J38K91r9j48k07l04j75O51j2J51m5j94
6484A24j67k74j29L41J73K55J03m70j27N5j02o4N51MJ68l26m56l90M66K84q7M01
6506C33J65l56l38k76j66L71O18r0k1k52l5j55j46R5L69J3L16j95m95Q0l27K54
6528b38N01L4j90j40j12l70K27L01j20M10J18k71k43m15K89K39L48L73l02m65
$$ y = [119, -248, -262, -157, -52, 203, 243, 291, -158, -141, -485, -395, -49, 226, 191, 287, 5, -410, -433, -325, -93, 233, 144, 328, 18, -499, -428, -326, -194, 69, 244, 315, 73, -121, -242, -345, -341, 428, 387, 378, -7, -154, -418, -308, -260, 182, 391, 238, -18, -40, -326, -411, -28, 34, 439, 350, 181, -70, -383, -76, -392, 297, 272, 174, 27, -78, -22, -365, 64, 276, 530, 521, 195, -239, -178, -521, -36, 263, 419, 520, 8, -250, -515, -225, -47, 40, 397, 731, 306, -147, -365, -141, -32, 366, 384, 200, 109, -150, -404, -552, 77, 215, 506, 407, 259, 52, -252, -427, 224, 212, 363, 318, 124, -43, -317, -446, -105, 68, 323, 426, -44, -171, -116, -218, -282, 269, 273, 441, 115, -341, -731, -265, 19, -68, 333, 498, 142, -196, -472, -638, -267, 351, 261, 240, -12, -47, -202, -348, -253, 116, 129, 445, 250, -245, -165, -492, -238, 263, 297, 107, -33, -145, -515, -288, 13, -107, 303, 421, 150, -93, -508, -219, 20, 368, 741, 439, -26]
6548b6j4m11k1L64J91L39k21j0l83Ok05L91J50J71j16r3k73k83L8K58K31K66L3
6571C82j04n33j46L52q3K65J37J10m05n8l95r1L29M95k20K17n3l95l90K57J74
6592a55M66K23k47j22k46k02M8M8q0P43l13j56q5l34J43M5L61L18k50j31j27j89
6614b42k50M20J90K35K42l91l65j59j00K26L06K40J15l49l51J34l39Q1M53M93
6634E89P1n30l11j96k11M13L98l8P1j75m9n02J17L4K94M79l08l4j45j01m67O07
6656FJ77J30n1J08m86k77lL32M05k18J03Q0l06m97J8K74K80K57j92o0o0nm17L71
6680c1J38L0L27j84m29q4K38j91L00J90O2o1m53J4j68Q9J56K62n0j2k32M0j89
6703b38K96m4K81o7N7k15m10j50L07K14M63j70m8k29n12J37L9M16K47j68Ql90
$$ y = [-26, -40, -451, -472, -108, 83, 422, 201, 191, -192, -186, -391, 0, 150, 321, 205, 112, -161, -444, -406, -148, 83, 349, 382, 278, -255, -401, -49, -132, 133, 270, 380, -25, -83, -478, -569, -240, 255, 35, 252, 199, -196, -586, -329, -155, 311, 534, 287, 165, -81, -283, -235, -187, -267, 476, 163, 7, -78, -412, -269, -224, 137, 455, 205, 74, -53, -242, -492, -72, 118, 353, 595, 204, -161, -320, -420, -194, 112, 352, 467, 118, -233, -99, -438, -357, 96, 589, 660, 130, -181, -377, -588, -175, 223, 185, 256, 81, 32, -470, -353, -319, -25, 454, 146, 112, -33, -134, -601, 6, 183, 313, 262, 370, -116, -393, -396, -64, 341, 123, 226, 306, 0, -497, -479, -205, 75, 332, 140, 80, 20, 15, -402, -31, 107, 137, 464, 280, -149, -233, 5, -186, 114, 304, 366, 305, -148, -134, -302, -213, -57, 205, 155, 143, -89, -49, -238, 58, 14, 295, 228, 285, 70, -340, -490, -183, 31, 494, 324, 276, 47, -465, -328, -289, 127, 374, 206, 214, -176]
6725a76QOo9M07K33j09M5n02l05O2J06L37K61K35m05l78j45N7J48L43K74k86K22
6748C69k43n45O4K08K20K43J2j82j76j43l53L51K10m8N56o6n06l70R7K34J17Q1
6770A30J98m26J55n14K08J22N3M03q6N9l15j48L1p3J91K48K47k77l59l11L11j78
6792c31J83P77l25j74k28k5k03K34J18L64R0j17m75l3p0R4M09J76J4l41l26j90
6814c79J51J99J54P4j59K87m4n13k08M65K65J69J3l52J8m15L5j38M59L27Q1l17
6836A72l44J19m50L51L72q7J68j20J9n25k27O8N34L98k7r9n15M9j18j26J15N57
6858B84k1l8N2m81k03L78O3N0N35k94n32J38m35M45J34K15P2j47q8l21j10q0M35
6881E1p6L73P1l00k50l6j54M39K29l0J2j47o64K04J07J21O30l71m4l12k10j2J58
$$ y = [-176, -168, -162, -231, 176, 409, 300, 345, -157, -462, -400, -294, 43, 304, 539, 134, -244, -389, -332, -184, 159, 433, 147, 369, 126, -419, -355, -147, 73, 316, 328, 146, -30, -173, -526, -175, 35, -13, 543, 477, -29, -399, -302, -68, 49, 130, 328, -98, 57, -457, -249, -127, -74, 329, 243, 302, -13, -161, -130, -203, -12, 236, 483, 206, -153, -464, -153, -331, -148, 629, 304, 130, -98, -123, -326, -92, 26, 390, 480, 363, -112, -145, -215, -121, 288, 464, 478, 137, -189, -379, -228, -29, 125, 199, 40, 327, 283, -230, -438, 27, 292, 461, 474, 122, 140, -275, -240, -378, 81, 408, 489, 172, -172, -53, -503, -152, 220, 133, 301, 181, 200, -325, -552, -484, 50, 448, 421, 322, -193, -144, -262, -388, -273, 284, 263, 225, 277, -204, -407, -29, 34, 84, 619, 325, -207, -69, -504, -59, 75, 290, 362, 215, 127, -194, -304, -384, 51, -25, 348, 419, 119, -131, -167, -321, 118, 347, 317, 329, 182, -482, -278, -171, -50, 580, 209, 165, -147, -357, -369, -211]
6904b11L61M0k69J48j31k12P9q3K26L71ql0m35j13l4J28K17J13J57Rm25l2j68
6927c02J53J01K65J09Jn28j35N6P4L39J02o8k1J01j99l54N1K91J51K10J3m44j69
6950b03j21l4R7L55K05k18M8m12J90k08L47K59K18k07j43k65j88m5R6N63J66l03
6972A97j90k24j43J13K19L41j12k0q8n22MM18k50K14K52j76j07l2k50J44R4K60
6994A42K08j25k22k17j21J58J72J87l8J67k24j28j41J2M43n2K90n95l4j49j48
7015d15L0K64n8M60Rl30j53r1J0L43j46J37J53j21p6k24K04j68K17J16J01k04
7037E8jj11Q0k09L55O5L6K17n73l29N7K59K31J50q7q4k47l38L58K04K11k36K53
7060C19j51j55l58QL38L05j37Q1j04l49Q6k20K39J7K32K54m36p1j84RM35r0L04
$$ y = [-211, 150, 190, -79, 69, -62, -274, -195, -278, -52, 319, 311, 281, -154, -267, -301, -173, 44, 157, 314, 323, -102, -134, -302, -149, -48, 217, 326, 327, -201, -336, -280, -206, 133, 235, 167, 146, 247, 48, -306, -255, 36, 187, 397, 410, -34, -203, -324, -358, -261, 94, 299, 81, 129, -283, -93, -301, 46, 305, 523, 316, 173, -92, -280, -325, -229, 334, 500, 197, 7, -217, -360, -247, -28, 313, 201, 181, 93, -429, -425, -7, -257, -43, 209, 33, -74, -106, -356, -212, -118, 142, 350, 225, 3, -214, -335, -177, -5, 182, 144, 311, 87, -41, -182, -170, 273, 221, 511, -84, -118, -267, -415, -385, -121, -179, 281, 290, -40, -193, -284, -274, 69, -77, 60, 213, 92, 16, -208, -4, -172, 45, 161, 262, 58, 57, -54, 26, -183, 172, 237, 273, 490, -83, -412, -355, -96, 135, 285, 198, 114, -133, -471, -113, 91, 302, 66, 319, 168, 13, -345, -337, 1, 306, 169, 250, 146, -203, -117, -337, -98, -81, 151, 405, -31, -102, -286, -277, 158, 68, 372]
7083C72j54K5o77L01J47k28J27M90k06l5k71J5L2k1K96O8k93J40k53j11k02N08
7105G0j18M52l8m65j40J3p4M49M3K27k77j26n1p4L1J80j67L65k79m0p0j16p7K35
7129d7K05J30K3j68j33j52k57M69K19j19%q4k5k10rK3M07r9O3k21k07l6J2m9M45
7154A80j57N69o80N1p1k21J47L18M1j5j21j75k19K47J62J17J09j21k06Om20L1
7176d28M80%M02j78K4l79k62M31%J17J53k28J11j34k85r5L37q0K99j63K6l86n
7199b43k76K68J43M88N9n62R6j37K3m5L73k1K29j86n44L77l21R1K94j6K29l70
7221e1j31p3J96J07q8J59J25r2j41m37L86k67K6M08J38M2k86j86J6Q2L7M18j50
7244B38j22l87L6R1q3N33j20K81m48J19j87k46L55K3n4J07n4j09j86N0L2Q3L9
$$ y = [372, 218, 243, -434, -133, 14, -214, -87, 403, 197, 162, -109, -94, -62, -83, 213, 281, -12, 128, -125, -236, -438, 70, -48, 404, 366, -99, -239, -226, -300, 149, 192, 419, 142, 16, -35, -109, -78, 102, -65, 300, 21, -19, -89, -205, -282, -47, 158, 288, 311, 143, 10, -142, -399, 70, 289, 170, 170, 86, 61, -149, -158, -135, 272, 173, 236, 15, -192, -228, -216, -265, 180, 23, 592, -88, -37, -108, -329, -182, 136, 177, 162, 41, -134, -353, -106, 56, 173, 282, 161, -45, -39, -459, -428, 52, 52, 454, 276, 300, -79, -341, 90, 90, 207, 360, 132, 243, 109, -176, -271, 66, -14, 285, 122, 148, -238, -243, -519, -251, -108, 380, 439, -123, -27, -164, -141, -186, 187, 166, 395, 209, -335, 42, -279, -188, 106, 90, 319, -51, -182, -255, -59, 48, -40, 119, 244, 152, 11, -426, -40, -307, -281, 127, 265, 307, 21, -165, -149, -67, -30, 388, 238, 116, -271, -235, -144, -227, 306, 186, 467, 19, 138, -49, -295, 60, 83, 29, 136, 82, -27, -213, -163, -131, -48, -9]
7267iN1J69k99K22r4k64L30J21N1k78j07m08J75K68J59M5R3k86m6M6q2L8L90O5
7291C50j19k08p7j65K7J9L53J17k04O3k54k87L90j48J18L62k93J91m21J97r6J77
7313I2j29J57J3j38O7m16K7N3O04j25n8j76rq5J20l79L87K32k2J9k72n5K0J1K27
7338A65J10Q3q1j17k96j84L67K4N3j65J06l11k20M27j71K68j01J93Q8j79m36L76
7360ak60N14k46Q2J12l6j42k09K12j85J47J35J69m35Pl18L97J41K4O7k95l3Q2
7383g1r4J23R6M0j70J5J83l38k4R2J69Qn6J58l34P6j61L23r4J79j98L49k45o33
7407f07N18O9K34Q2j64k8q0j57r7lK81J34k04j20M0j28J32j4J66r9J62K76l62
7430C1r9j36N01l17Q4N2j14k82N1J26j9k9J78K18j46j30j28l2J89J45p4l4M30
$$ y = [-9, 42, 211, -88, 134, 40, -224, 106, 227, 278, 0, -107, -515, -340, -72, 87, 132, 225, -61, -107, -61, -143, -105, 285, 350, 231, 23, -54, -219, -192, -173, 180, 297, 93, 156, -98, -385, 5, -143, -25, 337, 44, 235, -186, 11, -85, 92, -37, 120, 133, -5, 62, -354, -327, -274, 330, 205, 147, -29, -38, -123, -3, -382, 5, 237, 215, 234, -38, -93, -73, -62, 165, 275, 358, 277, 160, -136, -320, 47, 71, 124, -41, 65, -246, -466, -39, -210, 58, -43, 150, 238, 59, -377, -1, -261, 253, 7, 89, 201, 165, 23, -186, 26, -159, -12, 123, 292, -143, -136, -454, -57, 84, 108, 175, -120, -153, -71, -165, -42, 54, 94, -76, -61, 122, -216, -240, -148, 21, 29, -27, 131, -203, -127, -288, 35, -59, 120, -78, 271, 26, -607, -89, -20, 214, 296, 132, 104, 24, -133, -230, -233, 48, 182, -22, -142, -102, -230, -98, -112, 54, -45, 117, 393, 31, -68, -204, 297, -20, 64, 116, 2, -280, -229, -103, -122, -151, 27, 245, 99, -31, -159, -191, -2, 143, 69, 35, 465]
7453D65m24j23k06J90j25K74K44p1K12n87j37N08j53J18j27K19l89l17J66J65
7473i8J86RK08j98O6k42l2l14J42N28r4j52K2L5j57L6k9M04n2m24M20m79J88l6
7497f3q8J97R7j43J78k46j67J79j9K66j13Pk09M7o7r4L61J35j36R7j92k88R4K72
7521A05j00J68L9k25j39J64N2m21K13P1J42j33J69k99P6L3k6J56K91l97R0j42
7543a13j65L3Q2N77l20r9o3j38lK65R0j84J77j28ln4j27K32L28r6m33L91l11j34
7567a96j09j82O03J6lj29l35K23K74j70Nn6K75k0j41j89j1L13j8k60L15j66j33
7590i4Q2k44K87K0J3J12Jj98J72l88J22K87j22k7j84%J16k8nO7J09J24m9k29j00
7615a56J7m1L06l03R1J10j67R2Q7o8J56Qj06q4Q8j74j09R5J12J06J8M7k2K8l5
$$ y = [465, 41, -82, -288, -98, -223, 51, 295, 224, 436, -151, -288, 220, 67, 185, 58, 277, -112, -429, -263, -98, 88, 97, 305, 107, 173, -69, -101, -415, -273, 255, 161, 9, 31, 66, -91, -55, -84, 320, 268, -156, 264, -215, -27, -63, -151, 46, 143, 0, 178, -68, -235, -56, -75, 191, 78, 85, -124, -77, -144, -238, 123, 258, 122, 219, 27, -261, -167, 105, 5, 173, 212, -13, -152, 12, 64, -357, -144, -73, 69, -64, 105, -194, -118, -85, -111, 45, 336, -61, 29, -113, -278, -245, -163, 414, 94, -5, -68, -206, -209, 56, 146, -38, 139, 11, 8, -46, -173, 59, 387, 291, -142, 249, -62, -196, -305, -487, 116, 132, 129, 0, -335, -112, 162, -8, -3, -59, 216, 196, 55, -134, -145, 168, 150, -110, 205, 39, -94, -12, -256, 31, 51, 64, 176, 177, -21, 151, -237, -115, 172, 50, 23, -161, -161, -45, -73, -78, -11, 98, 222, 173, -56, -156, -139, -180, 126, -177, -86, 24, -143, -51, 36, -32, 124, 132, 26, -58, 30, -144, -253, -158, -46, 60, 78, 125, 103, 131, 96]
7640I6l7k18K89J0Q6k28J48l24J63L81l08K91k75k47J43j49J41J15o9K23p9l8
7662A14l34J81J80k16J69j43K29j69q7j20o9L01Q9L2k84J83k06j40L68k21J07
7683c6K81j67k2n62L25R8J81mL38m57P2r7k7N9P1p7N6R1j07l31J60K55j06j35
7707a41K18j79O2q8J3J86Q7n3N2n4L5k05l7J51k1j49J69%J2mj58J71k86R9L08
7732A88j02k20L51m41k64L54N7O4K95k80j42L15m39K62K09j78K01j77j36o0Q3
7753f0P2J33L8m8m5q9j26J17R7L04l28q9L3Q1l17K88k8o2J44K05l69j36K17J51
7777A83k07KJ97J68l54m9l9j6K05k17L68k1j29j13O7N7m1k73M37P2k36k83K71
7800D9j17L49j71j24P8k54K80k47M6kQ7j61J98P4m25M56l57J05L87j69j24K92
$$ y = [96, 59, -159, 130, 140, 226, -2, 146, -178, -15, 366, 58, 349, 74, -173, -30, -179, -38, 77, 8, 231, 152, 114, -220, -39, 141, -75, 94, -49, 180, 11, -76, -196, -265, 36, 125, 157, -127, 56, -150, -290, 78, -143, -36, 245, 78, 56, -506, -181, -83, 98, 94, 432, -25, 47, -50, -77, -18, 53, -24, 32, 123, 16, -315, -155, 100, -6, -141, 77, -102, -40, -128, -115, 71, 158, 105, 157, 103, 138, -67, -104, 47, 26, -123, 46, 46, 58, 54, -104, 67, -219, -120, 188, 86, -134, 217, -224, -488, -134, -77, -13, 282, 2, -140, 175, -264, -2, 207, 29, 230, 53, -83, -143, -60, 12, 145, 183, 135, 90, 1, -125, -8, 89, 393, 65, -24, 9, 90, -227, 61, 33, -29, 115, 320, -49, -185, 32, 183, -24, -22, 175, 343, -11, -60, -99, -115, 90, -127, 241, 220, 91, -22, 45, 102, 61, -212, 225, 297, 61, -222, 49, -68, 281, 110, -14, 64, -190, 90, -157, -111, -113, -26, -187, 11, 85, -340, 116, -241, -136, 251, 82, -42, 250]
7822B50k70k5K5J94j04k22J85J34l7n21L64LK69k56M6J57m16J43M1J53m5J42j4
7845A96l22O7k83J70K72l03L18j17M3j23J1J55N4j0l00M16j88j73J88o6J47m9
7867A03j44M2J08j89p5J96k12J84M2J82m88J74No3J38Q3J69l34J73j5l25K27K5
7890FO3pj7p5j89k7M95k54j9J60K8j05r0j02M8Q7J24J6K2j82K1N4j13j45L20k94
7916a75L61j75k00m8O2K42o5J38j0j39j64Q3j54J61K59k35j36J91K06l58K24j59
7938i1J59L10k58j91Jm2K13j65L67k63kK28k03j84K26j16j71K53j3J31l00M7k3
7961h7K08n0J85m12J54l0j06K56n2j12k5K9J62jk02L2j49K19j08N7M2qj7m5l3
7986i3O9O4O9j52N3n2k08L23NQ8J01k66J68k28j03O43l01p6J34k84J37j76o6p3
$$ y = [250, -20, -45, -20, 174, 70, -152, 33, 167, 130, -391, -27, -24, 245, -11, 35, 192, -224, -81, -40, 113, 68, 210, 196, -126, -59, -342, -172, 100, -203, 115, -2, 41, -82, -71, 84, 138, 128, -172, 244, 56, -117, 71, 5, 152, 103, -41, 1, 109, -80, -155, 41, -171, 13, 55, 237, -251, -77, -72, -135, 3, 86, 255, -79, 94, 79, -246, -19, 6, 69, 62, 45, -30, -219, -246, 249, -5, -24, 136, 164, 59, -31, -133, -85, 2, 126, 142, 164, -18, 3, 57, -56, -201, 119, -175, 186, 11, -189, -237, -175, 67, 2, 140, 130, -9, -173, -90, -244, -83, 176, -59, -195, -4, 202, -156, 68, -91, 68, 378, 120, -71, -70, -112, 101, -64, 303, 40, 38, 266, 63, -121, 105, -11, -182, 71, 58, 189, -111, -64, -87, 121, 71, 256, -156, -2, -32, -138, 118, 66, -46, -71, -42, 120, 119, -83, -51, -200, 19, -89, -32, 10, 2, -15, -60, -93, -24, 40, 109, -43, 10, -42, -250, 73, 78, 166, 267, 1, 169, -59, -162, 481, 180, 104, 238, -46, 91, -85, -151, -224]
8010b24L14j28L01j69r6J7O0q9j10nL66l53J77k61K05m3JK75o3j10j14kJ1L3Q7
8035H0O8K0j36J9k58k9K72J17p6j44Q8k0j46J21N8J63k7Nj29l22J77K46j37l9
8059b9j1Q4M1j57L4J24J1k48J33j50J71q1K17m18J17j8R4K51j73J29k69J48l2
8082c2K85j28j11K07l41K05k35M81j0j83l1k78R0R6O0j99K04rj60j28K12J48j40
8105Cr5K75j27k55J19j01OJ93j37ol9L04K16k34j47j50J83j27K22Ok06j16J40
8128g3L2j0J93k2k56J43j57LR9R2o6J42j87q1J64l12K38n9P4J75J60j42l78L21
8152I3k21J90q9M6J21j46N7J52l93o3N36k50K22j81k60L29o32K82M72k27j73P4
8174f1O5K5j6K7J99J28j67l29L82j67p2K6J60j97J65O1l42
$$ y = [-224, 90, -38, 263, 94, -2, 15, 75, -14, -124, -129, 237, -116, 61, -200, 5, -38, -37, 238, 175, 65, -49, -51, -40, -7, 80, 148, 168, 32, 51, -207, -236, 36, 153, 77, -67, 21, 1, -145, -24, 34, 197, 170, 175, 46, -276, -99, 147, 10, -29, -40, 44, 85, -72, -38, 86, 97, -151, -18, -168, 3, -78, 139, -279, -162, -180, -86, 165, -8, 121, -148, 0, -32, 253, 125, 14, 221, -120, 85, -150, 331, 321, 138, 107, -171, -81, 15, 75, -124, 80, 71, -89, -217, -5, 143, 3, -92, 183, 56, -199, -80, -181, -175, 18, -119, -125, -164, 140, 356, 122, -25, -175, 8, -119, 103, 109, -97, -213, -73, -41, -51, 142, 120, -136, 7, -150, -147, -48, 44, -22, 120, -67, -148, 16, -296, -58, -117, -43, 132, 292, 150, -228, 93, -128, 62, -27, 19, 140, -6, 51, 203, -190, -253, 283, 33, 255, 74, -186, 143, -489, -207, 265, 38, -135, -61, 4, 29, 13, 40, 239, 367, 200, -129, 253, 86, 14, 40, 200, 3, 168, 229, -113]
8191a13
$$ Imaginary data points
##PAGE= N=2
##DATA TABLE= (X++(I..I)), XYDATA
0@%%%%%%%%%qQqJ6j6K4l2L3m1N4o8P9r0J13j36J54j80K11k45K85l28L76m28M86
33B59n52O22p00P89q84R89j105J232j373J522j685J865k060K275k508K765l049
50a598L358l700M080m500M970n499O097o786P580q511R626j0982J2683j4879J7837
65I776k2078K8710m0655O9003k68703k69557L09351K96885K70312o135j96861
76A80048l23664k04587q464K31401L04634K27577o531k10435l12151k11832n610
87c39614K13814K92364K09968r237k15399l06212k13997q971K06829K94191K16327
98C40063J1355j90937k83929k06756j4100J86040K72034J99476Q889j83118k69398
109a30381j95292r726J82620K64359J92896Q546j79554k64068j92614j0173J78363
$$ y = [0, 0, 0, 0, 0, 0, 0, 0, 0, 0, -8, 0, -8, 8, -8, 16, -16, 17, -24, 30, -38, 41, -49, 64, -72, 82, -98, 113, -132, 153, -175, 201, -227, 259, -293, 329, -371, 418, -466, 523, -582, 650, -723, 799, -886, 979, -1081, 1194, -1314, 1451, -1598, 1760, -1940, 2140, -2360, 2610, -2889, 3208, -3578, 4002, -4509, 5117, -5865, 6818, -8061, 9776, -12302, 16408, -24247, 44756, -223947, -493504, -184153, 112732, 383044, 376909, 180048, -143616, -348203, -356667, -125266, 179368, 406945, 400414, 189979, -122172, -334004, -339614, -125800, 166564, 376532, 367295, 151896, -154316, -368313, -377284, -170455, 123736, 340063, 351418, 160481, -123448, -330204, -344304, -158264, 113770, 313246, 322135, 139017, -130381, -325673, -335399, -152779, 111580, 304476, 313022, 133468, -130600, -323214, -333387, -155024]
120a55024K64113J99406K2060j63511k50361j89955k0692J59561K43223J84234
130B93054J7504j58274k40155j81663j8551J54277K34761J76334J3632j57297
140A33622k37719j81125k0247J51587K34035J81117K5204j43104k26976j78042
150b61648k5968J37758K20429J73821K7074j33735k13899j67690k3179J34347
160a32690K13752J67798K3739j33760k12241j68227k6328J29905K10684J69706
170B42338L0129j24468k06328j68394l4156J17793J98994J63260L2327j15396
180A36099j95419j59918l1394J15103J93326J58354L1188j13961j92895j58758
190b18275l2315J11898J91518J60313L6879j07503j88147j58968l8697J02286
$$ y = [-155024, 109089, 308495, 330555, 167044, -83317, -273272, -293964, -134403, 108820, 293054, 310558, 152284, -87871, -269534, -288085, -133808, 100953, 277287, 290919, 133622, -104097, -285222, -305469, -153882, 80153, 261270, 286474, 143370, -83606, -261648, -287616, -149858, 70571, 244392, 271466, 137731, -76168, -243858, -267037, -132690, 81062, 248860, 272599, 138839, -73402, -241629, -267957, -138052, 72632, 242338, 272467, 147999, -58329, -226723, -260879, -143086, 55908, 219168, 251495, 136099, -59320, -219238, -250632, -135529, 57797, 216151, 247339, 133378, -59517, -218275, -250590, -138692, 52826, 213139, 250018, 142515, -45632, -204600, -243297, -141011]
200a41011J82853J55933L8776j00334j78587j52763l7611R8940J77673J51442
210A95311L6927r8776j76376j51267l8239R7283J75664J52163M0378r2914j73082
221c2928j52297m2636Q9616J69282J48802M2682q7722j66009j47055m1975Q6475
232a33765J64052J45020M1804q6394j63012j44591m2167Q5120J62537J45947M4529
243B19080q2235j60012j44665m5764P8767J57238J43466M5952p7046j54177j41811
254a61207m6926P5216J52675J39561M5808p4837j51299j40005m6309P3304J50437
265A6418J40027M8524p0795j48355j39099m9212O8705J46273J37964N0002o6554
276A33898j43791j36361n0060O4990J41859J35022M9396o4266j40726j34138n0412
$$ y = [-141011, 41842, 197775, 236551, 136217, -42370, -195133, -232744, -133804, 43869, 195311, 232238, 133462, -42914, -194181, -232420, -135137, 40527, 192690, 233068, 140154, -32928, -185225, -227861, -138245, 31037, 179839, 222521, 134799, -31210, -178265, -220240, -133765, 30287, 175307, 217111, 130717, -32295, -176886, -219053, -133933, 28604, 174551, 219080, 136845, -23167, -167832, -213596, -134829, 22409, 165875, 211827, 134781, -19396, -161207, -208133, -132917, 19758, 159319, 205127, 130290, -21009, -161014, -207323, -134019, 16418, 156445, 204969, 134174, -14181, -153280, -202492, -133787, 12486, 150450, 200452, 133898, -9893, -146254, -196314, -131324, 10535, 145557, 194953, 130687, -10039, -144177, -194589]
287a94589O3207J39527J34245N0835o1594j37380j34033n1728N9917J35859J32211
298A36477N2193n8012j34086j31077n2368N7338J31785J29795N2391n5822j30819
309b205j28654n2115N5017J29317J28234N2412n3725j27595j27745n2769N2079
320a27749J26077J26407N3340n1003j24540j25173n3413M9088J23454J24214N3170
331A73872m8000j21501j23175n3415M7604J19815J22381N3370m6136j18491j21720
342a15396n3912M4863J16839J20720N4318m3588j15681j19841n4298M2063J13922
353i991J18981N4924m0929j12413j17609n4412L9644J11117J17120N4570l8703
364A22299j09446j16489n5370L7516J08226J15057N5500l6680j07184j14965n6007
$$ y = [-194589, -131382, 8145, 142390, 193225, 131631, -5749, -139782, -191510, -131593, 4266, 136477, 188670, 130658, -3428, -134505, -186873, -129535, 2250, 132045, 184436, 128614, -2205, -130859, -182974, -127957, 1360, 129594, 182006, 128281, 686, -127059, -179828, -127749, -1672, 124735, 178075, 127072, 2532, -122641, -176054, -126966, -3512, 120702, 173872, 125872, 4371, -118804, -172219, -124615, -4800, 117581, 170951, 124815, 6324, -115396, -169308, -124445, -7606, 113114, 167432, 123844, 8163, -111678, -165976, -123913, -9991, 108990, 163914, 122985, 10572, -107037, -161449, -121805, -10688, 106432, 161002, 122299, 12853, -103636, -159006, -121490, -13264, 101793, 157293, 120613, 13429, -101536, -157543]
375a57543L5985J05380J13953N6057l4219j04004j12647n5408L3911J02996J12218
386I6679N5978l2849j01900j11268n6034L1329J00429J10553N5965l1183r9520
397A8179j10142n6644K9628R7964J09500N6732k8417r6165j08062n6258K8092
408a15593R5704J07430N6558k6994r4398j07135n7392K5837R3124J06111N6999
419A40251k4778r2528j05783n7674K3678R1170J05066N8226k2350q9400j03428
430g7550n7340K1372Q8871J03357N7799k1738q7911j02804n8863J9810Q6251J02280
442G3534N8186j8938q5344j02122n8784J8080Q4464J01361N9771j6142q2063r9760
454f7757n7997J6022Q1954R9211N8867j5753q1837r9618n9958J4105P9654R7721
$$ y = [-157543, -121558, -16178, 97775, 153832, 119613, 15609, -97038, -152446, -118535, -15539, 96679, 152657, 119808, 17908, -93360, -149394, -118065, -17636, 92917, 148882, 117699, 18179, -91963, -148607, -118979, -21015, 88485, 145217, 116800, 20635, -87427, -143685, -115593, -19889, 87541, 144099, 117105, 22707, -84428, -141820, -115983, -22859, 83252, 140251, 115473, 22945, -82838, -140512, -116834, -25664, 79402, 137628, 115278, 25878, -77550, -134890, -113518, -24647, 78710, 136509, 114771, 26860, -75944, -134807, -114997, -28746, 73534, 131720, 112782, 27438, -74684, -133468, -115388, -30924, 70437, 130208, 114066, 32003, -67757, -125754, -109732, -27778, 71433, 130300, 114547, 32710, -66908, -126866, -112761, -33107, 64614]
466F4614N9376j3710p9573r8234o0401J2471P7927R7978O0810j0762p5731r5282
478f0517n9521J1660P5865R5871N9498j0840p5153r5315o0577R740P4104R4450
490E9265O0310r541p3396r4792o1027P916P1477R3863O1115o278p0339r2070n9941
503a13438O870O8955R1793N9979p075o9270r1680o0576N693O8713R1381O0647
515A11992m736o7385r1010o0783L169O6586R0297O1472j930o4498q8387o0721
527a05934K533O3541Q7685N9914k629o4045q8281o0048J679O3029Q7504O1137
539A06085j085o1938q7510o1607k3O0809Q6177O1780J736n9197q4451o0693j927
552a01844N8483Q3757O0040R97n8221q3869o0230j373N8220Q4123O0451K782n7286
$$ y = [64614, 123990, 110280, 30707, -67527, -127928, -115457, -37530, 60448, 121258, 110496, 34765, -60517, -120038, -108378, -32513, 63358, 122856, 112016, 36863, -58452, -119029, -109289, -35185, 59265, 119575, 110034, 36638, -58154, -119181, -111265, -39788, 54075, 115190, 108912, 38573, -53497, -113438, -106568, -37613, 54180, 114159, 107084, 37814, -53866, -114442, -108749, -40036, 51345, 111992, 107256, 39871, -51139, -111922, -108753, -42167, 48130, 109602, 107672, 43174, -45213, -105934, -103401, -39860, 47825, 107739, 105110, 41065, -47216, -107264, -105585, -42556, 44948, 106085, 105000, 43062, -44448, -106055, -106078, -45269, 40908, 102688, 104424, 45227, -39224, -99917, -101844, -43361, 40396, 100436, 101433, 43212, -40657, -100887, -102260, -44040, 40083, 100534, 103316, 46030]
565D6030q3549o1491l604N5597Q2685O1571M821n4319q1305o0596m958N3062Q0081
578C4025N9361M010n3523p9978n9461m545N3486Q0692N9899N522n2469p9544o0864
591i3389o184N1118P9568O1089P854m9311p7685o0341p877M8194P6012N9017O752
604I4817m8919p6501n9302o795M8565P5920N9759Q278m7742p6237o0018r232M6848
617e0559P5820O0788J1006m5277p3632n9427j0780M3630P2364N8736R711m4050
629D8330p2443n8775j0267M4290P2268N8919J0957m3670p2771n9633j1549M2173
641e2171P2129N9741J3115m0188p0364n9000j3739L9664O8715N7789J3097l9344
653D9444o8917n7294j2692L9813O8873N8040J3065l9196o8472n8381j4490L8316
$$ y = [46030, -37519, -99010, -102614, -47017, 35668, 97239, 102060, 47741, -33564, -94160, -99118, -46056, 34025, 93386, 97396, 43873, -36105, -95566, -100111, -46625, 34067, 93966, 99488, 47019, -32525, -93389, -99573, -48455, 31113, 92202, 100056, 50745, -26940, -87281, -95158, -46964, 29048, 88065, 94817, 45898, -30603, -89905, -96700, -48135, 27785, 87544, 95822, 48080, -28157, -88175, -97407, -50559, 25261, 86049, 97055, 51778, -21854, -81281, -92061, -48431, 23933, 82669, 92380, 48330, -24113, -82888, -93155, -48865, 23403, 82322, 93279, 49609, -23162, -82795, -94344, -52171, 19958, 79699, 92814, 52626, -17738, -76738, -90477, -50813, 17902, 75691, 88788, 49444, -19473, -76767, -89459, -49646, 19227, 77267, 90332, 51136, -17336, -75717, -90207, -51891]
665e1891O8162N8648J5146l6384o6909n8425j5813L5570O5019N6972J5317l5460
677D9952o4854n6315j5076L5785O5143N6788J5118l4779o5449n7191j5908L3991
689e2795O4849N7507J7016l3202o3332n6731j7963L1583O1836N6005J6863l1419
701E0217o1131n5114j6710L2166O1371N5536J7270l1600o1306n5724j7861L0831
713e2055O1124N5956J8672k9212o0271n5872j9264K8234N8341N4341J8991k8028
725E0957n7535n4202j8515K7809N7960N3799J8953k7808n7690n4316j9373K6598
737e3363N7287N4431K0329k5617n6056n4607k0409K4606N5467N3303K0818k4259
749E1930n4094n2512k0044K4664N3821N2534K0155k4304n4190n2613k0808K3374
$$ y = [-51891, 16271, 74919, 90065, 53681, -13228, -71653, -87466, -51896, 13123, 70095, 85412, 49952, -14902, -71217, -86293, -50508, 14635, 71423, 86541, 51762, -13687, -70878, -86786, -52795, 12054, 69561, 86577, 53375, -9957, -66688, -84651, -53068, 8768, 64773, 81636, 50217, -10914, -66028, -82738, -50572, 10799, 66335, 83605, 52005, -9301, -65025, -82886, -52055, 9069, 65025, 83697, 54485, -5786, -61658, -80922, -52688, 5653, 59994, 78985, 50957, -6578, -60780, -79295, -51486, 6474, 60273, 79226, 51418, -6272, -60588, -79961, -53363, 3924, 58355, 78684, 53067, -2989, -57596, -78005, -53399, 2068, 55371, 76189, 51930, -2164, -54676, -74720, -50056, 3765, 56299, 76454, 52150, -2040, -54653, -75461, -52087]
761e2087N3619N2845K1411k2897n3114n2279k1731K1488N1976N1798K1721k1402
773E1348n1283n0989k1354K0905N0800N0634K1036k0899n0785n0940k1862K0620
785e2769N0554N1404K2292j9301m9483n0530k2323J8974M9113N0744K2560j8197
797E3038m8137m9850k2420J7956M7178M9115K2153j8436m8104m9549k2766J7275
809e2547M6917M9817K3133j6908m6352m9127k3374J6178M6318M9207K3516j5473
821E1305m4682m8475k3294J5009M4548M8181K3251j5244m4454m8102k3680J4739
833e0898M3782M8072K4175j4009m3775m7199k4134J3074M2803M7861K4418j3140
845E1030m2142m6863k4525J2464M1579M6604K3763j2126m1693m6680k4074J1889
$$ y = [-52087, 1532, 54377, 75788, 52891, -223, -52502, -74233, -52745, -769, 51029, 72750, 51348, 65, -50924, -72278, -51373, -573, 50061, 71097, 50198, -587, -51527, -73389, -52769, -2215, 49189, 71481, 52180, 2697, -47833, -70156, -51182, -2069, 48675, 71235, 53038, 4901, -44949, -67369, -49413, -2235, 46880, 69033, 50597, 2493, -47056, -69822, -52547, -5630, 44187, 67320, 50412, 4060, -45067, -68441, -52263, -5945, 43262, 66778, 51305, 6623, -41852, -65146, -50137, -5589, 42592, 65843, 50599, 6145, -41957, -65637, -50898, -7116, 40956, 65131, 51122, 7347, -39852, -63986, -50912, -8109, 39752, 64170, 51030, 8888, -37975, -62500, -50036, -8457, 38147, 61910, 49784, 8091, -38589, -62663, -50774]
857e0774M1242M6332K4262j1490m0491m6087k4084J0927L9928M6170K4573j0520
869D9988l9478m5209k4603J0512L9388M4491K4539j0221l8895m4636k4598R682
881d9040L8654M4317K4880r872l8319m4200k4641Q824L7495M3963K5208q761l7308
894A1200m3468k4909Q719L6552M3414K4882q328l6108m2799k4921P854L5744M2838
907C0670K5034p339l5562m2490k5115P099L4694M2208K5312o726l4771m1363k5490
920e3839O045L4204M1618K5299o117l3710m1077k5507N871L2889M1345K5352n554
933D6819l2409m1109k5053M592L2361M0840K5396m721l1658m0187k5448M172L1651
946a4754M0131K5304m307l0960l9546k5782L831L0696L9541K5172l572l0410l9245
$$ y = [-50774, -9532, 36800, 61062, 49572, 9081, -37006, -61090, -50163, -10235, 35935, 60508, 49988, 10510, -34699, -59302, -48790, -9402, 35089, 59628, 49407, 10512, -34124, -58722, -49040, -10386, 33931, 58811, 48939, 10620, -33580, -58221, -49397, -11902, 32061, 57269, 48508, 11200, -32268, -57177, -48458, -11906, 31508, 56390, 48062, 11954, -30845, -55766, -47912, -12168, 30670, 55704, 48365, 12803, -29687, -54802, -47703, -13009, 29199, 54511, 47785, 13014, -28349, -53839, -47794, -13590, 28028, 53327, 47210, 13500, -27577, -53084, -47213, -14324, 27021, 52373, 46819, 14410, -26699, -51752, -47160, -14799, 26041, 51437, 46716, 15058, -25129, -50577, -46405, -14754, 25377, 50681, 46374, 15414, -24132, -49914, -46083, -15387, 24154, 49326, 45754, 15344, -23901]
959b3901k5628L396K9947L9040K5426k979k9402l8317k5547K736K9122L8271K5579
972D7743k348k8510l8435k5423K191K8254L7956K5053j919k7672l7882k5440J438
985d4994K7387L7475K5783j064k7119l7165k5521J211K6874L6650K5454q27k6152
998A7992l6459k5462M64K5447L6254K5364o1k5747l6231k5753l2K5167L5930K5743
1012D2616O43k4540l5377k5737o42K4610L5064K5845R32k4029l5032k5459j111
1025d2217K3335L4718K5352J424k3720l4476k5571j483K2868L4346K5455K164
1037D2195k2632l3878k5272k204K2692L3321K5469K194k2102l3238k5394k644
1049d1493K1697L2892K5217K144k1436l3094k5091k252K1489L2393K5409L196
$$ y = [-23901, -49529, -46133, -16186, 22854, 48280, 45301, 15899, -22418, -47965, -45229, -16107, 22164, 47743, 45395, 16885, -21550, -46973, -44782, -16528, 21428, 46481, 44562, 16890, -20992, -46432, -44994, -17607, 19868, 45651, 44587, 17468, -19697, -45218, -44007, -17133, 19517, 44971, 44144, 17992, -18467, -43929, -43465, -18018, 18236, 43600, 43539, 17792, -18439, -44192, -44224, -19057, 16873, 42616, 43259, 18719, -16658, -42395, -43037, -18427, 16637, 42482, 43414, 19385, -15647, -41106, -42217, -18882, 15836, 41188, 42612, 18892, -15584, -41155, -42638, -19770, 14576, 40031, 42195, 19563, -14315, -39587, -41791, -19099, 14222, 39691, 41885, 19783, -13455, -38849, -41493, -19796, 13096, 38313, 40457, 19021, -14073, -39164, -41416, -19927, 12466, 37875, 41071]
1061D1071k0603l2768k4749l563K0731L2215K5113L298k0260l1699k5064l505
1073c9783J9856L1438K4590L775k0173l1284k4623l601J9563L1204K4882M235
1085D0079j9344l0840k4804m619J8616L0338K4726M671j8240l0258k4574m722
1097c8971J7805K9878K4620M770j7767k9694k4425m687J7714K9826K4406N300
$$ y = [41071, 20468, -12300, -37049, -40612, -19881, 12334, 37447, 40745, 20485, -11214, -36278, -39783, -19927, 11511, 36101, 39876, 19703, -11581, -36204, -39805, -20242, 10962, 35844, 40079, 20735, -10105, -34909, -39528, -20912, 9426, 34152, 38823, 20583, -9675, -34249, -38971, -21166, 8712, 33332, 38102, 20335, -9359, -33784, -38471, -20757, 9069, 33475, 38775]
$$ [...]
8191i
##END NTUPLES=NMR FID
##END=
