##TITLE=1H_ALL 2508
 CD3CN
 8 sc, 
 28.8.2023
##JCAMPDX= 6.0         $$ Bruker NMR JCAMP-DX V2.0
##DATA TYPE= NMR FID
##DATA CLASS= NTUPLES
##ORIGIN= UXNMR, Bruker Analytische Messtechnik GmbH
##OWNER= root
$$ XWIN-NMR		Version 3.5
$$ Mon Aug 28 14:14:04 2023 Russian Standard Time (UT+4h)  she@DPX200
##.OBSERVE FREQUENCY= 200.13135
##.OBSERVE NUCLEUS= ^1H
##.DELAY= (6, 6)
##.ACQUISITION MODE= SIMULTANEOUS
##.ACQUISITION SCHEME= undefined
##.AVERAGES= 8
##.DIGITISER RES= 18
##SPECTROMETER/DATA SYSTEM= spect
##.PULSE SEQUENCE= zg30
##.SOLVENT NAME= CD3CN
##.SHIFT REFERENCE= (INTERNAL, CD3CN, 0, 15.7039)
##AUDIT TRAIL= $$ (NUMBER, WHEN, WHO, WHERE, WHAT)
$$ ##TITLE= Audit trail, XWIN-NMR		Version 3.5
$$ ##JCAMPDX= 5.01
$$ ##ORIGIN= Bruker BioSpin GmbH
$$ ##OWNER= she
$$ F:/spectra/data/she/nmr/H-F/1/audita.txt
$$ ##AUDIT TRAIL=  $$ (NUMBER, WHEN, WHO, WHERE, WHAT)
(   1,<2023-08-28 14:12:49.87 +0400>,<she>,<DPX200>,
      <created by zg, POWCHK disabled, PULCHK disabled
       configuration hash MD5:
       00 E9 B6 7A A2 85 ED C7 34 08 36 98 17 FE 4E 26
       data hash MD5: 16K
       0F F4 CD 8C 62 8E F6 00 B6 8A 1E 17 16 BE 6F 49>)
$$ ##END=
$$ 
$$ hash MD5
$$ A8 93 B1 30 E5 D9 4B 0B 48 02 95 1C 7B 39 F2 BC
##$RELAX= 
##$RELAX= 
##$RELAX= 
##$RELAX= 
##$RELAX= 
##$RELAX= 
$$ Bruker specific parameters
$$ --------------------------
##$DU= <F:/spectra>
##$EXPNO= 1
##$NAME= <H-F>
##$PROCNO= 1
##$TYPE= <nmr>
##$USER= <she>
##$AMP= (0..31)
100 100 100 100 100 100 100 100 100 100 100 100 100 100 100 100 100 100 
100 100 100 100 100 100 100 100 100 100 100 100 100 100 
##$AQSEQ= 0
##$AQ_mod= 1
##$AUNM= <au_zg>
##$AUTOPOS= <>
##$BF1= 200.13
##$BF2= 200.13
##$BF3= 200.13
##$BF4= 200.13
##$BF5= 200.13
##$BF6= 200.13
##$BF7= 200.13
##$BF8= 200.13
##$BYTORDA= 1
##$CFDGTYP= 0
##$CFRGTYP= 5
##$CHEMSTR= <none>
##$CNST= (0..31)
1 1 145 1 1 1 1 1 1 1 1 1 1 1 1 1 1 1 1 1 1 1 1 1 1 1 1 1 1 1 1 1 
##$CPDPRG= <>
##$CPDPRG1= <>
##$CPDPRG2= <>
##$CPDPRG3= <>
##$CPDPRG4= <mlev>
##$CPDPRG5= <mlev>
##$CPDPRG6= <mlev>
##$CPDPRG7= <mlev>
##$CPDPRG8= <mlev>
##$CPDPRGB= <>
##$CPDPRGT= <>
##$D= (0..31)
0 1.2 0 0 0 0 0 0 0 0.06 0 0.03 0 0 0 0 0.0002 0 0 0 0 0 0 0 0 0 0 0 0 
0 0 0 
##$DATE= 1693217569
##$DBL= (0..7)
120 120 120 120 120 120 120 120 
##$DBP= (0..7)
150 150 150 150 150 150 150 150 
##$DBP07= 0
##$DBPNAM0= <>
##$DBPNAM1= <>
##$DBPNAM2= <>
##$DBPNAM3= <>
##$DBPNAM4= <>
##$DBPNAM5= <>
##$DBPNAM6= <>
##$DBPNAM7= <>
##$DBPOAL= (0..7)
0.5 0.5 0.5 0.5 0.5 0.5 0.5 0.5 
##$DBPOFFS= (0..7)
0 0 0 0 0 0 0 0 
##$DE= 6
##$DECBNUC= <off>
##$DECIM= 32
##$DECNUC= <off>
##$DECSTAT= 4
##$DIGMOD= 1
##$DIGTYP= 9
##$DL= (0..7)
0 120 120 120 120 120 120 120 
##$DP= (0..7)
150 150 150 150 150 150 150 150 
##$DP07= 0
##$DPNAME0= <>
##$DPNAME1= <>
##$DPNAME2= <>
##$DPNAME3= <>
##$DPNAME4= <>
##$DPNAME5= <>
##$DPNAME6= <>
##$DPNAME7= <>
##$DPOAL= (0..7)
0.5 0.5 0.5 0.5 0.5 0.5 0.5 0.5 
##$DPOFFS= (0..7)
0 0 0 0 0 0 0 0 
##$DQDMODE= 0
##$DR= 18
##$DS= 0
##$DSLIST= <SSSSSSSSSSSSSSS>
$$ [...]
##$SUBNAM2= <"">
##$SUBNAM3= <"">
##$SUBNAM4= <"">
##$SUBNAM5= <"">
##$SUBNAM6= <"">
##$SUBNAM7= <"">
##$SUBNAM8= <"">
##$SUBNAM9= <"">
##$SW= 18.05172834244
##$SWIBOX= (0..15)
0 0 2 0 0 0 0 0 0 0 0 0 0 0 0 0 
##$SW_h= 3612.71676300578
##$TD= 16384
##$TD0= 1
##$TE= 0
##$TE2= 300
##$TE3= 300
##$TEG= 300
##$TL= (0..7)
0 120 120 120 120 120 120 120 
##$TP= (0..7)
150 150 150 150 150 150 150 150 
##$TP07= 0
##$TPNAME0= <>
##$TPNAME1= <>
##$TPNAME2= <>
##$TPNAME3= <>
##$TPNAME4= <>
##$TPNAME5= <>
##$TPNAME6= <>
##$TPNAME7= <>
##$TPOAL= (0..7)
0.5 0.5 0.5 0.5 0.5 0.5 0.5 0.5 
##$TPOFFS= (0..7)
0 0 0 0 0 0 0 0 
##$TUNHIN= 0
##$TUNHOUT= 0
##$TUNXOUT= 0
##$USERA1= <user>
##$USERA2= <user>
##$USERA3= <user>
##$USERA4= <user>
##$USERA5= <user>
##$V9= 5
##$VALIST= <valist>
##$VCLIST= <CCCCCCCCCCCCCCC>
##$VD= 0
##$VDLIST= <DDDDDDDDDDDDDDD>
##$VPLIST= <PPPPPPPPPPPPPPP>
##$VTLIST= <TTTTTTTTTTTTTTT>
##$WBST= 1024
##$WBSW= 4
##$XGAIN= (0..3)
0 0 0 0 
##$XL= 0
##$YL= 0
##$YMAX_a= 401060
##$YMIN_a= -256718
##$ZGOPTNS= <>
##$ZL1= 120
##$ZL2= 120
##$ZL3= 120
##$ZL4= 120
##$ABSF1= 10
##$ABSF2= 0
##$ABSG= 5
##$ABSL= 3
##$ALPHA= 0
##$AQORDER= 0
##$ASSFAC= 0
##$ASSFACI= 0
##$ASSFACX= 0
##$ASSWID= 0
##$AUNMP= <proc_1d>
##$AZFE= 0.1
##$AZFW= 0.1
##$BCFW= 1
##$BC_mod= 2
##$BYTORDP= 1
##$COROFFS= 0
##$CY= 11.3945322036743
##$DATMOD= 1
##$DC= 2
##$DFILT= <>
##$DTYPP= 0
##$F1P= 15.7292609196834
##$F2P= 12.9074282941183
##$FCOR= 0.5
##$FTSIZE= 0
##$FT_mod= 4
##$GAMMA= 1
##$GB= 0.15
##$INTBC= 1
##$INTSCL= 1
##$ISEN= 128
##$LB= 0.24
##$LEV0= 0
##$LPBIN= 0
##$MAXI= 10000
##$MC2= 0
##$MEAN= 0
##$ME_mod= 0
##$MI= 1.114404
##$NCOEF= 0
##$NC_proc= 0
##$NLEV= 6
##$NOISF1= 3.799351
##$NOISF2= 2.8
##$NSP= 1
##$NTH_PI= 0
##$NZP= 0
##$OFFSET= 15.70392
##$PC= 1
##$PHC0= -21204.81
##$PHC1= 9.05272
##$PH_mod= 1
##$PKNL= yes
##$PPARMOD= 0
##$PSCAL= 0
##$PSIGN= 0
##$REVERSE= no
##$SF= 200.130013532006
##$SI= 16384
##$SIGF1= 3
##$SIGF2= 2
##$SINO= 400
##$SIOLD= 16384
##$SREGLST= <1H.CDCl3>
##$SSB= 0
##$STSI= 0
##$STSR= 0
##$SW_p= 3612.71676300578
##$SYMM= 0
##$S_DEV= 0
##$TDeff= 0
##$TDoff= 0
##$TI= <>
##$TILT= no
##$TM1= 0
##$TM2= 0
##$TOPLEV= 0
##$USERP1= <user>
##$USERP2= <user>
##$USERP3= <user>
##$USERP4= <user>
##$USERP5= <user>
##$WDW= 1
##$XDIM= 8192
##$YMAX_p= 0
##$YMIN_p= 0
$$ End of Bruker specific parameters
$$ ---------------------------------
##NTUPLES= NMR FID
##VAR_NAME=  TIME,          FID/REAL,        FID/IMAG
##SYMBOL=    X,             R,               I
##VAR_TYPE=  INDEPENDENT,   DEPENDENT,       DEPENDENT
##VAR_FORM=  AFFN,          ASDF,            ASDF
##VAR_DIM=   8192,          8192,            8192
##UNITS=     SECONDS,       ARBITRARY UNITS, ARBITRARY UNITS
##FACTOR=    0.0002768,     1,               1
##FIRST=     0,             0,               0
##LAST=      2.2672688,     0,               0
##MIN=       0,             -256718,         0
##MAX=       2.2672688,     401060,          0
$$ Real data points
##PAGE= N=1
##DATA TABLE= (X++(R..R)), XYDATA
$$ [...]
$$ plain form
1705 2256 -766 -4578 -2021 2528 -285 -4502 -4626 -4619 -2070 3860 5238 2185 208 -2409 -4800 -3181
1721 -3181 -1098 -790 1532 4097 2564 2002 5186 6329 4494 2539 -2601 -9005 -9280 -4339 48 2463
1737 2463 2463 25 -1163 993 2387 1020 -973 -4432 -7084 -4065 1460 4599 7356 8571 5102 709
1753 709 -333 -1168 -2772 -2570 -3093 -5462 -4698 -1019 2007 4875 5225 906 -3072 -4037 -4355 -2676 1164
1770 1164 2102 326 943 2543 3072 4854 5616 1590 -2874 -4651 -4903 -2452 1011 1309 -55 -1067
1786 -1067 -1767 -1060 1269 2093 405 -896 -1462 -2322 -1032 1767 2738 2139 847 -857 -1202 434 2689
1803 2689 3156 1132 -2097 -3990 -3398 -1049 483 443 -212 -922 -240 1730 3145 2545 573 -1081 -2776
1820 -2776 -3826 -2268 458 2098 3062 2577 616 -55 511 709 -17 -2127 -4497 -4196 -1149 1981 3719
$$ packed form
1705B256l022l812K557M549k813m217j24PK549N930J378l053j977k617k391J619
1721c181K083L08K322K565j533n62L184J143j835j955n140o404k75M941M387K415
1737B463%k438j188K156J394j367j993l459k652L019N525L139K757J215l469m393
1753G09j042q35j604K02n23k369P64L679L026K868L50m319l978r65l18J679L840
1770A164R38j776O17J600N29J782P62m026m464j777k52K451L463K98j364j012
1786a067p00P07K329Q24j688j301n66q60J290K799R71n99j292j704l45J636K255
1803B689M67k024l229j893N92K349J532m0o55p10O82J970J415o00j972j654j695
1820b776j050J558K726J640R64m85j961o71N66J98p26k110k370L01L047L130J738
$$ plain form
1837 3719 4066 2223 -294 -805 -896 -1626 -1537 -1283 -1370 -626 334 1367 2810 3026 1269 -962 -2645 -3154
1855 -3154 -1633 870 1442 652 208 5 520 1294 613 -396 -1107 -1626 -944 522 1084 1226 1184 -118
1873 -118 -1712 -1962 -1234 -132 1200 1577 774 691 924 616 461 -897 -2743 -2636 -1458 -348 1595 2942
1891 2942 2761 2316 1272 -908 -2503 -2875 -2966 -2281 -616 314 1617 3910 4267 2874 1299 -1474 -3769
1908 -3769 -3678 -3335 -2789 -703 1475 2999 4447 4274 1993 97 -1285 -3350 -4143 -3512 -3118 -1004 2431
1925 2431 3707 3971 4030 2336 29 -1451 -3404 -4473 -3453 -1753 -181 1555 2781 3113 3542 3240
1941 3240 1013 -1720 -3563 -4395 -3289 -1523 -125 1250 2173 2793 3371 2542 1004 -287 -1949 -3445
1957 -3445 -3608 -3207 -1768 1201 3484 3273 2599 1845 219 168 262 -2337 -4078 -3483 -2862 -444 3473 4089
$$ packed form
1837C719L47j843k517n11r1p30Q9K54q7P44R60J033J443K16j757k231j683n09
1855c154J521K503N72p90m44k03N15P74o81j009p11n19O82J466N62J42m2j302
1873a18j594k50P28J102J332L77q03q3K33l08j55j358j846J07J178J110J943J347
1891B942j81m45j044k180j595l72r1O85J665R30J303K293L57j393j575k773k295
1908c769R1L43N46K086K178J524J448j73k281j896j382k065p93O31L94K114L435
1925B431J276K64N9j694k307j480j953j069J020J700J572J736J226L32M29l02
1941C240k227k733j843q32J106J766J398J375R23O20N78q29j538j291j662j496
1957c445j63M01J439K969K283k11o74p54j626n1R4k599j741N95O21K418L917O16
$$ plain form
1975 4089 2938 2758 948 -1501 -1272 -1386 -3138 -2447 -1344 -2081 218 3922 3918 3438 2738 -1271 -3750
1992 -3750 -2255 -1742 -1819 -66 85 -910 1097 3006 2419 2486 1808 -2119 -4086 -3085 -2195 -19 2650
2009 2650 1847 -442 -468 676 1631 2556 1649 -1813 -3666 -2295 -477 1157 2297 1058 -999 -1094 -128
2026 -128 130 925 1927 625 -1493 -1762 -1990 -1642 1489 2858 358 -890 -868 -916 1795 4652 2012
2043 2012 -2181 -3206 -3933 -2949 1931 3551 589 205 286 -1204 1138 3605 526 -2206 -2568 -4320
2059 -4320 -3099 2423 4352 2507 2299 104 -3236 -1167 1163 -636 -791 -613 -3169 -2102 2388 3455
2075 3455 3377 3553 -369 -4615 -3225 -287 956 3079 2316 -2642 -3697 -393 1457 2470 2304 -1962
2091 -1962 -5415 -2912 1090 2910 3961 2668 -2009 -3465 -979 315 1549 3657 2405 -735 -588
$$ packed form
1975D089j151j80j810k449K29j14j752O91J103p37K299L704mm80p00m009k479
1992c750J495N13p7J753J51r95K007J909n87O7o78l927j967J001Q90K176K669
2009B650q03k289k6J144R55R25r07l462j853J371J818J634J140j239k057r5R66
2026a28K58P95J002j302k118k69k28L48L131J369k500j248K2m8K711K857k640
2043B012m193j025p27R84M880J620k962l84Q1j490K342K467l079k732l62j752
2059d320J221N522J929j845k08k195l340K069K330j799j55J78k556J067M490J067
2075C455p8J76l922m246J390K938J243K123p63m958j055L304J850J013j66m266
2091a962l453K503M002J820J051j293m677j456K486J294J234K108j252l140J47
$$ plain form
2106 -588 150 -137 1066 1178 -3188 -6273 -4874 -2894 977 6345 5658 722 -1400 -2375 -2811 669 2759
2123 2759 -491 -2276 -462 990 4655 9276 6379 -824 -4691 -7860 -8568 -3012 735 -905 -670
2138 -670 767 279 2768 6008 2870 -1818 -3253 -5390 -5534 648 5724 6659 7745 5630 -370 -2278
2154 -2278 -631 -1380 -2792 -4230 -7999 -8610 -1771 4761 6642 5868 1004 -5360 -5143 -907 1130 1970
2170 1970 1971 -198 -310 3762 6362 5699 4322 381 -5401 -6890 -4809 -3034 36 2350 -338 -3530
2186 -3530 -2870 -1000 1008 3853 2952 -2011 -3841 -1501 1309 5130 7505 3587 -1584 -2603 -1942 197
2202 197 3885 3302 -2003 -5087 -4894 -3962 -256 3105 473 -3036 -2827 -2006 596 5377 5789 1974 -761
2219 -761 -2583 -3483 -125 3843 3518 1676 91 -2685 -2430 1852 3109 551 -2451 -5942 -7143 -2412
$$ packed form
2106e88P38k87J203J12m366l085J399J980L871N368o87m936k122r75m36L480K090
2123B759l250j785J814J452L665M621k897p203l867l169p08N556L747j640K35
2138f70J437m88K489L240l138m688j435k137j44O182N076R35J086k115o000j908
2154b278J647p49j412j438l769o11O839O532J881p74m864o364K17M236K037Q40
2170A970Jk169j12M072K600o63j377l941n782j489K081J775L070K314k688l192
2186c530O60J870K008K845r01m963j830K340K810L821K375l918n171j019O61K139
2202A97L688n83n305l084J93R32L706L361k632l509K09Q21K602M781M12l815k735
2219g61j822r00L358L968l25j842j585k776K55M282J257k558l002l491j201M731
$$ plain form
2235 -2412 3546 5347 4042 1149 -2443 -2519 963 2637 1735 157 -2716 -4127 -1224 2835 4533 4360
2251 4360 1502 -3314 -5492 -3307 80 2183 2510 -175 -3284 -2306 1325 3770 4180 1781 -2796 -4924
2267 -4924 -2939 243 2761 3669 1547 -2269 -3231 -1602 479 2901 3367 -149 -3358 -3183 -912 2529
2283 2529 4761 2772 -1934 -4277 -3316 -450 3257 4214 979 -2251 -3055 -2430 282 2868 2070 -592
2299 -592 -2508 -2977 -1243 2552 4762 3437 154 -3033 -4213 -1762 1898 2887 1416 -1290 -3212 -2043
2315 -2043 1460 3876 3383 442 -2868 -4401 -2901 677 3245 2899 633 -1887 -2468 -477 2447 3310
2331 3310 1216 -2254 -4571 -4040 -560 2918 3625 2270 -160 -1927 -931 1562 2744 2055 -301 -3279
2347 -3279 -4212 -2095 1430 3708 3458 584 -2858 -3389 -1612 577 1756 53 -2912 -3428 -1100 2302
$$ packed form
2235b412N958J801j305k893l592p6L482J674r02j578k873j411K903M059J698j73
2251D360k858m816k178K185L387K103L27k685l109R78L631K445M10k399m577k128
2267d924J985L182K518R08k122l816r62J629K081K422M66l516l209J75K271L441
2283B529K232j989m706k343R61K866L707R57l235l230q04O25K712K586p98k662
2299e92j916m69J734L795K210j325l283l187j180K451L660R89j471k706j922J169
2315b043L503K416m93k941l310j533J500L578K568l46k266k520n81J991K924Q63
2331C310k094l470k317N31L480L478P07j355k430j767R96K493J182o89k356k978
2347c279r33K117L525K278k50k874l442n31J777K189J179j703k965n16K328L402
$$ plain form
2363 2302 5213 5251 2534 -892 -2580 -2283 -589 1134 1072 -559 -2019 -2241 -546 2355 3107 1181 -2318
2380 -2318 -5240 -5058 -1692 1888 3518 2830 703 -211 1028 2781 3260 2083 -726 -3295 -3538 -1665
2396 -1665 789 2900 2642 75 -2566 -3500 -2630 -211 1153 18 -1672 -2342 -1065 2081 4606 4232
2412 4232 1741 -741 -2219 -1488 913 2187 1626 362 -1600 -2643 -1278 418 901 364 -1623 -3476
2428 -3476 -2700 37 2232 3089 1950 -843 -2159 -926 839 2359 2788 1011 -812 -1022 -556 528
2444 528 1561 584 -1643 -3071 -3006 -1397 1441 3027 1974 -237 -1722 -1865 -317 1378 1321 72 -1119
2461 -1119 -1226 210 1962 2613 1814 -320 -2253 -2684 -2036 -341 1425 1593 391 -461 -617 75 1537
2478 1537 1826 -96 -1930 -2345 -1798 477 2711 2082 459 -575 -1797 -1544 257 748 1 -120 -683
$$ packed form
2363B302K911L8k717l426j688K97J694J723o2j631j460k22J695K901P52j926l499
2380b318k922J82L366L580J630o88k127r14J239J753M79j177k809k569k43J873
2396a665K454K111k58k567k641r34Q70K419J364j135j690o70J277L146K525l74
2412D232k491k482j478P31K401J274n61j264j962j043J365J696M83n37j987j853
2428c476P76K737K195Q57j139k793j316J233J765J520M29j777j823k10M66J084
2444E28J033r77k227j428O5J609K838J586j053k211j485j43J548J695n7j249j191
2461a119j07J436J752O51p99k134j933m31O48J695J766J68j202q52j56O92J462
2478A537K89j922j834m15N47K275K234o29j623j034j222K53J801M91p47j21n63
$$ plain form
2495 -683 -1142 608 2310 1851 1172 -89 -2239 -2092 285 963 1048 1064 -625 -1734 -468 182 -176 93
2513 93 -285 -1715 -1177 402 916 1845 2385 566 -1258 -1175 -775 260 1629 1261 -513 -1040 -204 458
2531 458 963 616 -1323 -2688 -1823 -717 243 1412 1476 433 146 334 -119 -212 600 210 -635 -298 -31
2550 -31 -56 1431 2029 265 -891 -1296 -2131 -1449 537 358 -529 168 160 -391 1313 1802 -60 -470 -475 -1681
2570 -1681 -445 1690 1117 330 681 -319 -918 641 603 -1198 -871 -437 -1241 -29 1194 38 -10 1170
2588 1170 86 -742 51 -288 -522 1013 1029 -800 -588 301 9 782 1327 -854 -1807 -276 202 239 890
2607 890 -60 -1383 -313 951 228 78 428 -684 -556 929 275 -692 223 294 -444 217 497 -767
2625 -767 -423 855 71 -374 440 -360 -1019 540 752 -380 145 171 -850 67 1113 -9 -517 331
$$ packed form
2495f83m59J750J702m59o79j261k150J47K377O78Q5J6j689j109J266O50l58K69
2513I3l78j430N38J579N14R29N40j819j824Q3M00J035J369l68j774n27Q36O62
2531D58N05l47j939j365Q65J106R60J169O4j043k87J88m53r3Q12l90q45L37K67
2550c1k5J487N98j764j156m05q35O82J986j79q87O97qn51J704M89j862m10nj206
2570a681J236K135n73p87L51j000n99J559l8j801L27M34q04J212J223j156m8J180
2588A170j084q28P93l39k34J535J6j829K12Q89k92P73N45k181r53J531M78L7O51
2607H90r50j323J070J264p23j50L50j112J28J485o54r67R15P1p38O61K80j264
2625g67L44J278p84m45Q14q00o59J559K12j132N25K6j021R17J046j122n08Q48
$$ plain form
2643 331 -491 -739 999 639 -827 -48 317 -484 445 887 -807 -804 543 120 -156 671 -428 -1174 666
2662 666 935 -490 -35 -18 -1031 165 1364 -197 -955 184 -69 -268 763 230 -997 29 725
2679 725 -268 71 315 -777 -192 932 -52 -692 260 114 -373 659 576 -845 -428 407 -182 21 689
2698 689 -231 -590 242 0 -253 639 387 -819 -377 216 -324 265 1077 -264 -912 296 302 -128 491 190
2718 190 -861 -174 475 -209 -140 480 -268 -172 555 -411 -966 331 501 -197 278 -69 -960 -14 1350 545
2738 545 -208 -134 -678 -474 885 697 -316 -75 -260 -636 408 563 -523 -459 49 -619 -618 425 351 -73
2758 -73 562 397 -432 29 468 210 411 325 -316 -332 207 85 188 552 -209 -1160 -752 -277 -403 174 478
2779 478 -452 -777 104 623 719 714 186 -472 -93 601 552 683 455 -351 -221 155 -442 -727 -172 -262 -882 -651
$$ packed form
2643C31q22k48J738l60j466P79L65q01R29M42j694LJ347m23k76Q27j099p46J840
2662F66K69j425M55J7j013J196J199j561p58J139k53j99J031n33j227J026O96
2679G25r93L39K44j092N85J124r84o40R52j46m87J032q3j421M17Q35n89K03O68
2698F89r20l59Q32k42k53Q92k52j206M42N93n40N89Q12j341o48J208Om30O19l01
2718A90j051O87O49o84O9O20p48R6P27r66n55J297J70o98M75l47q91R46J364q05
2738E45p53P4n44K04J359j88j013K41j85l76J044J55j086O4N08o68JJ043p4m24
2758g3O35j65q29M61M39k58K01q6o41j6N39j22J03L64p61r51M08M75j26N77L04
2779D78r30l25Q81N19R6nn28o58L79O94m9J31k28q06J30L76n97k85N55r0o20K31
$$ plain form
2801 -651 -451 -667 46 990 493 -263 -309 -221 557 1347 870 256 153 -46 192 801 368 -784 -892 -609
2821 -609 -857 -733 -144 -98 -223 -159 -365 -475 -80 347 747 724 186 78 659 1198 1012 546 39 -662 -911
2842 -911 -317 43 -246 -506 -348 -387 -671 -469 58 -57 -231 -210 -168 149 625 1078 1273 720 -117 -202 96
2863 96 39 -134 37 -225 -681 -387 144 44 -143 -207 -501 -671 -681 -182 605 803 358 188 304 63 103 516
2885 516 162 -694 -569 -51 54 224 344 309 -5 -376 -470 -124 -145 93 459 326 -117 -96 443 547 170
2906 170 -402 -733 -731 -476 68 467 236 -320 -24 304 -32 -53 189 188 110 234 274 467 396 353 379 -164 -1004
2929 -1004 -1005 -203 -139 -399 -151 -235 -542 32 452 186 -70 -133 70 443 490 445 859 921 190 -20 122 -371
2951 -371 -632 -166 -280 -878 -779 -323 -95 31 -109 -277 -225 -244 -6 432 569 312 468 929 484 61 276
$$ packed form
2801f51K00k16P13R44m97p56m6Q8P78P90m77o14j03j99K38O09m33j152j08K83
2821f09k48J24N89M6j25O4k06j10L95M27M00k3n38j08N81N39j86m66n07p01k49
2842i11N94L60k89k60J58l9k84K02N27j15j74K1M2L17M76M53J95n53q37q5K98
2863I6n7j73J71k62m56K94N31j00j87o4k94j70j0M99P87J98m45j70J16k41M0M13
2885E16l54q56J25N18J05J70J20l5l14l71r4L46k1K38L66j33m43K1N39J04l77
2906A70n72l31KK55N44L99k31n56K96L28l36k1K42jp8J24M0J93p1m3K6n43q40
2929a004jQ02O4k60K48q4l07N74M20k66k56o3K03L73M7m5M14O2p31k10J42m93
2951c71k61M66j14n98R9M56K28J26j40j68N2j9K38M38J37k57J56M61m45m23K15
$$ plain form
2972 276 296 -125 -374 -366 -427 -512 -234 144 -162 -597 -376 -102 31 -40 -30 83 233 158 373 591 282 -78 288
2995 288 348 -366 -356 226 -118 -376 64 -124 -353 1 148 9 97 -81 -105 304 175 -411 79 506 -239
3016 -239 -271 367 -241 -416 375 229 -437 -250 55 68 390 320 -171 151 453 56 182 335 -453 -494 426
3037 426 140 -618 -279 -105 -380 -131 123 -406 -570 -36 252 341 525 81 51 574 413 -7 167 144 -477
3058 -477 -192 442 -133 -593 -29 -29 -733 -414 -65 -547 -255 186 70 284 563 131 120 577 99 -250 493
3079 493 156 -733 148 771 -135 -246 106 -690 -733 210 26 -535 -163 -80 -64 873 716 -396 -39 199 -489
3100 -489 -41 586 -448 -577 603 534 -317 -20 -43 -612 27 453 -331 -310 281 173 728 1021 -128 -735
3120 -735 -43 -52 -510 83 21 -909 -391 610 11 -318 123 -313 -617 206 464 151 697 737 226 556 725
$$ packed form
2972B76K0m21k49Qo1q5K78L78l06m35K21K74J33p1J0J13J50p5K15K18l09l60L66
2995B88O0p14J0N82l44k58M40j88k29L54J47j39Q8j78k4M09j29n86M90M27p45
3016b39l2O38o08j75P91j46o66J87L05J3L22p0m91L22L02l97J26J53p88m1R20
3037D26k86p58L39J74k75K49K54n29j64N34K88Q9J84m44l0N23j61m20J74k3o21
3058d77K85O34n75m60N64%p04L19L49m82K92M41j16K14K79m32j1M57m78l49P43
3079D93l37q89Q81O23r06j11L52p96m3R43j84n61L72Q3J6R37j57j112L57K38o88
3100d89M48O27j034j29J180o9q51K97k3n69O39M26p84K1N91j08N55K93j149o07
3120g35O92rm58N93o2r30N18J001n99l29M41m36l04Q23K58l13N46M0n11L30J69
$$ plain form
3141 725 -195 -242 174 -606 -871 88 -209 -977 -152 155 -630 -476 -254 -874 -519 667 713 527 925 477
3161 477 331 1411 1039 -284 -190 -225 -848 1 689 -461 -1094 -330 -491 -881 -389 -617 -1144 -180 549 285
3181 285 764 1060 512 909 1326 215 -385 272 144 -242 454 260 -933 -603 -1 -625 -791 -554 -1200
3200 -1200 -1031 31 265 304 859 620 17 676 955 182 311 673 -200 -223 643 252 -432 -172 -345 -900
3220 -900 -475 -448 -1010 -629 96 -17 79 467 -113 -68 883 804 62 273 244 -139 553 928 -84 -664 -281
3241 -281 -363 -351 159 -380 -837 -257 105 -92 166 132 -457 -79 583 70 -141 528 470 148 575 243 -568
3262 -568 -206 120 -209 -174 -114 -443 -190 376 165 -180 77 -150 -442 28 166 -205 180 501 65 33 373
3283 373 115 -117 86 -228 -452 -127 138 -36 211 193 -169 -12 217 -147 -216 52 -48 -206 182 194 -66
$$ packed form
3141G25r20m7M16p80k65R59k97p68Q25L07p85J54K22o20L55J186M6j86L98m48
3161D77j46J080l72j323R4l5o23Q49O88j150o33P64j61l90M92k28n27R64P29k64
3181B85M79K96n48L97M17j111o00O57j28l86O96j94j193L30O02o24j66K37o46
3200a200J69J062K34L9N55k39o03O59K79p73J29L62q73k3Q66l91o84K60j73n55
3220i00M25K7n62L81P25j13R6L88n80M5R51p9p42K11k9l83O92L75j012n80L83
3241b81q2J2N10n39m57N80L62j97K58l4n89L78O62n13k11O69n8l22M27l32q11
3262e68L62L26l29L5O0l29K53N66k11l45K57k27k92M70J38l71L85L21m36l2L40
3283C73k58k32K03l14k24L25K65j74K47j8l62J57K29l64o9K68j00j58L88J2k60
$$ plain form
3304 -66 144 315 -117 -208 -41 -156 -13 223 36 -206 59 108 -77 112 123 -171 -60 170 -29 -158 181
3325 181 70 -106 65 -120 -245 22 194 62 27 39 -22 10 262 -73 -300 -71 -125 -51 123 15 -127 145
3347 145 195 5 -174 -161 -159 -14 92 -95 -263 48 208 221 179 -41 -204 -137 54 -31 -256 -169 -52 72 220
3370 220 238 -53 -88 102 36 -114 -298 -243 -164 146 213 99 86 104 158 204 -65 -397 -372 -176 -165 -32 108 66
3394 66 223 357 294 13 -114 -191 -254 -193 -109 -141 20 328 332 262 264 14 -137 -270 -254 -387 -299 -31 126 200 279
3419 279 298 251 113 -5 -187 -373 -268 -79 -40 103 259 257 312 309 -37 -182 -245 -288 -286 -218 -213 -36 227 383 259
3444 259 195 30 -106 102 -101 -299 -171 -117 29 364 325 98 107 136 17 -182 -283 -369 -305 49 20 -178 75
3467 75 230 187 335 160 -152 -198 6 -22 -42 -57 -91 -4 284 180 36 26 -124 -183 -92 -208 -356 -234 -16 40
$$ packed form
3304f6K10J71m32r1J67j15J43K36j87k42K65M9j85J89J1k94J11K30j99j29L39
3325A81j11j76J71j85j25K67J72j32l5J2o1L2K52l35k27K29n4P4J74j08j42K72
3347A45N0j90j79J3KJ45J06j87j68L11J60J3m2k20j63O7J91q5k25Q7J17J24J48
3370B20J8k91l5J90o6j50j84N5P9L10O7j14j3J8N4M6k69l32K5J96J1J33J40m2
3394F6J57J34o3k81j27p7o3O1Q4l2J61L08Mp0Kk50j51j33J6j33Q8K68J57P4P9
3419B79J9m7j38j18j82j86J05J89L9J43J56kN5ll46j45o3m3KO8NJ77K63J56j24
3444B59o4j65j36K08k03j98J28N4J46L35l9k27RK9j19j99j01q6O4L54k9j98K53
3467G5J55m3J48j75l12m6K04k8k0j5l4Q7K88j04j44j0j50n9R1j16j48J22K18N6
$$ plain form
3491 40 192 222 138 151 263 82 -189 -175 -174 -168 48 160 35 -26 151 104 -36 -59 -120 -272 -109 -23 -166 -21 302
3516 302 111 25 205 -15 -109 141 9 -304 -115 55 -94 113 80 -139 -44 237 44 -57 174 -42 -107 337
3538 337 137 -264 -67 37 -76 23 94 -244 -192 286 34 -219 -21 -316 -381 98 179 -134 74 434 280 426
3560 426 574 28 -225 0 -106 -385 -77 -92 -265 94 171 -2 -76 38 -407 -546 -257 -273 -296 229 472 279
3582 279 697 817 328 290 188 -370 -399 -90 -339 -494 -4 128 12 287 96 -628 -482 -151 -418 -427 -64
3603 -64 -221 72 1060 1108 576 517 334 -230 25 97 -727 -672 -160 -202 13 390 -2 -320 89 -36 -657 -433
3625 -433 -327 -441 108 758 457 439 846 591 405 572 -81 -767 -554 -428 -505 -47 233 -236 -102 338 35
3646 35 -154 102 -445 -849 -262 94 90 523 827 356 420 677 221 -224 -125 -485 -711 -151 -164 -435 133 572
$$ packed form
3491D0J52L0q4J3J12j81k71J4JOK16J12j25o1J77m7j40k3o1j52J63Q6j43J45L23
3516C02j91q6J80k20r4K50j32l13J89J70j49K07l3k19R5K81j93j01K31k16o5M44
3538C37k00m01J97J04j13R9P1l38N2M78k52k53J98k95o5M79Q1l13K08L60j54J46
3560D26J48n46k53K25j06k79L08j5j73L59P7j73p4J14m45j39K89j6k3N25K43j93
3582B79M18J20m89l8j02n58k9L09k49j55M90J32j16K75j91p24J46L31k67rL63
3603f4j57K93R88M8n32n9j83n64K55P2q24N5N12m2K15L77l92l18M09j25o21K24
3625d33J06j14N49O50l01j8M07k55j86J67o53o86K13J26p7M58K80m69J34M40l03
3646C5j89K56n47m04N87L56mM33L04m71O4K57m56m45R9l60k26N60j3k71N68M39
$$ plain form
3668 572 223 254 162 -544 -580 107 26 -347 -23 -49 -135 795 1036 253 -34 -58 -534 -257 140 -291 -584 19
3690 19 165 -6 508 416 -168 95 183 -453 -465 -6 -126 30 437 145 -200 211 392 -59 166 18 -663
3711 -663 -433 103 -43 144 456 61 -297 121 228 -11 239 68 -622 -428 148 -5 114 339 -166 -308
3731 -308 207 209 -5 220 105 -364 -170 55 -290 -128 350 61 -125 74 -188 -125 407 442 -92 -289 -247 -275
3753 -275 184 616 165 -131 98 -25 -45 476 230 -468 -489 -396 -545 -179 267 89 -4 193 11 -27 521 416
3775 416 2 -8 -141 -350 70 605 418 310 375 -144 -419 -264 -327 -653 -583 -618 -870 -246 310 574 844 708
3797 708 85 -192 103 190 148 185 -61 -207 300 701 557 417 -74 -709 -1022 -981 -1079 -852 -324 -40 8 347
3819 347 636 715 886 766 55 -366 -360 -106 369 814 711 253 98 128 -44 -303 -533 -1089 -1350 -1073 -692
$$ packed form
3668E72l49L1r2p06l6O87q1l73L24k6q6R30K41p83k87k4m76K77L97m31k93O03
3690A9J46j71N14r2n84K63Q8o36j2M59j20J56M07k92l45M11J81m51K25j48o81
3711f63K30N36j46J87L12l95l58M18J07k39K50j71o90J94N76j53J19K25n05j42
3731c08N15Kk14K25j15m69J94K25l45J62M78k89j86J99k62O3N32L5n34j97M2k8
3753b75M59M32m51k96K29j23k0N21k46o98k1R3j49L66M46j78r3J97j82l8N48j05
3775D16m14j0j33k09M20N35j87j08O5n19k75J55o3l26P0l5k52O24N56K64K70j36
3797G08o23k77K95Q7m2L7k46j46N07M01j44j40m91o35l13M1r8K27N28K84M8L39
3819C47K89P9J71j20p11m21OK54M75M45j03m58j55L0j72k59k30n56k61K77L81
$$ plain form
3840 -692 -123 568 739 661 542 377 254 406 469 134 -102 -74 -21 287 695 588 131 -272 -729 -898 -755
3861 -755 -522 -579 -439 -358 -261 117 777 916 811 494 80 -146 155 338 304 190 -48 -144 -36 174 226 -56
3883 -56 -300 -636 -928 -744 -420 -119 124 258 114 151 424 759 721 415 -42 -511 -461 -102 181 223 137 -119
3905 -119 -147 -38 39 18 -237 -433 -599 -497 -217 143 496 728 454 203 18 -50 122 249 -65 -448 -407 -204
3927 -204 179 450 485 16 -302 -297 -282 -137 47 51 -84 -41 -109 -12 252 437 193 -143 -378 -362 -131 216 273 53
3951 53 -149 -337 -220 77 227 240 95 -42 -11 75 269 298 50 -177 -446 -494 -239 106 227 324 85 -179
3973 -179 -106 -12 58 -56 -150 -266 -319 130 478 508 601 360 -139 -280 -313 -322 -200 -18 -179 -260 -10 319 480 564
3997 564 206 -367 -580 -365 -270 13 195 89 139 285 347 358 346 42 -337 -563 -615 -485 -28 334 342 237 214
$$ packed form
3840f92N69O91J71p8j19j65j23J52O3l35k36K8N3L08M08j07m57m03m57j69J43
3861g55K33n7J40Q1R7L78O60J39j05l17m14k26L01J83l4j14k38r6J08K10N2k82
3883e6k44l36k92J84L24L01K43J34j44L7K73L35l8l06m57m69N0L59K83M2q6k56
3905a19k8J09P7k1k55j96j66J02K80L60L53K32k74k51j85o8J72J27l14l83M1K03
3927b04L83K71L5m69l18NJ5J45J84Mj35M3o8R7K64J85k44l36k35J6K31L47N7k20
3951E3k02j88J17K97J50J3j45j37L1Q6J94K9k48k27k69m8K55L45J21R7k39k64
3973a79P3R4P0j14r4j16n3M49L48L0R3k41m99j41l3rJ22J82j61q1K50L29J61Q4
3997E64l58n73k13K15R5K83J82j06N0J46O2J1j2l04l79k26n2J30M57L62Qj05k3
$$ plain form
4020 214 52 167 220 2 -410 -433 -388 -252 130 496 373 364 321 15 -140 -96 -226 -366 -283 -313 -337 88 532
4043 532 492 461 219 -250 -333 -76 -154 -348 -228 -202 -123 358 555 297 294 121 -272 -383 -258 -406 -301 192 132
4066 132 66 300 370 185 243 53 -433 -497 -297 -238 -12 321 174 91 308 204 40 103 -8 -409 -362 -178 -118
4089 -118 89 376 242 50 173 79 -105 23 -102 -410 -219 -18 -61 -1 237 40 25 295 8 -263 -105
4110 -105 11 -210 6 17 -266 -109 280 200 146 176 -140 -237 106 49 -283 -178 -25 -181 174 409 0 -42
4132 -42 261 61 -112 4 -169 -353 -75 206 13 128 225 -44 5 273 -122 -267 3 -217 -281 171 231 24
4154 24 177 220 -165 -77 141 -165 -259 -15 -29 -64 226 102 -141 82 200 -170 -81 75 -197 -34 433 168
4176 168 -146 -21 -136 -157 155 189 -225 -159 70 15 191 303 -153 -418 -58 -104 -241 150 210 -15 276 402
$$ packed form
4020B14j62J15N3k18m12k3M5J36L82L66j23rm3l06j55M4j30j40Q3l0k4M25M44
4043E32m0l1k42m69q3K57p8j94J20K6P9M81J97k58lj73l93j11J25j48J05M93o0
4066A32o6K34P0j85N8j90m86o4K00N9K26L33j47q3K17j04j64O3j11m01M7J84O0
4089a18K07K87j34j92J23r4j84J28j25l08J91K01m3O0K38j97j5K70k87k71J58
4110a05J16k21K16J1k83J57L89q0n4L0l16r7L43n7l32J05J53j56L55K35m09m2
4132d2L03k00j73J16j73j84K78K81j93J15R7k69M9K68l95j45K70k20o4M52O0k07
4154B4J53M3l85Q8K18l06r4K44j4l5K90j24k43K23J18l70Q9J56k72J63M67k65
4176A68l14J25j15k1L12L4m14O6K29n5J76J12m56k65L60m6j37L91O0k25K91J26
$$ plain form
4198 402 -40 -179 46 -116 -244 -26 -190 -268 215 403 233 229 56 -488 -313 -51 -278 -202 125 -28 -29 529
4220 529 595 231 145 -67 -561 -424 41 -47 -9 222 19 1 341 151 -210 -213 -264 -625 -320 91 0 257 638
4243 638 346 29 73 -79 -76 270 79 -292 -228 -32 73 489 519 -157 -508 -303 -319 -248 162 30 -310 -68
4265 -68 190 241 288 425 160 -83 -12 -114 -123 247 189 -55 -14 -237 -346 15 264 -31 -248 -217 -321 -304 196
4288 196 287 107 -37 -115 -129 170 526 376 181 -21 -349 -237 179 158 -47 -3 -151 -386 -11 236 34 -40
4310 -40 -89 -346 -363 -49 148 283 330 127 -93 -56 96 93 322 109 -450 -498 -149 197 306 347 31 -338 -321
4333 -321 -38 86 154 31 -205 -150 1 82 267 442 156 -199 -261 -239 -145 219 440 -30 -380 -238 -42 129
4355 129 307 218 -151 -401 -291 -19 267 327 40 -87 -143 -270 -114 330 266 -42 -85 -321 -288 82 445 289
$$ packed form
4198D02m42j39K25j62j28K18j64p8M83J88j70mj73n44J75K62k27P6L27j53jN58
4220E29O6l64q6k12m94J37M65q8L8K31k03j8L40j90l61ln1l61L05M11r1K57L81
4243F38k92l17M4j52LL46j91l71O4J96J05M16L0o76l51K05j6P1M10j32l40K42
4265f8K58N1M7J37k65k43P1j02rL70n8k44M1k23j09L61K49k95k17L1j04J7N00
4288A96R1j80j44p8j4K99L56j50j95k02l28J12M16k1k05M4j48k35L75K47k02p4
4310d0m9k57j7L14J97J35M7k03k20L7J52lK29k13n59m8L49L46J09M1l16l69J7
4333c21K83J24O8j23k36N5J51Q1J85J75k86l55o2K2R4L64K21m70l50J42J96J71
4355A29J78q9l69k50J10K72K86O0k87j27n6j27J56M44o4l08m3k36L3L70L63j56
$$ plain form
4377 289 -63 -287 -316 -15 213 308 185 -66 -327 -304 128 185 149 126 -63 -391 -227 64 385 276 5 -152
4399 -152 -350 -208 210 367 269 -98 -301 -227 -35 223 208 179 -154 -329 -205 140 211 255 241 -129 -378 -148
4421 -148 233 314 139 -31 -354 -368 -191 136 280 102 -194 -227 -141 -16 183 374 137 -157 -114 -93 112 365
4443 365 477 230 -238 -404 -215 44 227 -13 -240 -417 -492 -168 251 310 -30 -129 -170 -57 143 463 506 199
4465 199 31 -58 -57 128 263 327 -48 -474 -574 -265 33 80 -36 -173 -475 -401 35 331 281 196 78 -14 14
4488 14 295 454 492 233 -83 -294 -191 -53 70 115 -273 -636 -554 -180 27 158 166 -95 -382 -108 207 449
4510 449 434 314 65 8 49 148 332 252 -161 -427 -408 -375 -105 156 54 -319 -397 -265 -83 132 286 118 -15
4533 -15 -100 -10 211 467 323 242 1 -257 -294 78 254 25 -176 -253 -343 -149 280 298 -14 -174 -272 -233 84
$$ packed form
4377B89l52k24k9L01K28R5j23k51k61K3M32N7l6k3j89l28J64K91L21j09k71j57
4399a52j98J42M18J57r8l67k03P4J92K58j5k9l33j75J24L45P1M4j4l70k49K30
4421a48L81Q1j75j70l23j4J77L27J44j78k96l3Q6J25J99J91k37k94M3K1K05K53
4443C65J12k47m68j66J89K59J83k40k27j77p5L24M19N9l40r9m1J13K00L20M3l07
4465A99j68q9JJ85J35O4l75m26j00L09K98M7j16j37l02P4M36K96n0q5j18r2K8
4488A4K81J59L8k59l16k11J03J38J23M5l88l63Q2L74K07J31Qk61k87K74L15K42
4510D49j5j20k49n7M1R9J84q0m13k66J9L3K70K61j02l73p8J32J82K15J54j68j33
4533a5q5R0K21K56j44q1k41k58l7L72J76k29k01p7r0J94M29J8l12j60r8L9L17
$$ plain form
4556 84 281 241 200 31 -201 -76 146 71 71 107 -208 -417 -71 209 237 223 17 -225 -324 -27 180 215 143 -118
4580 -118 -267 -5 52 62 213 -23 -406 -362 -73 -2 119 368 110 -222 -116 85 83 323 169 -44 0 -4 43
4603 43 226 274 -82 -294 -268 -348 -372 30 170 -92 -94 -79 -78 135 412 260 -46 -103 -171 69 480 437 130 41 -89
4628 -89 -324 -62 44 -247 -327 -177 -275 -274 75 190 51 86 59 -147 -19 186 213 272 334 -6 -99 192 235 -29
4652 -29 -10 -186 -547 -380 -24 -36 -15 66 -253 -286 2 136 123 246 75 -180 87 304 158 263 241 -151 -248
4675 -248 81 -30 -151 73 -41 -238 -134 -82 -261 47 144 -20 -10 -5 -127 110 436 245 -135 -78 -152 -176 126
4698 126 237 -128 -157 -18 -80 -22 130 -32 -270 -126 -128 -117 116 176 32 67 209 -140 -45 123 41 -23 52 -24
4722 -24 -166 13 223 31 22 114 -235 -184 10 -2 15 159 -32 -172 83 156 28 51 59 -285 -194 142 60 9 98
$$ packed form
4556H4J97m0m1j69k32J25K22p5%L6l15k09L46K80K8j4k06k42r9K97K07L5p2k61
4580a18j49K62N7J0J51k36l83M4K89P1J21K49k58l32J06K01kK40j54k13M4mM7
4603D3J83M8l56k12K6q0k4M02J40k62kJ5JK13K77j52l06n7o8K40M11m3l07q9j30
4628h9k35K62J06k91q0J50r8JL49J15j39L5k7k06J28K05K7N9O2l40r3K91M3k64
4652b9J9j76l61J67L56j2K1Q1l19l3K88J34j3J23j71k55K67K17j46J05k2l92r7
4675b48L29j11j21K24j14j97J04N2j79L08R7j64J0Nj22K37L26j91l80N7p4k4L02
4698A26J11l65k9J39o2N8J52j62k38J44kJ1K33O0j44L5J42l49R5J68q2o4P5p6
4722b4j42J79K10j92rR2l49N1J94j2J7J44j91j40K55P3j28K3Ql44R1L36q2n1Q9
$$ plain form
4747 98 -93 -156 114 119 -73 13 95 -121 -11 101 -131 -59 206 56 -56 39 -9 -82 144 163 -128 -127 -69 -39 33
4772 33 205 108 -94 5 -26 -84 75 -11 -148 -76 27 -41 25 206 48 -34 -15 -48 -94 46 78 -81 36 121 -47
4797 -47 -5 145 -72 -163 27 -57 -140 72 142 -1 144 95 -142 -130 39 -20 -49 85 -9 -80 156 103 -60 -13 -67
4822 -67 -226 -146 6 -78 4 145 60 53 171 -23 -192 -64 -36 -106 -12 138 97 283 262 49 -61 -43 -169 -238 -74
4847 -74 -58 -34 82 269 81 101 48 -129 -168 -116 -102 -99 104 219 150 195 155 18 -127 -73 -151 -225 -95 -26 49 138
4873 138 117 51 20 22 -131 -209 -104 -69 41 251 189 121 175 103 -53 -110 -162 -215 -63 74 31 70 113 101 18 -89
4899 -89 -219 -258 -129 -43 32 141 193 150 145 91 -58 -205 -121 -108 4 93 79 122 112 122 47 -158 -162 -206 -116 -24 76
4926 76 100 179 229 176 28 -31 -132 -181 -83 27 105 198 227 119 59 30 -190 -255 -222 -115 -101 32 116 181 252 69
$$ packed form
4747I8j91o3K70Nj92Q6Q2k16J10J12k32P2K65j50j12R5m8p3K26J9k91JN8L0P2
4772C3J72r7k02R9l1n8J59q6j37P2J03o8O6J81j58q2J9l3m6J40L2j59J17Q5j68
4797d7M2J50k17r1J90q4q3K12P0j43J45m9k37J2J69n9k9J34r4p1K36n3j63M7n4
4822f7j59Q0J52q4Q2J41q5pJ18j94j69J28K8p0R4J50m1J86k1k13j10J8j26o9J64
4847g4J6K4J16J87j88K0n3j77l9N2J4LK03J15o9M5m0j37j45N4p8p4J30O9P5Q9
4873A38k1o6l1Kj53p8J05L5J10K10o2o8N4p2j56n7n2n3J52J37m3L9M3j2q3j07
4899h9j30l9J29Q6P5J09N2m3nn4j49j47Q4J3J12Q9j4M3j0J0p5k05mm4R0R2J00
4926G6K4P9N0n3j48n9j01m9R8J10P8R3K9j08o0k9k20o5L3J07J4J33Q4O5P1j83
$$ plain form
4952 69 -72 -74 -135 -216 -17 48 48 186 257 181 18 58 -135 -147 -137 -216 -135 74 133 130 137 116 -3 -94 -115 -153 -114 -85 55
4981 55 146 166 124 55 18 -51 -127 -152 -170 -46 55 176 151 113 60 12 -39 -68 -124 -187 -51 68 106 131 89 30 -35 -83
5009 -83 -107 -208 -132 46 46 188 171 93 75 109 -39 -102 -76 -76 -37 63 183 69 120 108 -93 -94 -92 -218 -154 14 -8
5036 -8 34 128 128 64 56 40 -85 -48 -10 -68 -10 62 36 68 115 53 -135 -54 -34 -99 -61 -21 -70 102 184 87 26 70 -36 -28
5066 -28 37 -71 -52 17 0 20 14 46 -43 -24 14 -41 -110 -21 19 -41 34 25 -59 5 65 41 -6 66 -55 -107 43 34 -79 63
5096 63 63 -44 12 24 -15 64 91 -60 -104 46 64 -6 131 13 -160 39 96 -27 1 -44 -187 -64 63 -26 -5
5121 -5 58 26 -54 127 87 -129 42 215 75 111 33 -80 -29 111 7 -126 -89 -104 -78 87 59 -87 -46 -14 -73
5146 -73 -25 35 -6 -24 133 123 26 126 112 -24 -81 -61 -159 -118 46 -22 -36 110 25 -91 -35 -4 -96 -66 -10 -62 8
$$ packed form
4952F9j41ko1q1J99O5%J38P1p6j63M0j93j2J0p9Q1K09N9lPk1j19r1k1l8L9K9J40
4981E5R1K0m2o9l7o9p6k5j8J24J01J21k5l8n3m8n1k9n6o3J36J19L8K5m2n9o5m8
5009h3k4j01P6J78%J42j7p8j8L4j48o3K6%L9J00J20j14N1j2k01jKj26O4J68k2
5036hM2R4%o4qj6j25L7L8n8N8P2k6L2M7o2j88Q1K0o5L8M0m9J72Q2r7o1M4j06Q
5066b8O5j08J9O9j7K0oL2q9J9L8n5o9Q9M0o0P5rq4O4O0k4m7P2j21n2J50rj13J42
5096F3%j07N6J2l9P9K7j51m4J50J8p0J37j18j73J99N7j23K8m5j43J23J27q9K1
5121eO3l2q0J81m0k16J71J73j40L6p8j13N1J40j04j33L7j5K6J65k8j46M1L2n9
5146g3M8O0m1j8J57j0r7J00j4j36n7K0r8M1J64o8j4J46q5j16N6L1r2L0N6n2P0
$$ plain form
5173 8 261 186 153 266 8 -227 -24 -16 -145 48 51 -123 46 255 82 -35 -17 -208 -225 45 -8 -24 225 164
5197 164 76 94 55 -212 -151 2 -108 -97 38 -32 8 288 166 -89 -111 -109 -175 37 215 67 70 148 100 -29 57
5222 57 -91 -302 -228 -91 -213 30 281 118 26 34 15 -126 19 13 -94 106 252 108 205 295 31 -60 -59 -356
5246 -356 -412 -217 -135 -25 134 38 -134 -82 138 -19 -74 -22 -159 -31 339 428 309 341 163 -66 -38 -69 -241
5269 -241 -262 -131 -218 -99 -4 -40 -66 36 -75 -248 -141 -39 51 336 432 288 246 252 169 74 75 -138 -319 -248 -246 -197
5295 -197 8 -27 -137 -200 -150 -238 -183 -1 76 10 186 254 150 279 338 111 38 66 -25 -96 50 -11 -156 -72 -164
5320 -164 -329 -209 -97 -116 -18 43 -108 42 239 230 140 88 -11 -69 121 288 122 67 80 -27 -52 -33 -200 -259 -174
5345 -174 -174 -222 -51 109 62 191 151 -45 -67 -1 -39 40 118 89 23 126 159 103 59 -59 -175 -240 -194 -127 -50 59
$$ packed form
5173HK53p5l3J13k58k35K03Qj29J93Lj74J69K09j73j17J8j91j7K70n3j6K49o1
5197A64q8J8l9k67O1J53j10J1J35p0M0K80j22k55k2Ko6K12J78j48LP8m8j29Q6
5222E7j48k11P4J37j22K43K51j63r2Qj9j41J45oj07K00J46j44R7R0k64r1Jk97
5246c56n6J95Q2J10J59r6j72N2K20j57n5N2j37J28L70Q9j19L2j78k29K8l1j72
5269b41k1J31q7J19R5l6k6J02j11j73J07J02R0K85R6j44m2Oq3r5Jk13j81P1KM9
5295a97K05l5j10o3N0q8N5J82P7o6J76O8j04J29N9k27p3K8r1p1J46o1j45Q4r2
5320a64j65J20J12j9R8O1j51J50J97rr0n2r9n8J90J67j66n5J3j07k5J9j67n9Q5
5345a74%m8J71J60m7J29m0j96k2O6l8P9P8k9o6J03L3n6m4j18j16o5M6O7P7J09
$$ plain form
5371 59 87 -3 49 56 17 31 29 -76 -109 -10 30 112 127 83 -40 -30 8 -42 -28 -19 -85 -31 -7 -16 54 157 40 13 -8 -51
5401 -51 -81 32 98 -3 -33 -47 -69 17 7 -18 -15 -17 -40 -50 8 12 67 12 -8 -103 -70 -31 28 3 100 -47 -112 46 -1 4
5431 4 19 -46 -157 -33 75 42 23 38 -20 -24 34 32 -2 17 -23 -37 -76 -24 52 95 127 -15 -41 -65 3 -20 -8 25 -115
5460 -115 -83 69 68 60 37 39 15 -41 -133 -208 -34 -25 17 13 109 24 151 168 84 19 -54 -141 -121 43 31 59 64 127 80 -8 -13
5491 -13 -136 -185 -135 -138 -100 11 169 174 101 71 80 27 -8 -28 -104 -160 -76 -20 69 140 89 49 -4 -110 -121 -62 -128 -33 -22 36
5521 36 53 53 199 131 129 -15 -63 -58 -40 -60 -59 -10 -11 -3 91 19 -37 29 -65 -113 -65 -42 -138 -4 125 -6 67 92 59 87 110
5552 110 29 -31 -98 -17 -67 -44 -49 -49 17 180 68 23 -1 -60 -23 0 -62 -69 -33 87 108 124 87 26 25 51 -20 -155 -126 -164
5582 -164 -67 57 93 23 40 39 19 -56 -74 -146 -87 -20 63 17 120 109 1 57 65 -66 -54 -30 -48 -86 81 104 12 119
$$ packed form
5371E9K8r0N2Pl9J4kj05l3R9M0Q2J5m4j23J0L8n0J4Ro6N4K4rP0J03j17k7k1m3
5401e1l0J13O6j01l0j4k2Q6j0k5Lkk3j0N8MN5n5k0r5L3L9N9k5R7j47o5J58m7N
5431DJ5o5j11J24J08l3j9J5n8mN8kl4J9m0j4l9N2P6M3L2j42k6k4O8k3J2L3j40
5460a15L2J52jqk3Kk4n6r2p5J74RM2mR6q5J27J7q4o5p3q7K0J64j2K8NO3m7q8n
5491a3j23m9N0lL8J11J58Np3l0Rn3l5k0p6n6Q4N6Q9P1n1m0n3j06j1N9o6R5J1N8
5521C6J7%J46o8kj44m8NJ8k0JM9jQR4p2n6O6r4m8M8K3r6J34J29j31P3K5l3K8K3
5552A10q1o0o7Q1n0K3n%O6J63j12m5k4n9L7K3o2pL6J20K1J6l7o1jK6p1j35K9l8
5582a64R7J24L6p0J7jk0p5j8p2N9O7Q3m6J03j1j08N6Qj31J2K4j8l8J67K3r2J07
$$ plain form
5610 119 56 -41 64 50 -77 -34 37 -75 -28 111 -11 -59 -5 41 -96 -42 30 -54 70 159 -5 -3 16 -72 -57 74
5636 74 -39 -85 59 40 24 133 46 -108 -78 -23 -49 -22 -10 -7 26 164 110 -24 87 -45 -89 -44 -12 -57 -59 154 83
5663 83 56 144 10 -58 -57 -70 -145 -122 -17 -37 16 124 97 18 140 -7 -175 -35 34 -114 -3 2 9 124 252 104
5689 104 4 25 -78 -135 -25 -124 -201 25 100 28 174 199 -31 3 76 -49 -134 -23 -52 -25 138 113 30 143 71
5714 71 19 -14 -25 -243 -216 -8 1 -41 170 87 -15 133 107 6 -41 -67 -106 -59 2 -7 59 99 82 7 87 8 -122 -108
5742 -108 -83 -139 -99 16 -11 -34 172 214 7 26 -2 -193 -112 -27 -62 -77 26 9 84 232 120 -85 -17 -76 -176
5767 -176 -48 13 -154 -13 162 102 99 60 28 -66 12 -22 -122 -30 -14 3 56 138 -67 -6 62 -49 -84 31 -56 -122
5793 -122 30 11 38 16 48 -42 -13 25 -59 -27 23 -70 -116 56 69 -86 17 117 -51 -52 130 8 -79 -14 -23 -32 39
$$ packed form
5610A19o3r7J05j4j27M3P1j12M7J39j22m8N4M6j37N4P2q4J24Q9j64KJ9q8J5J31
5636G4j13m6J44j9j6J09q7j54L0N5k6K7J2LL3J38n4j34J11j32m4M5L2m5kK13p1
5663H3k7Q8j34o8Jj3p5K3J05k0N3J08k7p9J22j47j68J40O9j48J11NPJ15J28j48
5689A04j00K1j03n7J10r9p7K26P5p2J46K5k30L4P3j25q5J11k9K7J63k5q3J13p2
5714G1n2l3j1k18K7K08Rm2K11q3j02J48k6j01m7k6l9M7O1rO6M0j7p5Q0p9j30J4
5742a08K5n6M0J15k7k3K06M2k07J9k8j91Q1Q5l5j5J03j7P5J48j12k05O8n9j00
5767a76J28O1j67J41J75o0ll9l2r4P8l4j00R2J6J7N3Q2k05O1O8j11l5J15q7o6
5793a22J52j9K7k2L2r0K9L8q4L2N0r3m6J72J3j55J03J00j68jJ82j22q7O5rrP1
$$ plain form
5820 39 44 -50 37 66 -3 -6 -12 -101 -67 92 21 -82 34 10 -79 54 100 -60 -33 20 20 25 28 -104 -14 5 11 -77 56 39
5850 39 -39 57 98 -65 17 53 -61 -66 10 -3 -55 -17 -5 8 15 -1 -53 -4 -26 -151 -164 57 -9 16 181 195 103 124 72
5879 72 43 -110 -107 -22 -129 -82 -64 3 5 63 -79 -82 -84 -140 -70 -66 -104 -45 186 204 158 272 234 56 56 23 -108 -172 -131 -131
5909 -131 -89 -17 -38 -42 -17 -12 -171 -70 -109 -144 -1 151 95 175 213 219 148 224 125 -30 -69 -86 -147 -118 -87 -69 -34 -80 -175
5938 -175 -64 -10 -75 -62 -26 25 -7 96 207 209 230 226 159 107 17 -52 -36 -69 -194 -151 -114 -104 -149 -64 13 -115 -150 -51
5966 -51 -76 -51 55 60 107 145 230 199 191 123 53 24 -76 -136 -136 -87 -101 -146 -50 -9 -59 22 16 -67 -111 -53 18 36 149 167 137
5997 137 131 41 58 103 -36 -101 -47 -150 -140 -104 -8 -49 -68 -40 -15 -56 -53 17 46 -45 -38 18 139 90 125 56 -16 -32 -89 -4
6027 -4 -31 -80 14 -3 -14 -10 57 43 -8 -11 -19 -9 5 37 93 16 20 -67 -53 13 -23 47 -16 -2 -66 36 32 18 47 41 -34 -64 36
$$ packed form
5820C9Nr4Q7K9o9loq9L4J59p1j03J16k4q9J33M6j60K7N3%NLj32R0J9Oq8J33j7
5850C9p8R6M1j63Q2L6j14nP6j3n2L8J2J3Pj6n2M9k2j25j3K21o6K5J65J4r2K1n2
5879G2k9j53LQ5j07M7J8O7KN8j42lkn6P0Ml8N9K31J8m6J14l8j78%l3j31o4M1%
5909a31M2P2k1mK5Nj59J01l9l5J43J52n6Q0L8Op1P6r9j55l9j7o1K9L1J8L5m6r5
5938a75J11N4o5J3L6N1l2J03J11KK1mo7n2r0o9J6l3j25M3L7J0m5Q5P7j28l5R9
5966e1k5K5J06NM7L8Q5l1qo8p0k9j00o0%M9j4m5R6M1n0Q1oq3m4N8P1J8J13J8l0
5997A37or0J7M5j39o5N4j03J0L6R6m1j9K8K5m1LP0K9r1PN6J21m9L5o9p2j6n7Q5
6027dk7m9R4j7j1MO7j4n1lqJ0J4L2N6p7Mq7J4O6l6P0o3J4o4J02mj4K9op5l0J00
$$ plain form
6060 36 51 75 83 25 -32 10 -61 -32 -1 17 -142 -74 33 -33 22 138 51 13 33 38 -6 54 72 0 48 -84 -36 57 97
6089 97 52 -49 -138 -167 -88 61 -21 -33 -4 21 -1 90 86 40 39 -41 -66 -69 15 25 52 76 12 -36 7 73 44 -25 -25 -112 -110 10
6121 10 57 28 60 50 -15 -7 14 -30 23 -56 -110 -72 -19 -54 58 117 -17 -155 -1 29 -7 42 8 -42 -20 29 25 73 75 -76
6151 -76 -92 22 -61 -130 19 42 -111 42 42 -80 59 151 28 -15 0 -17 -33 102 43 64 10 -21 -92 -25 28 -15 -69
6178 -69 -18 -45 -142 30 105 4 -41 32 -30 23 86 -7 -42 48 -42 -37 55 16 -35 72 26 -103 -16 -19 -16 -25 92 -65 -115
6207 -115 43 26 18 123 48 -95 19 50 32 76 27 -82 -107 92 23 -12 96 5 -115 3 16 -104 -14 48 -37
6232 -37 -10 101 -50 -19 51 71 -70 -35 -15 -51 16 22 -5 40 27 -17 -45 54 66 -118 -23 -48 -58 37 125 -39 -57 -39
6260 -39 -73 -22 25 30 -135 -39 -4 -37 38 92 -32 -60 87 -8 0 45 -11 -94 70 16 -91 -35 77 8 54 66 -60 -90
$$ packed form
6060C6J5K4Qn8n7M2p1K9L1J8j59O8J07o6N5J16q7l8K0Nm4O0J8p2M8j32M8R3M0
6089I7m5j01q9k9P9J49q2j2K9K5k2R1mm6jq0k5lQ4J0K7K4o4m8M3O6k9o9%q7KJ20
6121A0M7k9L2j0o5QK1m4N3p9n4L8N3l5J12N9j34j38J54L0l6M9l4n0K2M9mM8Kj51
6151g6j6J14q3o9J49K3j53J53%j22J39R2j23m3J5j7j6J35n9K1n4l1p1O7N3m3n4
6178f9N1k7r7J72P5j01m5P3o2N3O3r3l5R0r0NR2l9n1J07m6j29Q7lLrJ17j57n0
6207a15J58j7qJ05p5j43J14L1j8M4m9j09k5J99o9l5J08r1j20J18J3j20R0O2q5
6232c7K7J11j51L1P0K0j41L5K0l6O7Ok7M5j3m4k8R9J2j84R5k5j0R5Q8j64j8J8
6260c9l4N1M7Nj65R6L5l3P5N4j24k8J47r5QM5n6q3J64n4j07N6J12o9M6J2j26l0
$$ plain form
6288 -90 40 0 -57 18 -33 -53 103 106 -61 45 74 -24 3 34 -53 18 37 -59 -30 -21 -29 -97 -5 4 -49 -35 16 -22 -28 33 14
6319 14 1 68 16 3 58 31 -65 -33 55 -37 29 34 -11 -80 -2 -7 -80 13 24 -87 -49 75 -32 37 61 -17 -35 119 -16
6348 -16 -54 1 68 -20 38 19 -23 -19 29 16 -49 94 1 -117 2 -37 -58 31 71 34 61 70 -43 -21 73 -48 -3 0 -37
6377 -37 -49 54 -18 -46 -31 9 4 -50 -33 -46 -33 36 14 15 25 35 22 39 91 -93 -70 10 -46 -22 44 -2 5 34 61 -18 32
6408 32 -25 -20 -54 -6 -39 -6 110 39 -15 41 0 15 16 -7 -28 -104 20 -30 -53 41 35 -23 -50 -23 -80 10 -1 -1 -2 6 -26 -46
6440 -46 104 -16 59 26 -7 -32 57 77 35 49 -8 -70 -34 54 -19 33 66 41 -1 -13 49 -52 10 3 -79 -44 17 72 17
6469 17 45 -26 -24 32 81 23 62 9 -111 -53 17 -20 42 8 5 20 -74 -50 22 68 27 -53 -15 33 57 80 40 -6 10 -45 4
6500 4 -18 -69 -18 10 -28 -43 -26 6 79 62 -14 -23 -77 -7 77 65 -18 39 -3 -26 38 46 -32 -39 -78 -78 -66 14 45 19 72 0 -29
$$ packed form
6288i0J30m0n7P5n1k0J56Lj67J06K9r8K7L1q7P1J9r6K9Rqo8R2Rn3J4N1l8oO1j9
6319A4j3O7n2j3N5k7r6L2Q8r2O6Nm5o9P8np3R3J1j11L8J24j07O9K4p8j8J54j35
6348a6l8N5O7q8N8j9m2MM8j3o5J43r3j18J19l9k1Q9M0l7K7Rj13K2R4j21M5Ll7
6377c7j2J03p2k8J5M0nn4J7j3J3O9k2JJ0J0j3J7N2j84K3Q0n6K4O6m6PK9K7p9N0
6408C2n7Nl4M8l3L3J16p1n4N6m1J5Jk3k1p6J24n0k3R4on8k7K7n7R0j1%jQl2k0
6440d6J50j20P5l3l3k5Q9K0m2J4n7o2L6Q8p3N2L3k5m2j2O2j01O2pq2L5O1N5n5
6469A7K8p1KN6M9n8L9n3j20N8P0l7O2l4lJ5r4K4P2M6m1q0L8M8K4K3m0m6J6n5M9
6500Dk2n1N1K8l8j5J7L2P3j7p6rn4P0Q4j2q3N7m2k3O4Qp8pl9%J2Q0L1k6N3p2k9
$$ plain form
6533 -29 -48 58 -42 -29 -49 -7 -1 43 128 81 22 5 -119 -51 -16 19 -115 -8 -3 -51 -17 27 14 29 -1 -41 -6 33 77
6562 77 107 123 42 -43 95 65 26 62 -33 -99 -68 28 -72 -19 2 -112 -93 -35 -85 -1 86 112 43 98 52 65 60 105 45
6591 45 -6 29 -21 90 78 39 -59 -107 -160 -90 -95 -9 13 42 33 67 72 127 56 19 45 -44 -63 64 76 67 59 18 -44 -88 34
6622 34 -101 -124 -26 -122 -91 2 62 147 88 79 -61 -47 6 29 40 73 45 -80 61 114 28 -97 -57 -129 -135 -35 0 30
6650 30 44 64 14 35 -14 -81 9 19 -83 -2 45 -42 53 105 -16 -131 -46 -73 -39 57 70 -53 42 69 -11 46 71 -46
6678 -46 -71 -22 -57 -13 49 59 14 1 -62 -89 -17 -24 -14 -4 9 39 98 125 112 74 -25 -28 -48 -66 26 32 47 85 13 -81 35
6709 35 22 -104 -79 -120 -191 -59 98 107 77 149 30 12 107 32 -49 44 7 -46 36 41 54 -46 3 -117 -184 -52 -106 -93
6737 -93 26 10 -13 50 120 38 69 75 -25 12 97 -8 29 129 -11 -95 -59 -68 -117 -50 29 -55 -67 -51 -13 -42 100 -16
$$ packed form
6533b9j9J06j00J3k0M2OM4Q5m7n9j7j24O8L5L5j34J07Nm8L4M4j3J5l0m0L5L9M4
6562G7L0J6q1q5J38l0l9L6r5o6L1R6j00N3K1j14J9N8n0Q4Q7K6o9N5m6J3nM5o0
6591D5n1L5n0J11j2l9r8m8n3P0nQ6K2K9rL4NN5p1l7K6q9j9J27J2rqm1o2m4J22
6622C4j35k3R8r6L1R3O0Q5n9rj40J4N3K3J1L3k8j25J41N3q6j25M0p2oJ00L5L0
6650C0J4K0n0K1m9o7R0J0j02Q1M7q7R5N2j21j15Q5k7L4R6J3j23R5K7q0N7K5j17
6678d6k5M9l5M4O2J0m5j3o3k7P2pJ0J0J3L0N9K7j3l8r9lk0j8R2OJ5L8p2r4J16
6709C5j3j26K5m1p1J32J57Rl0P2j19j8R5p5q1R3l7n3Q2NJ3j00M9j20o7J32n4J3
6737i3J19j6k3O3P0q2L1Oj00L7Q5j05L7J00j40q4L6rm9O7P9q4j2J6L8k9J42j16
$$ plain form
6765 -16 26 35 61 48 119 104 -15 67 48 -64 -43 -70 -44 -29 16 -57 -1 20 91 -17 -41 -4 -107 -31 135 93 2 69
6793 69 -20 11 59 86 -69 -30 -59 -117 -59 7 15 -12 91 -16 -97 -39 -15 -63 3 -32 -72 10 66 0 1 52 10 -66 6 -27
6823 -27 -74 9 93 -19 8 19 -15 46 87 -37 0 -25 37 -4 35 -9 -49 29 44 41 15 100 -42 -2 -33 -39 -65 15 82 -14
6853 -14 25 50 -29 38 37 13 -18 -64 -1 -2 -9 106 -41 50 49 -28 4 -3 -28 -19 30 32 -19 81 5 32 -30 -59 -92 3 15 -14
6885 -14 19 12 38 4 -11 -35 -58 25 -26 -44 44 54 -19 10 70 -80 -122 -88 -64 -34 -76 90 54 70 40 67 12 37 -80
6914 -80 -115 -2 36 -27 65 56 58 50 10 -114 -92 -84 -146 -61 -4 55 -12 124 106 -45 21 -99 -134 -24 3 -2 81 134 28
6943 28 15 22 -78 -143 -135 -55 -100 -69 43 67 88 185 93 -6 -6 -67 -54 8 48 45 112 115 10 31 -4 -73 -164 -126 -142 -96 54
6974 54 61 8 17 -33 -45 -51 -8 -54 15 63 79 82 81 36 28 -8 -50 -96 -88 -17 2 33 57 35 10 -43 -32 -72 -25 -27 41 69 130 72
$$ packed form
6765a6M2RK6j3P1j5j19Q2j9j12K1k7K6J5M5p3N6K1P1j08k4L7j03P6J66m2r1O7
6793F9q9L1M8K7j55L9k9n8N8O6Qk7J03j07q1N8K4m8O6l5m0Q2N6o6JN1m2p6P2l3
6823b7m7Q3Q4j12K7J1l4O1M1j24L7k5O2m1L9m4m0P8J5lk6Q5j42M0l1ok6Q0O7r6
6853a4L9K5p9O7jk4l1m6O3jpJ15j47R1jp7L2pk5RM9Kn1J00p6K7o2k9l3R5J2k9
6885a4L3pK6l4j5k4k3Q3n1j8Q8J0p3K9O0j50m2L4K4L0m2J66l6J6l0K7n5K5j17
6914h0l5J13L8o3R2rKqm0j24K2Qo2Q5N7N9o7J36j8j51O6j20l5J10K7nQ3N3j06
6943B8j3Pj00o5QQ0m5L1J12K4K1R7r2r9%o1J3O2M0lO7Lj05K1l5o9r1L8j6M6J50
6974E4Pn3Rn0j2oM3m6O9M8J6Ljm5ql6m2m6QP1J9L1K4k2k5n3J1m0M7kO8K8O1n8
$$ plain form
7008 72 55 83 18 -75 -92 -69 -85 -65 50 18 76 24 14 -63 -35 -120 -118 -50 -4 -3 96 126 49 98 -10 -126 -97 -52 -100 -7
7038 -7 43 95 22 58 53 -67 -37 -111 -130 -78 -21 28 56 102 86 32 13 -29 -116 -58 -48 -7 -34 37 30 83 87 -35 -49 -56 -83 -92
7070 -92 -14 -16 -8 59 57 41 -17 9 -75 -20 -16 -8 -30 78 77 31 32 -9 -114 -69 9 -102 -48 1 65 71 63 19 -34 -64 -25 -131 -69
7103 -69 16 -10 30 20 -37 64 18 3 -9 -55 -22 -37 61 39 46 15 -8 -81 -23 -31 -83 15 7 15 15 -8 15 8 -4 14 -31 10 27
7136 27 -34 -21 25 34 30 63 36 -1 -26 -26 -15 -61 16 -22 -30 -15 42 57 77 21 -41 42 13 -20 -49 3 -22 14 67 38 -22 54
7168 54 6 17 -4 23 -71 30 4 28 77 9 -14 57 123 -5 -30 -3 -20 -39 15 61 -9 -7 67 -43 -11 -10 -56 0 -7 -20
7198 -20 -31 43 110 -2 55 16 -24 30 72 -34 -45 6 -6 -66 -41 -27 -28 -27 -25 -41 12 50 75 21 43 9 31 30 21 16 29 8
7230 8 -54 -4 63 48 -36 -47 -116 -77 -42 -12 -21 86 19 15 21 20 -5 -44 -25 -37 -20 92 99 25 112 124 -22 -48 -10 -119 -94
$$ packed form
7008G2j7K8o5r3j7K3j6K0J15l2N8n2j0p7K8q5KO8M6JR9L0p7M9j08j16K9M5m8R3
7038gN0N2p3L6nj20L0p4j9N2N7M9K8M6j6n4j9m2q7N8J0M1k7P1pN3Mj22j4pk7r
7070i2P8kQO7kj6n8K6q4N5MQk2J08jm6Jm1j05M5P8j11N4M9O4Oqm4n3l0L9j06O2
7103f9Q5k6M0j0n7J01m6j5j2m6L3j5R8k2Pl1k3p3N8qn2R8qQ%k3K3pj2J8m5M1J7
7136B7o1J3M6RmL3k7l7k5%J1m6P7l8qJ5N7J5K0n6o2Q3k9l3k9N2k5L6N3k9o0P6
7168E4m8J1k1K7r4J01k6K4M9o8k3P1O6j28k5K7j7j9N4M6p0KP4j10L2Jm6N6pj3
7198b0j1P4O7j12N7l9m0N4M2j06j1N1j2o0K5J4jJKj6N3L8K5n4K2l4K2jrnJ3k1
7230Ho2N0O7j5q4j1o9L9L5L0rJ07o7mOjk5l9J9j2J7J12Pp4Q7J2j46k6L8j09K5
$$ plain form
7261 -94 -27 8 27 63 -3 -5 57 23 -111 -65 -23 -37 45 34 21 -16 110 91 -15 -31 -46 -87 -29 1 -21 37 28 19 70 22
7291 22 -77 -31 10 -32 -5 68 119 23 50 111 -19 -88 -126 -108 -68 69 25 52 108 -6 -55 41 -23 -70 -104 15 -71 12
7319 12 155 91 48 30 -98 -153 -119 -62 -43 3 104 25 88 70 43 17 30 -7 -75 -72 -18 41 88 110 -43 -68 -53 -69 -88
7348 -88 -74 -149 -48 -73 42 62 138 84 41 -10 -1 -4 -27 69 62 1 114 45 -33 14 -3 -78 -134 -109 -118 -35 20 38 17 46 13
7379 13 2 69 106 -78 62 101 -17 -3 65 36 -17 13 -68 -102 -28 -32 1 -24 -57 -81 -25 19 -18 -18 15 17 21 96 94 71 3
7410 3 45 -44 -60 -30 -22 3 24 -38 -45 1 -29 3 -45 -60 -136 -5 2 120 81 134 81 20 48 22 -19 -2 -52 -45 -7 -14 25 44
7442 44 48 -41 -51 -85 -67 -58 -29 19 -1 63 115 51 72 48 0 -42 -34 -85 0 -32 5 96 22 -8 -10 13 16 -47 5 -29 5 -33 70
7475 70 66 -7 -52 20 -46 -9 35 46 72 -6 -59 -27 0 7 19 40 -75 -106 -27 11 24 -17 -26 -14 17 -4 47 33 53 -45 -36 -16
$$ packed form
7261i4O7L5J9L6o6kO2l4j34M6M2j4Q2j1j3l7J26j9j06j6j5m1N8L0k2N8rrN1m8
7291B2r9M6M1m2K7P3N1r6K7O1j30o9l8J8M0J37m4K7N6j14m9R6o4m7l4J19q6Q3
7319A2J43o4m3j8j28n5L4N7J9M6J01p9O3j8k7k6J3l7o8LN4N9M7K2j53k5J5j6j9
7348h8J4p5J01k5J15K0P6n4m3n1Rlk3R6po1J13o9p8M7j7p5n6K5rQ3N5J8k1K9l3
7379A3j1O7L7j84J40L9j18J4O8k9n3L0q1l4P4mL3k5l3k4N6M4l7%L3KMP5kk3o8
7410CM2q9j6L0QK5K1o2pM6l0L2m8j5p6J31PJ18l9N3n3o1K8k6m1J7n0PL8pL9J9
7442D4Mq9j0l4J8RK9M8k0O4N2o4K1k4m8m2Qn1Q5l2L7R1p4l0kK3Lo3N2l4L4l8J03
7475G0mp3m5P2o6L7M4J1K6p8n3L2K7PJ2K1j15l1P9L8J3m1rJ2L1k1N1j4K0r8RK0
$$ plain form
7507 -16 33 42 25 10 -32 -58 2 14 18 46 6 -28 -4 1 50 -19 9 -37 -52 -19 -10 16 79 23 -29 36 74 -57 -31 55 2 -31
7539 -31 16 -43 61 49 60 -8 32 -47 -33 2 -27 -20 34 -5 36 76 90 96 -1 8 -29 -49 -6 10 -49 -25 -29 -2 -3 50 27 20 -29
7572 -29 -44 3 35 36 36 49 47 35 5 62 -17 -9 -42 -50 -93 -42 15 20 44 16 -17 -26 5 -27 22 47 29 -26 38 63 43 64 24 -33
7606 -33 -17 -64 -79 -46 8 -46 -82 -32 -36 8 44 70 8 14 48 34 66 73 -40 55 67 9 54 19 53 -20 -14 -26 -39 -54 -14 -44
7638 -44 -11 6 4 54 21 58 10 -5 -20 -18 34 66 -19 10 115 43 40 -8 -2 -41 -31 -37 -97 -89 52 4 36 73 56 14 72 -4
7670 -4 -14 -37 1 -41 3 5 75 74 5 36 -61 -20 -93 -75 22 6 -46 39 23 8 41 92 -4 -64 -16 -65 36 47 48 12 25 23
7702 23 28 17 22 -33 -8 66 -49 62 86 53 -29 -29 12 -90 -13 -7 7 8 -5 -35 -25 32 -62 -21 30 19 -2 -14 85 49 -24
7733 -24 14 -39 -47 -17 -47 -11 -2 -66 -42 -7 42 -6 19 -6 -112 -66 1 -73 -2 73 -21 46 91 66 7 -43 -67 -112 -40 -5 10
$$ packed form
7507a6M9Rj7j5m2k6O0J2MK8m0l4K4NM9o9K8m6j5L3RK6O3n6n2O5L8j31K6Q6n3l3
7539c1M7n9J04j2J1o8M0p9J4L5k9PN4l9M1M0J4Or7Rl7k0M3J6n9K4mK7jN3k3pm9
7572b9j5M7L2J%J3kj2l0N7p9Ql3qm3N1N7NK4k8l3rL1l2M9K5j8n5O4K5k0K1m0n7
7606c3J6m7j5L3N4n4l6N0mM4L6K6o2OL4j4L2Pj13R5J2n8M5l5L4p3Oj2j3j5M0l0
7638d4L3J7kN0l3L7m8j5j5KN2L2q5K9J05p2lm8Ol9J0oo0QJ41m8L2L7j7m2N8p6
7670dj0k3L8m2M4KP0jo9L1r7M1p3J8R7j6n2Q5j6j5L3N1r6o0M8m9J01J1Jl6J3k
7702B3Nj1Nn5K5P4j15J11K4l3q2%M1j02P7OJ4Jj3l0J0N7r4M1N1j1k1j2R9l6p3
7733b4L8n3qL0l0L6Ro4K4L5M9m8K5k5j06M6O7p4P1P5r4O7M5k5n9n0k4m5P2L5J5
$$ plain form
7764 10 -31 66 19 -33 44 -38 -51 -23 6 -74 43 0 9 -42 63 -62 1 44 17 7 -5 -30 -47 -58 -5 7 -2 -17 -31 -1
7794 -1 -9 -20 -24 16 -25 -39 13 101 0 85 72 14 35 38 -18 -47 -14 27 -23 -5 27 -10 3 43 -34 -57 -1 -66 -11 -7 -16 -19 44
7827 44 31 -31 -3 28 45 -15 81 -54 -20 22 14 -2 -28 40 30 17 -3 -44 -19 -8 16 -26 28 -17 -34 71 62 14 36 0
7857 0 -27 15 3 -1 -62 23 6 -1 4 14 -35 6 -4 -49 -45 -5 0 -7 63 -22 27 11 22 1 -1 -20 -29 19 -32 -5 -28 -5 34 22 12
7892 12 -5 -68 39 6 -33 -8 46 4 13 38 -23 -55 -3 -39 -43 -11 -8 -55 44 -8 -50 -43 43 -16 -14 63 -25 -29 46 34 -21 -2 21
7925 21 -64 -19 -60 13 15 36 21 -15 -27 -27 -34 -11 18 -54 -29 16 -8 -4 53 1 -13 6 38 0 -49 -13 -34 31 52 -10 55 38
7957 38 -52 -10 -19 43 -49 6 -10 -57 2 14 20 57 72 18 -44 71 -37 20 31 -13 -26 -21 8 2 -28 2 -10 -31 0 -35 -10
7988 -10 21 1 -30 27 30 -24 -16 22 -16 11 5 43 12 46 30 -43 -49 -8 -99 -49 -57 -4 -1 -26 -17 -47 -9 -33 4 20 29 -12 18 41
$$ packed form
7764A0m1R7m7n2P7q2j3K8K9q0J17m3Rn1J05j25O3M3k7j0j2k5j7j1N3J2rj5j4L0
7794aqj1mM0m1j4N2Q8j01Q5j3n8K1Ln6k9L3M1n0J8L2l7J3M0p7k3N6o5N5MrlO3
7827D4j3o2K8L1J7o0R6j35L4M2qj6k6O8j0j3k0m1K5J1K4m2N4m5j7J05rm8K2l6
7857@k7M2j2mo1Q5j7pNJ0m9M1j0m5MM0NpP0q5M9j6J1k1kj9rM8n1K7k3K3L9j2j0
7892A2j7o3J07l3l9K5N4m2RK5o1l2N2l6mL2Lm7R9n2m2PQ6n9KP7q8mP5j2n5J9K3
7925B1q5M5m1P3KK1j5l6j2%pK3K9p2K5M5k4MN7n2j4J9L2l8m9L6k1O5K1o2O5j7
7957C8r0M2rO2r2N5j6m7N9J2OL7J5n4o2J15j08N7J1m4j3NK9ol0L0j2k1L1l5K5
7988a0L1k0l1N7Ln4QL8l8K7oL8l1L4j6p3oM1r1N0qN3Lk5Rl0L8k4L7J6Rm1L0K3
$$ plain form
8022 41 -14 12 24 7 24 -44 2 -33 -27 -40 -75 -38 -37 -37 -101 40 50 18 -11 -33 4 95 -22 52 82 31 36 32 -16 16 -12 -38
8054 -38 -30 -109 -50 -37 -11 -44 42 2 23 21 8 25 -10 -8 33 94 52 -7 4 15 3 -36 8 -94 -87 -23 -61 -17 6 -39 1 -2
8086 -2 -18 -4 23 20 2 51 15 25 -9 19 20 38 36 -4 28 1 36 -27 43 21 -39 -44 22 -1 19 22 63 -44 -37 -13 13 62 -24
8119 -24 -29 -50 -24 -13 1 2 -68 2 -6 -35 -51 52 5 -7 30 35 -44 -40 37 -19 32 34 -32 -18 -19 -11 -3 -13 39 -23 71 32 12 27
8153 27 65 -33 -66 8 -26 -42 3 17 -5 21 3 -11 -9 -41 -80 -29 -8 -5 17 0 23 51 49 34 -38 14 5 -14 10 -43 -19 2
8185 2 -34 26 -3 -2 -34 -30
$$ packed form
8022D1n5K6J2j7J7o8M6l5Oj3l5L7J%o4J41J0l2k9k2L7R1j17P4L0n1Nmm8L2k8k6
8054c8Qp9N9J3K6l3Q6m0K1kj3J7l5KM1O1m2n9J1J1j2l9M4j02PO4l8M4K3m5M0l
8086bj6J4K7lj8M9l6J0l4K8JJ8km0L2k7L5o3P0k2o0nO6k3K0LM1j07PK4K6M9q6
8119b4nk1K6J1J4Jp0P0qk9j6J03m7j2L7Np9MP7n6N1Ko6J4jQQj0N2o2R4l9k0J5
8153B7L8r8l3P4l4j6M5J4k2K6j8j4Kl2l9N1K1LK2j7K3K8kj5p2N2rj9K4n3K4K1
8185Bl6O0k9Jl2M
8191c0
$$ Imaginary data points
##PAGE= N=2
##DATA TABLE= (X++(I..I)), XYDATA
$$ plain form
0 0 0 0 0 0 0 0 0 0 0 0 0 1 -8 8 -8 8 -16 16 -17 24 -25 33 -40 48 -57 64 -73 86 -99 113 -130 147 -168 189
34 189 -214 242 -272 305 -341 380 -422 470 -521 578 -640 706 -779 861 -946 1044 -1151 1269
52 1269 -1398 1539 -1702 1885 -2090 2325 -2598 2922 -3307 3778 -4367 5128 -6162 7648 -9974
67 -9974 14173 -24153 100395 -22132 -256718 -153740 -60302 31781 2834 -97242 -113767
78 -113767 11028 47325 30059 42876 40267 -24460 -78197 -145295 -142064 3231 155747 167455
90 167455 115469 45765 -12276 3162 64109 57750 -7827 -80398 -132262 -120950 -24175 71528
102 71528 96146 51687 -39744 -120370 -104344 -16343 45923 50410 23112 -25580 -52459 7723
114 7723 104218 120056 68740 8519 -64975 -92686 -18721 55459 53951 24418 -27522 -93909
$$ packed form
0@%%%%%%%%%%%JrJ6j6J6k4L2l3M1m9N8p3Q8j05J21j37J59j85K12k43K77l15L57
34A89m03M56n14N77o46P21q02Q92r91J099j218J346j485J640j807J990k195K420
52A269k667K937l241L587l975M415m923N520o229P085q145R495j1290J3810j7622
67i974K4147l8326J24548j22527k34586J02978R3438R2083k8947j00076j6525
78a13767J24795L6297j7266J2817k609o4727n3737o7098L231J45295J52516J1708
90A67455n1986o9704n8041J5438O0947o359o5577p2571n1864J1312R6775R5703
102G1528K4618m4459r1431q0626J6026Q8001O2266M487k7298m8692k6879O0182
114G723R6495J5838n1316o0221p3494k7711P3965P4180j508k9533n1940o6387
$$ plain form
126 -93909 -84456 -13473 20814 34690 36150 -27598 -71516 -16296 38999 57419 75804 26805
138 26805 -73034 -84746 -17424 40332 86884 86314 4779 -60443 -52331 -24500 14541 40851 -9008
151 -9008 -69500 -59658 -27014 17481 87050 93519 17471 -40759 -58268 -57733 -11132 48251 41998
164 41998 -3242 -27502 -30259 41 55638 66510 18085 -36471 -71946 -70893 -16677 47641
176 47641 61743 30641 -5595 -31383 -32591 6702 47443 37362 -7982 -46756 -58707 -29440
188 -29440 29143 63209 41045 -9540 -50729 -54201 -7113 43590 46666 21468 -10504 -43448
200 -43448 -34644 14547 37869 25545 7532 -21497 -44122 -19927 25934 45315 37644 2707
212 2707 -48798 -62362 -28941 9063 38568 40456 -1404 -32590 -13735 17482 35653 39832 8225
$$ packed form
126i3909R453P0983L4287J3876J460o3748m3918N5220N5295J8420J8385m8999
138B6805r9839j1712O7322N7756M6552n70q1535o5222Q112K7831L9041K6310m9859
151i008o0492R842L2644M4495O9569O469p6048n8230j7509N35M6601N9383o253
164D1998m5240k4260k757L0300N5597J0872m8425n4556l5475J053N4216O4318
176D7641J4102l1102l6236k5788j208L9293M0741j0081m5344l8774j1951K9267
188b9440N8583L4066k2164n0585m1189l472M7088N0703L076k5198l1972l2944
200d3448Q804M9191K3322j2324j8013k9029k2625K4195M5861J9381p671l4937
212B707n1505j3564L3421L8004K9505J888m1860l1186J8855L1217J8171M179l1607
$$ plain form
225 8225 -45276 -62254 -33390 5643 39893 50935 22855 -12735 -24923 -15921 8272 25131
237 25131 7523 -27634 -45529 -35531 -1650 41156 60051 36423 -4005 -28084 -29630 -13047
249 -13047 7701 10275 -7609 -27680 -29991 -6541 29035 52008 44875 11643 -24999 -43311 -31024
262 -31024 1571 19298 8291 -10101 -18281 -8610 19841 45806 40904 5904 -30816 -48611 -43600
275 -43600 -19059 8287 19677 14514 2890 316 14661 30330 31108 14307 -18340 -49250 -50861
288 -50861 -19817 17575 36791 34324 16829 -2431 -6273 2006 4054 -8082 -28607 -41916 -35567
301 -35567 -11500 21080 46669 48706 27824 -735 -19678 -21498 -12336 -2679 -2732 -12131 -15407 -2119
315 -2119 21589 38527 32995 8152 -20588 -38657 -35680 -16568 2685 11761 10090 5508 4785 7704
$$ packed form
225H225n3501j6978K8864L9033L4250J1042k8080l5590j2188R002K4193J6859
237B5131j7608l5157j7895R998L3881M2806J8895k3628m0428k4079j546J6583
249a3047K0748K574j7884k0071k311K3450L5576K2973p133l3232l6642j8312J2287
262c1024L2595J7727j1007j8392q180R671K8451K5965m902l5000l6720j7795N011
275d3600K4541K7346J1390n163j1624k574J4345J5669P78j6801l2647l0910j611
288e0861L1044L7392J9216k467j7495j9260l842Q279K048j2136k0525j3309O349
301c5567K4067L2580K5589K037k0882k8559j8943j820R162R657n3r399l276J3288
315b119K3708J6938n532k4843k8740j8069K977J9112J9253R076j671m582p23K919
$$ plain form
329 7704 13860 16477 6517 -12107 -26030 -23682 -6221 14080 26272 21066 1463 -13977 -14264 -5071
343 -5071 2922 3016 -2496 -7918 -8653 -589 10518 14021 7651 -3224 -12515 -16077 -9170 7790 19874
358 19874 17507 6954 -5486 -12794 -8828 -1352 471 -3972 -9124 -7123 4236 16558 19941 13120
372 13120 966 -13455 -21891 -17687 -8853 549 10975 13934 9545 6961 6369 4945 1781 -6907
386 -6907 -18989 -23134 -13808 1615 15212 22353 17449 5982 -983 -4845 -8839 -10465 -10076 -8038
400 -8038 -4028 1876 8964 13067 13118 9331 -630 -11075 -14807 -11971 -4054 4532 6384 3988 4850 5759
416 5759 2317 241 -1687 -8887 -8981 231 1781 1736 8753 7465 614 41 -5431 -13370 -7204 1838
432 1838 2329 6707 10576 3626 2603 6188 -5439 -14747 -9293 -9093 -6098 9123 12174 6347 12213
$$ packed form
329G704O156K617r960j8624j3923K348J7461K0301J2192n206j9603j5440k87R193
343e071P993R4n512n422p35Q064J1107L503o370j0875r291l562O907J6960J2084
358A9874k367j0553j2440p308L966P476J823m443n152K001J1359J2322L383o821
372A3120j2154j4421q436M204Q834R402J0426K959m389k584n92j424l164q688
386f907j2082m145R326J5423J3597P141m904j1467o965l862l994j626L89K038
400h038M010N904P088M103N1l787r961j0445l732K836P917Q586J852k396Q62R09
416E759l442k076j928p200r4R212J550m5P017j288o851n73n472p939O166R042
432A838M91M378L869o950j023L585j1627r308N454K00K995J5221L051n827N866
$$ plain form
447 12213 12612 -144 -6409 -11373 -21893 -16917 -193 5085 9322 17822 13634 6888 7375 -1307 -13857
462 -13857 -15985 -16580 -15625 -3535 10068 16308 20314 19087 6779 -5187 -9615 -14678 -17761 -12211
476 -12211 -5849 -1509 7778 17578 17284 11988 9571 -159 -17018 -20644 -15391 -12758 1603 17875
490 17875 11542 3401 9755 8688 3369 6339 -5578 -26913 -20775 -3238 1158 12059 18217 1134
504 1134 -2774 8522 449 -6692 -74 -7510 -12628 2151 3065 -4925 8233 15437 4498 4745 530
519 530 -17913 -10356 9320 3646 -1085 902 -12964 -12058 12172 14790 1883 1383 -5594 -15063 323
534 323 13764 3222 -1614 295 -9119 -7867 8096 10059 3185 3652 129 -8789 -6406 2322 1402
549 1402 -2075 699 -2271 -8315 -1621 7457 6881 7369 6379 -6532 -14001 -5091 2208 5393 10476 968
$$ packed form
447A2213L99j2756o265m964j0520M976J6724N278M237Q500m188o746M87q682j2550
462a3857k128n95R55J2090J3603O240M006j227j2308j1966m428n063l083N550
476a2211O362M340R287R800k94n296k417r730j6859l626N253K633J4361J6272
490A7875o333q141O354j067n319K970j1917k1335O138J7537M396J0901O158j7083
504A134l908J1296q073p141O618p436n118J4779R14p990J3158P204j0939K47m215
519E30j8443P557J9676n674m731J987j3866R06K4230K618j2907n00o977r469J5386
534C23J3441j0542m836J909r414J252J5963J963o874M67l523q918K383Q728r20
549A402l477K774k970o044O694R078n76M88r90j2911p469Q910P299L185N083r508
$$ plain form
565 968 -13605 -5756 6006 7136 12586 5640 -17199 -15871 1159 1881 6182 13455 -4016 -14133
579 -14133 3198 4507 -3568 10035 8058 -12403 -5392 2550 -9993 222 16900 1942 -7210
592 -7210 803 -7000 -7354 14083 13043 -4876 -4723 -6602 -13286 2511 14961 3897 -1261 -1691 -9897
607 -9897 -4391 10840 9827 1771 -2554 -11280 -13236 2097 12990 9162 3944 -3356 -11474 -5134
621 -5134 7132 6474 -631 -3927 -8091 -9522 89 8557 5025 3837 6224 -3326 -9838 -88 4614
636 4614 3609 10583 5610 -13293 -11349 4603 6376 7248 7966 -11815 -23124 -4816 6138 4083
650 4083 8133 -1204 -17126 -7131 7684 6428 10079 11933 -2053 -4671 5926 3491 2176 9926
664 9926 1242 -11296 -6863 -6606 -8434 4769 8141 -5342 -9297 -8928 -13298 -3938 10497 6451 -1002
$$ packed form
565I68j4573P849J1762J130N450o946k2839J328J7030P22M301P273j7471j0117
579a4133J7331J309q075J3603j977k0461P011P942j2543J0215J6678j4958r152
592g210Q013p803l54K1437j040j7919J53j879o684J5797J2450j1064n158m30q206
607i897N506J5231j013q056m325q726j956J5333J0893l828n218p300q118O340
621e134J2266o58p105l296m164j431R611Q468l532j188K387r550o512R750M702
636D614j005O974m973j8903J944J5952J773Q72P18j9781j1309J8308J0954k055
650D083M050r337j5922R995J4815j256L651J854j3986k618J0597k435j315P750
664I926q684j2538M433K57j828J3203L372j3483l955L69m370R360J4435m046p453
$$ plain form
679 -1002 1322 458 3971 19261 22413 8973 -1128 -7946 -11773 -2759 7552 3727 -5707 -10017
693 -10017 -11751 -8971 -95 1786 -6702 -11030 -9704 -8197 -648 11234 15409 14117 13899 8930 981
708 981 2795 8674 6481 2330 -2799 -12889 -12843 -507 4227 116 -5876 -16692 -22016 -11174 296
723 296 2057 3804 3934 -226 4760 14950 14988 12851 12432 3255 -4402 -1419 874 1966 5563 1068
739 1068 -10954 -15045 -11624 -8795 -3363 -630 -7666 -11687 -5482 1368 7879 13565 10776 3982 1877
754 1877 2711 4653 8825 10315 5335 -1120 -5180 -7236 -4665 460 -894 -7174 -11319 -11714 -7358 998
770 998 6683 4923 -418 -2494 -1056 2188 7140 9065 5754 2039 -594 -1456 1363 4297 3528 -858
786 -858 -6265 -9742 -7987 -821 4521 3556 194 -3092 -4379 -289 4724 4879 2279 -1053 -3674 -2824
$$ packed form
679a002K324q64L513J5290L152j3440j0101o818l827R014J0311l825r434m310
693a0017j734K780Q876J881q488m328J326J507P549J1882M175j292k18m969p949
708I81J814N879k193m151n129j0090M6J2336M734m111n992j0816n324J0842J1470
723B96J761J747J30m160M986J0190L8k137m19r177p657K983K293J092L597m495
739A068j2022m091L421K829N432K733p036m021O205O850O511N686k789o794k105
754A877Q34J942M172J490m980o455m060k056K571N125j354o280m145l95M356Q356
770I98N685j760n341k076J438L244M952J925l311l715k633q62K819K934p69m386
786h58n407l477J755P166N342r65l362l286j287M090N013J55k600l332k621Q50
$$ plain form
802 -2824 666 3371 3663 1883 -2294 -6435 -5801 -1487 2305 4391 2637 -1872 -2732 831 5567 7899
818 7899 5033 -438 -3677 -3548 -921 1551 1538 -1178 -4523 -5845 -5619 -4205 -937 1139 425 -1369
834 -1369 -2740 -714 4406 8143 8647 5222 328 -939 2000 4837 4491 1148 -2894 -5829 -5712 -3712
850 -3712 -3010 -3245 -3843 -5345 -5480 -3873 -1273 3071 5721 4584 2401 1396 2413 5851 8344 6437
866 6437 1891 -1234 -1802 -824 826 -525 -4235 -5755 -6590 -6734 -4046 -1918 -1490 18 162 -1273 -152
883 -152 3142 5395 6175 5045 1360 -388 2353 3928 3344 2246 -1798 -5030 -3235 -1696 -2394 -2024
899 -2024 -2331 -3540 -3019 -1622 -826 788 2745 2474 863 313 302 1888 4333 3408 628 -1055 -1564
916 -1564 -313 972 500 -739 -2271 -2623 -943 -630 -936 662 1264 -96 -407 -185 -816 1064 3645
$$ packed form
802b824L490K705K92j780m177m141O34M314L792K086j754m509q60L563M736K332
818G899k866n471l239J29K627K472j3k716l345j322K26J414L268K076p14j794
834a369j371K026N120L737N04l425m894j267K939K837l46l343m042k935J17K000
850c712P02k35n98j502j35J607K600M344K650j137k183j005J017L438K493j907
866F437m546l125n68R78J650j351l710j520q35j44K688K128M28J508J44j435J121
883a52L294K253P80j130l685j748K741J575n84j098m044l232J795J539o98L70
899b024l07j209N21J397P96J614J957k71j611n50j1J586K445r25k780j683n09
916a564J251J285m72j239j532l52J680L13l06J598O02j360l11K22o31J880K581
$$ plain form
933 3645 867 -2160 -1184 -1541 -412 3527 826 -3609 -1261 133 -646 2346 2068 -2287 -299 3179
949 3179 -4 -325 2359 -740 -826 3452 -716 -4600 44 282 -1941 1457 -80 -5193 -1479 2795
965 2795 101 557 2090 -1823 -1298 3834 2028 -208 2388 312 -1860 1384 1053 -1574 57 130
981 130 -2622 -1820 209 -889 -1152 568 -584 -1400 1081 1654 -348 -135 1308 827 485 1516 25
998 25 -2341 635 3044 -631 -1521 13 -2808 -1112 4357 481 -4090 65 953 -1200 3421 3036
1014 3036 -4793 -1875 4052 -741 -797 2726 -3568 -3845 4370 1013 -3857 1016 -121 -3493 3226 3693
1030 3693 -3663 -143 3690 -1422 1326 4930 -2637 -2620 3750 -949 -2747 3004 -1008 -5249 1013
1045 1013 911 -4095 575 2357 -4304 -1792 3883 164 -152 3958 17 -2234 3694 4214 -505 -522
$$ packed form
933C645k778l027R76l57J129L939k701m435K348J394p79K992k78m355J988L478
949C179l183l21K684l099q6M278m168l884M644K38k223L398j537n113L714M274
965B795k694M56J533l913N25N132j806k236K596k076k172L244l31k627J631P3
981A30k752Q02K029j098k63J720j152q16K481N73k002K13J443m81l42J031j491
998B5k366K976K409l675q90J534k821J696N469l876m571M155Q88k153M621l85
1014C036p829K918N927m793n6L523o294k77Q215l357m870M873j137l372O719M67
1030C693p356L520L833n112K748L604p567J7O370m699j798N751m012m241O262
1045A013j02n006M670J782o661K512N675l719l16M110l941k251N928N20m719j7
$$ plain form
1061 -522 171 -1902 -88 3235 -723 -5322 -2267 310 -714 525 -285 -4793 -2630 3905 3183 -141
1077 -141 741 -787 -1145 5334 5102 -2427 -1590 984 -1321 2527 4144 -4686 -5254 1955 -213 -1841
1093 -1841 2465 -3081 -7114 2988 4758 -2859 1003 2283 -4825 1562 8083 -1154 -3081 3198 -1229
1108 -1229 -2026 6040 1448 -6137 -237 1500 -3232 1617 2718 -5517 -3112 3203 115 37 2724 -2195
1124 -2195 -3371 3071 3316 -523 169 -730 -2689 2153 4563 -941 -2946 -713 -974 764 3457 -653
1140 -653 -4984 -1395 2607 1317 711 266 -3595 -2102 4486 2780 -2374 -860 -552 -1646 3203 3859
1156 3859 -3508 -3540 2226 513 -369 3051 -1693 -4896 2511 3537 -2105 115 679 -3436 675 4327
1172 4327 -1567 -2404 1951 -747 -1265 3440 -71 -3754 1633 1544 -2522 1185 1812 -2783 -86 2589
$$ packed form
1061e22O93k073J814L323l958m599L055K577j024J239q10m508K163O535p22l324
1077a41Q82j528l58O479k32p529Q37K574k305L848J617q830n68P209k168j628
1093a841M306n546m033J0102J770p617L862J280p108O387O521r237j927O279m427
1108a229p97Q066m592p585N900J737m732M849J101q235K405O315l088p8K687m919
1124b195j176O442K45l839O92q99j959M842K410n504k005K233k61J738K693m110
1140f53m331L589M002j290o06m45l861J493O588j706n154J514L08j094M849O56
1156C859p367l2N766j713q82L420m744l203P407J026n642K220N64m115M111L652
1172D327n894q37M355k698n18M705l511l683N387q9m066L707O27m595K697K675
$$ plain form
1188 2589 -1587 -1072 2377 -793 -2006 1690 135 -1806 1892 949 -2631 408 1962 -1102 -70
1203 -70 1251 -1630 -1253 2106 984 -1582 -117 366 -927 911 1475 -1458 -1307 871 242 47 888
1220 888 -524 -1581 954 1501 -1049 -490 982 -1065 -488 1887 -403 -1695 864 552 -1003 552
1236 552 703 -1048 298 1145 -975 -284 1485 -752 -951 1203 -638 -1301 1670 624 -1891 -15
1252 -15 1079 -462 207 565 -1467 -833 1467 564 -249 375 -925 -369 2230 830 -1686 -711 -144 -444
1270 -444 726 899 -1338 -1424 973 1421 328 -256 -907 -553 843 484 -549 -703 -474 357 1368 817
1288 817 -927 -1237 527 1080 -324 -786 -749 -793 471 1739 995 -417 -289 862 805 3 -594 -1023 -491
1307 -491 -154 -666 -267 38 -476 435 1025 -771 -1653 -189 694 179 96 473 292 1020 1948 1658 927 -11
$$ packed form
1188B589m176N15L449l170j213L696j555j941L698r43l580L039J554l064J032
1203g0J321k881L77L359j122k566J465M83j293J838N64k933J51K178o29j95Q41
1220H88j412j057K535N47k550N59J472k047N77K375k290j292K559l12j555J555
1236E52J51j751J346Q47k120O91J769k237j99K154j841o63K971j046k515J876
1252a5J094j541O69L58k032O34K300r03q13O24j300N56K599j400k516R75N67l00
1270d44J170J73k237q6K397M48j093n84o51L54J396l59j033j54K29Q31J011n51
1288H17j744l10J764N53j404m62L7m4J264J268p44j412J28J151n7q02n97m29N32
1307d91L37n12L99L05n14R11N90j796q82J464Q83n15q3L77j81P28R28k90p31r38
$$ plain form
1327 -11 -790 -211 -686 -2032 -1231 -200 -861 -1245 -638 -343 -222 407 591 -522 -1227 -360 1371 2483 1649
1346 1649 1081 1939 1493 799 1340 387 -1376 -1787 -1616 -2038 -2438 -1872 -426 277 -643 -1640 -866 196 370
1365 370 1418 1722 -204 -227 2403 3373 2824 1919 720 289 -396 -1281 -1032 -1160 -2496 -2557 -1433 -2056 -2688
1384 -2688 -192 1589 325 -477 -515 -314 1496 2712 2395 1958 337 -357 1983 2826 551 -517 -206
1401 -206 -1905 -2979 -1341 -974 -1595 -729 -701 -1498 -965 -177 1490 3159 1274 -1250 -463 569 597 1850
1419 1850 2204 -333 -1911 -543 539 241 124 -171 -692 -1629 -2190 -363 1549 1411 1493 989 -914 -1119
1437 -1119 823 2250 1639 -1238 -3324 -2380 -1031 -641 688 832 -2070 -2443 857 1082 523 2903 2878
1454 2878 758 903 475 283 2766 2794 96 -529 -2170 -4450 -965 2317 -1949 -4680 -3228 -4694
$$ packed form
1327a1p79N79m75j346Q01J031o61l84O07K95J21O29J84j113p05Q67J731J112q34
1346A649n68Q58m46o94N41r53j763m11J71m22m00N66J446P03r20r97P74J062J74
1365C70J048L04j926k3K630R70n49r05j199m31o85q85K49j28j336o1J124o23o32
1384b688K496J781j264q02l8K01J810J216l17m37j621o94K340Q43k275j068L11
1401b06j699j074J638L67o21Q66K8p97N33P88J667J669j885k524P87J032K8J253
1419A850L54k537j578J368J082k98j17k95n21r37n61J827J912j38Q2n04j903k05
1437a119J942J427o11k877k086R44J349L90J329J44k902l73L300K25n59K380k5
1454B878k120J45m28j92K483K8k698o25j641k280L485L282m266k731J452j466
$$ plain form
1470 -4694 -4096 1572 2592 450 1761 1975 1684 4722 5546 3362 3340 1489 -3032 -1741 2164 472
1486 472 -600 294 -3593 -6734 -3795 -2211 -3706 -3680 -3638 -3704 -1385 1965 4627 7124 7387 4474 2450
1503 2450 2116 1223 1573 3616 1952 -3098 -4547 -1494 417 100 -425 -4084 -9769 -8952 -3493 -1435
1519 -1435 3 1629 575 1830 6084 6427 5727 6944 3684 -1368 111 310 -3192 487 4716 -803
1535 -803 -4091 -2406 -5157 -5294 -162 -1546 -6149 -5184 -4182 -2112 5786 8608 4034 3676 3402 -825
1551 -825 2498 7468 2041 -2642 -1232 -3586 -3840 2512 3324 -1362 -2435 -3705 -5929 -2617 238 -2128
1567 -2128 -1203 1153 -1574 -765 4663 4818 3571 5884 3522 -3410 -4222 62 1173 1218 1517 -2767 -6188
1584 -6188 -2093 3177 3933 2288 -2204 -7057 -5059 651 2113 2072 2654 -705 -2462 2871 4680 962
$$ packed form
1470d694N98N668J020k142J311K14k91L038Q24k184k2j851m521J291L905j692
1486D72j072Q94l887l141K939J584j495K6M2o6K319L350K662K497K63k913k024
1503B450l34q93L50K043j664n050j449L053J911l17n25l659n685Q17N459K058
1519a435J438J626j054J255M254L43p00J217l260n052J479J99l502L679M229n519
1535h03l288J685k751j37N132j384m603R65J002K070P898K822m574l58k74m227
1551h25L323M970n427m683J410k354k54O352Q12m686j073j270k224L312K855k366
1567b128R25K356k727Q09N428J55j247K313k362o932q12M284J111M5K99m284l421
1584f188M095N270P56j645m492m853J998N710J462m1N82l359j757N333J809l718
$$ plain form
1600 962 1592 1588 -3725 -4427 -1047 -1248 598 4493 1528 -2393 -1052 -1396 -938 4607 3058 -4500 -3670
1617 -3670 -1160 -2763 2583 7803 1357 -3507 -1053 -1864 -1636 4250 3638 -2444 -2887 -2577 -3088 2788
1633 2788 6021 743 -1340 -660 -3348 -1380 4520 2781 -1934 -1311 -1640 -3599 -90 3609 2019 1155
1649 1155 760 -2390 -2289 1237 2160 1916 1222 -3197 -6105 -1749 3337 3241 2830 1153 -4299 -4996 1213
1666 1213 3475 1371 594 -1809 -4527 -1143 3826 4152 3631 2508 -2194 -3639 100 290 -522 1486
1682 1486 -1564 -6161 -3028 1035 633 2650 4231 -714 -3564 -963 -517 241 3713 2112 -1842 -768
1698 -768 369 1572 6494 6680 -539 -4649 -5004 -5868 -2688 2192 -383 -4796 -2748 202 2476 6095
1714 6095 5182 -388 -2885 -3171 -3297 -342 3045 3169 3552 4639 2401 167 1802 1607 -2341 -5219
$$ packed form
1600I62O30mn313p02L380k01J846L895k965l921J341l44M58N545j549p558Q30
1617c670K510j603N346N220o446m864K454q11K28N886o12o082m43L10n11N876
1633B788L233n278k083O80k688J968N900j739m715O23l29j959L509L699j590q64
1649A155l95l150J01L526R23k44o94m419k908M356N086r6m11j677n452o97O209
1666A213K262k104p77k403k718L384M969L26n21j123m702j445L739J90q12K008
1682A486l050m597L133M063m02K017J581m945k850K601M46P58L472j601l954J074
1698g68J137J203M922J86p219m110l55q64L180M880k575m413K048K950K274L619
1714F095r13n570k497k86j26K955L387J24L83J087k238k234J635j95l948k878
$$ plain form
1730 -5219 -7604 -9558 -5642 1992 5873 5224 2937 -77 -1286 717 1768 -412 -2507 -3277 -2855 1808
1746 1808 7238 7756 5787 3385 -1531 -5963 -5654 -4021 -4094 -2979 -1690 -2108 -338 3838 5380 4630
1762 4630 2470 -2448 -5450 -3643 -1031 1330 4308 4251 1372 1016 2490 1872 1224 400 -3749 -6993
1778 -6993 -5571 -2673 590 3308 2453 -64 -989 -639 377 2126 2141 -347 -1615 -1043 -485 887 3002
1795 3002 2791 711 -929 -1803 -1335 510 1914 971 -1819 -4031 -3848 -1424 1545 2510 1559 371 39
1812 39 718 2012 2191 330 -2040 -2988 -2828 -1857 643 3258 3450 2443 772 -1396 -1962 -957 -679
1829 -679 -1400 -2513 -2882 -963 2718 4808 4043 2048 -661 -2918 -2667 -1442 -1340 -711 233 387 1070
1846 1070 1923 2017 1868 891 -1365 -3170 -3090 -1801 459 2515 2270 515 -192 -109 75 587 -222 -1289
$$ packed form
1730e219k385j954L916P634L881o49k287l014j209K003J051k180k095p70M22M663
1746A808N430N18j969k402m916m432L09J633p3J115J289m18J770M176J542p50
1762D630k160m918l002J807K612K361K978n7k879l56J474o18o48q24m149l244
1778f993J422K898L263K718q55k517r25L50J016J749J5k488j268N72N58J372K115
1795C002k11k080j640q74M68J845J404r43k790k212J83K424K969R65r51j188l32
1812C9O79J294J79j861k370r48J60R71K500K615J92j007j671k168n66J005K78
1829f79p21j113l69J919L681K090p65j995k709k257K51J225J02O29R44J54O83
1846A070Q53R4j49r77k256j805Q0J289K260K056k45j755p07Q3J84N12q09j067
$$ plain form
1864 -1289 -1341 -907 104 1406 1382 539 -58 -1085 -1946 -1223 319 1378 1923 1484 246 -354 -152 -613
1882 -613 -1077 -1508 -2295 -1127 1136 2140 2821 2770 1110 -504 -1691 -3034 -3336 -2040 -659 733 2372
1899 2372 2940 2731 3160 1930 -1087 -2889 -4119 -4481 -2420 -145 1112 2846 4059 3727 2728 921
1915 921 -2108 -3784 -3675 -3570 -2631 -363 1413 2925 4968 4438 2080 376 -1795 -3782 -3917 -3556 -2678
1932 -2678 -216 2262 3241 3524 3192 1910 711 -604 -2886 -4399 -4098 -2546 -71 2315 3015 3132
1948 3132 2746 1847 1089 -532 -2379 -2993 -3208 -3060 -1562 475 2165 3970 4411 2310 35 -1049 -2148
1965 -2148 -2233 -1366 -2596 -3226 -710 1456 3100 5109 3870 425 -877 -1963 -3618 -2612 -1090 -1724
1981 -1724 -707 1492 1358 2383 4664 2940 -211 -1451 -3916 -4947 -1707 454 384 1494 1887 588
$$ packed form
1864a289n2M34J011J302k4q43n97j027q61P23J542J059N45m39j238o00K02m61
1882f13m64m31p87J168K263J004O81n1j660j614j187j343l02J296J381J392J639
1899B372N68k09M29j230l017j802j230l62K061K275J257J734J213l32r99j807
1915I21l029j676J09J05R39K268J776J512K043n30k358j704k171j987j35L61Q78
1932b678K462K478R79K83l32j282j199j315k282j513L01J552K475K386P00J17
1948C132l86q99p58j621j847o14k15J48J498K037J690J805M41k101k275j084j099
1965b148q5Q67j230o30K516K166J644K009j239l445j302j086j655J006J522o34
1981a724J017K199j34J025K281j724l151j240k465j031L240K161p0J110L93j299
$$ plain form
1997 588 1506 2818 990 -712 -1366 -3766 -4321 -1024 1212 2398 3508 1840 -1034 -870 790 1145
2013 1145 832 -557 -3237 -3578 -547 1843 2379 2095 279 -1800 -1346 322 748 757 848 -481 -2388 -1721
2031 -1721 -355 465 2394 2951 -273 -1840 -484 205 1566 2902 -387 -4650 -3831 -1478 314 3861
2047 3861 4379 66 -1419 -35 -903 275 2228 -1054 -3968 -2334 -1250 365 4764 5145 728 -1121
2063 -1121 -1843 -3807 -1431 1816 -94 -1205 79 -924 11 4046 3950 1013 -300 -2985 -5514 -2302
2079 -2302 2187 2430 2036 761 -3354 -3517 1217 2870 1648 275 -2800 -4328 -194 4276 4181 2465
2095 2465 112 -3425 -3723 435 2364 1887 2233 416 -2860 -2462 -520 -688 -644 -543 -3470 -4676 -698
2112 -698 3159 5175 6909 3852 -2724 -4212 -2308 -1088 1732 3353 -88 -2004 957 2832 3583
$$ packed form
1997E88R18J312j828j702o54k400n55L297K236J186J110j668k874J64J660L55
2013A145l13j389k680l41L031K390N36k84j816k079M54J668M26RR1j329j907O67
2031a721J366Q20J929N57l224j567J356O89J361J336l289m263Q19K353J792L547
2047C861N18m313j485J384q68J178J953l282k914J634J084J615M399L81m417j849
2063a121p22j964K376L247j910j111J284j003R35M035r6k937j313k685k529L212
2079b302M489K43l94j275m115j63M734J653j222j373l075j528M134M470r5j716
2095B465k353l537k98M158J929m77L46j817l276L98J942j68M4J01k927j206L978
2112f98L857K016J734l057o576j488J904J220K820J621l441j916K961J875P51
$$ plain form
2127 3583 4363 -551 -8274 -9445 -6867 -3888 2354 5980 2871 1298 2821 2224 2376 3684 -164 -5126
2143 -5126 -4326 -2305 -409 5248 8541 5218 1888 -1344 -6585 -7127 -3275 -2607 -3700 -3307 -3481 -1581
2159 -1581 5499 9977 6885 1982 -2933 -6622 -3781 2655 4318 2964 1963 88 -42 2944 3853
2174 3853 347 -3059 -5909 -8516 -6758 -1420 1678 3079 3644 476 -2524 -622 2447 3351 3761 1808
2190 1808 -2629 -3153 1241 4109 4823 4040 -1160 -6061 -4728 -1440 526 2268 388 -4751 -6127 -2683
2206 -2683 280 2948 4545 1285 -2549 -890 1829 3488 5590 3811 -1698 -4149 -3255 -1898 1437
2221 1437 4267 2151 -1487 -2581 -3238 -2168 1745 2220 -1763 -4091 -4216 -2485 3031 7645 6008 1495
2237 1495 -1909 -3648 -2367 1544 2744 203 -1781 -2771 -2430 1243 4519 3692 793 -2580 -5467 -4966
$$ packed form
2127C583P80m914p723j171K578K979O242L626l109j573J523n97J52J308l848m962
2143e126Q00K021J896N657L293l323l330l232n241n42L852O68j093L93j74J900
2159a581P080M478l092m903m915l689K841O436J663j354j001j875j30K986R09
2174C853l506l406k850k607J758N338L098J401N65l168l000J902L069R04M10j953
2190A808m437n24M394K868P14p83n200m901J333L288J966J742j880n139j376L444
2206b683K963K668J597l260l834J659K719J659K102j779n509k451Q94J357L335
2221A437K830k116l638j094o57J070L913M75l983k328j25J731N516M614j637m513
2237A495l404j739J281L911J200k541j984r90L41L673L276q27k899l373k887N01
$$ plain form
2253 -4966 -551 3194 3518 1804 -938 -2840 -827 3081 3807 1717 -1584 -4671 -4448 -338 3184 3733
2269 3733 2391 -567 -3542 -2977 279 2353 2852 1666 -1925 -3954 -1687 1628 3559 3392 -21 -4331
2285 -4331 -4518 -1105 2314 4040 2911 -1246 -3996 -2628 -289 1977 3248 1238 -1882 -2534 -1194
2300 -1194 1344 3842 3842 462 -3203 -4389 -2983 455 3465 2884 -78 -2347 -2483 -205 2980 3579
2316 3579 1027 -2398 -4206 -3291 -147 3202 3996 1752 -1223 -2686 -1886 802 2734 1933 -1112 -3807
2332 -3807 -3687 -1010 2895 4851 3319 222 -1966 -2464 -623 1737 1706 -217 -2471 -3697 -2525 838
2348 838 3763 3761 1426 -2063 -4190 -2917 339 2209 2020 55 -2123 -1130 2143 4534 4655 2208 -1838
2365 -1838 -4442 -4066 -1922 322 1461 615 -1218 -1861 -913 962 2680 1927 -1157 -3748 -4080 -1493
$$ packed form
2253d966M415L745L24j714k742j902K013L908P26k090l301l087K23M110L522N49
2269C733j342k958k975N65L256K074M99j186l591k029K267L315J931j67l413m310
2285d331j87L413L419J726j129m157k750J368K339K266J271k010l120o52J340
2300a194K538K498%l380l665j186J406L438L010n81k962k269j36K278L185N99
2316C579k552l425j808R15L144L349P94k244k975j463Q00K688J932q01l045k695
2332c807J20K677L905J956j532l097k188m98J841K360l1j923k254j226J172L363
2348H38K925kk335l489k127J273L256J870j89j965k178R93L273K391J21k447m046
2365a838k604L76K144K244J139q46j833o43R48J875J718p53l084k591l32K587
$$ plain form
2381 -1493 2928 5303 4579 2033 -614 -1156 352 1493 710 -1402 -3526 -4185 -2531 553 2529 2699
2397 2699 975 -2150 -3685 -2580 -325 1990 2596 773 -760 -306 1607 3733 4270 1828 -1708 -3366
2413 -3366 -2946 -1098 1355 1794 -27 -1672 -2610 -2413 -265 1471 984 -173 -1556 -2004 -77 2789
2429 2789 3792 2600 313 -1987 -2215 118 1947 2119 1189 -915 -2476 -1677 -417 348 647 -587
2445 -587 -2346 -2468 -844 1378 3121 3067 748 -1723 -2241 -1077 796 1997 1157 -507 -1144 -601 972
2462 972 2006 1338 -388 -2258 -3096 -1928 -32 1648 2441 1513 -144 -1003 -509 342 1063 708 -1287
2479 -1287 -2474 -1457 205 1924 3030 1193 -1286 -1741 -1624 -864 1001 1426 64 -269 -47 -246 1095
2496 1095 2276 763 -1010 -1525 -2389 -1501 1303 1802 523 16 -1156 -1822 -181 917 155 45 57
$$ packed form
2381a493M421K375p24k546k647n42J508J141p83k112k124o59J654L084J976J70
2397B699j724l125j535J105K255K315O06j823j533M54J913K126N37k442l536j658
2413c366M20J848K453M39j821j645r38J97K148J736m87j157j383m48J927K866
2429B789J003j192k287k300k28K333J829J72r30k104j561P99J260P65K99j234
2445e87j759j22J624K222J743n4k319k471n18J164J873J201q40j664o37N43J573
2462I72J034o68j726j870q38J168J896J680P93r28j657q59M94Q51P21l55j995
2479a287j187J017J662J719J106j837k479m55J17P60J865M25j362l33K22j99J341
2496A095J181j513j773n15q64Q88K804M99j279n07j172o66J641J098p62j10J2
$$ plain form
2513 57 -709 -146 1758 1784 1283 1016 -865 -2365 -1225 123 733 1359 493 -1332 -1462 -78 606 308
2531 308 -314 -1710 -2176 -321 1477 1812 1927 1304 -154 -608 -25 -269 -431 284 143 -756 -225 430 156
2550 156 807 966 -1084 -2205 -1522 -1143 -206 1537 1372 -140 282 714 52 961 1256 -795 -1463 -473
2568 -473 -768 100 1980 1044 -694 -309 -592 -1239 251 563 -1265 -982 317 -126 472 1708 377 -360
2586 -360 685 -53 -1088 -73 227 -244 736 847 -959 -848 620 374 232 548 -1158 -1862 207 1110
2604 1110 420 378 -99 -1168 -125 1335 389 -445 155 -420 -588 836 430 -849 -32 513 -428 -67
2622 -67 478 -507 -483 862 296 -665 140 -6 -771 539 896 -480 -288 355 -521 -83 1116 12 -915
2641 -915 126 -48 -564 915 809 -1015 -352 615 -296 155 758 -771 -942 722 513 -416 342 -157
$$ packed form
2513E7p66N63J904K6n01k67j881j500J140J348O10O26q66j825j30J384O84k98
2531C08o22j396m66J855J798L35J15o23j458m54N83k44j62P15j41q99N31O55k74
2550A56O51J59k050j121O83L79R37J743j65j512M22M32o62R09K95k051o68R90
2568d73k95Q68J880r36j738L85k83o47J490L12j828K83J299m43N98J236j331p37
2586c60J045p38j035J015L00m71R80J11j806J11J468k46j42L16j706p04K069R03
2604A110o90m2m77j069J043J460r46q34O00n75j68J424m06j279Q17N45r41L61
2622f7N45r85K4J345n66r61Q05j46p65J310L57j376J92O43q76M38J199j104r27
2641i15J041j74n16J479j06j824O63R67r11M51O03j529j71J664k09r29P58m99
$$ plain form
2659 -157 -965 632 1193 -680 -629 257 -554 92 1233 -195 -1214 184 447 -191 520 268 -1010 -127
2677 -127 908 -215 -252 343 -423 -231 885 66 -823 202 505 -300 302 453 -816 -566 616 142
2695 142 -232 508 -136 -729 221 365 -191 277 295 -825 -535 588 121 70 770 -272 -1063 254 639
2714 639 -244 131 122 -720 -181 775 -18 -309 369 20 -355 387 -184 -845 498 870 -225 -82 148 -588
2734 -588 160 1363 296 -921 -465 -341 -268 913 604 -792 -511 -81 -415 313 635 -485 -567 163 -118
2753 -118 -234 723 712 -28 306 321 -444 -145 562 136 -34 -102 -541 -464 136 150 -110 -69 -486 -1074 -477 469
2775 469 231 439 687 -159 -430 674 1077 545 163 -245 -734 -187 553 334 -65 -276 -873 -774 -129 -490
2795 -490 -753 -15 170 -435 -70 447 328 702 1318 534 -403 -185 285 720 1076 249 -671 -618 -451 -283
$$ packed form
2659a57q08J597N61j873N1Q86q11O46J141j428j019J398K63o38P11k52j278Q83
2677a27J035j123l7N95p66J92J116q19q89J025L03q05O02J51j269K50J182m74
2695A42l74P40o44n93R50J44n56M68J8j120K90J123m67n1P00j042p91J317L85
2714F39q83L75rq42N39R56p93k91O78l49l75P42n71o61J343L72j095J43K30p36
2734e88P48J203j067j217M56J24P3J181l09j396K81M30l34P28L22j120q2P30k81
2753a18j16R57j1p40L34J5p65K99P07m26j70o8m39P7O00J4k60M1m17n88N97R46
2775D69k38K08K48q46k71J104M03n32l82m08m89N47P40k19l99k11n97R9O45l61
2795d90k63P38J85o05L65N17j19L74O16p84r37K18M70M35L56q27r20N3J67J68
$$ plain form
2815 -283 26 -327 -1279 -1040 -284 -206 -116 449 492 122 183 203 131 516 834 867 542 -39 -261 299 593 47
2837 47 -644 -1005 -1207 -1026 -228 286 -111 -401 -146 39 -67 159 624 424 182 285 437 527 891 831 453
2858 453 -223 -945 -790 -256 -168 -387 -291 -246 -594 -225 384 175 -157 -204 -275 -195 158 576 947 837 115 -231
2880 -231 -32 -167 -199 60 -151 -784 -537 325 335 263 210 51 -272 -403 -293 152 242 280 430 247 -263 -239
2902 -239 151 253 -316 -712 -622 -290 182 587 670 264 -270 -14 414 186 -113 178 183 24 60 158 116 -122
2924 -122 -269 -367 -700 -1067 -689 260 445 -43 136 262 61 407 786 335 -46 54 240 489 505 161 159
2945 159 91 -536 -868 -478 -640 -764 -177 -49 -561 -312 396 574 421 157 -28 194 290 443 641 614 157
2966 157 108 416 -91 -536 -341 -174 -626 -648 -379 -272 -159 77 355 37 -306 21 408 415 299 184 264 354
$$ packed form
2815b83L09l53r52K39P56P8R0N65M3l70O1K0p2L85L18L3l25n81k22N60K94n46
2837D7o91l61k02J81P98N14l97k90K55J85j06K26M65k00k42J03J52R0L64o0l78
2858D53o76p22J55N34Q8k19R6M5l48L69O09k09l32m7p1Q0L53M18L71j10p22l46
2880b31J99j35l2K59k11o33K47Q62J0p2n3j59l23j31J10M45R0L8J50j83n10K4
2902b39L90J02n69l96R0L32M72M05Q3m06n34K56M28k28k99K91Nj59L6R8m2k38
2924a22j47r8l33l67L78R49J85m88J79J26k01L46L79m51l81J00J86K49J6l44k
2945A59o8o27l32L90j62j24N87J28n12K49P08J78j53k64j85K22R6J53J98k7m57
2966A57m9L08n07m45J95J67m52k2K69J07J13K36K78l18l43L27L87Pj16j15Q0R0
$$ plain form
2988 354 177 269 258 5 -410 -171 10 -545 -532 149 -11 -429 53 122 -207 126 304 55 41 30 -51 156
3010 156 220 -393 -69 485 -206 -423 268 -7 -398 325 345 -385 -197 335 235 318 239 -277 -100 278 -145
3031 -145 -307 43 -528 -618 344 238 -706 -309 234 -51 36 323 -20 -216 394 690 455 352 6 -173 318
3052 318 158 -412 -273 -163 -588 -364 260 -99 -705 -133 203 -451 -147 355 -4 149 673 432 259 480
3072 480 99 -152 276 -86 -520 68 73 -712 -118 669 -343 -670 -62 -444 -546 496 502 -319 56 409 230
3093 230 642 557 -578 -498 192 -329 -151 543 -176 -600 616 585 -492 -338 73 -327 53 605 -96 -314
3113 -314 523 447 248 381 -663 -1204 -155 162 -423 -45 190 -544 -192 860 373 -395 189 101 -271 539
3133 539 822 248 362 428 -222 -244 38 -717 -868 -177 -489 -830 136 206 -640 14 605 -181 -125 432 76
$$ packed form
2988C54j77R2j1k53m15K39J81n55J3O81j60m18M82O9l29L33J78k49j4j1q1K07
3010A56O4o13L24N54o91k17O91k75l91P23K0p30J88N32j00Q3p9n16J77L78m23
3031a45j62L50n71r0R62j06r44L97N43k85Q7K87l43j96O10K96k35j03l46j79M91
3052C18j60n70J39J10m25K24O24l59o06N72L36o54L04N02l59J53N24k41j73K21
3072D80l81k51M28l62m34N88Np85N94P87j012l27O08l82j02J042Oq21L75L53j79
3093B30M12q5j135Q0O90n21J78O94p19m24J216l1j077J54M11m00L80N52p01k18
3113c14Q37p6j99J33j044n41J049L17n85L78K35p34L52J052m87p68N84q8l72Q10
3133E39K83n74J14O6o50k2K82p55j51O91l12l41R66P0q46O54N91p86N6N57l56
$$ plain form
3154 76 309 1354 1165 353 429 139 -331 368 104 -1272 -1163 -458 -706 -187 495 -538 -1198 -185 210
3173 210 -334 170 376 -17 767 1525 825 703 829 127 27 349 -588 -1199 -327 -58 -593 -192 -112 -1141
3193 -1141 -835 93 -235 -578 59 -154 58 1175 1268 799 906 559 -231 191 560 -310 -497 -8 -527 -685
3213 -685 130 -100 -931 -641 -378 -666 -257 175 -153 103 922 702 425 681 220 -68 778 627 -338 -361
3233 -361 36 -280 7 367 -600 -1223 -435 -110 -228 173 -57 -503 142 661 210 220 282 -140 91 676 251
3254 251 -289 358 338 -215 -20 -117 -831 -409 186 -133 -277 74 -110 -17 468 253 -325 -58 -30 -281 224
3275 224 480 11 130 493 1 -233 137 -57 -262 -227 -154 -342 68 310 92 115 157 -211 -132 207 -101 -240
3297 -240 177 147 -138 138 232 -89 -12 223 -181 -372 -27 22 -7 225 34 -217 6 174 -11 -24 123 -167
$$ packed form
3154G6K33J045j89q12P6k90m70O99k64j376J09P05k48N19O82j033o60J013L95
3173B10n44N04K06l93P84P58p00j22J26p02j00L22r37o11Q72K69n35M01Q0j029
3193a141L06R28l28l43O37k13K12J117R3m69J07l47p90M22L69q70j87M89n19j58
3213f85Q15k30q31K90K63k88M09M32l28K56Q19k20k77K56m61k88Q46j51r65k3
3233c61L97l16K87L60r67o23P88L25j18M01k30m46O45N19m51J0O2m22K31N85m25
3254B51n40O47k0n53J95r7p14M22N95l19j44L51j84R3M85k15n78K67K8k51N05
3275B24K56m69J19L63m92k34L70j94k05L5P3j88M10K42k18K3M2l68P9L39l08j39
3297b40M17l0k85K76R4l21P7K35m04j91L45M9k9K32j91k51K23J68j85j3J47k90
$$ plain form
3319 -167 -168 242 -19 -252 166 95 -182 -29 5 -106 115 252 35 -74 57 -8 -11 149 -107 -286 -19 79 -11
3342 -11 160 55 -133 74 116 -138 -289 -82 -49 6 120 29 -145 128 356 156 -2 -201 -308 -112 129 35
3364 35 -123 -103 217 208 251 142 -164 -187 -24 -33 -193 -252 -51 60 249 346 121 -32 71 -7 -172 -215 -455 -298
3388 -298 51 171 170 224 184 217 227 23 -295 -320 -199 -139 -12 109 101 229 377 254 -17 -110 -292 -327 -269 -165
3412 -165 -141 51 240 376 291 244 106 -49 -89 -296 -375 -295 -83 185 238 203 230 141 42 13 -325 -377 -302 -186 -4
3437 -4 83 176 281 387 321 111 -42 -221 -239 -58 -94 -258 -73 183 166 227 186 -106 -154 -53 -138 -340 -264 -172 -100
3462 -100 264 305 61 150 255 93 85 -32 -316 -253 24 -3 -28 -5 25 38 236 176 -201 -225 -156 -201 -81 -56 -165
3487 -165 40 318 306 203 213 -16 21 66 -17 -324 -263 -33 -2 114 218 17 -137 126 -30 -189 -182 -112 -224
$$ packed form
3319a67jM10k61k33M18p1k77J53L4j11K21J37k17j09J31o5lJ60k56j79K67R8r0
3342a1J71j05j88K07M2k54j51K07L3N5J14r1j74K73K28k00j58j99j07J96K41r4
3364C5j58K0L20rM3j09l06k3J63rj60n9K01J11J89R7k25j53J03p8j65m3k40J57
3388b98L49J20jN4m0L3J0k04l18k5J21O0J27J21qJ28J48j23k71r3j82l5N8J04
3412a65K4J92J89J36q5m7j38j55m0k07p9Q0K12K68N3l5K7q9r9k9l38n2P5J16J82
3437dQ7R3J05J06o6k10j53j79j8J81l6j64J85K56j7O1m1k92m8J01q5k02P6R2P2
3462a00L64M1k44Q9J05j62qj17k84O3K77k7k5K3L0J3J98o0l77k4O9m5J20K5j09
3487a65K05K78j2j03J0k29L7M5q3l07O1K30L1J16J04k01j54K63j56j59PP0j12
$$ plain form
3510 -224 -43 151 73 68 368 108 -94 99 -35 -192 7 20 -247 -124 163 34 53 161 -104 -58 244 84
3532 84 -157 75 27 -118 196 88 -323 -177 128 -9 -55 135 -194 -171 209 68 -259 -148 -36 -114 307 438
3554 438 31 100 429 200 71 68 -331 -649 -247 -116 -304 -11 151 -22 160 323 -72 -202 -16 -266 -300
3575 -300 152 331 240 589 707 283 374 356 -332 -541 -374 -595 -635 -97 -113 -219 230 462 56 54 -40 -602 -384
3598 -384 289 173 36 529 498 524 1023 813 -217 -406 -383 -800 -591 -197 -702 -592 162 265 131 403 38
3619 38 -396 -9 40 -402 -191 323 312 611 1043 464 41 322 65 -434 -389 -685 -1121 -630 -10 -56 159 473
3641 473 -13 -155 357 94 -295 26 -98 -445 279 770 486 676 684 53 -235 64 -352 -819 -519 -464 -526
3662 -526 151 331 16 286 689 98 -193 -101 -489 -512 301 378 -149 94 362 174 637 669 -374 -759 -448
$$ packed form
3510b24J81J94p8nL00k60k02J93j34j57J99J3k67J23K87j29J9J08k65M6L02j60
3532H4k41K32m8j45L14j08m11J46L05j37m6J90l29K3L80j41l27J11J12p8M21J31
3554D38m07O9L29k29j29ll99l18M02J31j88K93J62j73J82J63l95j30J86k50l4
3575c00M52J79r1L49J18m24R1j8o88k09J67k21m0N38j6j06M49K32m06kr4n62K18
3598c84O73j16j37M93l1K6M99k10j030j89K3m17K09L94n05J10P54J03j34K72l65
3619C8m34L87M9m42K11N14j1K99M32n79m23K81k57m99M5k96m36M91O20m6K15L14
3641D73m86j42N12k63l89L21j24l47P24M91k84J90Qo31k88K99m16m67L00N5o2
3662e26O77J80l15K70M03n91k91R2l88k3Q13P7n27K43K68j88M63L2j043l85L11
$$ plain form
3683 -448 -467 -259 192 -52 -306 242 479 127 282 294 -367 -314 31 -405 -348 283 225 77 430 162 -301 18
3705 18 264 -206 -242 -74 -522 -275 466 332 111 331 -48 -373 57 260 -119 -70 -76 -507 -320 447 283 64
3727 64 277 -138 -380 226 306 -88 -11 -11 -365 -221 209 -6 -97 375 151 -220 57 7 -55 337 285 -330 -379
3750 -379 -59 17 314 564 79 -379 -102 6 -127 150 -77 -618 -492 -46 -90 204 642 434 80 215 194
3771 194 -14 321 313 -294 -320 -137 -157 184 591 207 -250 -234 -495 -757 -341 -200 -388 -153 25 53 491 1083
3793 1083 937 606 268 -344 -611 -77 109 -22 -104 -159 -255 146 425 -22 -517 -792 -1070 -985 -410 -105 219
3814 219 761 966 728 740 763 545 349 49 -559 -842 -379 100 399 484 175 -456 -620 -492 -594 -650 -622 -794
3836 -794 -600 116 751 1072 1339 1088 513 219 8 -90 2 54 -212 -474 -282 -47 81 244 -86 -693 -913
$$ packed form
3683d48j9K08M51k44k54N48K37l52J55J2o61N3L45m36N7O31n8j48L53k68m63L19
3705A8K46m70l6J68m48K47P41j34k21K20l79l25M30K03l79M9om31J87P67j64k19
3727F4K13m15k42O06Q0l94P7%l54J44M30k15r1M72k24l71K77n0o2L92n2o15m9
3750c79L20P6K97K50m85m58K77J08j33K77k27n41J26M46m4K94M38k08l54J35k1
3771A94k08L35qo07k6J83k0L41M07l84m57J6k61k62M16J41j88K35J78K8M38N92
3793A083j46l31l38o12k67N34J86j31q2n5r6M01K79m47m95k75k78Q5N75L05L24
3814B19N42K05k38J2K3k18j96l00o08k83M63M79K99Q5l09o31j64J28j02n6K8j72
3836g94J94P16O35L21K67k51n75k94k11r8R2N2k66k62J92K35J28J63l30o07k20
$$ plain form
3857 -913 -891 -739 -223 103 176 338 461 587 788 1076 836 219 -126 -452 -468 -116 113 -51 -242 -391 -389 -139
3879 -139 2 -55 -325 -517 -584 -513 -81 403 649 632 565 319 324 377 477 213 -280 -631 -767 -369 107 275 193
3902 193 0 -301 -242 -56 25 -134 -210 -308 -199 56 419 600 679 632 92 -266 -293 -222 -49 43 -202 -404 -260
3925 -260 152 409 458 180 -233 -480 -360 -91 60 246 149 -23 -26 48 144 203 218 -80 -337 -363 -198 117 375
3948 375 301 -23 -257 -187 -31 328 284 154 -26 -183 -48 61 174 5 -152 -307 -338 -235 180 413 368 115
3970 115 -98 -313 -188 27 59 -89 -177 -94 8 366 600 358 105 -171 -596 -570 -315 -158 -12 167 115 4
3992 4 210 443 352 201 -207 -607 -499 -133 181 343 441 202 145 204 74 -46 -145 -340 -609 -534 -221 39 439
4015 439 594 364 59 -23 -114 -110 -19 -207 -464 -365 -22 249 506 594 242 -10 -68 -268 -380 -149 -155 -217 -31 37
$$ packed form
3857i13K2J52N16L26P3J62J23J26K01K88k40o17l45l26j6L52K29j64j91j49KK50
3879a39J41n7k70j92o7P1M32M84K46j7o7k46NN3J00k64m93l51j36L98M76J68q2
3902A93j93l01N9J86Q1j59p6r8J09K55L63J81P9m7n40l58k7P1J73R2k45k02J44
3925b60M12K57M9k78m13k47J20K69J51J86r7j72lP4R6N9J5k98k57k6J65L15K58
3948C75p4l24k34P0J56L59m4j30j80j57J35J09J13j69j57j55l1J03M15K33m5k53
3970A15k13k15J25K15L2j48q8Q3J02L58K34k42k53k76m25K6K55J57J46J79n2j11
3992DK06K33r1j51m08m00J08L66L14J62R8k39n7N9j30j20r9j95k69P5L13K60M00
4015D39J55k30l05q2r1MR1j88k57R9L43K71K57Q8l52k52n8k00j12K31oo2J86O8
$$ plain form
4039 37 149 363 681 341 -62 -267 -504 -504 -83 12 -161 50 181 211 475 467 24 -225 -219 -463 -459 -65 -37 64
4063 64 433 432 34 219 247 -123 -183 -238 -523 -468 60 197 330 461 281 8 102 56 -248 -120 -97 -411 -155
4086 -155 181 182 253 418 152 -204 -30 -82 -248 -121 -25 -304 -33 251 101 54 266 113 -1 88 28 -393 -128
4109 -128 137 -102 22 128 -94 -18 374 233 -91 -31 -208 -298 54 99 -261 -121 158 35 158 399 -12
4130 -12 -219 136 34 -267 -104 -54 -242 152 347 59 35 232 -75 -122 149 -191 -381 -15 -21 -115 233 391
4152 391 -30 14 143 -162 -173 92 -93 -228 156 130 -14 242 134 -226 15 207 -156 -188 67 -67 -2 398
4174 398 124 -366 -151 -43 -65 110 187 -263 -175 184 127 78 92 -261 -502 21 149 5 166 367 4 113
4196 113 198 -269 -345 -53 -111 -247 -7 77 -68 381 505 16 -127 -223 -506 -289 246 41 -44 295 256 58
$$ packed form
4039C7J12K14L18l40m03k05k37%M21R5j73K11J31L0K64qm43k49Ok44ML94K8J01
4063F4L69jl98J85K8l70o0n5k85N5N28J37J33J31j80k73R4m6l04J28K3l14K56
4086a55L36JP1J65k66l56J74n2j66J27R6k79K71K84j50m7K12j53j14Q9o0m21K65
4109a28K65k39J24J06k22P6L92j41l24O0j77r0L52M5l60J40K79j23J23K41m11
4130a2k07L55j02l01J63N0j88L94J95k88k4J97l07m7K71l40j90L66or4L48J58
4152C91m21M4J29l05j1K65j85j35L84k6j44K56j08l60K41J92l63l2K55j34O5M00
4174C98k74m90K15J08k2J75P7m50Q8L59n7m9J4l53k41N23J28j44J61K01l63J09
4196A13Q5m67p6K92n8j36K40Q4j45M49J24m89j43r6k83K17N35k05q5L39l9j98
$$ plain form
4218 58 414 423 -168 -389 -354 -569 -268 251 233 119 186 -45 -133 134 -13 -398 -213 -128 -248 86 522 355 308
4241 308 502 169 -321 -166 -153 -236 21 -4 -312 -207 146 219 273 189 -442 -635 -186 48 89 278 237 -165 95
4264 95 401 298 204 199 -110 -353 -154 -135 -51 158 75 -228 -190 -135 -177 103 306 -35 -321 -93 22 -23 422 440
4288 440 -17 -54 7 -2 186 394 136 -195 -359 -433 -278 244 154 -159 -128 -140 -269 131 425 82 -163 -148 -165
4311 -165 -54 288 402 286 210 -67 -295 -117 110 -12 38 -128 -456 -343 209 376 280 175 -169 -416 -207
4332 -207 184 254 143 61 -134 -120 119 208 255 200 -129 -475 -301 -52 51 238 310 -155 -475 -131 208 197 226
4355 226 8 -304 -333 -22 231 351 205 -71 -211 -213 -122 88 367 158 -170 -225 -187 -67 260 448 114 -298
4377 -298 -303 -165 143 286 248 -83 -215 -321 -155 264 293 25 -80 -149 -262 -68 305 339 61 -149 -335 -253
$$ packed form
4218E8L56Rn91k21L5k15L01N19j8j14O7k31q8K67j47l85J85Q5j20L34M36j67m7
4241C08J94l33m90J55J3q3K57k5l08J05L53P3N4q4o31j93M49K34M1J89m1m02K60
4264I5L06j03r4nl09k43J99J9Q4K09q3l03L8N5m2K80K03l41k86K28J15m5M45J8
4288D40m57l7O1rJ88K08k58l31j64p4J55N22r0l13L1j2j29M00K94l43k45J5j7
4311a65J11L42J14j16p6k77k28J78K27j22N0j66l28J13N52J67r6j05l44k47K09
4332b07L91P0j11q2j95J4K39Q9M7n5l29l46J74K49J03J87P2m65l20L44L39j1K9
4355B26k18l12k9L11K53J20j46k76j40kR1K10K79k09l28n5L8J20L27J88l34m12
4377b98nJ38L08J43l8l31j32j06J66M19K9k68j05o9j13J94L73L4k78k10j86Q2
$$ plain form
4399 -253 -9 362 297 29 -239 -302 -91 181 281 264 -9 -179 -317 -15 326 314 149 -64 -223 -320 3 308
4421 308 242 -22 -269 -410 -236 65 342 359 39 -283 -152 78 204 300 290 24 -297 -188 39 186 267 187
4443 187 -205 -483 -408 -98 179 221 -118 -427 -246 -141 230 556 386 25 -138 17 112 268 416 313 -79
4464 -79 -336 -218 -136 16 77 -83 -395 -700 -479 34 289 209 46 -142 -179 40 492 604 401 95 -78 -2
4486 -2 41 231 255 114 -278 -503 -485 -207 -62 -10 -113 -269 -424 -177 336 419 297 182 -59 -172 170 481
4508 481 487 238 31 -208 -284 -79 7 53 -79 -433 -600 -368 -91 110 295 103 -267 -193 85 329 351 337 154
4531 154 -87 -4 65 298 346 47 -195 -376 -409 -252 86 249 -73 -278 -196 -87 65 328 354 -48 -214 -161
4553 -161 69 287 277 162 -50 -140 -211 -105 150 34 -77 -44 -210 -323 80 442 258 -7 -126 -328 -169
$$ packed form
4399b53K44L71o5k68k68o3K11K72J00j7k73j70j38L02L41j2j65k13j59r7L23L05
4421C08o6k64k47j41J74L01K77J7l20l22J31K30J26R6j0k66l21J09K27J47Q1q0
4443A87l92k78P5L10K77M2l39l09J81J05L71L26j70l61j63J55R5J56J48j03l92
4464g9k57J18Q2J52O1j60l12l05K21N13K55q0j63j88l7K19M52J12k03l06j73P6
4486bM3J90K4j41l92k25J8K78J45N2j03j56j55K47N13Q3j22j15k41j13L42L11
4508D81Ok49k07k39p6K05Q6M6j32l54j67K32K77K01J85j92l70P4K78K44K2j4j83
4531A54k41Q3O9K33M8k99k42j81l3J57L38J63l22k05Q2J09J52K63K6m02j66N3
4553a61K30K18j0j15k12r0p1J06K55j16j11L3j66j13M03L62j84k65j19k02J59
$$ plain form
4574 -169 203 296 141 4 -187 -253 20 114 10 21 -80 -348 -218 269 346 203 281 56 -311 -19 191 140
4596 140 118 -4 -221 -160 -13 53 56 46 -314 -501 -265 -79 -87 261 371 12 -39 105 131 246 383 86 -168
4619 -168 -251 -53 102 373 173 -255 -352 -222 -345 -104 104 -152 -273 7 79 75 305 403 69 34 -31 -122 43
4642 43 269 249 57 74 -216 -282 50 55 -298 -225 -274 -430 -154 306 192 62 164 -102 -190 180 315 201 138
4665 138 43 -157 110 241 74 -33 -59 -336 -383 50 -2 -163 41 48 -182 -139 49 -44 55 278 74 -82 90
4688 90 50 139 346 128 -280 -191 -71 -118 128 182 -192 -217 27 39 -13 78 -21 -198 -115 84 47 102 270 42 -28
4713 -28 94 -149 -192 62 33 -130 5 46 -103 42 200 -14 -124 -15 -173 -187 139 122 -21 142 -23 -218
4735 -218 84 242 -11 -70 4 -243 -93 211 213 -54 -2 -16 -63 104 170 -142 -85 102 -12 -63 80 -47 -94 186
$$ packed form
4574a69L72R3j55j37j91o6K73R4j04J1j01k68J30M87P7j43P8k25l67K92K10n1
4596A40k2j22k17O1J47O6Lj0l60j87K36J86qL48J10l59n1J44K6J15J37k97k54
4619a68q3J98J55K71k00m28r7J30j23K41K08k56j21K80P2mK30R8l34l5o5r1J65
4642D3K26k0j92J7k90o6L32Nl53P3m9j56K76M60j14j30J02k66q8L70J35j14o3
4665A38r5k00K67J31j67j07k6k77m7M33n2j61K04Pk30M3J88r3R9K23k04j56J72
4688I0m0Q9K07k18m08Q9J20m7K46N4l74k5K44J2n2R1r9j77Q3J99l7N5J68k28p0
4713b8J22k43m3K54k9j63J35M1j49J45J58k14j10J09j58j4L26j7j43J63j65j95
4735b18L02J58k53n9P4k47J50L04Kk67N2j4m7J67O6l12N7J87j14n1J43j27m7K80
$$ plain form
4759 186 69 -115 -89 0 -79 50 79 -152 -195 49 102 135 131 -24 -153 2 5 -43 -12 88 -117 -55 160 18 9
4784 9 156 -3 -101 -51 -10 -20 66 196 7 -18 106 -17 -42 51 -84 -134 27 60 -78 80 163 23 10 58 -138
4809 -138 -169 73 23 -17 96 7 -49 88 89 -144 -164 -33 -183 -10 161 50 69 225 85 -22 16 -47 -168 -42
4833 -42 68 -17 128 185 160 102 70 -158 -282 -197 -177 -151 41 139 68 173 162 -3 -114 -94 -169 -177 -19 43 77 172
4859 172 258 88 30 -57 -126 -261 -213 -126 -86 98 213 86 160 124 -111 -86 -113 -197 -147 72 143 155 245 156 -20 -13
4885 -13 -66 -299 -189 -119 -32 25 182 112 17 61 -8 -118 -105 -180 -168 35 205 109 190 139 31 -18 -22 -179 -195 -89
4911 -89 -33 110 118 129 7 -8 44 -165 -199 -129 -1 96 126 233 96 113 66 -44 -138 -222 -170 -84 86 118 64 151 111
4938 111 -70 -137 -190 -241 -249 -20 22 128 189 209 137 47 -86 -209 -143 -108 -62 83 155 138 137 166 32 -189 -135 -195 -211
$$ packed form
4759A86j17j84K6Q9p9J29K9k31m3K44N3L3mj55j29J55Lm8L1J00k05O2K15j42r
4784IJ47j59r8N0M1j0Q6J30j89k5J24j23k5R3j35n0J61L3j38J58Q3j40j3M8j96
4809a38l1K42n0m0J13q9n6J37Jk33k0J31j50J73J71j11J9J56j40j07L8o3j21J26
4833d2J10q5J45N7k5n8l2k28j24Q5K0K6J92R8p1J05j1j65j11K0p5qJ58O2L4R5
4859A72Q6j70n8q7o9j35M8Q7M0J84J15j27P4l6k35K5k7q4N0K19P1J2R0q9j76P
4885a3n3k33J10P0Q7N7J57p0r5M4o9j10J3p5J2K03J70r6Q1n1j08m9mj57j6J06
4911h9N6J43QJ1j22j5N2k09l4P0J28R7L0J07j37J7m7j10r4q4N2Q6J70L2n4Q7m0
4938A11j81o7n3n1qK29M2J06O1K0p2r0j33j23O6L5M6J45P2j7jK9j34k21N4o0j6
$$ plain form
4965 -211 -72 69 51 218 255 101 -12 -92 -166 -153 -84 -67 -69 112 112 159 104 30 -140 -133 -125 -144 -93 -24 102 177 186 66
4993 66 -25 -90 -65 -104 -131 -128 -10 90 192 124 61 -47 -89 -83 -132 -101 -123 -9 177 139 156 150 -14 -41 -29 -107 -145 -92
5021 -92 38 80 111 109 25 -16 -20 -134 -92 -89 -78 0 198 183 84 92 79 0 -44 -58 -165 -4 64 80 50 192 29 -3 -37
5050 -37 -67 -187 -35 -23 -81 16 10 18 88 192 70 -45 -13 -69 -62 57 43 -131 -32 11 -42 23 -27 -44 -105 32 -24 -81
5078 -81 54 10 -12 43 48 -7 -11 110 4 -48 -4 -21 -87 40 65 -45 -7 101 -66 -15 70 -29 -10 62 -84 -120 65
5105 65 92 12 94 -19 -151 -28 32 -82 -132 54 -89 -20 104 81 -33 66 80 -35 16 56 -49 48 170 63
5129 63 -65 50 -152 -148 62 -28 -177 -37 25 -24 109 136 -102 -122 -24 11 1 159 39 9 117 99 -59 -45 41
5154 41 -191 -245 -59 -159 -124 86 72 -9 68 34 -82 -55 33 -76 34 185 19 37 252 144 -45 69 -178
$$ packed form
4965b11J39J41j8J67L7j54j13q0p4J3O9J7kJ81%M7n5p4j70PQj9N1O9J26P5Rj20
4993F6r1o5K5l9k7LJ18J00J02o8o3j08m2Om9L1k2J14J86l8J7oj64k7J2p8l8N3
5021i2J30M2L1kq4m1mj14M2LJ1P8J98j5r9Qj3p9m4j4j07J61O8J6l0J42j63l2l4
5050c7l0j20J52J2n8R7oQP0J04j22j15L2n6PJ19j4j74R9M3n3O5n0j7o1J37n6n7
5078h1J35m4k2N5Nn5mJ21j06n2M4j7o6J27K5j10L8J08j67N1Q5r9J9P2j46l6J85
5105F5K7q0Q2j13j32J23O0j14n0J86j43O9J24k3j14R9J4j15N1M0j05R7J22j07
5129F3j28J15k02MK10r0j49J40O2m9J33K7k38k0R8L5j0J58j20l0J08j8j58J4Q6
5154D1k32n4J86j00L5K10j4q1P7l4j16K7Q8j09J10J51j66J8K15j08j89J14k47
$$ plain form
5177 -178 -358 -85 74 -15 53 98 -98 31 159 -20 -191 -38 -168 -159 184 164 64 178 186 -63 -70 -145 -246 -163
5201 -163 60 75 -34 104 161 92 135 105 -173 -160 -82 -44 140 209 95 -98 -2 -9 -128 -112 -129 -308 -153 119 109
5226 109 166 316 117 -27 -6 -26 -105 100 103 46 83 200 24 -32 -33 -255 -333 -214 -302 -296 62 182 117 204 188 -83
5252 -83 -15 186 56 44 127 11 142 398 270 2 -95 -238 -438 -355 -221 -281 -162 104 19 18 158 96 -24 109
5276 109 45 -104 42 239 265 321 366 107 -86 -100 -146 -271 -193 -299 -377 -175 4 25 63 73 -72 -122 -6 88
$$ packed form
5177a78j80K73J59q9O8M5j96J29J28j79j71J53j30RL43k0j00J14Qk49pp5j01Q3
5201a63K23J5j09J38N7o9M3l0k78J3P8L8J84O9j14j93R6pj19J6j7j79J55K72j0
5226A09N7J50j99j44K1k0p9K05Ln7L7J17j76n6jk22p8J19q8OL58J20o5Q7j6k71
5252h3O8K01j30j2Q3j16J31K56j28k68r7j43k00Q3J34o0J19K66q5jJ40o2j20J33
5276A09o4j49J46J97K6N6M5k59j93j4m6j25P8j06p8K02J79K1L8J0j45n0J16R4
$$ [...]
8191e8
##END NTUPLES=NMR FID
##END=
