##TITLE=1H_AEDM2907
 CDCl3, 8 sc, 
 29.7.2019
##JCAMPDX= 6.0         $$ Bruker NMR JCAMP-DX V2.0
##DATA TYPE= NMR FID
##DATA CLASS= NTUPLES
##ORIGIN= UXNMR, Bruker Analytische Messtechnik GmbH
##OWNER= root
$$ XWIN-NMR		Version 3.5
$$ Mon Jul 29 15:58:52 2019 Russian Standard Time (UT+4h)  she@DPX200
##.OBSERVE FREQUENCY= 200.13155
##.OBSERVE NUCLEUS= ^1H
##.DELAY= (6, 6)
##.ACQUISITION MODE= SIMULTANEOUS
##.ACQUISITION SCHEME= undefined
##.AVERAGES= 8
##.DIGITISER RES= 18
##SPECTROMETER/DATA SYSTEM= spect
##.PULSE SEQUENCE= zg30
##.SOLVENT NAME= CDCl3
##.SHIFT REFERENCE= (INTERNAL, CDCl3, 0, 15.7039)
##AUDIT TRAIL= $$ (NUMBER, WHEN, WHO, WHERE, WHAT)
$$ ##TITLE= Audit trail, XWIN-NMR		Version 3.5
$$ ##JCAMPDX= 5.01
$$ ##ORIGIN= Bruker BioSpin GmbH
$$ ##OWNER= she
$$ F:/spectra/data/she/nmr/H-F/1/audita.txt
$$ ##AUDIT TRAIL=  $$ (NUMBER, WHEN, WHO, WHERE, WHAT)
(   1,<2019-07-29 15:57:46.84 +0400>,<she>,<DPX200>,
      <created by zg, POWCHK disabled, PULCHK disabled
       configuration hash MD5:
       00 E9 B6 7A A2 85 ED C7 34 08 36 98 17 FE 4E 26
       data hash MD5: 16K
       51 B8 B8 DA 5B 24 E0 AE 98 CD 6E 38 27 87 35 EA>)
$$ ##END=
$$ 
$$ hash MD5
$$ 5C 7F 59 40 78 45 93 F9 09 3C 05 27 76 A1 D2 BA
##$RELAX= 
##$RELAX= 
##$RELAX= 
##$RELAX= 
##$RELAX= 
##$RELAX= 
$$ Bruker specific parameters
$$ --------------------------
##$DU= <F:/spectra>
##$EXPNO= 1
##$NAME= <H-F>
##$PROCNO= 1
##$TYPE= <nmr>
##$USER= <she>
##$AMP= (0..31)
100 100 100 100 100 100 100 100 100 100 100 100 100 100 100 100 100 100 
100 100 100 100 100 100 100 100 100 100 100 100 100 100 
##$AQSEQ= 0
##$AQ_mod= 1
##$AUNM= <au_zg>
##$AUTOPOS= <>
##$BF1= 200.13
##$BF2= 200.13
##$BF3= 200.13
##$BF4= 200.13
##$BF5= 200.13
##$BF6= 200.13
##$BF7= 200.13
##$BF8= 200.13
##$BYTORDA= 1
##$CFDGTYP= 0
##$CFRGTYP= 5
##$CHEMSTR= <none>
##$CNST= (0..31)
1 1 145 1 1 1 1 1 1 1 1 1 1 1 1 1 1 1 1 1 1 1 1 1 1 1 1 1 1 1 1 1 
##$CPDPRG= <>
##$CPDPRG1= <>
##$CPDPRG2= <>
##$CPDPRG3= <>
##$CPDPRG4= <mlev>
##$CPDPRG5= <mlev>
##$CPDPRG6= <mlev>
##$CPDPRG7= <mlev>
##$CPDPRG8= <mlev>
##$CPDPRGB= <>
##$CPDPRGT= <>
##$D= (0..31)
0 1.2 0 0 0 0 0 0 0 0 0 0.03 0 0 0 0 0 0 0 0 0 0 0 0 0 0 0 0 0 0 0 0 
##$DATE= 1564401466
##$DBL= (0..7)
120 120 120 120 120 120 120 120 
##$DBP= (0..7)
150 150 150 150 150 150 150 150 
##$DBP07= 0
##$DBPNAM0= <>
##$DBPNAM1= <>
##$DBPNAM2= <>
##$DBPNAM3= <>
##$DBPNAM4= <>
##$DBPNAM5= <>
##$DBPNAM6= <>
##$DBPNAM7= <>
##$DBPOAL= (0..7)
0.5 0.5 0.5 0.5 0.5 0.5 0.5 0.5 
##$DBPOFFS= (0..7)
0 0 0 0 0 0 0 0 
##$DE= 6
##$DECBNUC= <off>
##$DECIM= 24
##$DECNUC= <off>
##$DECSTAT= 4
##$DIGMOD= 1
##$DIGTYP= 9
##$DL= (0..7)
0 120 120 120 120 120 120 120 
##$DP= (0..7)
150 150 150 150 150 150 150 150 
##$DP07= 0
##$DPNAME0= <>
##$DPNAME1= <>
##$DPNAME2= <>
##$DPNAME3= <>
##$DPNAME4= <>
##$DPNAME5= <>
##$DPNAME6= <>
##$DPNAME7= <>
##$DPOAL= (0..7)
0.5 0.5 0.5 0.5 0.5 0.5 0.5 0.5 
##$DPOFFS= (0..7)
0 0 0 0 0 0 0 0 
##$DQDMODE= 0
##$DR= 18
##$DS= 0
##$DSLIST= <SSSSSSSSSSSSSSS>
##$DSPFIRM= 0
$$ [...]
##$SUBNAM2= <"">
##$SUBNAM3= <"">
##$SUBNAM4= <"">
##$SUBNAM5= <"">
##$SUBNAM6= <"">
##$SUBNAM7= <"">
##$SUBNAM8= <"">
##$SUBNAM9= <"">
##$SW= 24.9336996594482
##$SWIBOX= (0..15)
0 0 2 0 0 0 0 0 0 0 0 0 0 0 0 0 
##$SW_h= 4990.01996007984
##$TD= 16384
##$TD0= 1
##$TE= 0
##$TE2= 300
##$TE3= 300
##$TEG= 300
##$TL= (0..7)
0 120 120 120 120 120 120 120 
##$TP= (0..7)
150 150 150 150 150 150 150 150 
##$TP07= 0
##$TPNAME0= <>
##$TPNAME1= <>
##$TPNAME2= <>
##$TPNAME3= <>
##$TPNAME4= <>
##$TPNAME5= <>
##$TPNAME6= <>
##$TPNAME7= <>
##$TPOAL= (0..7)
0.5 0.5 0.5 0.5 0.5 0.5 0.5 0.5 
##$TPOFFS= (0..7)
0 0 0 0 0 0 0 0 
##$TUNHIN= 0
##$TUNHOUT= 0
##$TUNXOUT= 0
##$USERA1= <user>
##$USERA2= <user>
##$USERA3= <user>
##$USERA4= <user>
##$USERA5= <user>
##$V9= 5
##$VALIST= <valist>
##$VCLIST= <CCCCCCCCCCCCCCC>
##$VD= 0
##$VDLIST= <DDDDDDDDDDDDDDD>
##$VPLIST= <PPPPPPPPPPPPPPP>
##$VTLIST= <TTTTTTTTTTTTTTT>
##$WBST= 1024
##$WBSW= 4
##$XGAIN= (0..3)
0 0 0 0 
##$XL= 0
##$YL= 0
##$YMAX_a= 631755
##$YMIN_a= -502122
##$ZGOPTNS= <>
##$ZL1= 120
##$ZL2= 120
##$ZL3= 120
##$ZL4= 120
##$ABSF1= 10
##$ABSF2= 0
##$ABSG= 5
##$ABSL= 3
##$ALPHA= 0
##$AQORDER= 0
##$ASSFAC= 0
##$ASSFACI= 0
##$ASSFACX= 0
##$ASSWID= 0
##$AUNMP= <proc_1d>
##$AZFE= 0.1
##$AZFW= 0.1
##$BCFW= 1
##$BC_mod= 2
##$BYTORDP= 1
##$COROFFS= 0
##$CY= 11.3945322036743
##$DATMOD= 1
##$DC= 2
##$DFILT= <>
##$DTYPP= 0
##$F1P= 20.1537800932815
##$F2P= 0.134698688090026
##$FCOR= 0.5
##$FTSIZE= 0
##$FT_mod= 4
##$GAMMA= 1
##$GB= 0.15
##$INTBC= 1
##$INTSCL= 1
##$ISEN= 128
##$LB= 0.24
##$LEV0= 0
##$LPBIN= 0
##$MAXI= 10000
##$MC2= 0
##$MEAN= 0
##$ME_mod= 0
##$MI= 1.114404
##$NCOEF= 0
##$NC_proc= 0
##$NLEV= 6
##$NOISF1= 3.799351
##$NOISF2= 2.8
##$NSP= 1
##$NTH_PI= 0
##$NZP= 0
##$OFFSET= 15.70392
##$PC= 1
##$PHC0= -9375.848
##$PHC1= 10.00097
##$PH_mod= 1
##$PKNL= yes
##$PPARMOD= 0
##$PSCAL= 0
##$PSIGN= 0
##$REVERSE= no
##$SF= 200.130013532006
##$SI= 16384
##$SIGF1= 3
##$SIGF2= 2
##$SINO= 400
##$SIOLD= 16384
##$SREGLST= <1H.CDCl3>
##$SSB= 0
##$STSI= 0
##$STSR= 0
##$SW_p= 3612.71676300578
##$SYMM= 0
##$S_DEV= 0
##$TDeff= 0
##$TDoff= 0
##$TI= <>
##$TILT= no
##$TM1= 0
##$TM2= 0
##$TOPLEV= 0
##$USERP1= <user>
##$USERP2= <user>
##$USERP3= <user>
##$USERP4= <user>
##$USERP5= <user>
##$WDW= 1
##$XDIM= 8192
##$YMAX_p= 0
##$YMIN_p= 0
$$ End of Bruker specific parameters
$$ ---------------------------------
##NTUPLES= NMR FID
##VAR_NAME=  TIME,          FID/REAL,        FID/IMAG
##SYMBOL=    X,             R,               I
##VAR_TYPE=  INDEPENDENT,   DEPENDENT,       DEPENDENT
##VAR_FORM=  AFFN,          ASDF,            ASDF
##VAR_DIM=   8192,          8192,            8192
##UNITS=     SECONDS,       ARBITRARY UNITS, ARBITRARY UNITS
##FACTOR=    0.0002004,     1,               1
##FIRST=     0,             0,               0
##LAST=      1.6414764,     0,               0
##MIN=       0,             -502122,         0
##MAX=       1.6414764,     631755,          0
$$ Real data points
##PAGE= N=1
##DATA TABLE= (X++(R..R)), XYDATA
0@%%%Qj6J6j6K4l8M7n7P2r6J21j44J75k14K55k98L52m15M88n67O49p47Q63r84
27e22J116j269J437j624J827k047K295k567K859l180L538l928M354m825N344n918
43c110O553p256Q044q934R938j1085J2414j3969J5821j8067K0861k4457K9271
56A6024l6090M6585o4990J06536l58477K4531P32100j74314k70087j9140n7663
67e4985l20403K16158N87680K4216o55122k46222L23013J94315n4793K03255J31373
78C48485m03724l96725L13806M50092j29654l18675O9094Q6233j69380M7147L78492
89B75191J9999m33204j35929L29284J16773k23384l8062J48457r5743j39022K39139
100F3499K62508k29914l53261Q1190K63435L066p6953N0555p8195k32947O0792
$$ plain form
0 0 0 0 0 8 -8 8 -8 16 -22 25 -32 40 -56 65 -79 96 -118 137 -161 191 -224 264 -303 346 -401 462 -522
27 -522 594 -675 762 -862 965 -1082 1213 -1354 1505 -1675 1863 -2065 2289 -2536 2808 -3110
43 -3110 3443 -3813 4231 -4703 5235 -5850 6564 -7405 8416 -9651 11210 -13247 16024
56 16024 -20066 26519 -38471 68065 -290412 -265881 466219 291905 21818 2678 -54985
67 -54985 -375388 -159230 428450 452666 -202456 -448678 -125665 68650 13857 217112 348485
78 348485 -55239 -451964 -138158 311934 182280 -136395 -67301 18932 -150448 -103301 275191
89 275191 295190 -138014 -273943 55341 172114 -51270 -89332 59125 -36618 -175640 63499
100 63499 326007 96093 -257168 -175978 87457 90523 13570 64125 -14070 -247017 -186225
111a86225L84437J44720k69591k45244q678M3540R3855K29709Q5549k88932l03499
122c20359R8231L13985J43534m4708j22246k15755j67403J45712L45938J23025
132B99954j99687k30496o8132P3609J86089J87777m1157k75007j92927Q0578K01678
143B2279J37803K7609j14325k05583o6092J80380J88728k8160j43435r1499l9096
154a31391L1892J59883J36220r8328k05560k3818J32026O3155j8012p993o0532
165b2458j14151L0853J95176P4739j45437j14160M0795M2510N065P0836L4010
176I7778j52905j42227J24535K14692j697j35311m6999j0804m7837O5356J80485
187A45066O251k24901j20933J32744J43929J3987l200k6999j50291j10361J42033
$$ plain form
111 -186225 198212 342932 73341 -171903 -180581 -137041 -43186 186523 272072 -16860 -320359
122 -320359 -222128 91857 235391 190683 68437 -147318 -314721 -169009 176929 299954
132 299954 100267 -130229 -198361 -124752 61337 249114 207957 -67050 -259977 -179399 22279
143 22279 160082 187691 73366 -132217 -198309 -17929 170799 142639 -796 -92295 -131391
154 -131391 -99499 60384 196604 98276 -107284 -131102 924 64079 46067 38074 -22458
165 -22458 -136609 -105756 89420 164159 18722 -95438 -54643 -12133 -7068 63768 97778
176 97778 -55127 -197354 -72819 141873 140176 4865 -42134 -52938 -100775 -35419 145066
187 145066 151317 -73584 -194517 -61773 82156 96143 92943 65944 -84347 -194708 -52675
198e2675K15156j5657j68667o9477K2894J7669Q2167J33146l2984k14000j01582
209a84010J25321J28814L157j8153k2554j00410o4549J19135J54868l7014j48427
220d3822m9769L8478K6034M5416P0512k4497j19612l9690Q7228O6510j9313k9758
232G717k3996m5906l4Q6958N6462n8184o8239J4519L2982J406J6663J8392m9126
245a0386o0346L8326Q3419K156n1861j2717L535j8458J8952O1980m815q3467k9353
258f3035N8809L7922j1759N570O35n8118l4541O8305O4450m4035n9681J9272J9270
271C064l0160J6508P1654j2152r8214j7156Q0602K2322n1242K386M0427l3251
283e212n1398M5922O4879l7629n8038L0902L4752m2853k0003O0682J9942o4011
$$ plain form
198 -52675 162481 146824 -21843 -91320 -68426 -50757 31410 164556 131572 -82428 -184010
209 -184010 -58689 70125 73282 55129 32575 -67835 -132384 -13249 141619 104605 -43822
220 -43822 -93591 -55113 -29079 16337 86849 62352 -57260 -96950 -9722 56788 37475 7717
232 7717 -16279 -62185 -62219 24739 81201 23017 -45222 -30703 2279 3685 20348 38740 -10386
245 -10386 -70732 -32406 51013 53169 1308 -11409 -7874 -26332 -7380 54600 49785 -33682 -63035
258 -63035 -4226 33696 21937 27507 28142 -29976 -64517 3788 68238 24203 -35478 -16206 3064
271 3064 -27096 -10588 61066 48914 -49300 -66456 14146 36468 -14774 -12388 28039 -5212
283 -5212 -56610 -10688 54191 16562 -41476 -10574 24178 -18675 -38678 22004 41946 -22065
295b2065j6901O1137O418o0687P076O6633j1519o8210J0454N8449j5228m2273
307b6716L5030M0155n2753n1960N1567N8647l5157m3530K6476J5784m1143j173
319b4773O4971J1639p1682l2626M8204L1672j7422j004J0622l5564l6596M0477
331a2082O2402j5501n7692r736K1086J285J1312L8518m881p0362l5105N6469O0962
344D6675j1483l9919j5643q417k817L7825N0574j5219p2755l4075L9269N1890
356B5905J7117j1317l2863m2960n750N6633N8862j1913o5334m4520J1109M6675
368A644M7824J2338m4770o5479j3994N5573O2518O621m7280n7191k3039L4310
380c0925P1029M0032l9903q1910l7235M3143P3474L2488l3530o8237m4245K1724
$$ plain form
295 -22065 -38966 22171 28589 -32098 -25022 41611 30092 -38118 -27664 30785 15557 -26716
307 -26716 8314 48469 -4284 -56244 -4677 53970 18813 -24717 1759 17543 -23600 -24773
319 -24773 40198 51837 -19845 -52471 -4267 27405 9983 8979 19601 -15963 -52559 -12082
331 -12082 50320 34819 -22873 -32609 -11523 -10238 1074 39592 34711 -35651 -70756 -14287 46675
344 46675 35192 -4727 -20370 -28787 -31604 6221 56795 41576 -31179 -65254 -25985 25905
356 25905 43022 31705 -1158 -44118 -49868 6765 65627 53714 -11620 -56140 -45031 1644
368 1644 49468 61806 17036 -48443 -62437 -6864 55654 62275 14995 -42196 -65235 -30925
380 -30925 40104 80136 40233 -41677 -78912 -35769 37705 70193 36663 -31574 -75819 -54095
392e4095P2622N7588j4750p6192o5323R475P6648O7758q581p5520o6506M449O8864
405c563P1733J1361o2962q3257k1627O4905Q6130K1054n9703p9173k7255M9082
417c3275Q5578M3817m6465r5176m8503M4510Q9011M9726k9987q3225o2378K2877
429f3490R2930O9000k7218r1769o5324J3357P3945P5599J0923p5845r5022j0416
441i3330Q9119R0383J28p8909q0908j9522N7980R3392M2239n9373j04231l9894
453a02926O1529R5100M0085m7213r4600n8510L9173J05572O7179l7924r9477o3755
465i5767K5735Q8614P3328j1950r3265q5323J0861R7112Q6398l391q4315q6494
477g8457j2497P4346R3919K2401p4359j00001k6904P3704J03021L3489o6790j00241
$$ plain form
392 -54095 18527 76115 61365 -14827 -80150 -70675 5973 73731 65150 -10370 -76876 -72427 -3563
405 -3563 68170 79531 16569 -66688 -88315 -23410 62720 83774 24071 -55102 -82357 -33275
417 -33275 52303 96120 49655 -45521 -94024 -49514 39497 89223 59236 -23989 -86367 -63490
429 -63490 29440 98440 71222 -20547 -85871 -72514 1431 77030 87953 12108 -82914 -93330
441 -93330 -4211 86172 86300 7391 -73517 -93039 -35059 58333 100572 41199 -63032 -102926
453 -102926 -41397 53703 93788 46575 -48025 -106535 -67362 38210 105389 67465 -32012 -95767
465 -95767 -70032 18582 91910 79960 -13305 -98628 -87767 9345 95743 92352 8037 -78457
477 -78457 -90954 -16608 77311 99712 25353 -74648 -101552 -27848 75173 108662 41872 -58369
489e8369m0598N1218R2924N2257l7040r8368o7309L6849J08143O8112l7895r9318
501b9394o7223J7801Q5132Q0813j824r0973q9564O677R1165Q0979J206p2306q7503
514g5014k7218O9294J05494K9025p7758r5159j8659O0897Q1476M0133m0797r9625
526d7911o0938N2187J10279M7333n2316q4592m3728K3243P7304P1900j3192r9457
538a9888q0704K6555R8044O6456j7299p5885p1354m979P4441Q5888O710q1467
550F518q5548q207P0460Q3717K4243n9518r2121l6197N7696R5228L7717n6145
562C7843r3082m0302M7006Q6813M9459k8492q3602o7817J6175R3262P5687k4133
574F8817r2141n9957J8635O5588O4406J8368o1053r7656k2617Q7261Q9270o485
$$ plain form
489 -58369 -98967 -47749 45175 97432 60392 -37976 -105285 -68436 39707 107819 69924 -29394
501 -29394 -96617 -78816 6316 87129 85305 -5668 -95232 -88555 2610 83589 84795 12489 -75014
514 -75014 -102232 -32938 72556 101581 23823 -71336 -89995 -29098 52378 92511 51714 -47911
526 -47911 -108849 -56662 53617 100950 48634 -35958 -79686 -56443 20861 92761 79569 -19888
538 -19888 -100592 -74037 24007 90463 73164 -2721 -74075 -79054 -4613 81275 87985 6518
550 6518 -79030 -87237 -16777 66940 91183 31665 -60456 -96653 -38957 56271 93988 37843
562 37843 -55239 -95541 -48535 38278 87737 59245 -24357 -92174 -75999 17263 92950 68817
574 68817 -23324 -83281 -64646 942 65348 83716 22663 -74993 -97610 -10349 78921 72436
586G2436o6170m9145j6797K0419P2655O3223m3575j10444l2899P2477O4906L473
598E0559j6871l3967o1073p785R4057P4844n7299r6402l937M5737J5455K2450
610B5768L9170m0669j05934m255J20250N8763p1647o0340J0761l974p744P3294
622C3443O7880p8651j23620K3404J11207K3021l9659L52j7624p8957O81J32866
634E4343O7124j03848r6829L3000M5783o231L7875N6548o9143j27323K5528J38667
646E5494L0893p6281k1236J3678n0560j8719J08825P4210r9318j08604M5929P8349
658C2660j6954j3020M6233k3070r9356L986J17069K8912q8277l0724M8123n403
670A79l5161M8345N3723o6233p8706N1831Q0349l0501n4766K6113J9966m5029
$$ plain form
586 72436 6266 -42879 -59676 -39257 33398 96621 53046 -57398 -90297 -17820 47086 50559
598 50559 33688 -279 -61352 -69137 24920 99764 42465 -53937 -57874 -12137 3318 25768
610 25768 64938 24269 -81665 -85920 34330 93093 21446 -38894 -28133 -32107 -39851 33443
622 33443 101323 22672 -100948 -77544 33663 56684 17025 17377 -247 -79204 -78523 54343
634 54343 121467 17619 -79210 -46210 -427 -6658 31217 87765 18622 -108701 -83173 55494
646 55494 86387 10106 -11130 2548 -48012 -66731 42094 116304 16986 -91618 -45689 32660
658 32660 15706 2686 48919 25849 -73507 -69521 47548 76460 -11817 -42541 5582 179
670 179 -34982 13363 67086 853 -77853 -26022 54327 23826 -30940 -4827 15139 -29890
682b9890K47P5469P387q9256k9898P0364L4786l5042n403K0839l5605m1471N1316
695f157P3717k5688p3510q155L2004M905J0239L6921q416o8545k6683N3486M6611
708D0729r923k0523j1317k6425j3838M1904N0540j2908n1006j9731J3517J4771
720d210J6503J7949j0723l7508j7260K1291K6989Q016o777j6790j7539J073J8664
733c22J1701k994n035o786j1229K135J8801N933j4785l875J1813l823j6032P052
747g446K0152n722j5666J0025J1454j9244j3847K4238J9164j9756j4727J4921
759C546J026k0549R814L4172p870l9405P96L0557m116j9938J8761K0307l1213
772d112k9154K9787L1681k2760k1790K2184Q778l1385n083L7673O417l4597l681
$$ plain form
682 -29890 -29643 45826 53213 -36043 -65941 4423 39209 4167 -1236 19603 -16002 -57473 -6157
695 -6157 67560 41872 -31638 -39793 -7789 -2884 7355 44276 35860 -32685 -59368 -5882 40729
708 40729 30806 10283 -1034 -27459 -41297 607 51147 38239 -12767 -32498 -18981 -4210
720 -4210 12293 30242 19519 -17989 -35249 -13958 13031 21047 14270 -2520 -20059 -18986 -322
733 -322 11379 8385 3350 -3436 -14665 -12530 6271 12204 -2581 -6456 5357 1534 -14498 -7446
747 -7446 12706 6984 -8682 1343 12797 -6447 -20294 3944 23108 3352 -11375 3546
759 3546 4572 -15977 -6163 28009 20139 -19266 -18470 12087 7971 -11967 6794 27101 -4112
772 -4112 -33266 -3479 28202 5442 -16348 5836 14614 -16771 -21854 15819 22236 -12361 -16042
785a6042K8826o487k9267J3405L2629j2825k9108J2067J7997j9909j1559L2004
797A1731J6510l3153k1415K1637J1845j3041R121K2670j9402l9853R309M1357
809A7316O643j9949k299j210k1886j306L9634K2249k9076l0332K690R824O421
822a281K1148J2540k9850l6440J0498L4101Q932o823k285j6245k5442J1532M2430
835B2815J0152l1911j9777O386K891N330K3871O138l5744k5478K4707K8772o510
848A1642j1314K556j1954j7153K1530L6258j2219m0977k177K6082M029m081J5040
861A7262m159l9905q857M8975K8784l2870l0182J0434N523p384K4346L1501k9618
874A3850n6663O346N2795J5194j9765m873q292l2519J251N8926L0707m7325m7249
$$ plain form
785 -16042 12784 6297 -22970 -9565 23064 10239 -18869 -6802 11195 -8714 -20273 11731
797 11731 28241 -4912 -26327 -4690 7155 -5886 3235 25905 6503 -33350 -24041 17316
809 17316 23959 4010 1711 501 -21385 -22691 16943 39192 10116 -20216 -17526 -7702 -1281
822 -1281 19867 32407 2557 -33883 -23385 10716 19648 12825 10540 -5705 -31147 -19615 22815
835 22815 32967 1056 -18721 -12335 -9444 -4114 19757 25895 -9849 -35327 -10620 18152 11642
848 11642 328 2884 -9070 -26223 -4693 31565 19346 -21631 -23808 2274 6303 2222 17262
861 17262 13103 -26802 -35659 13316 42100 9230 -20952 -10518 -4995 -12379 11967 43468 13850
874 13850 -42813 -36467 16328 31522 11757 6884 -1408 -33927 -32676 26250 56957 9632 -37617
887c7617J2468K3342K176J8010K2077l4779n9418J1883O6504J9735l5429j9372
899a0420q61j7017K525N1982K8855n0415n4325J7590M2906O805l725N592k3236
912c744m1512J3171O2206J8565m4691l2550Q810J0589Q511K7659R959m4253m1969
925d9249K5203N1336O868k5300j4241j0446j2458J9898M6159N328n1266l5950
937d4118K1026L5965J1942j872j2553l1525k0365K9384M8716M217m0440l1142
949c0765J718J9061K5568K0040j2465m4125k5695K6158M4285J3151k1403k9854
961a4326j9100N153L3466L3545o409m2649l0547J2358L5475K3810k238k5607l1667
974b8736q122K9937M0001O035l4243l5693k777K7396L0375R987j9055l4267j7947
$$ plain form
887 -37617 -25149 -1807 369 18379 40456 5677 -53741 -41858 24646 44381 8952 -10420
899 -10420 -11281 -28298 -25773 26209 55064 4649 -49676 -32086 10820 17625 13900 19492 -3744
912 -3744 -45256 -32085 30121 48686 3995 -28555 -19745 -9156 -645 27014 36973 -7280 -49249
925 -49249 -24046 27290 34158 8858 -5383 -15829 -28287 -8389 37770 43098 -8168 -44118
937 -44118 -23092 12873 24815 22943 10390 -21135 -41500 -12116 36600 40817 377 -30765
949 -30765 -29047 -9986 15582 35622 23157 -20968 -46663 -20505 23780 36931 15528 -14326
961 -14326 -33426 -28273 5193 38738 32329 -10320 -40867 -28509 6966 30776 28538 2931 -28736
974 -28736 -36858 -6921 33080 39115 4872 -30821 -33598 -6202 24173 34160 15105 -19162 -37109
987c7109J9784L9555J7354k1799l6400j5600J5767L1903K1371r499l5401k6923
999c6997J1254L7351K3753j1264l1067k3541K260K7929L0975K041l2993l3316
1011c3615J854L1071K7360J627k2212k9443j1772K1975L7269J2075k6347l4555
1023b4713p934K0635K8142J4217j1961l1427k1694J3025L5668K0337j3751l0706
1035a0162j9472P226K8084K5009l539l0497k6260M605K8516K3627o58k2948k6296
1048b2765o029K3134L0640O013k4359k8937n797K0170K6418R979j6046k8631j4110
1061c0320J5658K9671J4131j4523k7961j4748J0695K6170J7509p637k6186j9655
1073b7196N673K5576K0704l563k4240k1837K187K3078K1712k1k0692k1515k779
$$ plain form
987 -37109 -17325 22230 39584 17785 -18615 -34215 -18448 13455 34826 25327 -10074 -36997
999 -36997 -25743 11608 35361 24097 -6970 -30511 -28251 -322 30653 32694 -299 -33615
1011 -33615 -31761 -690 26670 28297 6085 -23358 -35130 -13155 24114 36189 9842 -24713
1023 -24713 -32647 -12012 16130 30347 18386 -13041 -34735 -21710 13958 34295 20544 -10162
1035 -10162 -29634 -22408 5676 30685 27146 -3351 -29611 -25006 3510 27137 26479 3531 -22765
1048 -22765 -28794 -5660 24980 30993 6634 -22303 -28100 -7930 18488 28467 12421 -16210 -30320
1061 -30320 -14662 15009 29140 14617 -13344 -28092 -17397 8773 26282 18645 -7541 -27196
1073 -27196 -21523 4053 24757 21194 -3046 -24883 -22696 382 22094 22073 1381 -20134 -22913
1086b2913J8208K2393O255j6445k3666p918J5810K4047Q546j4369k2674r472J1812
1099a0386K1544J1569r033k1220j3463P195K0699J4281n419j9941j5537L568J9132
1112B989J6309k476j8083j6210M88J5784J6624J983j4769j8284l372J4996J7707
1125A3686K980j2752j5684n464R020J6600R245q838j8956q831J0472J7053O982
1138A5513p426j3357r390L363J4412J2376l376j5514j0572L487J2511J0027M63
1151A2517j0605j3503j852J3227J3427j040j1517q864r62N709R964O652o107j4940
1165g894n721J0241J1991J012o292o494m987J0R737J0339l772j4024n743P285
1179d312P721J590k28l366q339l642R679J0929l274j0623k996L415J723L311N884
$$ plain form
1086 -22913 -4705 17688 23943 7498 -16168 -24086 -8276 15771 24317 9948 -12726 -22198 -10386
1099 -10386 11158 22727 13694 -7526 -20989 -13794 6905 21186 15767 -4174 -19711 -16143 2989
1112 2989 19298 16822 -1261 -17471 -16983 -1199 15425 17408 2639 -15645 -19017 -4021 13686
1125 13686 16666 3914 -11770 -17234 -8214 8386 17631 8793 -10163 -18994 -8522 8531 15513
1138 15513 8087 -5270 -14660 -11297 3115 15491 12115 -3399 -13971 -10484 2027 12054 12517
1151 12517 1912 -11591 -13443 -216 13211 12171 654 -8210 -9172 -3463 6501 13153 7046 -7894
1165 -7894 -13615 -3374 8617 9629 3337 -3157 -8144 -8134 1603 11942 8170 -5854 -11597 -4312
1179 -4312 3409 4999 4771 1405 -6934 -10576 -897 10032 6758 -3865 -6861 -3446 -1723 1588 7472
1194G472k703j1917l431J1334P751n475n262K234j251m861N267J0956l355j3559
1208f800j167J0868K472n807J490L721o657o574Q864R713o598r768M130N895n000
1223a218k568Q669J767j1521l369J1133L794r356j847Q449j181r803L205J0932
1237G086l629j0746L965R675n591r061P179R173p551q621P549O895q345m780J0210
1252C408M515j1422m915J0167M456q160p55P773k806j0038M084J2335k484j1207
1266e049J247P509l208m579P505N238j0213q221Q975R138n864n940M347R44o948
1281e119J311J0974J79j2079l504Q819L882m644Q6K877m874n846O361R551k942
1296E032r660j378M697J709J087L169j933q785k531Q595P850k693o873k516j26
$$ plain form
1194 7472 4769 -7148 -10579 755 8506 3031 -2231 3 -1248 -6109 -842 10114 6759 -6800
1208 -6800 -7967 2901 5373 -434 1056 4777 -1880 -8454 410 10123 3525 -6243 -2113 3782 -1218
1223 -1218 -3786 4883 6650 -4871 -8240 2893 6687 -2669 -4516 3933 2752 -7051 -3846 7086
1237 7086 3457 -7289 -3324 6351 760 -8301 -1122 8051 500 -8121 -572 6323 -2022 -6802 3408
1252 3408 7923 -3499 -8414 1753 6209 -1951 -2706 5067 2261 -7777 -3693 8642 6158 -5049
1266 -5049 -3802 3707 499 -4080 3425 8663 -1550 -9771 -796 8342 2478 -3462 885 1829 -5119
1281 -5119 -3808 7166 7345 -4734 -8238 581 4463 -181 -95 2782 -2092 -7938 -1577 7974 5032
1296 5032 -4628 -6006 -1309 400 1487 4656 2723 -6062 -8593 2 7852 5159 -1714 -4230 -4356
1311d356J487N703N754l365j0786m528P346R526J458n192n696l693N96O959Q440
1326I653o46j1236q331M119R859M625j817n002o700m106O174J2284K604j1109
1340C71r671J713O785M829K941j415r496q178O051J3302K606q559o483o79N57
1355e326M599R315Q70j3161r516P684J1919Q62n014k706m075m213O689J2868J5
1370A0810j4032p726O195P540K668J706k986j1019n733J1140J3674j982j1471
1383a216n764N52K517Q112Q560n349j5912n389J0958J1116J034m281p014q651
1397a0727NJ3567J1733n830j4410n856M466P516P743K674r021j3579r13J2390
1411b42J0254r88p296q424m684N793J3445N068r921j1098j051N843O649N648j229
$$ plain form
1311 -4356 -2869 2834 8588 5223 -5563 -10091 -2745 6781 8239 3047 -2649 -6342 -5746 1213 9653
1326 9653 9007 -2229 -10560 -6441 3418 8043 6226 1224 -5476 -9582 -3408 8876 11480 371
1340 371 -9300 -7587 -802 4027 6968 5553 -3943 -12121 -6070 7232 9838 1279 -5204 -5883 -5326
1355 -5326 -727 8588 9458 -3703 -13219 -5535 6384 7246 2232 -474 -4549 -8762 -2073 10795 10810
1370 10810 -3222 -10948 -4753 2787 5455 7161 4175 -6844 -12577 -1437 12237 10255 -1216
1383 -1216 -6980 -6428 -3911 4201 12761 7412 -8500 -13889 -2931 8185 9219 4938 -2076 -10727
1397 -10727 -10722 2845 14578 8748 -5662 -11518 -7052 464 8207 10881 1860 -11719 -12632 -242
1411 -242 10012 9024 1728 -6696 -11380 -5587 7858 12926 3005 -8093 -9144 -3301 3348 8996 7767
1426G767j1196q895O110J2662L489n992o137m501o78P980J0509j822j3515o494
1440a0713O599P477K647R20m490j0928l383J2678J1968m762j1723l659J699K252
1454c418Q025Q121p407j7180k177J4658R299l386m781m147p624m09J5005J1546
1468A6125r838j6057j085Q100M625M261M115q114j5582N00J7535Q879q242q188
1482b966j237k340N82J2228Q721j1419j5897K367J2880L825k520J23m473j0037
1496a0163J616J5636O493j1626j0101K705M487J357M728L418r060j1632M742J4023
1510F623K659p830m444r89j937L325J0476K202j2358r244N881R537J467j712j799
1525A857o214n650O454J2672R67j1038p276K609M762M259L908j818r848o177O578
$$ plain form
1426 7767 -3429 -12324 -6214 6448 9937 3945 -2192 -6693 -7371 609 11118 9296 -4219 -10713
1440 -10713 -4114 3363 6010 6930 2440 -8488 -11871 807 12775 8013 -3710 -7369 -5670 -3418
1454 -3418 4607 12728 5321 -11859 -14036 622 9921 6535 1754 -2393 -10017 -10426 4579 16125
1468 16125 6287 -9770 -10855 -2755 1870 6131 10246 2132 -13450 -12950 4585 13464 5222 -2966
1482 -2966 -4203 -6543 -5961 6267 14988 3569 -12328 -9961 2919 6744 4224 4347 -126 -10163
1496 -10163 -8547 7089 13582 1956 -8145 -5440 -953 404 5132 8550 -510 -12142 -7400 6623
1510 6623 9282 1452 -2992 -3981 -5918 -2593 7883 10085 -2273 -11517 -5636 3901 5368 3656 1857
1525 1857 -4357 -10007 -3553 9119 10086 -952 -8228 -5619 -857 3402 7310 5492 -4356 -10533 -3955
1540c955J0744J970o011o018k889R07O585P471j368r639o512L515P747M107j144
1555E510n027n978j758O089P893O34o955o457J33M971M852J586k835o073l494
1570f909L389P548K588m705o251j191L283M222K592j161n131m462K047O666L397
1585E922l359n110j695J007L564M424L06n659n528K073O350K668j967k982k845
1600b831j690L048O441J332o148n332J416M169K317R36q39m779m015L163O993
1615D181J428m847l838%J037K215L638M07n492m378K601N138J226j709j849k249
1631b491j599L067M879m8m922k709J894K064J040J211m64l875k131L158M167m48
1647B793l018j373J22L49J820K353j059l589j264K472K360j28r07r65j630L6K358
$$ plain form
1540 -3955 6789 8759 2748 -3270 -6159 -5252 1333 8804 7436 -2203 -8715 -5200 2547 6654 5510
1555 5510 483 -5495 -7253 -1164 6729 7363 408 -6049 -5916 -945 3907 5493 2658 -3415 -6909
1570 -6909 -3520 4028 6616 1911 -4340 -5531 -2248 1974 4566 3405 -1726 -6188 -4141 2525 5922
1585 5922 2563 -2547 -4242 -3235 329 4753 5059 -600 -6128 -4055 2295 4963 2996 14 -2831
1600 -2831 -4521 -1473 4968 6300 152 -5180 -3764 405 2722 3658 2819 -1960 -5975 -2812 4181
1615 4181 5609 762 -3076 -3076 -2039 176 3814 4221 -1271 -5649 -3048 2090 3316 1607 -242 -2491
1631 -2491 -4090 -1023 3856 3808 -1114 -3823 -1929 135 1175 2386 1922 -1953 -4084 -926 3241 2793
1647 2793 -225 -1598 -1476 -1127 693 3046 1987 -1602 -2866 -394 1966 1838 931 -34 -1664 -1628 730
1664G30K185j436k725n42J028J115J024M07j655k130J56K345J301j166j065n82
1680a010k84M05J717Q33j524j750J00J386P95R1l71r16q05N22J447K56q31m44
1698c83p3q0M04J028Rj021n36N99M74j91L3J49k50l92K36M86j40l39K52Q7l67
1719a5k67K80M10p7k75N1l22j79K31O63r0n27l43p2J39M27P00k53j101p13Q24
1740e09J000K19m94p41m38O8J011R03j65j162r59K37J105J214p4j446j015K48
1758i98J126J203K5j148j278l42J179J810L05j326j784j75J043J615R49j177j963
1775i36j093J229K080P30q93j933j148M37K255J692r25k649j311R91J908J377
1791A811J15j906k582l16L070K658p03k682j872J34J749K125J335j971l551o06
$$ plain form
1664 730 2915 1479 -1246 -1788 -760 355 1379 1786 131 -1999 -1843 502 1803 637 -428 -1010
1680 -1010 -1294 -889 828 1661 137 -1613 -1513 -127 668 759 388 -528 -1333 -811 636 892 61 -383
1698 -383 -456 -536 -132 896 905 -116 -652 -53 421 230 263 412 162 -230 6 492 352 13 265 352 -15
1719 -15 -282 -2 408 331 56 107 -215 -394 -163 500 410 -117 -460 -532 -393 34 734 481 -620 -1333 -509
1740 -509 491 710 216 -525 -963 -895 116 1019 854 -308 -1267 -1030 75 1289 1215 -231 -1246 -998
1758 -998 128 1331 1356 208 -1070 -1412 -233 1577 1882 556 -1228 -1403 -360 1255 2204 1027 -936
1775 -936 -2029 -800 1280 2010 1117 -816 -1964 -1527 728 2420 1495 -1154 -2465 -1474 434 1811
1791 1811 1926 20 -2562 -2878 192 2850 2147 -535 -2407 -2273 -524 1601 2936 965 -2586 -3192
1807c192K781K820K25k038k012j368J057L523K113k147m015j038K207K630J289
1822B835m71k842l050N88M433K712j926l576j602P52K120K788J116l224m660Q0
1838c927M526L044r82k724k353r76J642M210K165l428m868n40L367L159Q07j205
1854A917l591l030J734N347K475l187m255j060J524K834K988J43m380m460J305
1869c696N537K876k032l390k461l89K948M559J241m962n026P21M560L140J2k200
1885A438m046k230K605N833K014m228n052o88K576L820K387j163n250l904K499
1900c389O083K356k778m270k215N62L823M372K85n492n040J300N428L416q06l514
1916A21l768j161L377N665J514m925n346j91L892M099J345k235m927k995K945
$$ plain form
1807 -3192 -411 2409 2634 596 -1416 -2784 -1727 1796 3909 1762 -2253 -3291 -1084 1546 2835
1822 2835 2364 -478 -3528 -2940 1493 4205 2279 -1297 -2899 -2147 -27 2761 3877 653 -4007 -3927
1838 -3927 599 3643 2661 -63 -2416 -3392 -1750 2460 4625 1197 -3671 -4211 -844 2315 3122 1917
1854 1917 -1674 -4704 -2970 2377 4852 1665 -2590 -3650 -2126 708 3696 3839 -541 -5001 -3696
1869 -3696 1841 4717 2685 -705 -3166 -3555 -607 3952 5193 231 -4795 -4074 486 3626 3638 1438
1885 1438 -2608 -4838 -2233 3600 5614 1386 -3666 -4354 -1778 2042 4429 3266 -1984 -5888 -3389
1900 -3389 2694 5050 2272 -1998 -4213 -3651 172 4544 4829 -663 -5703 -4403 1025 4441 3635 121
1916 121 -3647 -4808 -1431 4234 5748 823 -4523 -4714 -822 3277 4622 2387 -2540 -5535 -2590
1931b590O241K347l734n144j825K138M307L429j022n556m407K135N940K941j939
1946C261m201l267j43M020N239M16n766n064P76N146L737o1l240m494j939L688
1962a892O031J461m526n246q19L156M450K464k126n761l264L151N969K522k748
1977B822m688k870R51M894M378r35n794l968J381M730L729k12m101m608o57M636
1993c12N125N0m447m304p39L367M679J766l385n248j597L258M539J831k136m781
2009b334l111K538N545K348k845m449j983J157L887L606m65n243m055J956M813
2024A365K559r57k940l494j076L935N535o7n260l722R46K803K742K090j871n605
2040c017k728M484N772k22l485k551j184k18M011M862j658o940k874M149L983
$$ plain form
1931 -2590 3651 5998 2264 -2880 -4705 -2567 1740 5169 4147 -1409 -5816 -3681 2259 5200 3261
1946 3261 -940 -4207 -4350 -330 4909 5325 -441 -5505 -4729 417 4154 4093 853 -3641 -5580 -1892
1962 -1892 4139 5600 1074 -4172 -4991 -1835 2615 5079 2953 -2808 -6072 -2921 3048 5570 2822
1977 2822 -1866 -4736 -3785 1109 5487 4552 -1242 -5210 -3829 901 4630 4418 317 -4291 -4948 -312
1993 -312 4813 4863 416 -3888 -4627 -1260 3419 5185 1800 -3448 -5045 -1787 2752 4583 2447 -2334
2009 -2334 -5445 -2907 2638 4986 2141 -2308 -4291 -3134 753 4359 3894 -1349 -5404 -3448 1365
2024 1365 3924 2967 27 -3467 -4543 -608 4927 4860 -400 -4122 -3176 -373 2369 4459 2588 -3017
2040 -3017 -5745 -1261 4511 4289 804 -1747 -2931 -3149 862 5724 4066 -2874 -5748 -1599 2384
2055B384K89k29j365m521j877N147N821j929n682j459J625P47K104L348j682o696
2071c975j790N671M319k245k435p4j618j463M045M955k750o418k45M525J235r36
2087H01R53l52m530j151N714L836l801m353J114J754n12J478K801k379n350L44
2103c633N510J864k901j472J52j606l27M222K864l937m750J391L723L42o66P06
2119A482j089l858K45M808K343l179l252O96J108l9J718J773k102l806K96L719
2135H63J495j807p38p7j099l88K769J886j996k942M30K106L99m72L43k86j713
2152a227l13K195J556j604j754N26J145l62m29R96K01j695o83J977J294j736j530
2169a443J210J005j004l59J305Q7j816m52K134N75k010l82J597k6j506N55J940
$$ plain form
2055 2384 2673 2444 1079 -3442 -5319 -172 5649 3720 -1962 -3421 -1796 -1049 1055 4403 2721 -3975
2071 -3975 -5765 -94 4225 1980 -455 -529 -2147 -3610 435 5390 2640 -3778 -4023 502 1737 801
2087 801 1754 1402 -3128 -4279 1435 5271 1470 -2883 -1769 -15 -527 951 3752 1373 -3977 -3633
2103 -3633 1877 3741 840 -632 -480 -2086 -2413 1809 4673 736 -4014 -2623 1100 1442 776 1482
2119 1482 393 -3465 -3220 1588 3931 752 -2500 -1804 -696 -735 983 2756 654 -3152 -2856 863
2135 863 2358 551 -187 -264 -1363 -1751 1018 2904 908 -2034 -1604 502 901 429 772 486 -1227
2152 -1227 -1540 655 2211 607 -1147 -621 524 162 -267 729 930 -765 -1448 529 1823 87 -1443
2169 -1443 -233 772 -232 -591 714 801 -1015 -1467 667 1242 -768 -1150 447 421 -1085 -530 1410
2186A410j096k198J046K257r71k026J325J746j519j560J679J581j934j229K244
2201G55R01k515q82K646R22k278n41J929k46k210R49L044q83l236J04K384k8j343
2219e28J446O77k765j608K961K465j826k078P09K44j275J306K981p93m149q42
2235c075L049J296p71M4R2k296j353K826L190j258l083m56R87L24J148J799j151
2252A312l530o33K994K198p80j304q30j210J54K965J951k084l174j52J820J578
2268A275N97j01k162k586R84L559J521j778k373j166N05K074K539j60l408k667
2284c347R81K908J912J2k243l094r81L251L944j42l142k841k86J583L296J965
2300C776j914m483j675K808L828J000j533k900k642M30M474L517j723m408k238
$$ plain form
2186 1410 314 -1884 -838 1419 448 -1578 -253 1493 -26 -1586 93 1674 -260 -1489 755
2201 755 1656 -859 -1741 905 1827 -451 -992 937 691 -1519 -570 2474 1591 -1645 -1541 843 815 -528
2219 -528 918 1595 -1170 -2778 183 2648 822 -1256 -547 -303 -1578 -272 2709 1916 -2233 -3075
2235 -3075 -26 1270 499 543 635 -1661 -3014 -188 3002 1744 -1339 -1795 -808 -484 664 2463 1312
2252 1312 -2218 -2851 143 2341 1561 257 -573 -1783 -1629 1336 3287 1203 -1971 -2123 -303 1275
2268 1275 1872 1771 -391 -2977 -1993 1566 3087 1309 -1064 -2230 -1725 349 2888 2728 -680 -3347
2284 -3347 -2366 542 2454 2466 223 -2871 -3852 -601 3343 3201 59 -2782 -3068 -1485 1811 3776
2300 3776 1862 -2621 -4296 -1488 2340 3340 1807 -1093 -3735 -3305 1169 4686 2963 -1445 -3683
2315c683J244K971K818O85l387m588k7M481L496p74k835k707j244J959M422K208
2331E039l373n283o48L469L466Q71j451l703k892J493N286K642k687m557j886
2346d214J733L318L101l96m478m093J058N185L224j325l574l321m24L411M753
2361C958R04m469m764k7L855L926R44k511m605k335K905N407K321l188m855k112
2377d646K253M470K851j215n162l443J381N003L481r30m677l904K35M472M559
2392D728r1m558m569J3L864M435Q66l634m841j372L468M944J685l171n075j976
2408e284K825N048K459k616m870k675J860M988L247j512n094l504J389M928L635
2423D824r17m340m079K37M157M784M27m548m847m49M262M579Q18l466m607j863
$$ plain form
2315 -3683 -2439 532 3350 4035 648 -3940 -3967 514 4010 3236 401 -2306 -3550 -1591 2831 5039
2331 5039 1666 -3617 -4265 -796 2670 3541 2090 -1613 -4505 -3012 2274 4916 2229 -2328 -4214
2346 -4214 -2481 837 3938 3542 -936 -5029 -3971 1214 4438 3113 -461 -3782 -4206 -795 3958
2361 3958 4862 393 -4371 -4398 -543 3383 4327 1816 -2789 -5124 -2219 3188 5509 2321 -2534 -4646
2377 -4646 -2393 2077 4928 3713 -1449 -4892 -3511 1492 4973 4043 -634 -4538 -4303 169 4728
2392 4728 4637 79 -4490 -4477 -613 3822 4688 1054 -3787 -5159 -1691 3253 4938 1767 -3308 -5284
2408 -5284 -2459 2589 5048 2432 -2438 -5113 -3253 1735 4982 3470 -1624 -5128 -3739 1189 4824
2423 4824 3907 -433 -4512 -4275 -118 4666 5093 545 -4302 -4751 -489 4090 4908 1442 -3165 -5028
2439e028L304N110K060l140m949k170K274M716K918j714n190l539J875N154L029
2454D710j430m418l494O09M108M336j16m499m699M50M373L812L31l300m288j526
2470e041L517N023J488l677m877j042K916M231K047j914m782k826K219M946K922
2485E150k328m350k697J249L961L562m23m610m012J008M395L253n57l156l666
2500c221r33L214M658R93l922m463l71L135L478J352k161m026k280K070M822J910
2516D255k435l904j735J248L470K785o99m051l410J277M082K673q43l043k923
2531c253k23K980L820M74l558l674L24K821K806Q28k035l222j815K409L887J399
2547C968k511l420j059J744K932J771j190l215k364J217L425J842r58k861j941
$$ plain form
2439 -5028 -1724 3386 5446 2306 -2643 -4813 -2539 2177 5095 3381 -1809 -5348 -3473 1681 4710
2454 4710 3280 -1138 -4632 -4023 85 4421 4305 -194 -4893 -4443 -70 3742 4073 773 -3515 -5041
2470 -5041 -1524 3499 4987 1310 -3567 -4609 -1693 2538 4585 2671 -2111 -4937 -2718 2228 5150
2485 5150 2822 -1528 -4225 -2976 985 4547 4124 -486 -4498 -3490 905 4158 3601 445 -3221
2500 -3221 -4154 -940 3718 4711 789 -3674 -4045 -910 2568 3920 1759 -2267 -4547 -2477 2345 4255
2516 4255 1820 -2084 -3819 -2571 899 3684 2985 -1066 -4476 -3199 883 3556 2713 -330 -3253
2531 -3253 -3476 -496 3324 3798 240 -3434 -3110 -289 2517 3345 1310 -1912 -3727 -1318 2569 3968
2547 3968 1457 -1963 -3022 -1278 1654 3425 2235 -980 -3344 -2127 1298 3140 2182 -679 -2620
2562b620J07K664K720k35k919k458J63K487K121J93j678k664r96K166K875O61
2578B587k024k259r09J357K312J191j153k315j200R94K253J304o29k112j610O66
2594a547K204J501o85j595j374%J379J900K47j720j942K35J619J215p6p66j274
2611f79r38Q63J908O79j535j226O1M21O08R78P2j742j303J012J725Lq80l28o6
2630c67p09K73J711M37j892j063J092R61m18j45Q52n53j656N50K019L4j735j93
2648h02J310m43q46R05J286j183j422J048J168r73p70J336O54j819o58J870O61
2665A322j882j32J776k17k198N22K288j64k258L22J520p40j435J333J801j681
2681A77k199J376J967j013j210J096O23k030n55K514J231k516j212J485Q01j162
$$ plain form
2562 -2620 -2513 151 2871 2636 -283 -2741 -2578 -91 2030 2223 545 -2119 -3115 -949 1926 2587
2578 2587 563 -1696 -2605 -1248 1064 2255 1102 -1213 -2413 -1419 834 2138 1509 -603 -2213 -1547
2594 -1547 657 2158 1473 -122 -1496 -1496 -117 1783 2030 310 -1632 -1397 222 1437 1361 595 -679
2611 -679 -1617 -754 1154 1833 298 -928 -867 -446 162 1140 1212 -530 -1833 -821 904 907 27 -301 -367
2630 -367 -1076 -803 908 1345 -547 -1610 -518 443 25 -120 732 179 -1477 -927 1092 1126 -609 -802
2648 -802 508 65 -781 124 1410 227 -1195 -147 1021 48 -722 614 1268 -551 -1209 661 1322
2665 1322 -560 -692 1084 867 -1331 -809 1479 1315 -943 -621 899 159 -1276 57 1858 177
2681 177 -2022 -646 1321 308 -902 194 817 -1213 -1768 746 1977 -539 -1751 -266 535 -627
2697f27M62J709j244k602R15K768K38k209k02R45q29l84K041J554k268k690J290
2714a133K627k79j017L09l24j756K08K847J331k635k137Q32J357J45O65O50j752
2731f2k638P42L617R95k206j651LM5M33K159J184k597l098O87L118J251j060r01
2749B1r12j505O70L269J704k706l354N60K298J193K6K07j579k651L96L881J984
2766C502k312k780k73J071R48J651J028k599l354N18L933J771j706j698q10q55
2782a965P75L272J761l112m058N56L198J717m29n51j887k597P70M647K043l264
2798H76l575n1J774J373J885O55l289m024J228M688K087k072k431j315o43J830
2814a004L872J215l970l924O47L435J889L42j018k850k550J829M978J498l332
$$ plain form
2697 -627 -165 1544 300 -2302 -1387 1381 1619 -590 -792 153 -676 -1060 981 2535 267 -2423 -1133
2714 -1133 1494 1215 198 507 183 -1573 -1365 1482 2813 178 -1959 -1127 230 375 1040 1690 -62
2731 -62 -2700 -1958 1659 2654 448 -1203 -1200 -1155 -722 1437 2621 24 -3074 -2387 731 1982 922 21
2749 21 -891 -2396 -1726 1543 3247 541 -2813 -2253 45 1238 1264 1471 -108 -2759 -2363 1518 3502
2766 3502 1190 -1590 -1863 -792 156 1807 2835 236 -3118 -2600 1333 3104 1398 -300 -1110 -1965
2782 -1965 -1190 2082 3843 731 -3327 -2771 427 2144 1715 1164 -723 -3320 -2550 2097 4140 876
2798 876 -2699 -2750 -976 397 2282 2937 -352 -4376 -3148 1540 3627 1555 -876 -2191 -2834 -1004
2814 -1004 2868 4083 113 -3811 -3164 271 2160 2502 1484 -1366 -3916 -2087 2891 4389 1057
2829A057l453k81J368K120K358o6l968l201J649M295J557j530k371k183k82K765
2845a66L650O1m103l001P42K908K271O65k110l561j436L213L965K52k929l072
2861b651o37J573L475K038j784m268j820K397L503J637j338l180k679Q27M011
2876A104K882j316l642k193L37L017L269M11l671m039M86L594K970m7k113l172
2892b123j664K415M333J399l201l603p89J832K843J954r87l792k923K013M153
2907A860J712j835k660j771k80K801L721j73m222l107J435L068J824J28j763l182
2923b444j585K966M296L27l549k730j6J618K450J955j191m140j892K590L800Q31
2939C286k023k184j820L13L080L297j102m100k192J551K884J608j65j982l022
$$ plain form
2829 1057 -2396 -2677 -1309 811 3169 3103 -865 -4066 -2417 1878 3435 1905 -466 -2649 -2931 -166
2845 -166 3484 3545 -558 -3559 -2817 91 2362 3027 917 -2644 -4080 -867 3098 3350 421 -2651
2861 -2651 -3288 -1715 1760 3798 2014 -2254 -4074 -1677 1826 3463 2125 -1055 -3734 -2907 1104
2876 1104 3986 2670 -972 -3165 -2828 189 3458 3869 198 -3841 -3355 239 3209 3162 1049 -2123
2892 -2123 -3787 -1372 2961 4360 1159 -2444 -3233 -1401 1442 3396 2409 -1383 -4306 -2293 1860
2907 1860 3572 1737 -923 -2694 -2974 -173 3548 3375 -847 -3954 -2519 549 2373 2501 738 -2444
2923 -2444 -4029 -1063 3233 3560 11 -2719 -2735 -1117 1333 3288 2097 -2043 -3935 -1345 2455 3286
2939 3286 1263 -921 -2741 -2428 652 3949 2847 -1253 -3445 -1894 990 2598 2433 451 -2571
2954b571p14L091L543k63l182k366m6J821K466J432j762l609j459K463L133R56
2970B933j880k370j320N35K870K260q59l338j869J170K554J706m54j941k441j42
2986b586K484K722j69k667k015J65J932J966N45j411k565r89J891K657P47j938
3002G69k179p02J155K101J328r82k430j650J198K569J169j053j926j342K62J798
3018H5K009q4k385j983N82J982J341L7j075k083o95J589K368L47j832j768j35
3035a700J006J344J070m95k108j376J166K163P00r27j508n68O5J297J534l3j869
3052b39j403M48J490R73j7q74j319n45J352J603l7j299j093O6O05J014O10n44
3070G91j520o32Q58J349J95o88p43n66J45Q85R49k99j060p70M96Q05M95l1p00
$$ plain form
2954 -2571 -3285 -194 3349 3086 -96 -2462 -2508 -687 1779 3211 1449 -2160 -3619 -1156 1977 2933
2970 2933 1053 -1317 -2637 -2102 768 3028 2169 -1169 -3038 -1868 686 2392 1938 -3 -2444 -2586
2986 -2586 -102 2620 2451 -216 -2231 -2066 -134 1832 2377 966 -1599 -2588 -697 1960 2707 769
3002 769 -1410 -2112 -957 1144 2472 1490 -940 -2590 -1392 1177 2346 1293 -633 -1975 -1713 85
3018 85 2094 2010 -375 -2358 -1776 206 1547 1584 509 -1574 -2269 -680 1688 2035 203 -1565 -1700
3035 -1700 -694 650 1720 1225 -883 -2259 -1093 1070 1770 843 -665 -1233 -1168 129 1663 1630 -239
3052 -239 -1642 -1194 296 1269 1252 378 -941 -1486 -134 1469 1432 133 -960 -894 -289 725 1335 791
3070 791 -729 -1361 -503 846 1041 353 -390 -956 -811 74 1023 724 -336 -1106 -610 195 690 659 -41
3089d1o97r7P07Q15o2p10m95j31N67O20L37n47p28j20M42N67P9p3n20l19J52O17
3111C63K62j40n61k28Q2L26K28J07l36k43j20L04r5K94l5k70p3M0J64P0r4m4q8
3134h7Qk27L07Q9O0l29M1p4j5J98L21r3l76j32J28J23K01R5k39j60j44J70L07
3157A72L12m37j17l42J51M94M26j27n32m93J17P34K38o2m01o54l6N44O03K38p12
3178A16o40j94O37P12J60m26q45l94N71N96M71l60r49n44L83J107M19k55q97o88
3198a020N6J080Q24j21j136q56K60R66Q58l1q54q32l36J056J120J34r60j143p2
3217a007O58J062O94o65j551o36R92J486L52p80j030o13O4J278J349l86j879q85
3235a497O25J403O09j69q49j305m36J349J820j53j487j308K08Q67J102O02o01
$$ plain form
3089 -41 -738 -835 -128 687 625 -85 -580 -711 -144 476 813 266 -462 -582 -140 427 506 433 -87 -406 -254 363
3111 363 625 485 -76 -304 -222 104 332 439 103 -140 -260 44 -51 243 208 -62 -135 -95 69 139 45 1 -87
3134 -87 -79 -306 1 90 150 -179 -138 -212 -227 -29 292 199 -177 -309 -181 -58 143 238 -1 -161 -305 -135 172
3157 172 484 47 -70 -412 -261 233 659 532 0 -493 -376 358 596 534 133 -521 -557 -13 590 828 116
3178 116 -524 -718 -81 631 791 365 -480 -874 -303 293 764 404 -545 -1089 -706 401 820 565 -332 -1020
3198 -1020 -964 116 940 819 -317 -1173 -913 53 911 880 26 -806 -1142 -86 1034 1168 208 -935 -1007
3217 -1007 -349 713 1407 742 -809 -1445 -453 1033 1385 605 -425 -1038 -974 304 1653 1267 -612 -1497
3235 -1497 -872 531 1140 971 122 -1183 -1619 -270 1550 1397 -90 -1398 -1190 -323 779 1381 780
3252G80j970r64J620J859P0j099j044n13Q5J551J474o74k129j143J261J750N77
3269A491m40j090j253k85J677J887m21k085j080O12R86J159N04r99k034o46J810
3286b07J974k47j521r34m46N70J566J355j026k353q52J568J664K44o81r08j233
3303a467k07K014J833q32k418p74Q16J267P92L72j050j962m43K128J933n57j650
3320b05j042q2P88J607J030j105k311r51J812J874R5q89j010j186K01K011J702
3337B339r00k526r11J197J516N49N6j111j940k14K247J831o17k075r14M56O76
3354c41J295Q93j249k208m89J929J778j93j313j099n36M56J925J249j029k579
3370a511m00J322J353N83k85j243j514M4K230J665j002j992q18O34R95J176N48
$$ plain form
3252 780 -1190 -2154 -534 1325 1395 296 -748 -1261 -1176 375 1849 1175 -954 -2097 -836 914 1491
3269 1491 1051 -39 -1292 -1577 100 1987 1566 -519 -1599 -987 -1 1158 1662 663 -1371 -2017 -207
3286 -207 1767 1520 -1 -935 -1381 -811 755 2110 1084 -1269 -2121 -553 1111 1355 674 -234 -1467
3303 -1467 -1674 340 2173 1341 -1077 -1851 -1035 232 1024 1396 346 -1616 -2059 69 2002 1445 -205
3320 -205 -1247 -1329 -541 1066 2096 991 -1320 -2271 -459 1415 1510 621 -389 -1575 -1374 637 2339
3337 2339 1439 -1087 -1998 -801 715 1264 1320 209 -1731 -1945 302 2133 1516 -559 -1473 -1017 -341
3354 -341 954 1847 598 -1610 -2099 -170 1608 1415 102 -997 -1533 -1077 848 2097 1068 -1511
3370 -1511 -1911 -589 764 1347 1062 -181 -1695 -1651 579 2244 1242 -750 -1568 -934 61 1237 1785
3387A785j366k130j12J962J615l35j334j000l89N79J790J018j342k086m25J517
3403b53J301J72m60j147j295L83K158J075j101j813n01O57Q79J124K13j481j687
3420a776K83J855J170n81j214p17l50Q49J565M15j248j610p1J386J076J93n99
3437F26j316q28P57J747P07j041j433m21N24J235P94k33j573r97O26J392P13l73
3455I06q57j099j6J155J210o8j344r68Q4P28J355J00r13j361j71R95J131O8o06
3474C29j032p07P14J332O30p09j391k56N04J062M44j36j132q50L59J235N93l85
3492F04r37m45P9O70R87O0r94j043L77R49L44L6k48r49n25M82J475J71j041p59
3512g07J81K06M83O01j21j022p73O01J096K28p33k21l59j02N21Q68Q2j138n36
$$ plain form
3387 1785 419 -1711 -1823 139 1754 1419 85 -915 -1304 -725 1065 2083 741 -1345 -1770 -253
3403 -253 1048 1220 760 -387 -1682 -1299 859 1934 833 -980 -1481 -824 55 1179 1392 -89 -1776
3420 -1776 -1493 362 1532 951 -263 -980 -1330 -481 1084 1499 251 -1359 -1430 -44 1032 1225 626
3437 626 -690 -1518 -761 986 1693 652 -781 -1202 -678 557 1351 1118 -455 -1452 -826 566 1279 906
3455 906 49 -1050 -1066 89 1299 1231 -113 -1081 -997 -269 1086 1186 273 -1088 -1259 -264 867 935 329
3474 329 -703 -1410 -696 636 1266 557 -834 -1090 -586 476 920 784 -348 -1198 -839 396 989 604
3492 604 -333 -778 -699 -29 958 1018 24 -1019 -642 307 651 687 439 -510 -1035 -553 922 1093 52 -707
3512 -707 -526 -320 163 764 643 -379 -1152 -551 545 773 40 -181 -540 -642 -121 747 829 -309 -845
3531h45M30O10L7J44k42m79n70P05Q25p1o52m97J78K86K19L85Jp17n09N84Q15
3552F37k09l59j66l3m0J49N25J30o57n15M37M56q3L2k08j96l93N89L58j63l83
3573i2o5J14M6j1J30l2j92k91J51M58p7l68P9J7p1Q1J36K93k99m29L65K05j39
3596Ij06Q3J25l65n1L96K16m22JK27q1k11K51J87j38k95K8K86P8l97K41K39l94
3619i3j68K97K70j24k79J6J86l58J02M79k5m65k94M76J77j83N2J06j85m70K19
3640b64O16j40l12j35L3J91k05M18J84n26n50M03N18J7k09J1j41l70K53P03M0
3661E35o64k55J01M17%J59O7n58l19L80O65J13o73k40O1P8K83M34j54o82k96L18
3683b30N24R7j47k74l95j61N27P38j96p33j60P1L63M45Qm69n97r3N57N86N6o55
$$ plain form
3531 -845 -415 195 232 376 134 -345 -915 -210 615 544 -108 -605 -427 -141 78 463 464 -253 -762 -178 637
3552 637 428 69 -97 -130 -170 -21 504 634 -23 -538 -101 355 272 304 96 -100 -493 96 454 291 -92
3573 -92 -157 -43 3 -8 122 90 -102 -393 -242 216 139 -229 -150 -133 -204 -123 13 306 7 -422 -57 148 9
3596 9 -97 -14 111 -254 -305 91 307 -115 -114 113 32 -179 72 259 121 -174 -146 140 218 -179 62 301 -93
3619 -93 -261 36 306 182 -97 -81 105 -253 -151 328 303 -162 -456 20 197 14 66 172 -13 -483 -264
3640 -264 352 212 -100 -235 -202 -11 -216 202 386 -140 -690 -287 231 248 39 50 -91 -461 -208 495 535
3661 535 -129 -384 -283 134 134 293 360 -198 -517 -137 528 641 -32 -272 -211 -133 150 584 430 -252 -548 -230
3683 -230 294 391 244 -30 -425 -586 -59 679 483 -250 -410 -339 24 469 477 8 -589 -682 -125 461 517 -138
3705a38l57l8L27O10K98l87q31j69L20P72K52l23n28l49Q3P27N37l37o29n26L60
3726c26N85M89j20o91n82J70O68N36n0n33p25J8M58Q09J47p28q90JN44O91L14
3747G85m76q17m26M77R33K75m35n90n82L72O89O53m08q35m18K37P89N68j16p68
3767i3p02J49O89O62Jp51p37N3O89Q38n2m87j007l0N41R57J62m30j044m42P62
3788b72R23M20p11q22m49N10Q02M86j44j152n00L48P14P26j71j033n74J15Q93
3807A09Q00k76p66p64Q6O61Q52J69p69r32p1O93R59J62p37q02j93M56R01M09n33
3828D14r28l50N88P66L86j93j012o31L56J096N83m58q56o45K75P97O95q2p74r43
3848i16O3Q58Q18n4o80o65k29M86J103J72p60j016q4N98Q78P0k44q10o08M55J065
$$ plain form
3705 -138 -495 -533 -206 404 702 315 -516 -685 -365 407 659 336 -192 -541 -458 269 806 469 -160 -686 -326
3726 -326 259 748 628 -63 -645 -475 193 729 679 146 -579 -561 -103 706 853 125 -765 -764 -220 471 785
3747 785 309 -508 -934 -457 476 751 316 -274 -856 -484 205 858 450 -385 -803 -566 223 791 675 -93
3767 -93 -795 -646 43 705 706 -45 -782 -729 -40 798 746 259 -748 -778 -237 720 882 452 -592 -1034 -272
3788 -272 651 1071 360 -462 -911 -401 401 887 743 -409 -909 -561 153 879 708 -325 -899 -784 109
3807 109 909 633 -133 -897 -811 -150 702 871 102 -830 -901 -208 751 913 176 -626 -819 -363 538 947 414
3828 414 -514 -864 -276 490 876 683 -329 -960 -604 492 1075 617 -239 -884 -609 188 883 801 27 -916
3848 -916 -853 5 823 769 89 -576 -805 -319 784 956 196 -820 -904 -306 572 642 398 -412 -1020 -565 500
3869E00O11o97r23m01L54R16L77j09r17o51K24R58N42j43p61m82j04N82J041p5
3889H42q69q44R8P87N04L14n32p07m71N88R94K49o59q61k25M71O33N09j63r41
3909b83o71M46Q86M75m97o97k55l3N69P64J14j084p28L33P84M91j28m49m72m16
3929h51O31R54J04p03q22O8M75N62L49l24p27n38L53R80L07n79n88j58J23M02
3949A8P09rr39m79K72P39K31j31k89n12k92N06R38m3q44n11K73M21R8L36k21o05
3971c34m92N35Q84Ko17l04k6J23L22N15l32n63k74L38N74R4j97l28k75j40M52
3992d3N93J09o76m11J31M25K72P3k30n06k66M99N20j48m01j69k9NL60K91j57n79
4014c37j66L59M56j82j6j50k50m0L82K53j2m62k19K15K03J39J17k54k30j19L30
$$ plain form
3869 500 1111 414 -509 -910 -556 360 737 628 -289 -940 -716 242 784 641 -120 -602 -706 -124 917 842
3889 842 -27 -871 -773 14 518 832 300 -407 -878 -290 704 953 294 -567 -792 -321 312 821 658 -283
3909 -283 -954 -508 378 853 356 -341 -596 -629 -60 704 818 -266 -994 -661 123 614 486 37 -435 -851
3929 -851 -220 734 838 135 -687 -619 -144 418 767 443 -284 -822 -469 511 818 239 -349 -507 -384 18
3949 18 727 718 -221 -700 -428 311 542 411 122 -390 -682 -176 762 719 -125 -636 -363 58 156 492 271 -334
3971 -334 -826 -291 593 595 -22 -326 -352 -229 93 608 276 -287 -561 -223 351 445 248 -80 -355 -495 -43
3992 -43 550 659 -17 -428 -297 128 400 473 243 -263 -529 -30 490 342 -59 -228 -257 -252 108 399 242 -337
4014 -337 -503 -144 312 130 114 -36 -286 -326 56 309 297 -165 -384 -169 34 173 290 36 -194 -313 17
4035A7J58l3k1k63q1P2J98K62j44l96L6q6L94Ok4j77j37J17Q1K55j19k5j87J8
4059g9J65j7J02l3q0o1j08K6K48R1j36k61M5J94l8j61J66n9j77L4K74Lk92o0J56
4084e8m3M0L7J02j46j46J03J83j11QJ61J9k48j97K94K01j10k79J54M9j05N3L02
4107B63L9m90j40L46K72j61p7Q7k70q3J66M29k74l76JK10J70n3K79j05n04j48
4129d19L10M57k35k61M5j66K5J53N09j88m44k37L55L22j00N3j74l75m6M54N18
4150E56j27o44k65K66L17J21J65k18o98p4O83N32l2n55k73j4J85K65L74k42p24
4171d02k48N73M93R3l45k55l02p8O82N41l11q45k49L72N34k8J25k23o07k61O91
4192e0O62o6p25l80J91K11K42O13m77p73l71P28P47K2m39l09k21j08P07P13l21
$$ plain form
4035 17 175 142 121 -142 -223 -151 47 309 165 -231 -195 -281 113 119 95 -82 -219 -102 -21 234 115 90 -97 -79
4059 -79 86 69 171 138 58 -3 -111 -85 163 254 118 -143 -98 96 58 -103 63 4 -173 -139 135 138 -154 -214 -58
4084 -58 -101 -61 -24 78 -68 -214 -111 72 -39 -31 130 149 -99 -296 -2 199 89 -190 -36 13 -92 -39 263
4107 263 302 -188 -328 18 290 129 52 139 -131 -214 -48 381 107 -269 -268 -58 112 59 338 233 -271 -419
4129 -419 -109 348 113 -148 -103 -269 -244 -91 418 230 -214 -451 -96 226 126 179 5 -370 -416 38 556
4150 556 429 -215 -480 -214 103 224 389 171 -527 -601 82 614 582 27 -246 -260 -75 190 564 322 -402
4171 -402 -650 -77 416 509 164 -91 -393 -471 211 752 441 -404 -653 -281 253 225 350 127 -480 -741 -50
4192 -50 612 546 -179 -559 -368 -157 85 698 221 -552 -923 -195 552 574 135 -174 -395 -503 204 917 596
4213E96j032l70N61N32R1L7j69p53j59Q58O49k55q72l38K52K79M20N43m95r30
4233e55l25Q70P71j70n45k87k78K3O98O89m61r69k47O13N04J01n5l68p69L1R70
4254B41P23m55r03k11J97L69N65K29n05r90j76R40P80k54m81m26k49K73Q65M76
4274A008o19j024l8N57N67L25l73o51n90K67Q56O07l62r05l29K87N00N77J23p84
4294ap59j7Q40P47j19o58o19j68N70Q03K58p68p39j27L91P75L22k66r70m32L95
4315e42R91L45m62o50m90L08P28L96r4o60n81J50O62O07l8o16p22q8P55P30J38
4336H67p22o26j74N61P09K25n78q77j25M04Q79K05l30q88k29K03Q31M13m33o40
4356c25m69K40N86O83k14n55o15n8O50P30j27m29p08j63N83P67R1n49o80k70N94
$$ plain form
4213 596 -436 -806 -245 287 378 415 246 -507 -666 192 841 586 -286 -624 -372 -93 327 870 375 -555
4233 -555 -880 -10 761 591 46 -241 -519 -496 202 891 430 -539 -786 -173 331 432 377 9 -760 -729 241
4254 241 964 509 -394 -605 -408 -39 526 755 250 -740 -916 24 804 550 69 -357 -606 -333 532 1008
4274 1008 389 -635 -673 -116 451 776 403 -248 -838 -571 285 892 530 -375 -704 -417 83 660 783 -1
4294 -1 -760 -777 63 810 691 33 -586 -754 -184 619 877 109 -630 -757 -366 409 731 465 -505 -937 -542
4315 -542 449 794 332 -318 -808 -500 228 624 530 -130 -711 -561 101 708 670 54 -668 -756 -1 729 867
4336 867 145 -481 -655 -94 615 840 262 -615 -740 -336 543 748 418 -470 -699 -496 335 748 315 -325
4356 -325 -794 -554 32 715 501 -54 -669 -727 -77 653 526 97 -611 -774 -191 576 667 118 -562 -832 -238
4377b38P28J52k95p65l92N25P14L41m19o38l41K19O59M48k10n72m67R1O19N13
4397F72r5n53n13p0N85N40N2o19m43k21N66O27J47n38n69p7K73N23L52l27n17
4418b05m55K55O57J62j38n30k52J20M04M23k4n25n41K29N45L59ll61n45j77M43
4439a59O27J28n23l88o4K42M58K33k28n90k77K62O93O8j55n34j20P7K26N36k66
4460B46l11k32o5M17K91j40j84m35J66J24L86P2l04k28j03J45K98K43j93n32j36
4481d75L04L27J97j94k78k03Q5K45K45K0l35k69J63K52K59m5k29k57rK00K94r4
4503B03j21k41J52M8J44O8j36j07k04J6K92J83j63j13k04J65NK12L0k00k19j3
4525b03K05J57j89L4r1m6o8J85J45r6j25m8P1J80p9J32j72j46K3P9J50n1Kjp5
$$ plain form
4377 -238 490 642 347 -418 -810 -285 429 770 351 -287 -628 -409 250 698 488 -84 -551 -460 159 672
4397 672 577 24 -489 -559 26 566 618 -1 -444 -665 -99 528 675 137 -432 -509 -236 287 639 312 -205
4418 -205 -660 -405 252 414 276 -254 -506 -386 18 441 417 -108 -649 -420 125 484 481 120 -425 -602 -159
4439 -159 468 596 73 -315 -379 -137 321 554 326 -264 -541 -279 414 482 327 -207 -327 -250 -24 512 246
4460 246 -65 -297 -362 55 346 206 22 -413 -247 -123 263 335 31 -197 -300 -155 143 386 193 -339 -475
4481 -475 -171 156 353 159 -119 -322 -237 8 253 273 -62 -331 -168 84 343 298 69 -188 -197 3 297 203
4503 203 82 -159 -7 41 185 253 117 10 -194 -178 114 297 134 21 -183 -18 -13 199 229 29 -190 -203
4525 -203 2 159 -30 4 -87 -133 -201 -16 129 33 -92 -140 -69 111 32 164 -8 -154 -131 -52 98 47 49 48 -27
4550b7PJ42O2n2j68o8P6J01n5J36j7j07j49J8K65Oj25Pm7p2P8J29O6k50j21J09
4576e6J03J4j58J29j25j85K07J66J60l25j01j09J72j9K91M6k98j30Q5K44m3M3
4598A11n9j76r4J12L41r1n4k26j6R5J07J94J9k88k73J90M22n7K6m59Nm3K93J32
4622B11J54l16l71K1M10J62m4m0m11o6J96K39J69j95m68J03O3L71kl3l25k54O9
4645c57M51K86k22l37j14qM69J90q9k62m59J66J38M44J5k60l26j33L46M56Q2l42
4667A34m34o4K14N16K22m43l64k97L32M67K17k41n40j65K02M30L15j70m04j51
4687b24j29L43M91R0o92k87p3N79K14K4n7n90k84M06N14J82m26m78o0L57K15L04
4709D19j25m39n04L05O08L11l27m06l57J08N19M07J02o85m44J29L76N61j82k66
$$ plain form
4550 -27 -20 122 184 132 -36 -104 -28 73 18 154 137 30 -119 -101 164 170 45 52 5 -67 11 140 206 -44 -165 -56
4576 -56 47 61 -97 32 -93 -278 -71 95 255 -70 -171 -280 -108 -127 164 210 -88 -218 -133 111 68 111
4598 111 52 -124 -218 -106 235 144 90 -136 -152 -57 50 244 263 -25 -298 -108 314 257 283 -176 -171 -214 79 211
4622 211 365 49 -322 -301 109 271 227 187 -224 -290 -94 145 314 119 -349 -246 -183 188 186 153 -172 -426 -357
4645 -357 94 380 158 -179 -293 -301 168 358 269 7 -452 -286 -148 296 311 51 -275 -408 -62 394 476 134
4667 134 -300 -364 -150 366 588 145 -219 -516 -184 283 500 259 -281 -446 -244 186 501 331 -73 -224
4687 -224 -353 -10 481 571 -121 -408 -481 98 312 336 279 -311 -595 -189 325 507 81 -397 -457 -100 115 419
4709 419 294 -145 -649 -344 264 575 248 -158 -515 -407 112 519 621 -64 -508 -379 -3 558 376 110
4729A10m43j05K56P30L9n77m42J6M18L37K33k78n63l88M05N33L33n19k74l15J27
4750c67M14M95l1p64m99L20O87J81j08l39m12k22N46N36K35p30n50J55N16K00
4770B63J17j14o45l34L88Q33J41o07l96l7K48K54M61n3o08o56L89O43K77l89j90
4791a5l65o9L95O01J06p94l40Q5O07K43j40j02n14l59N21O39J73q08j35j65K17
4812b19K79K20Kn68m84N02N64J48l73k62j33j12L54O60j24p39l57M66L71K23r7
4833C21j64m76l07M64P22k3n50l21J32J74K34K99k18n45l96M82O24p5l11j29k05
4854b68j40L96N90j58p59k09L93K97P2k6j03m97l6M12M80pn72l18K89O3K34L44
4876D77l38m58l15M22M35Q7j95k29l45J63L77M26k11n98m8M6N38J30j38k74l12
$$ plain form
4729 110 -333 -438 -182 548 587 10 -432 -416 2 339 572 294 -269 -657 -252 281 614 95 -179 -494 -367
4750 -367 47 542 511 -253 -752 -432 255 436 328 -11 -423 -645 -99 437 672 -58 -608 -453 63 263
4770 263 380 266 -379 -713 -325 508 649 42 -354 -391 -143 111 572 519 -89 -745 -356 287 564 175 -15
4791 -15 -380 -449 -54 547 653 -141 -481 -396 211 454 314 212 -302 -661 -140 499 672 -136 -271 -436 -219
4812 -219 60 280 282 -286 -770 -268 296 444 71 -191 -324 -436 -82 578 454 -285 -642 -176 195 418 321
4833 321 157 -319 -626 -162 560 537 -13 -334 -202 -28 206 505 287 -258 -654 -172 452 377 66 -63 -268
4854 -268 -408 -12 578 420 -339 -548 -155 142 214 188 85 -412 -448 -36 444 437 -135 -453 -164 -101 133 477
4876 477 139 -319 -634 -212 223 310 115 -114 -459 -296 81 507 296 -302 -350 -304 234 364 226 -48 -360
4897c60K2K97M18J4m60j95j4K84L73o2k79j83k30L45L35l7j86j38k60K54J75K53
4919C66o6m28j12K9L52J93j07k89k10M0J64L66j23k87k30R3L08J77K8k55k83m8
4941c22J72K96P6j02l89j12K71K28K16l23o0j48N8L12Lm0j49q5j12K39J36K02
4963C67l94q4p2J45J02R5j51j47r0J88P0J15k11k7j03J95J01m6J3j60q4l6J97
4986a7J17Q5k61o3K3J17J77n5k15J04r8Q2J70m1j17n1N1J4J4Rplj48J24r9K34
5012A46Q6j46j96J03j5N4J00q4k20R6J76j38J54l0l1j88l3J84K1l2p4m0k1l1K34
5037G5N1q1j85L4J2J43k2L1Mk26j3R5K27qj38j4m6J0K12ok3j15k13J6L29n3N8
5064A54j28j18o6J70R1O5j75j35J27N2k2J02m0k38p5J06J92O2k9j81j2l3J79K48
$$ plain form
4897 -360 -338 -41 377 391 -69 -264 -278 6 379 317 38 -145 -375 -30 305 268 82 -56 -316 -62 113 366
4919 366 300 -128 -240 -211 141 334 227 -62 -272 -232 -68 298 175 -112 -342 -249 59 236 264 9 -274 -322
4941 -322 -150 146 222 120 -269 -381 -110 118 334 11 -49 -197 -139 173 176 136 -13 -98 -210 29 165 367
4963 367 -27 -111 -183 -38 64 159 8 -139 -229 -41 29 144 -67 -94 -197 -2 99 53 66 -94 -178 -214 -17
4986 -17 100 185 -76 -139 -116 1 178 123 -92 12 -86 -4 166 125 8 -43 8 22 36 45 38 35 -113 11 -88 146
5012 146 232 86 -110 -7 -22 32 132 48 -172 -76 100 -38 116 86 55 -133 -166 18 39 7 -67 -107 -128 -159 75
5037 75 126 45 -140 -106 -94 49 27 58 62 -164 -177 -82 145 137 -1 -15 -61 -51 161 155 132 17 -196 -180 149 96 154
5064 154 26 -92 -158 12 103 168 -7 -142 -15 37 15 117 77 -161 -236 -130 62 124 95 -86 -98 -131 48 296
5088B96j72k86o4J17J44N8Q5k05j73o2K59J47J12m16L4J02m5K19P6n6k98k10K68
5111g0K88j2k38j27n0J06K52P4j17k04r8rK88K71j15k31m60J83M14J39ok80k33
5134b35m9K73K87M5l80j33o4P5L77k0j88k29j5J68K24R3j9k74k31J43L64J04k08
5157A08k08k33R0K47K18L7l08j66k3K93L28k22j47k20n9K57J48J40j62k46j28
5178b56J75K46J47k14k25k10J06L91L21l49l12r0L6M20K06j41k77l13Q5L51K17
5199C14p2m43j17j9L63K21j1j76l60j16L83J91K30l66k62k07K42M16Q6p1m52k8
5221b54J23K95J65r3l38k02J55K31K79n5l53l43J01K44L80J0l62j41j42K39K17
5242A56J52k64k36j42N7N09M9j17l44j66K14L35R5j34l01j02K9L82J45q1m38j72
$$ plain form
5088 296 124 -162 -226 -109 35 93 178 -27 -200 -262 -3 144 256 -160 -126 -24 -69 150 226 170 -128 -338 -70
5111 -70 218 206 -32 -159 -209 -103 149 223 106 -98 -196 -205 83 354 239 8 -452 -269 145 284 278 -2 -235
5134 -235 -284 -11 276 321 -59 -192 -256 -181 196 176 -12 -241 -256 -88 136 229 210 -64 -295 -152 212 316 108
5157 108 -100 -333 -243 4 222 259 -49 -215 -238 55 383 161 14 -206 -265 -8 140 280 118 -128 -256
5178 -256 -81 165 312 98 -127 -337 -231 160 481 132 -180 -270 -234 186 392 251 -26 -339 -254 97 314
5199 314 242 -201 -318 -337 26 247 236 60 -300 -416 -33 158 388 22 -240 -447 -205 211 297 226 -226 -254
5221 -254 -131 164 329 236 -102 -304 -149 82 361 306 -47 -390 -289 -45 335 345 -17 -158 -300 -61 156
5242 156 308 44 -192 -334 -277 232 281 164 -180 -346 -132 203 298 164 -137 -239 -210 172 317 236 -202 -374
5264c74K16J44L79j64k25k83n2L31L71j1l27l37n1L38K80J80k90m13L5Q0L30K55
5286D12k19l86j24J78K22K40n2m79r7J07J99K73m3l13j71k6L88J43k6l53j24k7
5308b78K98J88R2l01k48k5J49L15J58l03l25mJ55J82J10J53l89k55M4M25Q4q2
5330A43j70j99N6J87K19qk82k28R0L97k6O3l17l1j63J77L46O5k52l58J99J55P8
5353A41M3q7j35k25N1L91J03j81l06L9J05K5K26J27l51k59R0K55J09r4q4j01j62
5376b80J38K77R1l26j64n2K55J49Q9j00r3p6q6L41O7j17k01K4Nk4J23K58q2m56
5400b40J27K57n2j31L7l4k39K35J76Lk18j70J80P9O6o6L8j26k02J31J26J39j67
5423e1k0l1P4j21K28K8j89j45PK19J43o7o5Q5j11j57K55J30k39p9J71n2l9J13
$$ plain form
5264 -374 -158 -14 365 201 -24 -307 -359 -28 343 332 5 -332 -383 -45 235 415 125 -288 -253 -173 157 412
5286 412 193 -193 -317 -139 83 323 271 -208 -305 -198 1 274 231 -82 -253 -279 109 252 226 -127 -251 -278
5308 -278 20 208 300 -1 -249 -274 -125 190 348 45 -280 -284 -129 53 163 316 -73 -328 -284 141 225 143
5330 143 -27 -226 -170 17 236 228 -54 -282 -192 205 179 242 -75 -106 -269 -92 254 319 67 -291 -92 63 141
5353 141 184 97 -38 -263 -212 179 282 101 -205 -166 -61 -36 190 317 -34 -293 -203 52 161 67 -17 -118 -280
5376 -280 -142 135 226 -100 -264 -316 -61 88 177 77 -16 -92 -178 163 230 113 -88 -64 -59 -83 40 298 216 -240
5400 -240 -113 144 92 -39 -2 -36 -275 -40 136 139 -79 -249 -69 10 76 10 48 -78 -280 -149 -23 116 -51
5423 -51 -71 -102 -28 -149 79 107 -82 -227 -220 -1 142 75 10 95 -16 -173 82 212 -27 -106 65 13 -26 87
5447H7n8J45k51LK15Oj13l3p0J25NL5J39r9j20j06R3N9O7j54J42k53K6K10Q1n8
5473A23k02j3O7N1OJ0q9r4k6J52J51p4k54K05q1O4KR0o1j18p7M8K03J2r3L6j34
5500i6J9N9K4J23j06q1J25j4J13jk02n4O0O7L0J7m3P8j40k0M1J47j12j0m4k5L6
5527iJ32m5j48K0L7P1j33J32l0m0n5J08m4l9N6J2k08J05N3J5jk5n6j6J74m1R3
5554A18Kk45O3R5J05M9q7p5n3qNJ49j05N1j50L1J19nm8J39r5q9J04lL5j61M2o0
5582g7M3J50n5p5m6r9Q9Q4J29k19o6n9L5J12K12j77j00j61K12P5o6J69q5j56J5
5607a16Q2J30j6l3j70M6P4J02Nj00p2o5j2J90J41j48n1j6p9J39J85o0p4j66K0
5632f4P2J09j07J0j54R1J25N9M2j71k07M0R5O9nj43Nq9J93J34L6j39O9k01j5O4
$$ plain form
5447 87 29 174 -77 -74 141 147 34 1 -69 56 61 96 235 136 16 -90 3 62 129 -25 117 -136 -110 100 181 123
5473 123 -79 -92 -25 26 32 42 -47 -141 -167 -15 136 62 -192 13 -68 -4 -2 88 27 -91 -168 -120 83 95 2 38 -96
5500 -96 -77 -18 6 129 23 -58 67 53 166 165 -37 -91 -31 36 66 83 40 118 -22 -42 -1 146 34 24 -20 -45 -9
5527 -9 123 78 -70 -50 -13 58 -75 57 27 -13 -68 40 -4 -43 13 25 -183 -78 -25 -10 -11 -36 -92 -108 66 25 118
5554 118 120 -125 -62 33 138 187 100 25 -28 -36 -31 118 13 64 -86 -55 64 59 11 150 55 -34 70 67 102 -59 -17 -77
5582 -77 -34 116 61 -14 -60 -159 -70 14 143 -76 -142 -201 -166 -54 158 -19 -119 -280 -68 7 -59 110 25 -131 -116
5607 -116 -34 96 80 47 -123 -77 -3 99 104 4 -68 -133 -145 45 186 38 -13 -29 -108 31 216 156 82 -84 -64
5632 -64 8 117 10 20 -134 -43 82 141 183 12 -195 -155 -60 9 4 -139 -134 -223 -30 104 140 1 70 -131 -146 -82
5658h2J57L7k46p9N6J50O1l3R7r8k04J66J84j74o2j8R3jJ33J5r5m7j97J00K42
5683A55J41j46j73j0k5J98QO6l04qjJ75J07j46L3k23Q6K44k2rj88j22m6J29J66
5708H5N1k27m9J2m4J04K38j90l0j51J26J70N4j10j17j18J37J35p2Q6p5j52RJ04
5732b4J15N3j51j5q7J48J33m0r1q3p3N8K81m7p5j54j19K08Q8k5J23l82%J08M0
5757a1N8K9j85m1P6O1J67j47oj21p0K59J36j75l3k32L0J89M9k3n4j12M5J08M6
5782D3ll2P7j75K2J36L0m4r1R%KJ02O1j44n1o2J07J56N3j00k25k5Q0K01L1j66
5809hp2N3oP6k8R6j47q1m3J35P3p5p5m1J29K7L8l1n6k2N8n6P4L4j00O3n4n1K84
5838A94j36K1p4o7PM0J24J6n5j36J51m3J39j40j02N0q6J0J00Q4j61K11j38N2k3
$$ plain form
5658 -82 75 112 -134 -213 -157 -7 54 21 118 20 -184 -18 166 -8 -70 -88 5 4 137 152 57 10 -187 -87 155
5683 155 296 150 -23 -33 -58 140 148 214 -90 -98 -99 76 183 37 70 -153 -67 177 155 146 -42 -164 -210 -81 85
5708 85 136 -91 -140 -128 -172 -68 170 -20 -50 -201 -75 95 149 39 -78 -196 -59 76 4 90 15 -137 -128 -24
5732 -24 91 144 -7 -22 -109 39 172 132 41 -42 -115 -57 224 177 102 -52 -171 37 125 100 223 -159 -159 -51 -11
5757 -11 47 76 -109 -150 -74 -13 154 7 1 -120 -190 69 205 30 -3 -235 -205 -16 33 10 -44 -156 -111 -3 43
5782 43 40 8 85 -90 -68 68 98 54 -37 -28 -28 -26 76 137 -7 -58 -120 -13 143 196 96 -129 -154 -74 127 158 -8
5809 -8 -80 -27 -33 43 15 111 -36 -117 -160 -25 48 -27 -102 -143 -14 13 51 20 -36 -58 0 -56 18 52 -48 15 -39 -90 194
5838 194 58 79 5 -62 -55 -15 109 125 70 -66 85 42 181 41 -61 -11 -97 -87 13 97 -64 147 9 61 38
5863C8J76j42j62M4j2J26n8J02p2r7Q3l3j6N4l5j0j9K9J02kj07k2N8m0N7j3q5
5890e6r4J03J26J1j70Q1K2m8J49J9j51o9M5M4J3j04K14k0j43j33P8J68j0j6l8
5915B1JK4o3J38K7j39l3J60k35J19p9J5M0q3K41j24O4j33K8M0j09p6J07P1K2j01
5941e7L3P1m3J25j35k3j11K14q2K6K2r6j9oJ52m0l6L4k00L8J26Q1q1J13j34J00
5967G2q1N3p9Q4p0lJ12j01mL3N7k4j33q6J78n8L3L1j3q2J3M0P9k3j5k20K53pj24
5996h5O3K2nL3L7j25P9k63K41j14K26J2k00J04p3K0O9J32q8k10k6M3R1l0J78j62
6022c1j06J52K9j5J6JK5r3m5N9L7R0j32M7p9R1M1m3k0j23P6R7k0l1n3j4L3l7J59
6051A11L2j30l5r9K11o3m6R7j28j09J56N1J61k36o1j0Q9NQ1Lj36p1R8kJ24Po9
$$ plain form
5863 38 214 72 -90 -46 -58 68 10 112 40 -57 26 -7 -23 31 -4 -14 -33 -4 98 96 -11 -33 25 -15 42 29 -56
5890 -56 -150 -47 79 90 -80 1 23 -25 124 143 -8 -77 -32 12 25 -79 135 115 -28 -161 -83 85 75 59 21
5915 21 22 46 -17 121 148 9 -24 136 -99 20 -59 -44 -4 -87 154 30 94 -39 -11 29 -80 -156 -49 22 44 -57
5941 -57 -24 47 4 129 -6 -29 -140 74 -8 18 40 -56 -75 -81 71 31 -5 29 -171 -133 -7 74 -7 106 -28 72
5967 72 -9 44 -35 49 -21 -24 88 -13 -17 16 73 49 -84 -170 8 -50 -17 14 1 -81 -68 -28 51 28 13 -207 46 39 -85
5996 -85 -22 0 -5 28 65 -60 19 -244 -3 -117 109 121 -79 25 -48 -28 41 173 85 -125 -151 -108 -17 -47 131 -31
6022 -31 -137 15 44 29 45 46 71 -22 -67 -8 29 119 -13 34 -45 46 87 44 24 -99 -23 74 54 23 -30 -44 -11 -48 111
6051 111 143 13 -22 -121 90 27 -19 78 -50 -159 -3 48 209 -27 -88 -98 -9 -4 77 80 -56 -127 -29 -31 93 100 31
6078C1K9mj26J10l4K8j34Q2l0P5N4k4p4j54K77M1o0K9p2j20O4N3O9p9qj12P1j6
6106c4j4Q2j4j04K3j3J54r6O6j73J8k2Q7O3K9j15r8P5J57k7O2j65mQ6p9J65j00
6133IK4j54O7J18lK2k7q9J10k42J75J6K3J5j55J17K5J31j69l6m8j0K16j6P3j81
6159A1L0K8lM0K6j23j25J62q5J21R3j55j48J6O5J51j27R5n5p8R1j79K21kj88k9
6185a47J09j5J36M2k09Ll3J92k5Mj54J52o2L4N8J5m7r1J4J53O9j07m1j08L0n1
6211g9K58m3k16K3K8J78q7Q1m9r1j45k5K05Q4q2q5L6q7N6P0J07j57j09QJ68m8
6237aK8k0n5r7N1J23n1j2M0q4L3M0Q3j03J03j11M6nP7j54o8J01rO7J14m5k9j58
6265i6K6J66n5M8j12m1O6n6J33N8r0Pj04J05o8l2R4O0j63k4L6K21j25j00k4l2
$$ plain form
6078 31 60 56 -70 40 6 34 -100 -18 -48 27 81 57 -17 -171 106 147 87 116 44 -76 -12 41 110 31 23 -89 -18 -34
6106 -34 -48 34 20 -84 -61 -74 80 -16 50 -123 -105 -127 -40 23 52 -63 -161 -86 71 44 106 -59 -63 23 -56 109 9
6133 9 33 -121 -54 64 61 83 56 -33 77 -165 10 26 49 64 -91 26 51 182 13 -23 -71 -81 135 119 192 11
6159 11 41 69 66 106 132 9 -116 46 -39 82 175 20 -128 -112 -47 104 -23 72 17 -61 30 -149 72 70 -118 -147
6185 -147 -38 -53 83 125 -84 -81 -114 78 53 57 -97 55 -7 27 85 100 53 -38 -24 129 198 91 50 -58 -28 -79
6211 -79 179 136 -80 -57 -29 149 62 143 94 3 -142 -167 38 122 40 -45 -9 -96 -40 30 137 -20 -129 -121 47 -1
6237 -1 27 7 -48 -145 -94 29 -22 -34 6 -78 -45 -5 78 -25 78 -33 13 8 85 -69 -137 -36 -45 22 136 91 62 -96
6265 -96 -70 96 41 89 -23 -64 2 -54 79 137 47 54 -50 55 -13 -45 49 109 -54 -78 -42 179 54 -46 -70 -102
6291a02k0K24J2j39L4k11K47Ro8KN4o8m9J95o1J0j31nj5J28P1k8j41m8Q9J21r9
6318A1J34j79N8j4j4J1J03m9r1J4J3J40p5l9j20l9oK65j47J33j99O0l5J41j2j13
6344d9MN0j68K34q2O0nj9k11J17J19N8k9j55RJ12N6j60J52j21J05j29R0j21K14
6369A31j73j0k0P1J32P5k52o2N8J5J94j33R8j27N7j00rK24l4j52L0k8N3q6P5j49
6395a22Q2m9JK04j19K2j73Q5M9j2J04m2N6j47O3r5Q4k5r4LO2Q1MR1j24p7O3k3
6423d8Q5K6k2l4q5N3J9J15j79p1O2J24p1L3Lpp4o3J68J28j51N1j62l5J43N2L8
6450I8o4j45L5K5R9P4j71L6M3n5J09p6J35j89j3j26K70O2j8n2j57P6K7O3p1n2
6476c7l3P2n7J04K5j02j3O3j7J05j26j5m9Rj0J96j1j62kP0o9j8L0M9o3o4J10j4
$$ plain form
6291 -102 -122 102 114 -25 9 -202 45 54 -14 -12 42 -26 -75 120 59 69 -62 -67 -82 46 117 89 -52 -100 -11 110 11
6318 11 145 -34 24 10 -4 7 110 61 -30 -16 -3 137 62 23 -97 -136 -142 123 -24 109 -90 -30 -65 76 64 -49
6344 -49 -45 5 -163 71 -11 49 44 25 -186 -69 50 108 79 -76 -67 45 101 -59 93 -28 77 -52 38 -83 131
6369 131 -42 -52 -72 -1 131 206 -46 -108 -50 -35 159 26 124 -3 54 -46 -55 169 135 -17 13 -15 38 -48 27 -122
6395 -122 -40 -89 -88 116 -3 19 -154 -69 -20 -32 72 30 86 -61 2 -93 -9 -34 -128 -125 -63 18 22 113 -11 -88 -25 -48
6423 -48 37 63 41 7 -78 -25 -6 109 -70 -141 -79 45 -26 7 10 3 -71 -134 34 162 11 62 -100 -135 8 60 98
6450 98 34 -111 -76 -51 48 122 -49 -13 30 -25 84 8 143 -46 -59 -185 85 147 129 77 -80 -4 23 86 15 -37
6476 -37 -70 2 -55 49 74 -28 -41 22 5 110 -16 -31 -80 -71 -81 115 104 -58 -60 10 -59 -77 -47 2 -61 -125 -15 -29
6504b9Q7N9j50o1P6PJ9N2r9P9o1j8Q6n5q0R8j39Q6J00L9k5k09P7j0K11K9j43l5
6532ij82J54rJ80p0K6j90%O7P3O1j13p1Q4j05J83N6j8j89o2J6O5K52j03j09j3
6558b6J4M7n3L3n3k9j0O6N6O8k36J01r6L5L2J34r0m8pl2J32J7J22j24j14r0J95
6585D4P0po4J8q4o4J22J49j84j42J21j24J94M3o8k8o2Q2M3M2q5j24oJ14P7K3P
6612A07j51o5O0J36m1M2j76N7m9J48J19O8l04J1r1J48J21j36P5j68k5O0J35R1
6636A72j25j43n2J87J10K5j05j09j85J16K39J88k18j48Jo5Q7J28L8j74mk2O9J28
6660A38L6j54L4j55R8k1J5O6j24o5O7J30M1L4l12J09N6J46r9r0P5j46Q1M6J38
6685A44m5o3j01O2J0J0R5o3q7j6R0O8M7j22j13P3Q3J9L3m3o4k02L0K57j6q3Pm6
$$ plain form
6504 -29 58 117 -33 -94 -18 -11 8 60 -39 40 -21 -39 47 -8 -88 10 -129 -43 57 96 71 -138 -61 -71 140 169 26 -9
6532 -9 -191 -37 -46 134 64 90 -100 -100 -33 40 101 -12 -83 1 -104 79 135 117 -72 -134 -118 -53 199 96 -13 -26
6558 -26 -12 35 -18 15 -38 -67 -77 -11 45 113 -123 -22 -118 -83 -51 83 -7 -55 -62 -94 38 55 177 53 -61 -151 44
6585 44 114 107 43 61 -23 -87 35 184 0 -142 -21 -145 49 92 24 -4 -66 16 59 101 16 -108 -114 0 77 100 107
6612 107 -44 -109 -49 87 46 88 -88 -31 -80 68 187 255 -49 -38 -129 19 140 4 79 -89 -114 -54 81 172
6636 172 47 -96 -148 39 149 174 69 -40 -225 -109 130 318 100 -48 -47 -112 -25 103 141 -33 -37 -59 10 138
6660 138 174 20 54 -101 -3 -24 -9 57 -67 -132 -65 65 106 140 -172 -63 -7 139 40 -50 25 -121 -40 6 144
6685 144 99 36 -65 -3 7 17 112 49 -38 -54 36 104 151 29 -84 -11 72 91 124 81 17 -185 -155 102 86 3 10 -36
6713c6j12K71n5K3j83M4r6K17K1r0Mk9m8J22m0J20o5j41K9k7J65Q4r1j45l9N6
6739d1l8J70p3L6k27JJ66J34l2j16l6M0r5J20Ml0r4qR3Q0j9M1k1j7o9M6J50j01
6767F4j48Q8j5n5Q2P6j44Nj98K09J47j06K3lj59oJ77L9r1j93J3K30n2M3p9j5l2
6794a00J4J03J3K9q6p1r9K40n8N5n8l0L1J75n9j51P6j3o4K5P7R1j19j10kJ00p
6821Bm9K18n6j07j02N0J96q8r3ml9m9J45J05j55k5j24J82o9P8m9o7J40k18R8K16
6847A36r1O1j11m9M3M7O3k0k36R8J04L9p8M1j30N2R0j55K62k5k18M7Q6j1j1P0
6873A04j08N0j76J34J02j38Q4Ol3n8P2RJ69k43r7J61L3K0j63jO0oJ17J16k43j04
6899a33j2N0R0O2j7lj91MN8K24n2j37M1o4O2Q8j00K6k0l2L4j3Q0M0n5p2l4l9K36
$$ plain form
6713 -36 -148 123 68 91 -92 -48 -144 73 94 4 8 -21 -69 53 13 133 68 -73 -44 -71 94 178 87 -58 -97 -41
6739 -41 -79 91 18 54 -173 -172 -6 128 96 -20 -56 -16 -111 9 13 -17 -111 -119 -26 54 35 76 55 38 -31 15 165 64
6767 64 -84 4 -11 -66 16 92 -52 -47 -245 -36 111 5 28 25 -134 -140 37 76 -15 -208 -195 35 -17 26 -53 -68 -100
6794 -100 -86 17 30 59 -27 -98 -197 43 -15 40 -18 -48 -17 158 99 -52 24 11 -53 -28 49 140 21 -89 -91 9 2
6821 2 -47 171 115 8 -94 -44 152 64 -29 -33 -72 -121 24 129 -26 -51 -175 7 -62 16 -33 -100 40 -178 -80 136
6847 136 45 106 -5 -54 -11 36 99 79 -157 -59 45 84 6 47 -83 -31 59 -96 166 141 -77 -30 56 45 34 104
6873 104 -4 46 -130 4 106 -32 52 58 25 -33 39 48 217 -26 -123 38 71 91 -72 -73 -13 -19 98 214 -29 -133
6899 -133 -145 -95 -5 57 40 37 -154 -150 -92 132 80 -57 -16 -80 -18 70 -30 -4 -24 -56 -22 -35 45 85 30 -42 -76 -115 121
6928A21j21j0P2K5j58K14qn2j09j49R4J09OL8l5j46R7K8M3k0o0o3P6J92n1j45
6954a2p8m0L9M0O7k3pk9k2O2J08N9k28o9L5j8L38l9k02j40J02l6J86r7np5n4O8
6982g0J67L7n4k4j84J10J32oRj24k1q1J51J09j5l1j77O6n2J13O5q3j33J06l1J26
7008A05o4Q2k00p3K36k5M0n7r7o6M4Q3P4k6j04n0P9j21J78J13k03p2J7J78oj00
7034c5j3J5r8P4J06L7n5j2j84J60J6O2L1k61J23J1J23J1m2r6k9k5J77N2l6q7j62
7061a37K6Q2J68j61k4L2L1m3J35J2j24p1m1Q3Nl5J8r5L4NM1Q0j6r9o4Q9O8J18
7089A17o1q0PL8Q9p6o3O4l8q8O1K26N7k39k7n2nkJ89j01j1o7P3Q2p6R0k3n4j46
7118a16K00J2q5j39K4J18p7J53J6r1j52J01J08j45J83q3n7j2P1R0k6j22j6n9l2
$$ plain form
6928 121 0 -10 62 87 -71 143 135 83 -26 -175 -81 28 34 72 37 -109 -12 16 59 39 -21 -84 -8 184 133 -12
6954 -12 -90 -130 -91 -51 16 -7 -14 -43 -65 -3 105 164 -64 -133 -98 -116 222 183 -19 -159 -57 -93 93 -4 -9 -84 -138 -70
6982 -70 97 134 80 56 -128 -18 114 108 117 -7 -28 -109 42 151 136 105 -72 -6 -58 55 120 37 -96 10 -21 105
7008 105 41 123 -77 -150 86 61 101 44 -53 -119 -75 8 82 56 -48 -98 -19 -140 38 151 -52 -124 -107 71 65 -35
7034 -35 -48 -33 -131 -57 49 86 31 19 -165 -5 11 73 104 -157 -34 -23 100 111 69 -27 -56 -81 96 148 112 25 -137
7061 -137 -111 -29 139 -22 -46 -14 17 -26 109 121 -3 -74 -115 -32 -27 -62 -44 -139 -105 -100 -59 21 5 -94 -158 -69 -1 117
7089 117 56 -24 -17 21 110 34 -29 35 -3 -91 -30 196 253 14 -13 -65 -70 -72 117 16 5 -62 11 93 17 107 84 30 -116
7118 -116 84 96 11 -128 -104 14 -63 90 106 15 -137 -36 72 -73 110 27 -30 -42 29 119 93 -29 -45 -104 -136
7143a36J03J47r7j63R5q4J59J19J3j45r7Q4N0N0j31J6pO6j0j1Q7j06r4K9J66K5
7169A28j17J01j57J43p7L7ro4J0q4K3L1n6P2m1o7J41k8j8J07lj70P8K7q0Q2lm9
7197d3q3K1K9M4MJ0n2K16j53N7K6j76N0O8n5L5N1J55l13L0J36l6j24J33n6J08
7223H2l9J1m6M0j11%J05j0N5q8J46j74M9K1j16J96j01j16R4n6O9O4j11O3j05j1
7249h9nP6N5q0k50K47L3J10n3l0r4j3R5J01j00J21j0r5j38R8J12j12n7l3K2J90
7275A01l8M6k14J47o5J10j5n7N6r4L2P1J42j35L6k27R1J35k12R0J3J02j38p4J7
7300h0L1J29p0j34J5K8L4O6n2m5O9j00J67k9l3q1K2m1N8P9J06k42P4l8J28J4L1
7327A06n3j73J25J6J46k52J19j27J23j9J16q0J06k06M0o6N5Q2m7J3r8Q5RN3j11
$$ plain form
7143 -136 -33 114 17 -146 -51 -135 24 143 156 11 -86 -2 48 98 -33 -17 -24 42 32 21 108 2 -92 -63 103 128
7169 128 11 112 -45 98 21 58 49 -15 -5 -89 -66 -35 -91 -19 -60 -127 14 -14 -32 75 72 -98 -20 7 -73 9 6 -43
7197 -43 -126 -105 -76 -32 -28 -18 -70 146 -7 50 76 -100 -50 18 -37 -2 49 204 -109 -79 57 21 -103 30 -26 82
7223 82 43 54 8 48 -63 -63 42 32 87 -1 145 -29 20 41 -75 121 20 -96 -2 -58 11 75 -36 27 -78 -89
7249 -89 -94 -18 37 -43 -293 -46 -13 97 44 14 -80 -93 2 103 3 124 114 19 -119 -21 91 -21 -78 -111 -89 101
7275 101 63 109 -105 42 -23 87 72 15 71 -23 9 80 222 87 123 -104 -13 122 -90 0 13 115 -23 -97 -80
7300 -80 -49 80 10 -124 -109 -81 -47 19 -33 -78 -9 -109 58 29 -4 -85 -63 -104 -46 33 139 -103 -29 -67 61 75 106
7327 106 53 -120 5 21 167 -85 34 -93 30 11 127 47 153 -53 -13 -79 -24 58 11 24 -74 11 20 73 -38
7352c8J06j00j78L66j04j00J01j78N8R4k3J07k16R9k01R9J72m4K0j58mj7J20J27
7376A08j19p5L3l1J67K0kr4k2K6l9J37N4j67m4N5j3K16o0j06r4j7J12j4j1j09
7402h9J00j10J6J86m0k1j15r1Q5J25L1j6N3k15k9J45J26o6j47M0r4J13Q4Q3j29
7427B5j12LO9J5L8q3O1n6J43m8K9Nj50j34L09j4R2r4q6j79J64Q8qpj26j04J28
7454c2L8R7q9k6q0n4R4Q2J12q4k1o7qK7J91j54J4j27J16l3J7R5j29j33L6J82L0
7481I4j06j72N1J05J4J23n9j02n8m3K30J30k59k5j6J41j37J68k2J30k10j3J45
7504A09j40J7O8j55L0k7J87p8M3j63K2J21J2J08ko4k65R2J07Q3M3k57R0J5P2j37
7530f9J72j9p7j8o3J83r0L8j12k5J80p2j9o8O6k38J65P7q7J11n4m1N2j3K54j43
$$ plain form
7352 -38 68 -32 -210 156 52 -48 53 -125 -67 27 4 111 -105 -6 -207 -108 64 20 40 -118 -122 -139 -19 108
7376 108 -11 -86 -53 -84 83 103 101 7 -15 11 -28 109 163 -4 -48 7 -6 210 150 44 -50 -67 45 31 20 -89
7402 -89 11 -99 -83 103 63 42 -73 -164 -79 46 77 61 114 -101 -130 15 141 75 -72 -32 -126 -13 71 154 25
7427 25 -87 -84 -15 0 38 -45 16 -40 103 55 84 89 -61 -195 114 100 192 98 12 -167 -3 85 77 70 -56 -160 -32
7454 -32 6 103 14 -12 -92 -146 -52 30 142 58 37 -30 -38 -11 180 26 40 -87 29 -4 13 108 -21 -154 -118 64 94
7481 94 -12 -184 -133 -28 -14 109 50 -52 -110 -153 77 207 -52 -77 -93 48 -89 79 57 187 -23 -36 109
7504 109 -31 -14 54 -101 -71 -98 89 11 54 -109 -87 34 46 154 152 88 -177 -85 22 105 148 -109 -19 -4 68 -69
7530 -69 103 84 7 -11 -74 109 19 57 -55 -80 100 28 9 -59 7 -231 -66 11 -76 35 -19 -60 -8 -21 233 90
7556I0j82O0R5o1qR6n0n0m2pJ42l9k2L7j66o2J80P8r2n2P4M7m7N8p7j8j17P0J05
7585D0q4J44r3K2K4j5q4J59j13n1M1R1n3%l9m9n2J0R1j5K1k3n9K24q1j07J13l3
7613B9j02O2l1J15j4j64L9O9O3J3r4R9j45J13l6rR6n2n2O4J1nj21J90r0j99J30
7640b1o0J22j6j70jL36j47k7r6J63j62m8J07NL1J02j61p6M4Q4n4L4M8k2m0jm6
7667g2M7j2j09J67j24J74m4j33R9J44j9j39J4J50j06k6K6o4J6p6R3J3j14J47j1
7692D1l9O3Nj76M1J26k9K4j12J12n2N9r0q8P2P9k9k0P2l4kJ0M2Mk07J29K09j89
7720B1Ol4L2n1J6L6o8J2J03M0k0k67K48m0l1m5JM9K0o6P6j16m2N4j0J26K5j04
7748b9o1K36j01n3n3J33j1N2j19RL4j46N6K9M8k8j3r7J33rm9nM7j9K0Jm2l9O1
$$ plain form
7556 90 -92 -32 63 2 -6 90 40 -10 -52 -59 83 44 22 59 -107 -169 11 89 -3 -55 19 66 19 77 0 -18 -135 -65 40
7585 40 -44 100 7 29 53 38 -46 113 0 -51 -10 81 28 28 -11 -60 -112 -102 -11 -26 -5 -28 -87 137 56 -51 62 29
7613 29 -73 -11 -42 73 59 -105 -66 3 66 79 -15 84 -61 52 16 7 103 51 -1 63 74 69 -52 138 48 -151 -21
7640 -21 -81 41 25 -145 -146 190 43 16 -80 83 -79 -127 -20 -15 16 118 -43 -119 -75 9 -45 -11 37 15 -25 -26 -72
7667 -72 -25 -37 -146 21 -103 71 27 -106 -7 137 118 -21 -7 143 37 11 37 -27 -11 -87 6 19 -95 52 41
7692 41 2 65 70 -106 -65 61 32 56 -56 56 4 63 -27 -115 -43 36 7 -13 59 25 23 33 75 79 -128 1 210 21
7720 21 27 -7 25 -26 -10 26 -42 -30 73 113 93 -174 74 34 3 -42 -41 8 28 -38 38 -78 -120 -66 -76 50 75 -29
7748 -29 -90 146 45 -8 -61 72 61 113 -6 3 37 -109 -53 -24 24 -4 -17 -114 19 10 -39 -44 3 -16 4 5 -37 -76 -15
7777a5j16J22L5J8j28M9n2NJ49k8r2J02q3n5R8N5m5n5J9j04j1K14l6Mp2o9J26
7804C5j24n8J77l2o3Q7j01J46j26J64j57M5j06O1J07p0R7j15R9j54J38r1O7j09
7828h3J8Q6j09J86k22K2J14q7M7O3j62M9Q5J5jj30K7K9j8P1J19j32n4N6M3L5j21
7855e4K8J04j62N9K6M1Q6j08kL2R5j23j02J06q7N9K6M9M9r6M5j12P9Mq3l9J05
7882B5r9J44K3q6N7p8J5M5o6o9J24j40M1k9J22l3n4o5M1J20M0k6l6N3j88J14p4
7909g9J02j8l6K0j2m2M9M4ro6q0J99r4Q4n0j34N8M8L0k0j2Pj1l3J02j79K6P7L9
7938A0pJ22q2j77M7N8M1kJ07j24P4k28J83Qj05O8j4K7n1J58j58R6j37J77j39M6
7964bkJ0n0NkQ2k7P6j66J92j71k5J04M6q1pm3L7JJ10j11rO6R5n5qP0j75L4p3l6
$$ plain form
7777 -15 -131 -9 26 44 -84 -35 -87 -82 67 39 -53 49 -34 -89 9 64 19 -36 -17 -121 -132 82 46 50 -22 -91 35
7804 35 -89 -147 30 -2 -65 22 -79 67 -59 105 -52 -7 -113 -52 55 -15 82 -33 66 -88 50 -41 26 -83
7828 -83 -65 21 -88 98 -124 -102 12 -75 -28 35 -127 -78 7 22 21 -109 -82 -53 -71 0 119 -13 -67 -11 32 67 -54
7855 -54 -26 78 -84 -25 1 42 128 20 18 50 145 22 -80 26 -61 -2 24 73 122 26 71 -41 38 42 -41 -80 25
7882 25 -74 70 93 7 64 -14 1 46 -20 -89 35 -105 -64 -93 29 -4 -58 -123 -82 38 78 52 16 69 -119 -5 -79
7909 -79 23 5 -31 -11 -23 -65 -16 28 19 -47 -127 72 -22 62 12 -122 -64 -16 14 -6 -18 -11 -22 -55 47 -132 -106 -29 10
7938 10 3 125 43 -134 -87 -29 12 10 117 -7 67 -161 22 30 -75 -7 -21 6 -45 113 -45 51 -86 91 -48 -2
7964 -2 -4 6 -44 -39 -41 41 14 90 -76 116 -55 -80 24 70 -11 -18 -61 -24 -23 87 -24 -33 33 128 73 65 135 -40 -6 -79 -115
7995a15R6L7j01J26K7j70J10K36k76O7lK2j3M0r0rO8N4l3p8m2j7J25J5p5O8J9
8022H8k9n5m4P5rn9j16J03K0k8O4j2J23j40N9J38j13p4L9j2n1J05j21J57j41J24
8048I1o9N1K5j24J8m1Mj1Q5j5jl7p3M3K2J54j19jo1l0Q2j06J21q1L5j3L2Q8m4
8077B5j20M0L3n9Q2j29N7M7P8j8l9J91k14J79j31o4O6R0j7j23m9P2N4r9J8N7j86
8104a59M9Q8k8O8lN2k3j3k0%j60J19K6J03n7o8P6K6o5J0M9n0m1K1m4O1o9R2p5
8133c5L9n6J11j29Q9p3J02J8o5M3j28Q0m6J10p7n4M1m7J33P6m4M9q2m6M1q3M1
8160HKm3R3R4j41k1O6J6o8K4nJ1q5l3J72j10qP8Q8k39J65r5N6p7j7J72j87J08
8188B4M0Jr8
$$ plain form
7995 -115 -19 18 -83 43 70 -100 10 246 -30 37 34 56 43 83 -7 -16 52 106 73 -5 -47 -64 61 76 1 69 88
8022 88 59 4 -40 35 26 -33 -149 -46 -26 -54 10 -2 121 -19 40 178 65 -9 30 18 -33 72 -49 108 -33 91
8048 91 22 73 98 -26 -8 -49 -45 -56 29 14 13 -24 -97 -54 -32 122 3 2 -59 -89 -7 -113 8 -73 -38 -51 -19 69 25
8077 25 -95 -55 -22 -81 1 -128 -71 -24 54 36 -3 188 -26 153 22 -42 24 114 97 -26 -75 -3 51 -48 -30 27 -159
8104 -159 -110 -22 -50 18 15 67 44 31 11 11 -149 -30 -4 99 42 -26 50 76 11 21 70 20 -21 0 -44 17 -52 40 -35
8133 -35 4 -52 59 -70 19 -54 48 66 1 44 -84 -4 -50 60 -17 -71 -30 -77 56 132 88 137 55 9 50 -33 8
8160 8 10 -33 60 154 13 -8 58 74 6 30 25 36 -49 -82 90 -20 -28 50 138 -101 64 -31 25 -52 -69 103 -84 24
8188 24 64 65 -33
8191c3
$$ Imaginary data points
##PAGE= N=2
##DATA TABLE= (X++(I..I)), XYDATA
0@%%%%%%%%%qQqJ6j6J6k4L2l3L8m4N3o4P0q0R5j06J16j31J49j68J87k07K33k62
34a38K88l16L54l95M36m80N30n89O52p20P98q90R93j110J250j417J619j870K191
53A186k616L197m040N371p705J2537k6211J30811N19225k94611n20277M850R3950
66h4333j29584J87426M68795j20729o71488j52209N17174K77222j54692n371M4728
77A76939l47011k73708L86542M53774k15006m03657Q0842K03769r5915L645K76817
88B47031l6382m34344r0474L90231J40468k71005q1616J83489k0748j27784J76010
99G4876J89437k60958l26966J59651L29559k2765j73467N957j2409j30329R9686
110f7728L30483L1251l65136k30125J27790J76047R0561J07021k5837k93615k06795
$$ plain form
0 0 0 0 0 0 0 0 0 0 0 -8 0 -8 8 -8 8 -16 16 -17 21 -23 30 -34 36 -44 51 -55 61 -70 79 -89 98 -109 124 -138
34 -138 150 -166 188 -207 229 -251 279 -310 342 -378 420 -470 523 -587 663 -754 865 -1005 1186
53 1186 -1430 1767 -2273 3098 -4607 7930 -18281 112530 631755 337144 -183133 -178283 -84333
66 -84333 -213917 -26491 442304 321575 -349913 -502122 15052 292274 137582 132211 176939
77 176939 -170072 -443780 -57238 396536 181530 -222127 -141285 62484 -33431 -29786 247031
88 247031 210649 -223695 -314169 76062 216530 -54475 -136091 47398 26650 -101134 74876
99 74876 264313 3355 -323611 -163960 165599 142834 -30633 -24676 -37085 -167414 -67728
110 -67728 262755 294006 -71130 -301255 -173465 2582 93143 200164 174327 -119288 -326083
121c26083K17982L46833L7233k04212j78310j13584q779K26068K95094j1657l07233
132b6648k11498O1734J79373J58091O0512j43276k68409q6596K03728K37033M8715
143B12759j00919j58920j39760K8669K16507J43909j11883j89478m7662N9348
153h7430Q6317J20447N2201j48790j91941L2633J80658N6381p4637m6301l0285
164e0747m9267O1613J69114K1119j85298j09472R1238Q8972p175J4056L896j20314
176g2265q2876J56256J93408o5371j93704m1481N9203J3504N5343J18859m1794
187I9082k18994o6061J94985J52547n4315q9525m5437q6797l2733J68637J78463
198A99852q3752k11148m0742J00168O1570M4254N3795p8388j93963l6767J87082
$$ plain form
121 -326083 -108101 238732 275965 71753 -106557 -220141 -228920 -2852 292242 280585 -26648
132 -26648 -238146 -176412 2961 161052 221564 78288 -190121 -276717 -72989 164044 212759
143 212759 111840 -47080 -186840 -158171 58336 202245 90362 -99116 -146778 -87430
153 -87430 -1113 119334 171535 22745 -169196 -136563 44095 100476 25839 -20462 -50747
164 -50747 -100014 -38401 130713 151832 -33466 -142938 -51700 37272 30097 44153 48049 -72265
176 -72265 -155141 1115 194523 129152 -64552 -106033 -46830 -33326 22017 140876 99082
187 99082 -119912 -185973 9012 161559 107244 17719 -27718 -114515 -147248 21389 199852
198 199852 116100 -95048 -135790 -35622 25948 70202 123997 45609 -148354 -185121 1961
209A961J36313n3951q4225l0150m8980j3305J24720J16669q7124j67608j4700
220a20380J00164N3876J5696K1381m6162j05779q260J11767O0878n3714n5650
231b6183q905o877K0606P5618L0074p8846o9954L4286N4696k064p962M156l6823
244a8178l8354M9914P7736j8184p3593j3770K6157M75J1942M0737j6418p7699
256d9235j2511P6663L9912l4476k1801j195l5220j4824O8989N2641n8732o7400
268e7189K9033M2024j9192K225M9510j9848r0016k734R3892K4674o4563j2216
280b4400M2904j8475m3964M2942N9875m3278o4351L2628M7181l4540k4683N2985
292B4824J9443o3906j9722O3062J2583o0057Q21O3366j0826o8576J1127O4750
$$ plain form
209 1961 138274 84323 98 -30052 -79032 -92337 32383 149052 61928 -105680 -120380
220 -120380 -20216 33660 49356 70737 24575 -81204 -89464 22303 83181 29467 -26183
231 -26183 -35088 -41965 -21359 54259 84333 5487 -64467 -30181 24515 22451 14489 18645 -18178
244 -18178 -56532 -6618 71118 52934 -20659 -34429 -8272 -7797 4145 44882 28464 -49235
256 -49235 -61746 14917 54829 20353 -1448 -2643 -37863 -52687 16302 68943 10211 -57189
268 -57189 -28156 13868 -5324 -3099 46411 26563 -63453 -66187 27705 52379 -12184 -24400
280 -24400 18504 29 -43935 -993 58882 15604 -48747 -16119 31062 -3478 -28161 24824
292 24824 44267 -19639 -39361 23701 36284 -23773 -22952 40414 29588 -38988 -27861 36889
304C6889j1225n0015K3649L8457m5643m5637N4711N7320m4325n4265K8153K9379
316A7448l1420n567N3268L250p2037k3118O2853L6048l1559j9197R193j9339k0954
329d1131M3111N1960l0195o4726M42M1849J0857j453J6803j3691n8424j3230O9889
342A2061N3263l4609n5966p020J6855J2399K8655K6336l2912o7818r683O2609
354D170N0424r524l7501l2545j8145J8803N7346L4301m0145p0691j9756M3584
366a9679N4845K2839k1876n6212m4622J8614O9080M3686k7985o4352l8452J4878
378d9236N5856N5005J136o5658p0109J364P1886O4322m979o2188n9566n680N4454
391a3393O9339K0040n2222p8562k9079N0601Q2894L4252m8959q3037l3458M7023
$$ plain form
304 36889 25664 -24351 -702 37755 -7888 -53525 1186 58506 14181 -40084 -11931 17448
316 17448 -13972 -19539 33729 36979 -35058 -58176 4677 40725 9166 -10031 -838 -20177 -41131
329 -41131 1980 53940 23745 -40981 -40539 1310 12167 10714 27517 13826 -44598 -57828 12061
342 12061 65324 30715 -25251 -32271 -15416 -3017 25638 51974 19062 -48756 -58439 4170
354 4170 54594 45070 7569 -24976 -43121 -24318 33028 67329 27184 -43507 -63263 -19679
366 -19679 35166 58005 36129 -20083 -64705 -46091 22989 66675 38690 -25662 -64114 -49236
378 -49236 6620 61625 62761 -2897 -73006 -71642 244 64566 59587 -2601 -62167 -67847 -13393
391 -13393 55946 75986 23764 -54798 -83877 -33276 49618 83870 34911 -48126 -81584 -34561
403c4561Q0232L9781l4891q0347n5334K5120Q6862O2979k4733q4518n9295J8940
415e9765P5733O6209m938p8622q1420j095Q1508Q1059M041p0020p8812j8454O2518
428b2058Q9374K5585p0311r4304k3572O1633Q3989L7604l8675q9674o0488L8860
440f2037J05407N7828n0677r8734m8880L4985Q4435O7291j0594q9968q4625J1286
452h4283R5676P9022j1588q3644p9313m915Q0140R6164J6162q3389r8037j6708
464i4713P2772R0275K8074n9878r7200m1480O1653J06449M4549n8796j01356n0434
476a00085M1627R4992O2250l0954r8516p0734K8372J01297P5642k3744j00102
487a9955p9817J3795Q8970P9927R92p7130q8137j6130P9680J01381J7732q5006
$$ plain form
403 -34561 45671 85452 50561 -29786 -85120 -60000 26862 89841 65108 -19410 -78705 -59765
415 -59765 15968 82177 77239 -1383 -82803 -83898 -2390 78669 82710 12690 -66122 -84576 -22058
428 -22058 67316 92901 22590 -71714 -95286 -33653 50336 87940 49265 -40409 -100897 -62037
440 -62037 43370 101198 50521 -48213 -97093 -62108 22327 89618 79024 -10944 -95569 -84283
452 -84283 11393 90415 78827 -4817 -84130 -89045 -8905 87259 103421 20032 -78005 -94713
464 -94713 -21941 68334 96408 36530 -60670 -102150 -40497 65952 110501 51705 -49651 -100085
476 -100085 -58458 36534 98784 67830 -30686 -101420 -73048 28249 103891 80147 -19955
487 -19955 -99772 -85977 2993 82920 83912 6782 -81355 -97485 -17805 83576 101308 16302
499A6302r8809j8901O9108R1410L7766n1729r9913n0113N6684J04782M4367n2139
511D8815r1539n3051K8404R3556P6984k3395j05038p2681L2310R1014O0581j2370
523G3590p4300q1663r251Q8727R8471j234r2934p8855J931O3989P2770K6703n5582
536C2362r9056l7542P2607J03437K4968o6085q5230l3631M2130Q6040N1848m0428
548E1420r7231n3627M2577R2000N5146k7485q5374o8351J4147Q7614P6615j1632
560G5819q7703p6140Q911Q2494P6118K093o8975p9707k2444N9972R3978L4145
572I8561o7089r6832k2555O3518P6218K9066l0630p6292o5704K4207J05246O4542
584A02256m9932q9767l0172K7087M5587N3421J9718o8754r6873N189J01146N8767
$$ plain form
499 16302 -82507 -101408 -32300 59110 96876 45147 -54766 -104879 -48195 56587 100954 48815
511 48815 -42724 -95775 -67371 26185 103169 79774 -25264 -97945 -65635 25379 85960 73590
523 73590 -710 -82373 -91624 -2897 95574 94340 1406 -77449 -75518 -11529 61241 87944 32362
536 32362 -66694 -104236 -31629 71808 96776 30691 -54539 -88170 -46040 40000 91848 51420
548 51420 -45811 -99438 -56861 35139 90285 62800 -22574 -90925 -76778 10836 87451 75819
560 75819 -11884 -88024 -79113 3381 79499 81592 12617 -67090 -89534 -29562 64416 98561
572 98561 31472 -65360 -87915 -24397 51821 80887 50257 -26035 -91739 -67532 37714 102256
584 102256 52324 -37443 -67615 -40528 5059 58480 78198 9444 -87429 -82240 18906 77673
596G7673l3665m9405k8158k3642K0318Q6271M2742q3158r4992K4552P8326J8991
608C5853r019N855m0342p5841K3833J21990L4710j01704o8516L7674L4039O61
620h07M3619L3250q5623j01588N5278J27596N923p8986k0909M094l7009J9576
632c5586J14754L2138j28474r1649O8160Q0322j0047k337K3686o3792r5106N4451
644e3480J43697O868j13597l6604L9218j1232o849Q6312M4241j13055r8522P3933
656c9070J01220k4846m6049K4753j1954p4024J8606J15160J4046j06907l5160
667f4225O6752J5854l6914K8420M1623o1609o7656O2203Q3658m0267o9973K5491
679a6643L7056l2740o635O0540K13q6123j8400Q3924L6424n2225k3773K3647j5942
$$ plain form
596 77673 44008 -5397 -33555 -57197 -36879 49392 92134 8976 -86016 -61464 16862 35853
608 35853 26834 32689 -7653 -83494 -59661 62329 97039 -4665 -73181 -35507 -1468 -807
620 -807 42812 76062 -9561 -111149 -55871 71725 77648 -1338 -22247 -18153 -55162 -35586
632 -35586 79168 111306 -17168 -108817 -40657 39665 29618 27281 50967 -12825 -107931 -53480
644 -53480 90217 97085 -16512 -53116 -13898 -25130 -31979 54333 98574 -14481 -113003 -39070
656 -39070 62150 37304 -8745 16008 4054 -69970 -51364 63796 77842 -29065 -64225
667 -64225 2527 18381 -18533 9887 51510 -10099 -77755 -15552 68106 27839 -42134 -16643
679 -16643 20413 -12327 -18962 41578 41791 -44332 -62732 21192 57616 5391 -18382 5265 -10677
692a0677k7475M8549N9219m2599p9765O380N6347J2728p372J3485j5834n7217
704d4231p968O6813M1641l2548l9131o369m040L418M0461L4160l1292n7087o414
717d2587L4573K2320N200N02j8300l1784k994L3534K6153n793j9618j6128p036
730b1958J0501K1570P727j1462j0454l674l192O066J6802K975j7515o234J2487
743C639k6j3159O508J8885o338j8500O908J2812j4525j1887K2900J6932k2898
756A251j8472J6232Q614j6329N450K7222j0465l8736L636L6182p47k4368J0533
769CJ8253k6288k4669L2028L2014k6263k8060K0941J4642k6138n580L5570N856
782B2309l7037o103L1299p51k8082J0909L1333j3787l1869J1760K3974j4697j3246
$$ plain form
692 -10677 -38152 10397 69616 27017 -52748 -46368 9979 22707 15335 28820 12986 -44231
704 -44231 -52199 14614 56255 23707 -15424 -21793 -25833 -22415 18046 52206 20914 -36173 -42587
717 -42587 -8014 14306 19506 20008 1708 -30076 -33070 464 26617 20824 1206 -14922 -21958
730 -21958 -11457 10113 17840 6378 -4076 -7750 -10942 -4876 11926 14901 -2614 -8848 3639
743 3639 3613 -9546 -3038 15847 9509 -8991 -2083 10729 -3796 -15683 7217 24149 1251
756 1251 -17221 -989 7625 -8704 -3254 23968 13503 -25233 -21597 14585 13838 -10530 3
769 3 18256 -8032 -32701 -673 31341 5078 -22982 -2041 12601 -13537 -19117 16453 22309
782 22309 -14728 -20831 10468 9717 -18365 -7456 23877 10090 -21779 -10019 13955 -742 -13988
795a3988K6581J3061l4535j9969K8412J8901j5695j434J5707j6766l1932J6637
807a5020M3844k40l2662p844P396q755L290L3487J1133l7983k9773J5745K3134
820E752N311O600L83k9826k6311K2435L9184J322k2175r424p384j0565J7256L7059
834B9617j018m0599j8005J9196J4215K420J0956j747l2636j6419L2467L0200j4955
847A3692k2031K331r71p995J9348K7602j8639m1335M539L5724N892j4726L546
860F977k858k8006r7M7464J9600m3405l2939K0710K0087n129J0735J7031l1349
873a179m6389K0255N9194O912l8524j4624K488j2505R567M9346J3924n8179m3661
886e3375L0365M0000n14k033N610l1530m2172K7416O8403N962n4371k5152J4978
$$ plain form
795 -13988 12593 25654 -8881 -28850 -438 18463 2768 1334 17041 275 -31657 -15020
807 -15020 28824 28584 -4078 -11922 -4526 -13281 -9991 23496 34629 -3354 -33127 -17382 5752
820 5752 11063 17663 18046 -11780 -38091 -15656 23528 24850 2675 -6749 -14133 -24698 -7442 29617
834 29617 28599 -12000 -30005 -10809 3406 5826 16782 15035 -17601 -34020 -1553 28647 13692
847 13692 -8339 -6008 -6979 -14974 4374 31976 13337 -27998 -23459 12265 18157 3431 6977
860 6977 4119 -23887 -23984 23480 43080 -325 -33264 -12554 7533 2404 13139 30170 -1179
873 -1179 -47568 -27313 31881 38793 269 -14355 -11867 -24372 -14805 34541 48465 -9714 -53375
886 -53375 -23010 16990 16476 14443 20053 -11477 -53649 -26233 42170 48132 -6239 -31391 -16413
899a6413M103P256L7741J1016n6381m4885L5620N3971j860k4476n158j3417k3124
912c6007K2896N6318K454n7935k9799K6799K5686M067Q880l324m0373k6830L8648
925h520N1309q516m1823j5308N879M093K0131L0776j0722n3709k2669L9170M0785
938C0876k119k1648j7492j7736j756L5676L7914j4610m9821k1187K2365L0522
950A0984J6165n00k4199l6631n949M0209L9645o156l7505k6462N69K2164L1489
963B3823J5675k4020m3681j3657L1327L8421Q156k1939l0241j7431J1453L6348
975A4234K7113j4091m2677k4307J7230L6815K0430r996k9853k6384J282L1920
987A716L2991j704l5477l1472K850L0395K8550L203k4751l3413r721K7019L7109
$$ plain form
899 -16413 -12310 -5054 32687 43703 -12678 -57563 -21943 32028 30168 5692 534 -12883 -36007
912 -36007 -13111 43207 45661 -12274 -42073 -15274 10412 14479 23359 20035 -20338 -47168 -8520
925 -8520 42789 34273 -7550 -22858 -16979 -12886 7245 38021 27299 -26410 -49079 -9909 30876
938 30876 28757 7109 -10383 -28119 -29875 5801 43715 29105 -20716 -41903 -19538 10984
950 10984 27149 26649 2450 -34181 -40130 79 39724 33568 -3937 -30399 -29830 -7666 23823
963 23823 39498 15478 -28203 -41860 -10533 27888 36044 14105 -16136 -33567 -22114 14234
975 14234 41347 27256 -15421 -39728 -22498 14317 34747 24751 -5102 -31486 -30204 1716
987 1716 34707 33003 -2474 -33946 -31096 -701 27849 31052 6301 -27112 -36833 -9814 27295
1000B7295P639k7903l2575p669K0098L0655J6592j5732l7156k0118J9809L7307
1012A8242J5940j6771k9733j8657O891L0679K8053n919l6600k6996J0058L2029
1024G216K2180l367k4330k6971n039K6380L2924M125k8195l0195l948K2381K8254
1037B1415J0346j8872l2440j3276K0361L1655J1620j6826k7928j5481J0431K9153
1049A0158K0771j0048l1844k0553J0635K8611J9183n916k5247k2744J347K6023
1061C76K5532q12k5636k4517l46K2375K4363M162j9934k5724o878J9000K6387
1074A8348R003j6944k6469j0640J5251K6452J1884j3480k4904j2934J0614K3354
1086I535J5073p099k2929j7543N094K2999J8636m320k2289j8368K450K0173J8306
$$ plain form
1000 27295 34934 7031 -25544 -33213 -13115 17540 34132 18400 -18756 -38874 -19065 18242
1012 18242 34182 17411 -12322 -30979 -24088 6591 34644 28725 -7875 -34871 -24813 7216
1024 7216 29396 26029 1699 -25272 -30311 -3931 28993 33118 4923 -25272 -29220 -6839 21415
1037 21415 31761 12889 -19551 -32827 -12466 19189 30809 13983 -13945 -29426 -18995 10158
1049 10158 30929 20881 -10963 -31516 -20881 7730 26913 20997 -4250 -26994 -25647 376
1061 376 25908 25096 -540 -25057 -25403 -3028 21335 25497 5563 -20161 -27039 -8039 18348
1074 18348 27351 10407 -16062 -26702 -11451 15001 26885 13405 -11499 -24433 -13819 9535
1086 9535 24608 17509 -5420 -22963 -17869 5130 23766 19446 -2843 -21211 -18761 1412 19718
1099A9718o8j8115j9242k801J6644J9991M206j5331k0321n947J3750K0354P320
1112B0158j2472k0204q219J0738J8915R610p998j8455j1886O718J9326J2571o753
1125A2049j7770j1225M155J4870J3258j46j4948j6169J1J7023J5002j328j4146
1138F36j2476j357J0260J4074N174j0610j6115m273J0718J3557M307p157j2492
1151e754q178N409J5253Q823q022j4402n228N784R035O609J96r828j2154K29J4072
1166A844J0232m516j0549n237O56M395Q798N286p783j3580j076J1539Q200k393
1180E816m882l686m514N85J0259P990o988j1936l53P478L450N99J877l895r670
1195g870j34J2575O279q523p318L109J891k543L902P889n240j2840R39J2879K343
$$ plain form
1099 19718 19650 1535 -17707 -20508 -3864 16127 20333 5002 -15319 -21266 -7516 12838 20158
1112 20158 7686 -12518 -20737 -9999 8916 18526 10528 -7927 -19813 -13095 6231 18802 12049
1125 12049 -5721 -16946 -12791 2079 15337 15191 243 -15926 -15915 1108 16110 14782 636
1138 636 -11840 -13197 -2937 11137 16311 5701 -10414 -14687 -3969 9588 13895 6738 -5754
1151 -5754 -13932 -8523 6730 15553 7531 -6871 -12099 -6315 2720 9329 9525 -303 -12457 -12228 1844
1166 1844 12076 7560 -2989 -8226 -7570 -3175 5623 10909 3126 -10454 -11530 9 8209 5816
1180 5816 934 -2752 -7266 -6681 3578 11568 4580 -7356 -7709 -231 3219 3818 5695 1800 -7870
1195 -7870 -8004 4571 10850 2327 -4991 -1882 9 -2534 1368 9257 4017 -8823 -7884 4995 7338
1210G338q224j081M148m288m830Q381Q282q181j0403N181Q220m278l881O636J561
1225D581j0350k568J1989L797j0374l050Q731L24r051K446J0549l179j1177L644
1239c688J0291m650r192O580R074p340r202P705P829p646n602R139M379j0924
1253c247m610J0858M897r083k777P733j229q855L852J1396l513j2398J531R688
1267D243j880n784N248M541r414o742J0108R041p456q006M483L434n221N92R194
1282F381j058j2100j982J1028M175o619k255L111k477l928O265P799n029j0101
1296f790N53P690K317j477K58k168o264j2R651N659o108q211m54L667L184L522
1312E017J882n588r123m42J0068P959l011q530m820Q33M143O618M122m904j1278
$$ plain form
1210 7338 -886 -1967 2181 -2107 -6937 1444 9726 1545 -8858 -3677 4543 265 -3616 3020 4581
1225 4581 -5769 -8337 3652 7449 -2925 -5975 2756 3080 -5971 -3525 7024 3845 -7332 -3688
1239 -3688 6603 1953 -7239 -659 8415 1075 -8127 -422 7407 -239 -5841 3298 7677 -3247
1253 -3247 -7857 3001 7898 -1185 -3962 3771 2542 -6313 -2461 8935 5422 -6976 -5445 4243
1267 4243 2363 -3421 1827 6368 -3046 -9788 320 9361 1905 -6101 -1618 1816 -3405 -2813 6381
1282 6381 5323 -6777 -8759 2269 6444 -175 -2430 681 -1796 -5724 541 8340 3311 -6790
1296 -6790 -6237 1453 3770 2293 2551 383 -5881 -5893 3758 9417 3309 -4902 -5356 -1689 1495 5017
1312 5017 6899 1311 -7812 -8254 1814 9773 6762 -1768 -6588 -5755 -1612 5006 9128 4224 -7054
1327g054m275Q660J0301P70o656o186l037J094P695R028k420j2894p130O655R705
1342D256K587k248m294p168l197Q849J1938j631j2072n723M048M514L801M485
1356H145k802j2169n414J1365J1887l154r400k938O5J16O668Q966m084j4893m315
1371a1957J0917Q993j216l593m399p153m91J2357J0450p162j4159k749O482N598
1385A918N010K414q383j3407J70J4922R693n070r153n512k223M720J2993O064
1399A4156j1131j4738l58J0584Q503K415l560j0150q839M996J4838O556p432j0296
1413d456n051J792Q668J0643q49j3135r275M492R882N194o4n275r825m016R858
1428a417J2106j138j0380o049L88L784P331O120o105j3264k690J0802Q309j500
$$ plain form
1327 -7054 -11329 -2669 7632 8402 1746 -4440 -7477 -6383 1312 10340 7920 -4974 -12104 -5449 4256
1342 4256 6843 4595 301 -6867 -10064 -1215 10723 9092 -2980 -8703 -4655 -141 3660 8145
1356 8145 5343 -6826 -12240 -875 11012 7858 -1542 -4480 -4415 -4299 2369 11335 7251 -7642 -11957
1371 -11957 -1040 7953 6737 3144 -1255 -8408 -8899 3458 13908 6746 -7413 -10162 -3680 1918
1385 1918 6928 9342 959 -12448 -12278 2644 12337 7267 -1886 -7398 -9621 -4901 8092 14156
1399 14156 3025 -11713 -12071 -1487 7016 9431 5871 -4279 -13118 -8122 6716 13272 5840 -4456
1413 -4456 -9507 -7715 953 11596 10747 -2388 -11663 -7171 2711 7905 7841 2566 -7259 -11275 -1417
1428 -1417 10689 9551 -829 -6878 -6490 -2706 4625 10745 4640 -8624 -11314 -512 7797 6297
1442F297m234m854o433J296J3198Q229r585j3216l4P409M331M073K329r351j3608
1457a4153L229J7492O967r507q485j531j326L272J2976N992j3857j5445M393J3397
1471C414M377j437j542p711j0539N605J7976M972j3901j0121K808L650K340Q256
1485H147L419j3137j3363P247J5636J730p891l139k092n080M381J3838K279j4684
1499b709r536P197Q565J08K89J51q020p841P913J3956q49j1765m745L418J776
1514b092L250O893j423j2526o208J0012J0607j723o287k737k893j389P509R895
1528A0888l131j3058m818P062P279J720n78m348p885k006R349R496k368r451n048
1543f897J358M421N868L414m683r839l014P436Q204P54n137n692k939K134P086
$$ plain form
1442 6297 2063 -2791 -9224 -7928 5270 13499 3914 -9302 -9336 -1927 2404 6477 8806 -545 -14153
1457 -14153 -10924 6568 13535 4028 -4457 -5988 -7314 -4042 8934 14926 1069 -14376 -9983 3414
1471 3414 7791 6354 4812 -2899 -13438 -7833 10143 15115 1214 -8907 -6099 -2449 -109 8147
1485 8147 11566 -1571 -14934 -7687 7949 9679 1788 -1351 -3443 -8523 -4142 9696 11975 -2709
1499 -2709 -12245 -5048 3517 3625 3914 4065 -3955 -11796 -3883 10073 9224 -2541 -7286 -3868 -2092
1514 -2092 1158 8051 6628 -5898 -12106 -2094 8513 6790 503 -2234 -5127 -6516 993 10888
1528 10888 7757 -5301 -10119 -3057 4222 5942 5364 1016 -6869 -8875 474 9970 7602 -1849 -6897
1543 -6897 -5539 -1118 4750 8164 3481 -6358 -9372 -1936 6268 7022 1885 -3807 -6746 -4612 2474
1558B474N255k953q530m186L895O593L226k000m691m592L6N431O290o18o724n155
1574f249J739N613L380k73l260m568j761M176O400P62n683m799N24L642L442J740
1590D825j921n839l277M287O639O63m640l544q28J011L696M510j215p179l765
1605f577M063N720P01j907k357l189j556M501O289j065o604l114K345L053J718
1620B021J412j353n278k476M579N381n89l762k174m19M59L149L517j499n600j428
1636d060L534K770j66m56j273k732q01L756L652j785l916r66J673J165J269Q17
1652B481j638l466j17L565J940j418j805p29n56Q66K215J003k049k560K81K001
1668A4J076J28o63j530j301J018K583O78j920j434K05L39Q39J220K9j657j517
$$ plain form
1558 2474 7729 4776 -3754 -7940 -4045 2548 5774 3774 -917 -5509 -5473 -42 6248 5630 -1094 -6249
1574 -6249 -4510 1103 4483 4210 950 -3618 -5379 -1203 5197 5959 276 -4523 -3999 -357 3085 4825
1590 4825 2904 -2935 -6212 -1925 4714 5377 737 -2807 -3635 -2624 1072 5582 4367 -2812 -6577
1605 -6577 -2514 3206 3907 2000 -357 -3546 -5102 -601 5688 4623 -1981 -5095 -2750 303 2021
1620 2021 3433 2080 -3198 -5674 -1095 4286 3697 -65 -2239 -2658 -2199 950 4467 2968 -2632 -4060
1636 -4060 -526 2244 2078 1622 349 -2383 -3184 572 4224 2439 -1477 -2443 -770 395 1664 2481
1652 2481 843 -2623 -2740 825 2765 1347 -458 -1187 -1743 -877 1338 2341 292 -2268 -1987 14
1668 14 1090 1218 555 -975 -2276 -1258 1325 2003 83 -1351 -1146 -807 32 1252 1281 -376 -1893
1685a893Q60J837M93o72o96p61k36J153J208k02j200m27K16K19L73P22l35j077
1703d18k94Q46N25l81k09J18j93l51L05M98k77m71J22L81m31k47L43M29k89k10
1723b04j08o8j30M58N62l43p79l3L05L36K87K49n60q87r3J187Q04l00j011n40
1743h68K36N69Q26M80q17j156m04J006J183K89o82j331o82P50J537P07r22j270
1761e49q15L55J670J220p17j795j201N93J651J227j65j629j788J25J859J815l32
1778A524j699j770L4J379K011O99j830k555j91K034J938L23j096k152j313J139
1794a525L021J767k024l098o36J572K059J247l75k448k571O57L698K071j491k741
1810h17j573L29K144K780M00l162l493M93L587K187n21j827k498j345J878M303
$$ plain form
1685 -1893 -1033 804 1297 625 -71 -832 -1068 85 1293 1091 -109 -536 -320 -101 272 994 659 -418
1703 -418 -712 134 659 278 69 187 -6 -357 -52 446 169 -302 -180 201 -230 -477 -134 295 6 -204
1723 -204 -312 -380 -510 -52 510 167 -612 -645 -340 -4 283 532 -28 -915 -1008 179 983 683 -328 -868
1743 -868 -632 -63 763 1243 426 -730 -1134 -128 1055 1344 662 -669 -1351 -601 936 1643 721 -549
1761 -549 -1364 -1009 661 1881 1164 -631 -1832 -1239 412 1639 1474 -155 -1943 -1818 41 1856 1524
1778 1524 -175 -1945 -1911 -532 1479 2178 348 -2207 -2398 -364 1574 1897 801 -1351 -2664 -1525
1794 -1525 1496 3263 1239 -1859 -2495 -923 1136 2383 2008 -440 -3011 -2354 1344 3415 1924 -817
1810 -817 -2390 -2061 83 2863 3263 101 -3392 -2899 688 2875 2354 527 -1971 -3316 -1438 2865
1826B865J067l519l625P1K495K273J185q50l583k933K017M926J761k919l466q54
1842c089Q76K578L001N9m407l761J625M686K218j171k735k754q11L018M877M29
1858D639m808l894P60L678K486P58j682m466k377L142N712J052m159l904m52J836
1874a679L362K847j182n505l508L053N548J504k467l482k363K91L808M664n10
1889D381n728m011J626M595K891l17l030m324j242M230N691K49n005m231K20L072
1905i33L480K241k194n573k929L784N993J372l428m236j854J477M358M006j454
$$ plain form
1826 2865 3932 413 -3212 -3141 -646 1627 2812 1962 -1621 -4554 -2537 2389 4150 1231 -2235 -3089
1842 -3089 -2213 365 3366 3425 -982 -4743 -3118 1568 3786 2615 -120 -2874 -3685 -667 4210 4639
1858 4639 -169 -4063 -3303 375 2861 3619 1937 -2529 -4906 -1764 3948 5000 841 -3063 -3515 -1679
1874 -1679 1683 4530 3348 -2157 -5665 -2612 2936 4440 1973 -1509 -3872 -3581 227 4891 4381
1889 4381 -1347 -5358 -3732 863 3754 3437 407 -3917 -5159 -929 4762 5011 6 -4225 -4005 -933
1905 -933 2547 4788 2594 -2979 -5908 -2124 3869 5241 1813 -2423 -4277 -2800 1558 5564 4110
$$ [...]
8191I1
##END NTUPLES=NMR FID
##END=
