##TITLE=1H_AEDM21609
 CDCl3, 8 sc, 
 17.9.2019
##JCAMPDX= 6.0         $$ Bruker NMR JCAMP-DX V2.0
##DATA TYPE= NMR FID
##DATA CLASS= NTUPLES
##ORIGIN= UXNMR, Bruker Analytische Messtechnik GmbH
##OWNER= root
$$ XWIN-NMR		Version 3.5
$$ Tue Sep 17 14:10:28 2019 Russian Standard Time (UT+4h)  she@DPX200
##.OBSERVE FREQUENCY= 200.1315
##.OBSERVE NUCLEUS= ^1H
##.DELAY= (6, 6)
##.ACQUISITION MODE= SIMULTANEOUS
##.ACQUISITION SCHEME= undefined
##.AVERAGES= 8
##.DIGITISER RES= 18
##SPECTROMETER/DATA SYSTEM= spect
##.PULSE SEQUENCE= zg30
##.SOLVENT NAME= CDCl3
##.SHIFT REFERENCE= (INTERNAL, CDCl3, 0, 15.7039)
##AUDIT TRAIL= $$ (NUMBER, WHEN, WHO, WHERE, WHAT)
$$ ##TITLE= Audit trail, XWIN-NMR		Version 3.5
$$ ##JCAMPDX= 5.01
$$ ##ORIGIN= Bruker BioSpin GmbH
$$ ##OWNER= she
$$ F:/spectra/data/she/nmr/H-F/1/audita.txt
$$ ##AUDIT TRAIL=  $$ (NUMBER, WHEN, WHO, WHERE, WHAT)
(   1,<2019-09-17 14:09:00.85 +0400>,<she>,<DPX200>,
      <created by zg, POWCHK disabled, PULCHK disabled
       configuration hash MD5:
       00 E9 B6 7A A2 85 ED C7 34 08 36 98 17 FE 4E 26
       data hash MD5: 16K
       25 27 83 E1 D5 B7 5E CF CB B8 2F 73 37 2D 9A 9B>)
$$ ##END=
$$ 
$$ hash MD5
$$ 89 DF A5 5C 6E 45 5F 19 8E 51 81 93 D4 04 8C 77
##$RELAX= 
##$RELAX= 
##$RELAX= 
##$RELAX= 
##$RELAX= 
##$RELAX= 
$$ Bruker specific parameters
$$ --------------------------
##$DU= <F:/spectra>
##$EXPNO= 1
##$NAME= <H-F>
##$PROCNO= 1
##$TYPE= <nmr>
##$USER= <she>
##$AMP= (0..31)
100 100 100 100 100 100 100 100 100 100 100 100 100 100 100 100 100 100 
100 100 100 100 100 100 100 100 100 100 100 100 100 100 
##$AQSEQ= 0
##$AQ_mod= 1
##$AUNM= <au_zg>
##$AUTOPOS= <>
##$BF1= 200.13
##$BF2= 200.13
##$BF3= 200.13
##$BF4= 200.13
##$BF5= 200.13
##$BF6= 200.13
##$BF7= 200.13
##$BF8= 200.13
##$BYTORDA= 1
##$CFDGTYP= 0
##$CFRGTYP= 5
##$CHEMSTR= <none>
##$CNST= (0..31)
1 1 145 1 1 1 1 1 1 1 1 1 1 1 1 1 1 1 1 1 1 1 1 1 1 1 1 1 1 1 1 1 
##$CPDPRG= <>
##$CPDPRG1= <>
##$CPDPRG2= <>
##$CPDPRG3= <>
##$CPDPRG4= <mlev>
##$CPDPRG5= <mlev>
##$CPDPRG6= <mlev>
##$CPDPRG7= <mlev>
##$CPDPRG8= <mlev>
##$CPDPRGB= <>
##$CPDPRGT= <>
##$D= (0..31)
0 1.2 0 0 0 0 0 0 0 0 0 0.03 0 0 0 0 0 0 0 0 0 0 0 0 0 0 0 0 0 0 0 0 
##$DATE= 1568714940
##$DBL= (0..7)
120 120 120 120 120 120 120 120 
##$DBP= (0..7)
150 150 150 150 150 150 150 150 
##$DBP07= 0
##$DBPNAM0= <>
##$DBPNAM1= <>
##$DBPNAM2= <>
##$DBPNAM3= <>
##$DBPNAM4= <>
##$DBPNAM5= <>
##$DBPNAM6= <>
##$DBPNAM7= <>
##$DBPOAL= (0..7)
0.5 0.5 0.5 0.5 0.5 0.5 0.5 0.5 
##$DBPOFFS= (0..7)
0 0 0 0 0 0 0 0 
##$DE= 6
##$DECBNUC= <off>
##$DECIM= 24
##$DECNUC= <off>
##$DECSTAT= 4
##$DIGMOD= 1
##$DIGTYP= 9
##$DL= (0..7)
0 120 120 120 120 120 120 120 
##$DP= (0..7)
150 150 150 150 150 150 150 150 
##$DP07= 0
##$DPNAME0= <>
##$DPNAME1= <>
##$DPNAME2= <>
##$DPNAME3= <>
##$DPNAME4= <>
##$DPNAME5= <>
##$DPNAME6= <>
##$DPNAME7= <>
##$DPOAL= (0..7)
0.5 0.5 0.5 0.5 0.5 0.5 0.5 0.5 
##$DPOFFS= (0..7)
0 0 0 0 0 0 0 0 
##$DQDMODE= 0
##$DR= 18
##$DS= 0
##$DSLIST= <SSSSSSSSSSSSSSS>
##$DSPFIRM= 0
$$ [...]
##$SUBNAM2= <"">
##$SUBNAM3= <"">
##$SUBNAM4= <"">
##$SUBNAM5= <"">
##$SUBNAM6= <"">
##$SUBNAM7= <"">
##$SUBNAM8= <"">
##$SUBNAM9= <"">
##$SW= 24.0689530833862
##$SWIBOX= (0..15)
0 0 2 0 0 0 0 0 0 0 0 0 0 0 0 0 
##$SW_h= 4816.95568400771
##$TD= 16384
##$TD0= 1
##$TE= 0
##$TE2= 300
##$TE3= 300
##$TEG= 300
##$TL= (0..7)
0 120 120 120 120 120 120 120 
##$TP= (0..7)
150 150 150 150 150 150 150 150 
##$TP07= 0
##$TPNAME0= <>
##$TPNAME1= <>
##$TPNAME2= <>
##$TPNAME3= <>
##$TPNAME4= <>
##$TPNAME5= <>
##$TPNAME6= <>
##$TPNAME7= <>
##$TPOAL= (0..7)
0.5 0.5 0.5 0.5 0.5 0.5 0.5 0.5 
##$TPOFFS= (0..7)
0 0 0 0 0 0 0 0 
##$TUNHIN= 0
##$TUNHOUT= 0
##$TUNXOUT= 0
##$USERA1= <user>
##$USERA2= <user>
##$USERA3= <user>
##$USERA4= <user>
##$USERA5= <user>
##$V9= 5
##$VALIST= <valist>
##$VCLIST= <CCCCCCCCCCCCCCC>
##$VD= 0
##$VDLIST= <DDDDDDDDDDDDDDD>
##$VPLIST= <PPPPPPPPPPPPPPP>
##$VTLIST= <TTTTTTTTTTTTTTT>
##$WBST= 1024
##$WBSW= 4
##$XGAIN= (0..3)
0 0 0 0 
##$XL= 0
##$YL= 0
##$YMAX_a= 678952
##$YMIN_a= -1081651
##$ZGOPTNS= <>
##$ZL1= 120
##$ZL2= 120
##$ZL3= 120
##$ZL4= 120
##$ABSF1= 10
##$ABSF2= 0
##$ABSG= 5
##$ABSL= 3
##$ALPHA= 0
##$AQORDER= 0
##$ASSFAC= 0
##$ASSFACI= 0
##$ASSFACX= 0
##$ASSWID= 0
##$AUNMP= <proc_1d>
##$AZFE= 0.1
##$AZFW= 0.1
##$BCFW= 1
##$BC_mod= 2
##$BYTORDP= 1
##$COROFFS= 0
##$CY= 11.3945322036743
##$DATMOD= 1
##$DC= 2
##$DFILT= <>
##$DTYPP= 0
##$F1P= 20.1720416913024
##$F2P= 0.152960286110954
##$FCOR= 0.5
##$FTSIZE= 0
##$FT_mod= 4
##$GAMMA= 1
##$GB= 0.15
##$INTBC= 1
##$INTSCL= 1
##$ISEN= 128
##$LB= 0.24
##$LEV0= 0
##$LPBIN= 0
##$MAXI= 10000
##$MC2= 0
##$MEAN= 0
##$ME_mod= 0
##$MI= 1.114404
##$NCOEF= 0
##$NC_proc= 0
##$NLEV= 6
##$NOISF1= 3.799351
##$NOISF2= 2.8
##$NSP= 1
##$NTH_PI= 0
##$NZP= 0
##$OFFSET= 15.70392
##$PC= 1
##$PHC0= -9575.131
##$PHC1= 17.00096
##$PH_mod= 1
##$PKNL= yes
##$PPARMOD= 0
##$PSCAL= 0
##$PSIGN= 0
##$REVERSE= no
##$SF= 200.130013532006
##$SI= 16384
##$SIGF1= 3
##$SIGF2= 2
##$SINO= 400
##$SIOLD= 16384
##$SREGLST= <1H.CDCl3>
##$SSB= 0
##$STSI= 0
##$STSR= 0
##$SW_p= 3612.71676300578
##$SYMM= 0
##$S_DEV= 0
##$TDeff= 0
##$TDoff= 0
##$TI= <>
##$TILT= no
##$TM1= 0
##$TM2= 0
##$TOPLEV= 0
##$USERP1= <user>
##$USERP2= <user>
##$USERP3= <user>
##$USERP4= <user>
##$USERP5= <user>
##$WDW= 1
##$XDIM= 8192
##$YMAX_p= 0
##$YMIN_p= 0
$$ End of Bruker specific parameters
$$ ---------------------------------
##NTUPLES= NMR FID
##VAR_NAME=  TIME,          FID/REAL,        FID/IMAG
##SYMBOL=    X,             R,               I
##VAR_TYPE=  INDEPENDENT,   DEPENDENT,       DEPENDENT
##VAR_FORM=  AFFN,          ASDF,            ASDF
##VAR_DIM=   8192,          8192,            8192
##UNITS=     SECONDS,       ARBITRARY UNITS, ARBITRARY UNITS
##FACTOR=    0.0002076,     1,               1
##FIRST=     0,             0,               0
##LAST=      1.7004516,     0,               0
##MIN=       0,             -1081651,        0
##MAX=       1.7004516,     678952,          0
$$ Real data points
##PAGE= N=1
##DATA TABLE= (X++(R..R)), XYDATA
$$ [...]
2615H43r18j423O70J756m98n95L03J9j708j3K936J172k681k323J625J478o15l11
$$ 843 -75 -1498 -828 928 430 -165 138 157 -1551 -1564 1372 2544 -137 -2460 -835 643 28 -283
2633b83J691p74k586n40K957J343j326q22N0j105o57K639K404k215l139O69K158
$$ -283 1408 634 -1952 -2492 465 1808 482 -340 -290 -1395 -2052 587 2991 776 -2363 -1694 464
2650D64l98n70J759N29l135j975L005L128j122k642K30l5p19J512K599r58l681
$$ 464 66 -504 1255 1784 -1351 -3326 -321 2807 1685 -957 -727 -762 -1481 31 2630 1672 -2009
2667b009l92K539Q16p17P48O63k836k601K996M309o29l702j209J064L76P04K141
$$ -2009 -2401 138 954 237 985 1648 -1188 -3789 -793 3516 2887 -815 -2024 -960 -584 120 2261
2684B261M97l602k476J856K646N40l01O6k377k645J916M694Q84l949k304R29P33
$$ 2261 2758 -844 -3320 -1464 1182 1722 1421 1487 -890 -3535 -1619 3075 3959 10 -2294 -1365 -632
2701f32L75K132J349k708l776N78L480J973p38j385k116j545J624L859J414l333
$$ -632 -257 1875 3224 516 -3260 -2682 798 2771 2033 648 -1468 -3013 -1389 2470 3884 551
2717E51k820L41J215J028J652J096k493m024j20M011L377r39k984k261o52J399
$$ 551 -2269 -1928 -713 315 1967 3063 570 -3454 -3574 437 3814 2875 -109 -2370 -3022 -1623
2733a623L725J579k183l508j356J225K412K493M83k767m130q35M154L698Mk607
$$ -1623 2102 3681 1498 -2010 -3366 -2141 271 2764 3247 480 -3650 -4485 -331 3367 3371 764
2749G64l073j111J387L247K051p98l544k131L02K561K953P32k708l974m64L168
$$ 764 -2309 -3420 -2033 1214 3265 2467 -1077 -3208 -2906 -345 2608 3340 632 -3342 -3806 -638
2765f38L393K02k320k410j348J139K984K341j016l364k626Q08L078L203Ql487
$$ -638 2755 2957 637 -1773 -3121 -1982 1002 3343 2327 -1037 -3663 -2855 223 3426 3434 -53
2781e3l766p0L653L515K64k731k687j836J020L742L231p13m375l679J063L355
$$ -53 -3819 -3889 -236 3279 3543 812 -1875 -3711 -2691 1051 4282 3569 -806 -4485 -3422 -67
2797f7L600P28l265m108j271L092M019J035j832k745k304m79L328M507Q5m126
$$ -67 3533 4261 996 -3112 -4383 -1291 2728 3763 1931 -814 -3118 -3597 -269 4238 4323 197
2813A97m253Q61L329K528N79j572l318j955K066L677J486j869k671j638j4K433
$$ 197 -4056 -3195 134 2662 3241 1669 -1649 -3604 -1538 2139 3625 1756 -915 -2553 -2567 -134
2829a34L625M92m178l910J049L823K353m80j701k484k081J174M474K441k162m005
$$ -134 3491 3983 -195 -4105 -3056 767 3120 2640 939 -1545 -3626 -2452 2022 4463 2301 -1704
2845a704j910J085K545L376Q48l697m853K32M398K711k77j655k018k551J47L871
$$ -1704 -3614 -2529 16 3392 4240 543 -4310 -4078 320 3031 2754 1099 -919 -3470 -3323 548
2861E48L844j147m609k437J098K538K412J165k185m146j064L001L021M00j282
$$ 548 4392 3245 -1364 -3801 -2703 -165 2247 3412 1227 -2919 -3983 -982 2039 2439 1157
2876A157j611k024r10K976M185n15m545k399J704K186J352P27j101k861j690K137
$$ 1157 -454 -2478 -3388 -412 3773 3258 -1287 -3686 -1982 204 1556 2283 1182 -1679 -3369 -1232
2892a232L154P97j678k130j357k04K629L397k42m008k638J481K596J236K16q85
$$ -1232 1922 2719 1041 -1089 -2446 -2650 -21 3376 3134 -874 -3512 -2031 565 1801 2017 1132
2908A132k309k006J269L510J519j579k530j507L07K318K574K74l177k472N67K148
$$ 1132 -1177 -3183 -1914 1596 3115 1536 -994 -2501 -2194 124 2698 2972 -205 -2677 -2110 38
2924C8J422N06p01j551k193N38K762J927q31k485j313M53J627J850J71k164j543
$$ 38 1460 1966 1265 -286 -2479 -1941 821 2748 1917 -568 -1881 -1428 199 2049 2220 56 -1487
2941a487Q5J278R14O77k07j499j679N10K348J567r47k108j167N68J680J034k15
$$ -1487 -1402 -124 790 1467 1260 -239 -1918 -1408 940 2507 1560 -548 -1715 -1147 533 1567 1352
2958A352j068j033k28N11J134Q82M6j869j720N69K076J063p04j414q23J53J018
$$ 1352 284 -749 -977 -466 668 1550 1596 -273 -1993 -1424 652 1715 1011 -403 -1226 -1073 -55
2975e5R76O0n50j033k47NQ64J016K38j762j132N41J653L50n14o86j34o0L7O70
$$ -55 921 981 431 -602 -849 -844 20 1036 1274 -488 -1620 -1079 574 924 410 -276 -410 -470 -433 237
2995B37M57k17q47l88K45O03N19np96q28N27P34J38o03r1L45j89l23P0Q73K7o66
$$ 237 694 477 -370 -758 -513 90 609 604 -192 -1020 -493 241 379 -224 -315 30 -159 -482 -412 461 488 -178
3017a78n40L87K67K96j22l53o1L39o6j71k84N31M87l15p32j22P31J91j51j13j26
$$ -178 -718 -331 -64 232 110 -243 -304 35 -31 -202 -486 45 532 217 -515 -637 94 285 134 21 -105
3038a05k1m5o9P6O22m0o10l83r1R27N38l70p22j82K77M09J07J73P4n13o26k15
$$ -105 -126 -171 -240 -164 458 418 -192 -575 -666 261 799 429 -293 -475 -198 211 318 491 565 52 -574 -789
3060g89J018R10j44j133p34Q7J293Q25m76r54m77J55J90N71P01k8j122j308M97
$$ -789 229 1139 995 -138 -872 -785 508 1333 857 -97 -574 -419 -229 342 1043 1015 -107 -1415 -918
3079i18J445J075m15j419r44L11R64R25L52j097r31k65N13J013P97j62j498j485
$$ -918 527 1602 1187 -232 -1176 -865 99 1024 1376 279 -652 -917 -404 609 1406 1244 -254 -1739
3097a739L65J979J193q66j394o53J64N46J486M18p49j886n22P68J653P29j54j675
$$ -1739 -1374 605 1798 932 -462 -1115 -951 -405 1081 1499 750 -1136 -1658 -890 763 1492 1338 -337
3115c37j798L10K138J930j047j781q80K62N03J163J352p10k132j472J264K259
$$ -337 -2135 -1825 313 2243 1196 -585 -1465 -1203 -700 463 1815 1105 -1027 -2499 -1235 1024
3131A024P52n08j662j547k78K451J862n38k024j274J34R19J414J263m80k887j609
$$ 1024 1776 1268 -394 -1941 -2219 232 2094 1556 -468 -1742 -1608 -689 725 1988 1508 -1379 -2988
3148b988J349L067Q47j316j735r66n9J442K212K80k142j964P4J245J802J104n85
$$ -2988 -1639 1428 2275 959 -776 -1742 -1801 -359 1853 2133 -9 -1973 -1899 -654 1148 2252 1667
3165A667k524k026J227L191J227j938j757p09J70J077J856J309k107k845k52K136
$$ 1667 -857 -2883 -1656 1535 2762 824 -933 -1642 -1472 -395 1461 2770 663 -2182 -2434 -298
3181b98K052L42o20k238j827O57L199J912j681k411j006N90Q68J971J193j376
$$ -298 1754 2096 1476 -762 -2589 -1932 1267 3179 1498 -913 -1919 -1329 -461 1510 2703 1327
3197A327l160j181K499K738K66j569j703j404J65K658K294p38k736j609M57J604
$$ 1327 -1833 -3014 -515 2223 2489 920 -783 -2187 -2022 636 2930 2192 -544 -2153 -1696 -92
3213i2J576R78p28l526j372K154L455K98k271j756n57K66J696K512j56k795k479
$$ -92 1484 2462 1734 -1792 -3164 -1010 2445 2743 472 -1284 -1841 -1575 121 2633 2477 -318 -2797
3230b797O78K179J890K26j019k747j588J830L474Q80k163k559k95N60J489J930
$$ -2797 -2119 60 1950 2176 1157 -1590 -3178 -1348 2126 3006 843 -1716 -2011 -1451 38 1968
3246A968O34k377l218K29K863K219j97j557j978j464J300L071J401j648k858p19
$$ 1968 2602 225 -2993 -2764 99 2318 2121 564 -1414 -2878 -1578 1493 2894 1246 -1612 -2331
3262b331O52J397K171N76j786l288n49K867K707p7k157j856o75J170K024J846
$$ -2331 -1679 -282 1889 2465 679 -2609 -3158 -291 2416 2339 182 -1674 -2349 -1179 845 2691
3278B691j214k471j655P08K385J873j90j932k555l55K273K932K34k433k205l58
$$ 2691 1477 -994 -2649 -1941 444 2317 2127 195 -2360 -2715 -442 2490 2724 291 -1914 -2272
3294b272J153J807J832n19k437k517N27L005K242n62k163k233m17J748K823R54
$$ -2272 -1119 688 2520 2001 -436 -2953 -2426 579 2821 2259 96 -2137 -2554 -806 2017 2971
3310B971j872k743n05J020J656J474J29j924k666j07L062K098m44k261j504R1
$$ 2971 1099 -1644 -2149 -1129 527 2001 2130 206 -2460 -2567 495 2593 2149 -112 -1616 -1525
3326a525J082J634J242j110k433j256J525J735J113k12j867k172q7K814K370p48
$$ -1525 -443 1191 2433 1323 -1110 -2366 -841 894 2007 1795 -72 -2244 -2331 483 2853 2105
3342B105k682j332M16J010J577J208p42k661j805J433K561J271p72j843j802j76
$$ 2105 -577 -1909 -1493 -483 1094 2302 1560 -1101 -2906 -1473 1088 2359 1587 -256 -2058 -2234
3358b234K089K667l96j964j759j43P64J268J551N3k473j925P13K496J268o52j367
$$ -2234 -145 2522 2126 162 -1597 -1740 -976 292 1843 1896 -577 -2502 -1789 707 1975 1323 -44
3375d4j534j80J334J731K70j511j209k40M91J037J264r2k059j268P08J937Q78
$$ -44 -1578 -1758 -424 1307 1577 66 -1143 -1383 -892 145 1409 1317 -742 -2010 -1302 635 1513
3392A513o26j245j162M07J305J124n4j301r25l34L88J367J446n12k359j457J499
$$ 1513 887 -358 -1520 -1113 192 1316 1262 -39 -964 -1298 -910 457 1903 1391 -968 -2425 -926
3409i26J749P18m27r45j254o76J107K068J92j191r14m24o81J168K289jk344j324
$$ -926 823 1541 1114 169 -1085 -1761 -654 1414 1606 415 -499 -923 -1604 -436 1853 1852 -492 -1816
3427a816J136J400k82j49M30l73j595L17J706O03j145n19J28j34m9J058P49j571
$$ -1816 -680 720 438 289 719 346 -1249 -932 774 1377 232 -287 -159 -293 -342 716 1465 -106
3445a06j383J493J554j281j012J258L41j388o96K011P91j679j058J028N52q32
$$ -106 -1489 4 1558 277 -735 523 864 -524 -1220 791 1582 -97 -1155 -127 425 -407
3461d07O32R18j114j422Q64J583m24j156Q87P85j609j449J901J960j181k070J005
$$ -407 225 1143 29 -1393 -529 1054 630 -526 361 1146 -463 -1912 -11 1949 768 -1302 -297
3478b97R18j080l81J429P67j601o97J026O4j090R21J546j014k190N54J883k74
$$ -297 621 -459 -840 589 1356 -245 -942 84 148 -942 -21 1525 511 -1679 -1125 758 484
3495D84j341Q38J348j312j915J054K103k60j355J16K27j023L06J544L69j621n48
$$ 484 -857 -19 1329 17 -1898 -844 1259 999 -356 -240 -13 -1036 -730 814 1183 -438 -986
3512i86J117j12p19M62J645j101k233M95K385L83j625m28P48k25o92J005J055
$$ -986 131 19 -700 -238 1407 306 -1927 -1432 953 1336 -289 -717 31 -194 -886 119 1174
3529A174q85j541M08Q43K96L33L02j000j922L48K356J247j536j202O8k2M0J188
$$ 1174 289 -1252 -844 -1 295 628 930 -70 -1992 -1644 712 1959 423 -779 -711 -733 -693 495
3547D95J384q08k291o21J154J508Q91m12j284j972J70K063J716p49j363n78l24
$$ 495 1879 1071 -1220 -1841 -687 821 1712 1300 16 -1956 -1786 277 1993 1244 -119 -697 -1021
3564a021O7J316J946o14k406j420P37K417Q00l96j620j373J87J333J752j05j191
$$ -1021 -954 362 2308 1694 -712 -2132 -1395 1022 1822 1426 -194 -1567 -1380 -47 1705 1600 409
3581D09j279o81L97J883J734o42k755j650J155K461J326o63k008j302m12J646
$$ 409 -870 -1551 -1154 729 2463 1821 -934 -2584 -1429 1032 2358 1695 -313 -1615 -2027 -381
3597c81K119N41j231k432j158R23K539J923o30l308j843J102K489J759n58j737
$$ -381 1738 2279 1048 -1384 -2542 -1619 920 2843 2213 -1095 -2938 -1836 653 2412 1854 117
3613A17j946n18J228K687J383j692k455j589P68K847K002q14k921j683M47K269
$$ 117 -1829 -2347 -1119 1568 2951 1259 -1196 -2785 -2017 830 2832 2018 -903 -2586 -2139 130
3629A30J797J42j600k247p98J385K449J705j485k866j879J423K885J793q69k765
$$ 130 1927 2069 469 -1778 -2576 -1191 1258 2963 1478 -1388 -3267 -1844 1041 2834 1965 -800
3645h00j707M3K285K023O07j729k443j304J312L037J947j268l480j724R69L202
$$ -800 -2507 -2464 -179 1844 2451 722 -1721 -3025 -1713 1324 3271 2003 -1477 -3201 -2232 970
3661I70J825m63k685k205j65K043K525J019j304l256j558J299L482J886j260l331
$$ 970 2795 2332 -353 -2558 -2723 -680 1845 2864 1560 -1696 -3254 -1955 1527 3413 2153 -1178
3677a178k032R93K791K202j90k398k238o95J863K678J304j325l287j932J544L485
$$ -1178 -3210 -2217 574 2776 2586 188 -2050 -2745 -882 1796 3100 1775 -1512 -3444 -1900 1585
3693A585J893j467k884j655L79K380K171M40j999k962n78J409L088J682j613l147
$$ 1585 3478 2011 -873 -2528 -2149 231 2402 2842 843 -2119 -2697 -1288 1800 3482 1869 -1278
3709a278k221J612L458J625j137k738j723J73J838K542R13j925l178j214K185
$$ -1278 -3499 -1887 1571 3196 2059 -679 -2402 -2229 -391 2151 3064 1139 -2039 -3253 -1068
3724a068K821J322j207l172j857R37L476J760j004k329j717l70J575K717J412
$$ -1068 1753 3075 1868 -1304 -3161 -2224 1252 3012 2008 -321 -2038 -2408 -833 1884 3296
3739C296j612l820j495K141L174J272j448k330k017L70K781K409n22k433j886
$$ 3296 1684 -2136 -3631 -1490 1684 2956 1508 -822 -2839 -2469 312 2721 2199 -234 -2120
3754b120l93J502K403J604j327l599j733K241L147Q94j492j969j177j72J712K687
$$ -2120 -2513 -1011 1392 2996 1669 -1930 -3663 -1422 1725 2619 1127 -842 -2019 -2191 -479 2208
3770B208L89k193k773J9J305K350J277p88l241j714J378L298J156j431j891j008
$$ 2208 2597 404 -2369 -2350 -1045 1305 2582 1794 -1447 -3161 -1783 1515 2671 1240 -651 -1659
3786a659k39J062K444J331k213k700q06K130K135N37o37k244j642N51K510J816
$$ -1659 -1898 -836 1608 2939 726 -1974 -2780 -650 1485 2022 1385 -859 -2501 -1950 560 2376
3802B376j058j753r43l04Q15J997J647j641k964r95K200K176K06p36j285j211
$$ 2376 1318 -435 -1378 -1682 -867 1130 2777 1136 -1828 -2823 -623 1553 1759 1023 -262 -1473
3818a473k05J978J666k41j854j232pO73J561J633j028k581j615K202K252J5j086
$$ -1473 -1678 300 1966 1725 -129 -1361 -1368 -695 866 2499 1471 -1110 -2725 -523 1729 1744 658
3835F58q02n76p10J201J547Q18j795j744J39J035J133O65n51j822j147J277J610
$$ 658 -144 -720 -1430 -229 1318 2136 341 -1403 -1264 -229 904 1569 1018 -804 -1951 -674 936
3852I36M75j161n37j57o47M36J523J168j321k090j35J120J155L39n27j070o46
$$ 936 1411 250 -287 -444 -1091 -655 868 2036 715 -1375 -1510 -390 765 1104 577 -493 -1139
3869a139K33J153O85l05p42l92m74n9J724P17r08j695O7R45O97J99m40m02l71
$$ -1139 -906 247 932 627 -115 -507 -981 -1040 684 1401 493 -1202 -1135 -190 507 706 266 -136 -507
3888e07n1M53P06m7j13j013l41L91J044K74o54q14j60O57M78M5l85o7l38J1L4
$$ -507 -558 -105 601 554 441 -572 -913 -522 522 796 142 -672 -832 -175 303 348 -37 -104 -442 -431 -397
3909c97O46Q7O8p99m51N07J001N2o95n04K98J79k38K97L57L1o25l71N1O42L71
$$ -397 249 336 404 -395 -846 -339 662 714 19 -485 -187 -8 -246 51 408 439 -186 -557 -506 136 507
3930E07j21l10n67M7P25K17q03J63M28k0n92p6Q56N57r14p30M96K17o8k7K98j43
$$ 507 386 76 -491 -444 281 498 -305 -142 286 266 -326 -402 454 1011 97 -633 -137 80 12 -15 283 140
3952A40j12k77J04j31L77O32k22p75p08R48J073p20o82R6O28m61l29O87M38n45
$$ 140 28 -249 -145 -276 101 733 511 -264 -972 -24 1049 329 -353 -257 371 -90 -419 268 706 161
3972A61q33J62N51L30O0r1n31p05O66J137l44q32l36M65j42j88Q61R21r81j496
$$ 161 -672 -510 41 371 431 340 -191 -896 -230 907 563 -269 -605 -140 -282 -470 391 1312 331 -1165
3992a165r1J296R38l43n32m87n35K03R85Q16n53r52j48p7J44J064Q58p61k144
$$ -1165 -1256 40 978 635 103 -384 -919 -716 269 1085 532 -420 -568 -645 -501 563 1421 660 -1484
4011a484k04J623J098j24j007j98j55l15O67Q86K36j146r33J42P74N47O29n07
$$ -1484 -1688 -65 1033 909 -98 -296 -451 -766 -99 787 1023 -123 -1056 -914 -140 407 1036 529
4029E29j449n34J098J263J44j072n63L4k63N51J220N31j445j570N6J437J179Q5
$$ 529 -920 -1454 -356 907 1051 -21 -584 -550 -813 -262 958 1489 44 -1526 -1470 -33 1146 1231
4047A231q88j474n71R90J636O06r23j013o40J78O42J622O66j660k062j95J875
$$ 1231 343 -1131 -1702 -712 924 1530 607 -406 -1046 -868 -226 1396 2062 402 -1660 -1855 20
4064B0J416N4j152r32o02J85J171J401k22j442j162p0J341J186M79j207j483o14
$$ 20 1436 1490 338 -594 -1196 -1011 160 1561 1339 -103 -1265 -1335 6 1192 1671 464 -1019 -1633
4082a633J544J431j13j044q33j34N8R63J214J25j861j574N90J754J377m22j325
$$ -1633 -89 1342 1229 185 -648 -782 -724 239 1453 1578 -283 -1857 -1267 487 1864 1442 117
4099A17j384l42J207J680M52j252j276p17M76J271J422K82j821k072l2K167J794
$$ 117 -1267 -1609 -402 1278 1730 478 -798 -1515 -1039 232 1654 1936 115 -1957 -1989 178 1972
4116A972k80j564j227m24Q78J081J351n90j773j252N85J348J200K12j093k142
$$ 1972 1692 128 -1099 -1523 -645 436 1787 1197 -576 -1828 -1243 105 1305 1517 424 -1718
4132a718m24J993J834j94j679r73j4L86J098J178k56j693j586P06J654J200m13
$$ -1718 -2142 -149 1685 1491 -188 -1161 -1175 -789 309 1487 1231 -462 -2048 -1342 312 1512 1099
4149A099j137j518j68J675J628lj591j273r5N99J115J210K68k166j880N68K400
$$ 1099 -38 -1556 -1724 -49 1579 1576 -15 -1288 -1383 -784 331 1541 1809 -357 -2237 -1669 731
4166G31J100o85j176j217o97J381J840O11j314j774k11L56J067J370M81j960j889
$$ 731 1831 1146 -30 -1247 -1944 -563 1277 1888 574 -1200 -1411 -1055 12 1382 1863 -97 -1986
4183a986L73K062J248m70j156q38m60M33J738R37r42j557q11N19J224J102R2j633
$$ -1986 -1613 449 1697 1227 71 -767 -1227 -794 944 1881 939 -618 -1429 -910 314 1416 1508 -125
4201a25j556L55J937J143p03j152p90l74O20J591R01q16k022o51Q48J407R14j01
$$ -125 -1681 -1326 611 1754 1051 -101 -891 -1265 -645 946 1847 1031 -991 -1642 -794 613 1527 1426
4219A426j398j624K43J848R97j58j111q76p97M97J494J340n97j936j097Q54J258
$$ 1426 28 -1596 -1353 495 1492 1334 223 -653 -1450 -953 541 1881 1284 -652 -1749 -895 363
4236C63R42J50j466j250j46J420J113j27p16p10q12J96J498J085n19j854q51Q38
$$ 363 1305 1455 -11 -1261 -1407 13 1126 999 283 -427 -1239 -1043 455 1540 1021 -833 -1684 -846
4254h46J239M67m4q81j117j36J069R77L84q34r45n07J98J462J124p22j847o88
$$ -846 393 860 816 -65 -1182 -1318 -249 728 1112 278 -667 -1174 -976 486 1610 888 -959 -1647
4272a647Q55J134L92K4o02j043l56Q15J180M69o17j141o93N30J101J023n60j408
$$ -1647 -792 342 734 758 156 -887 -1243 -428 752 1221 604 -537 -1230 -700 401 1424 864 -544
4290e44q84Q56P75L74J97m29o67q62M52J541K55m56j046m84J01J168Q18k57r46
$$ -544 -1428 -572 203 577 774 345 -322 -1184 -732 809 1064 608 -438 -922 -821 347 1165 908 -38
4309c8p32L85K90O48J37O0j181o93O77R27P45o87r42m52N20N33N50j26p03l12
$$ -38 -770 -385 -95 553 690 750 -431 -1124 -447 480 1225 538 -404 -856 -336 197 747 621 -82 -394
4329c94n0K46O92M24n16o82n14K95R34M52n13o04k60J73K99N54p1l86k42l15J59
$$ -394 -444 -198 494 918 402 -280 -794 -499 435 887 374 -230 -490 -317 -18 536 465 79 -163 -478 -319
4350c19N53N97m14p06k59L33N85Q9j24m82L2k06Q8L73K99k56l99m2J17J21M93
$$ -319 234 831 417 -289 -548 -215 370 459 335 -147 -115 -321 -233 140 439 183 -216 -258 -141 -20 473
4371D73j06n15k62J40O97j75m32K01J9n08N3M21K39Nl55j66J03n7L33J14l88q3
$$ 473 367 -148 -410 -270 427 252 -180 21 40 -468 -415 6 245 250 -105 -271 -168 -225 108 222 -166 -249
4393b49J33K65l91N0L15L99p58l22M11M56Mm75J03p3k39k0N93j20l2j52j38ro
$$ -249 -116 149 -242 -192 123 522 -236 -558 -147 309 313 -162 -59 -132 -371 -391 202 82 50 -102 -240 -249 -255
4416b55M80L22l98p64J24O10J26l02J23j24P8m48K08N68O9n25l04J21O9N04L53
$$ -255 225 547 149 -615 -491 119 245 -57 66 -58 20 -428 -220 348 417 -108 -412 -291 -222 282 635
4437F35k71n52m35O45L60J4P9l44l75m09M25J035N7o46r94L52M61L43K25k96l85
$$ 635 364 -188 -623 22 382 396 475 131 -244 -653 -228 807 864 218 -776 -424 37 380 605 309 -76
4458g6m63j9O93M77J02n85p76j08O16P66K13n70r05pM72N26L66k3p63m17l50P58
$$ -76 -539 -558 135 612 714 129 -647 -755 -139 627 840 270 -635 -642 -170 356 722 699 -64 -481 -831 -73
4480g3Q17K15o78j019l88Q30R64L00o69r64k84M99Q94L01l4o65r49j08P01J022
$$ -73 744 959 281 -738 -1126 -296 668 968 299 -665 -949 -450 444 745 711 46 -903 -1011 -310 712
4500G12N20q71j200n21R34R83N19p65p73o29J84J031Q22j64p59j143J1R26Q59
$$ 712 1232 361 -839 -1360 -426 557 1076 311 -462 -1091 -907 124 946 782 23 -1120 -1109 -183 676
4519F76L10o81j095p94J133J189L29p14o67n19j43P58J034L94j087j394k34J337
$$ 676 986 305 -790 -1584 -451 738 1067 353 -314 -833 -976 -218 816 1210 123 -1271 -1505 -168
4537a68J102P4p62r84n45N21J280Q49o57j180p79K03Q34J451k0q65j647l88J614
$$ -168 934 1008 246 -738 -1283 -762 518 1367 710 -470 -1249 -1046 -212 1239 1219 354 -1293 -1681 -67
4556f7J381j63p06p42q05J23J223J278j90j762r44K29J213J129L60r08j646p48
$$ -67 1314 1151 445 -297 -1102 -979 244 1522 1332 -430 -1374 -1145 68 1197 1557 649 -997 -1745
4574a745J449J598p7r05p02k90m37J071J531K15j725j627N78J345P32J66p32j273
$$ -1745 -296 1302 1225 320 -382 -672 -1109 -38 1493 1708 -17 -1644 -1066 279 1011 1177 445 -828
4592h28r17J087J984K35j116j105l23P3P47J389N79j625k057O60J543J007m32
$$ -828 -1745 -658 1326 1561 445 -660 -983 -910 -163 1226 1805 180 -1877 -1217 326 1333 901
4609I01m23q59j171L39K103J099j364j399k52L47L83J402N68j314k203J69J922
$$ 901 478 -381 -1552 -1213 890 1989 625 -774 -1026 -679 -296 1106 1674 360 -1843 -1674 248
4626B48J141n73p07m49r01j93J650J557m62k259n93O05R39Q48P26j065j862m80
$$ 248 1389 816 109 -340 -1241 -1434 216 1773 1311 -948 -1541 -936 3 851 1577 512 -1350 -1830
4644a830J596J607k66j212l27n54k57J343J731l22k328r17Q32J345O00n1m91j537
$$ -1830 -234 1373 1107 -105 -432 -986 -1243 100 1831 1509 -819 -1736 -904 441 1041 990 499 -1038
4662a038q63J579J759l5j134q42l57l83J084J876M2k182j403R98J263M66O5m93
$$ -1038 -1901 -322 1437 1402 268 -574 -931 -1314 -230 1646 1688 -494 -1897 -899 364 830 895 402
4680D02p48j060N54J787O41r87j047k44jM04J580J84j359j563N74J164M70k9m15
$$ 402 -346 -1406 -852 935 1576 589 -458 -702 -703 -299 1281 1465 106 -1457 -883 281 751 722 307
4699C07o51q46O70J440N53r20r90k68q0P30J192J74j643j057M13J180O28n7k98
$$ 307 -344 -1190 -520 920 1473 553 -437 -705 -785 -55 1137 1311 -332 -1389 -976 204 832 775 477
4718D77r53r29M94J646Q33p70j443l72J08P95J298O9j095j247R9P82O66L71j92
$$ 477 -476 -1405 -911 735 1568 798 -645 -1017 -909 -114 1184 1253 158 -1089 -990 -208 458 829 637
4737F37q97r56K92J394N50l08r66n11L9L74R57N05j011r40J90M35L73K80J18o24
$$ 637 -260 -1216 -924 470 1020 712 -254 -765 -726 -352 605 1110 99 -841 -651 -216 157 437 555 -69
4757f9q83J85J320M98q57q66K59o7K13P11K45o83j006K69O81M94N4m5o47r59J85
$$ -69 -952 -767 553 1051 194 -672 -413 -480 -267 444 689 6 -1000 -731 -50 444 498 453 -194 -1153 -968
4778i68J177R14r62m16k48j17R9Q54Q29o92j134j96N07N20J09M53m45p70n53R48
$$ -968 209 1123 161 -255 -503 -620 -521 333 1162 470 -664 -860 -353 167 276 729 284 -486 -1039 -91
4798i1O63q7m10Q1k10n37K28R26K90q75l51K49L29j41J53M0l74j73K51O17l86
$$ -91 572 485 75 156 -54 -591 -363 563 853 -22 -373 -124 205 64 217 257 -117 -290 -39 578 192
4819A92m82J57K00m09K18N69J41p25l44K80O22k03j63J56l40m88N21L50K4j50
$$ 192 -290 -133 67 -342 -124 445 586 -139 -483 -203 419 216 53 209 -131 -619 -98 252 276 126
4839A26l05K02l96J11N56M67n16n25K0K94o9N8J83K33p32k69K54M44K22l3k44
$$ 126 -179 23 -373 -262 294 761 245 -280 -260 34 -35 23 206 439 -293 -562 -308 136 358 325 81
4860H1n34l7M04N10M0l51j69kj86k7L58L67j58p40j56M32K68o1J79j76m11MK27
$$ 81 -453 -490 -86 424 464 113 -56 -58 -244 -271 87 454 296 -444 -600 -168 100 39 218 42 -369 -365 -138
4883a38K50N6j76k51j10J02N20L15p19l00L4K61K26K23j65l96k58K9L99N35J00
$$ -138 112 168 -8 -259 -369 -267 253 568 -151 -451 -417 -156 70 293 128 -268 -526 -497 -98 437 537
4904E37n15l85k34K16Q46M75n37j017j46K47N82N92k2m51q73l71R58P86J97n91
$$ 537 22 -363 -597 -381 465 940 403 -614 -760 -513 69 661 639 188 -685 -1056 -98 688 885 294
4924B94n12n81J70Q20O75k10p99n89J25M85P97R1l95p97p11P36J229m8k98p77
$$ 294 -218 -799 -629 191 866 656 -143 -732 -607 -122 675 766 371 -426 -1137 -401 828 780 482 -295
4944b95n02J72Q71N99j0r61p51J25Q12N28L44l49j094o14Q15J052M06p12r27m47
$$ -295 -797 -625 246 845 835 -126 -877 -752 60 588 932 583 -511 -1125 -310 742 1148 436 -491 -938
4964i38L58P35R67O1j056j132o5J003R46J58m26j147q44O35J309J027q04j360
$$ -938 -580 155 1122 1183 127 -1005 -1070 -67 879 1037 611 -536 -1380 -745 564 1591 787 -573
4982e73l25r5Q64J046M50j136j369j86R82J172K48m91j098q00L91J333R52k94
$$ -573 -898 -993 -129 917 1367 231 -1138 -1324 -342 830 1078 587 -511 -1311 -920 413 1365 1071
5000A071j303q70J70P83J060L05j042j147m93J080J124N82p44j227o64L88J143
$$ 1071 -232 -1102 -932 -149 911 1216 174 -973 -1466 -386 738 1320 576 -651 -1315 -927 216
5017B16J035j76j244j215J34J076R70Q00j094j604m63R70J299O05n58j354p73
$$ 216 1251 1075 -169 -1384 -1250 -174 796 1596 502 -1102 -1565 -595 704 1309 751 -603 -1376
5034a376K99J142J264m1j305j268NQ58J389N40r11j591n01Q10J357P09l07j284
$$ -1376 -1077 65 1329 1288 -17 -1285 -1280 -422 967 1507 596 -995 -1496 -686 671 1380 1073 -211
5052b11q88J04J028J139L08j314j353j83O76J450P92p43j587p35P19J409P44l20
$$ -211 -1099 -995 33 1172 1480 166 -1187 -1370 -694 756 1548 805 -782 -1517 -798 611 1355 1035
5070A035j214j099j8J265J316L07j211j372o23J250J159N72m56j377j071M46J732
$$ 1035 -179 -1278 -1296 -31 1285 1592 381 -991 -1614 -364 795 1367 911 -466 -1537 -1091 641
5087F41R74n14j159j172j09J095J325N60j217j527k40P17J432N33l62j258j167
$$ 641 1615 1101 -58 -1230 -1339 -244 1081 1641 424 -1103 -1343 -626 806 1339 977 -281 -1448
5104a448M04J259J304l13r17j352l23J023J473K80p91j607n12R37J316M34l15
$$ -1448 -1044 215 1519 1206 289 -1063 -1386 -363 1110 1390 599 -1008 -1520 -583 733 1167 852
5121H52r22j111j31R90J541K54j521j127j61Q82J109Q15o01j471q73O09J460N34
$$ 852 -70 -1181 -1312 -322 1219 1473 -48 -1175 -1336 -454 655 1470 869 -602 -1475 -866 594 1128
5139A128k61q99j155j82Q83J690Q7j089j238k18J017Q52O15l26j102j196L09J481
$$ 1128 867 -32 -1187 -1369 -486 1204 1291 202 -1036 -1254 -237 615 1230 904 -198 -1394 -1085 396
5157C96R03n53q89p89l00Q19J295O29j149j417j65Q53Q08K92j55n18j215j63J502
$$ 396 1299 746 -143 -932 -1232 -413 882 1511 362 -1055 -1220 -367 441 733 578 60 -1155 -1318 184
5176A84J094l01j198o28N7M96P31Q05o83j229n69P89J071ro4l34r75l32Q85J264
$$ 184 1278 977 -221 -849 -792 -296 435 1240 557 -672 -1241 -452 619 610 546 212 -763 -1095 -210 1054
5196A054R7j139j027M43M63N05N31l92p36r12M70J108K18j77o35l35k61L58J035
$$ 1054 1151 12 -1015 -572 -109 396 927 535 -201 -1113 -643 465 683 506 -129 -464 -725 -367 668
5215F68O69j036j202nQ16L56N7L72n38q65l55J365Q03m63q81k1l76K17P35P31
$$ 668 1337 301 -901 -906 -90 266 323 695 157 -708 -1063 302 1105 642 -239 -260 -636 -419 316 1047
5235A047l20j439j78Q20N52m34L50n1q10n57P93J232l22q95k68J02j44N90M25
$$ 1047 727 -712 -890 -70 482 48 398 347 -463 -1020 -227 1005 683 -212 -480 -378 -522 68 493
5254D93l6q27n39N22O02n9j71L95l24p51L2J147K83j065k47N42m4j74K85N31n93
$$ 493 457 -370 -909 -387 215 156 -15 380 56 -695 -663 484 767 -298 -545 -3 -47 -221 64 595 2
5275Bp41K26N45L52m03PJ9m11l65Q35P06n97n04J36L22k90J59N28j47o55m63M87
$$ 2 -739 -513 32 384 -19 -12 7 -404 -769 66 772 175 -329 -193 129 -161 -2 526 379 -276 -739 -252
5297b52O34k22r0J81k34n99L23O75L7j95m10J49n15j8Q10M79n85n56J26L06J37
$$ -252 382 160 70 251 17 -582 -259 416 453 258 -152 -3 -518 -536 274 753 168 -388 -262 44 181
5318A81k85N68n1n62m64P14L75k07k48N5o9k56K93M62k63o47J10N27m6j46J66
$$ 181 -104 464 413 -149 -613 101 476 269 21 76 7 -249 44 506 243 -404 -294 233 187 41 207
5339B07P3m86l67M93M46Q5l02k22l50k21Q57N91m72n34m45M79K97p6M42N4p08
$$ 207 280 -206 -573 -80 366 451 149 -73 -423 -644 213 804 332 -202 -647 -168 129 53 495 549 -159
5360a59q59O01P98M23l47n24m86l02N16J068j19l81o42l62K87L04P26J43q07q79
$$ -159 -1018 -417 381 804 457 -67 -553 -855 -339 729 610 229 -413 -775 -488 -184 542 685 -122 -1001
5380a001J94R00O08l29l56j96n35J91J010L69n74o73k24J86L87P56j0p81j165
$$ -1001 -807 93 701 372 16 -180 -715 -524 486 855 281 -392 -616 -430 -43 713 703 -78 -1243
5399a243K81J329N36n40m07l18k09n5J160N80o64j172k33M59O01P14J01r52j173
$$ -1243 -962 367 903 363 -44 -362 -571 -626 534 1114 450 -722 -955 -496 105 819 920 -32 -1205
5418a205rJ514N89j37n43m87o04l52J464J379m79j767n23N87N76N21L81l43j343
$$ -1205 -1214 300 889 752 209 -278 -882 -1234 230 1609 1130 -637 -1160 -573 3 524 905 562 -781
5437g81p22J330J114ln71l98o12k75O56J592q9j532r70P06R88n3L90k5j354p91
$$ -781 -1503 -173 941 938 367 -31 -643 -918 -262 1330 1241 -291 -1261 -555 433 380 770 745 -609 -1400
5457a400Q76J580qo75q83k37j59P86J328K74j738j507Q59J417K40J40k36r36j454
$$ -1400 -524 1056 1048 373 -510 -747 -906 -120 1208 1482 -256 -1763 -904 513 753 893 657 -279 -1733
5476a733N96K162O81j060j262m65M4O24J551N67j569j519J57J268P46J71q5q31
$$ -1733 -1137 1025 1706 646 -616 -1081 -1037 -413 1138 1705 136 -1383 -1226 42 788 959 874 43
5494D3j491J67J495J355n12j623k61r1M94R36Q17p66j734o4R41Q42L12m10n07
$$ 43 -1448 -1281 214 1569 1057 -566 -827 -918 -424 512 1329 563 -1171 -1235 -294 548 860 450 -57
5513e7j067j54J596J476q56j471o41L33N75J114M58p46j616m72J138J122L14k15
$$ -57 -1124 -1278 318 1794 938 -533 -1174 -841 -266 848 1306 560 -1056 -1528 -390 732 1046 831
5531H31r78j250o8J662J456k96j652j051K10O15J118Q90n76j494q26O82J274Q05
$$ 831 -147 -1397 -1465 197 1653 1357 -295 -1346 -1136 -521 597 1487 911 -583 -1409 -727 547 1352
5549A352m67j025j160j32J421J312j45j206q29j04N15Q95Q17m88j307r34N97J333
$$ 1352 885 -140 -1300 -1432 -11 1301 1156 -50 -879 -983 -468 427 1244 756 -551 -1485 -888 445
5567D45Q01m44q24r67l5R84J331k37j196q43R7L88R51P35k01j573q50N96J354
$$ 445 1246 802 -22 -989 -1024 -40 1291 1054 -142 -985 -888 -500 451 1186 985 -588 -1438 -842 512
5586E12P48l13q62j011k36Q69J178M77j025r90l06L13R46R18J9j421j124K24J249
$$ 512 1260 947 85 -926 -1162 -293 885 1362 337 -653 -959 -646 300 1218 1237 -184 -1308 -1084 165
5605A65P26N7q10o07m47J44J434M94p01q21n45L93N00J045j38q51j352L92J093
$$ 165 891 948 138 -469 -916 -772 662 1156 455 -366 -911 -518 -18 1027 889 38 -1314 -922 171
5624A71O79j80m73p09n58M99R85N31l87j088m30O8J116O50o1r51q25o1Q28Q89
$$ 171 850 670 197 -512 -1070 -571 414 945 558 -530 -960 -892 224 874 813 -138 -963 -1024 -196 693
5644F93q4j91q41p10K80R79Q49m84q59n02Q7P10O99M6n59q32j75O17O10L45k90
$$ 693 609 418 -423 -1133 -853 126 975 491 -368 -870 -783 -73 626 672 113 -719 -894 -277 333 678 388
5665C88m58n88NP18P61j39o60p17K16N22J96L93m36p78j05M17M03L60r6k87n54
$$ 388 -70 -658 -653 65 826 687 27 -690 -474 48 244 637 201 -577 -682 -265 138 498 402 115 -439
5686d39k23P47P91j93q61j93J04nN70M29k79o94m25K02P80L64k66k94n76j12N03
$$ -439 -662 85 876 683 -178 -371 -267 -272 298 727 448 -246 -671 -469 311 675 409 115 -461 -573 -70
5707g0O32J28o72k73K6J8L5M59L95o51o55M55L70L11j63k06k37m9k86P70L7k52
$$ -70 562 690 18 -255 -229 -211 -176 283 678 27 -628 -173 197 508 345 139 -98 -147 -433 337 374 122
5729A22l25L7J55k30L70L18j25n96k76N82L24l23l5J18k73m52N91L54nn73L4N8
$$ 122 -203 -166 -11 -241 129 447 322 -274 -550 32 356 33 -2 116 -157 -609 -18 336 331 -242 -208 -150
5751a50P3j13L82K29m69m74J07N22P6j17K7k80j73m3N09L79n38k44nJ54Q4L5L53
$$ -150 -77 -190 192 421 -48 -522 -415 107 183 66 93 -187 -360 -403 106 485 -53 -297 -302 -148 -64 -29 324
5774C24j02o33M1L94J48Rm2O0n74k87N93P84l50n24j93J36J14J68O31k02m82n47
$$ 324 222 -411 -370 24 172 181 139 199 -375 -662 -69 715 365 -159 -352 -216 -102 66 697 495 13 -534
5796e34J32N37J04o5j8k75m45L25O91J70o22l39J5J59J3N96Q9l56p37j64N89N79
$$ -534 -402 135 239 174 156 -119 -564 -239 452 622 0 -339 -324 -165 -152 444 533 177 -560 -724 -135 444
5818D44j99J2k99m92p1O30Q20n37n23j95N9K26J78N53j75p98k68N75N52J65n03
$$ 444 245 257 -42 -534 -605 25 845 308 -215 -410 -351 -125 53 606 431 -367 -635 -60 492 657 154
5839A54k22m01j14O54N21o9m23l68l7J36K64M42m6o97o14M70O18N09m55l72l86
$$ 154 -68 -469 -583 71 592 523 100 -268 -305 -169 95 537 491 -206 -820 -350 268 777 322 -50 -436
5860d36j55M24P06R6k89r15j43O50M17L32k72n77o01K60Q95L25l83l69p57N5M24
$$ -436 -591 -167 539 635 346 -569 -712 -62 355 687 415 -162 -763 -503 392 717 334 -35 -792 -737 -313
5881c13Q23K04l05r60l96N78N05M15j06o10l55l1N13N81J66o85n67j39K80N40
$$ -313 510 714 409 -551 -947 -369 136 551 445 -165 -520 -551 -38 543 709 24 -543 -682 -402 138
5901A38N97j98r72m23K70R31M00m49o35k67J06N24M70J54l06q96l52N68O73K96
$$ 138 735 537 -435 -858 -588 343 743 294 -341 -608 -502 22 492 646 340 -556 -908 -340 333 629
5921F29l67n69m94L34N56M98Q0p26o22K07M00L56M51k91q01n21L28R85M22m17
$$ 629 262 -307 -801 -467 89 587 667 -59 -681 -474 -74 282 733 442 -359 -880 -552 433 855 438
5941D38o31l34J59L28P26J19o58n55k63M78N61M49m53o06n72P1J085M46j75p21
$$ 438 -193 -527 -368 -40 686 805 147 -408 -671 -193 368 817 364 -242 -814 -743 342 788 613 -108
5961a08m06N8L76N41J49l06p81k30N28O70J37k60p18l18K36M72O49j8o15o39J08
$$ -108 -514 -456 -80 461 610 304 -477 -707 -179 491 628 368 -350 -668 -432 40 689 671 56 -583 -475
5982d75L70N29L22m68n35o12L77P50L96k16n83o00M68K77M04R3l61n76j90M76
$$ -475 -105 424 746 278 -257 -869 -492 258 654 438 -145 -745 -277 0 404 497 136 -440 -630 -154
6002a54M03K55k83n24k15L7N89N65k59p77j91L02K38K85o7j85m50l59O84N76L28
$$ -154 249 504 221 -303 -518 -481 108 673 414 -363 -554 -252 -14 271 204 19 -431 -790 -106 470 798
6023G98m55o82j79J76K77M89n2n37m80J14O09J99P7k96k83l39K05P47L24n44l10
$$ 798 343 -339 -518 -342 -65 424 372 -165 -645 -531 78 277 354 58 -225 -564 -359 388 712 168 -142
6044a42k74J21K77K54K51m40n23n8N35L12R3k30k46m48L49O5O24m16m20j21K59
$$ -142 -416 -295 -18 236 487 47 -476 -534 1 313 406 176 -70 -518 -169 -104 520 104 -316 -437 -178
6065a78J51J49M35k47o09j73M19M36kk72j90j99J17M18K75j98m23j88K38L1J48
$$ -178 -27 122 557 310 -299 -472 -53 383 381 109 -81 -280 -163 255 530 332 -91 -279 -41 -10 138
6086A38L4K89p43k77M48N12j93r0m2k34j65K33Q30l79m17j71k3J63K18J84K0l86
$$ 138 172 461 -282 -559 -111 401 208 118 76 -158 -323 -90 740 361 -56 -227 -250 -87 131 315 335 -51
6108e1m20K87M71J63j42l44R6k99j7N32Q6l13k01o9J93J97l3P4k28k90M7M69K3
$$ -51 -471 -184 287 450 308 -36 60 -239 -256 276 362 49 -152 -221 -28 169 136 210 -18 -308 -261 208 231
6131B31k43k19n8J67q5L34Q6j41k73q2K07J47M9q7l7l17J62K19J40K5k06M3n7
$$ 231 -12 -231 -289 -122 -207 127 213 72 -201 -283 -76 71 120 33 -4 -321 -159 60 200 225 19 62 5
6154Em8QK06J30n30k05K51L61k05J00jl23q8K68J25K21j69j08o7j59P2M27p4j90
$$ 5 -43 -35 171 301 -229 -434 -183 178 -27 73 72 -251 -339 -71 54 275 106 -2 -69 -228 -156 271 197 7
6178Gk14M6R2K1J02K88l10l01K69Q0j11J17Rj28k5L6K12j27j15Om0J62o8m9J36
$$ 7 -207 -161 -69 -48 54 342 32 -269 0 80 -31 86 95 -33 -58 -22 190 63 -52 -46 -86 76 8 -41 95
6203I5p1k12O0K56p5Q1j36J05l17J37K61N5j92p6r0L42l51L55m0j26k49L8J25
$$ 95 24 -188 -128 128 53 134 -2 103 -214 -77 184 239 47 -29 -119 223 -128 227 187 61 -188 -150 -25
6226b5O7l2J8j30J11j61lL35j0j78p7P5k62M13J25j51j55j11J93j2M3P8O6k09
$$ -25 42 10 28 -102 9 -152 -155 180 170 -8 -85 -10 -272 141 266 115 -40 -151 42 30 73 151 217 8
6250Hr4N7J03J26j67j39j18l6K57K26%k86l24L21J24J19k67P0j23j0J00J89j30
$$ 8 -86 -29 74 200 33 -106 -224 -260 -3 223 223 -63 -387 -66 58 177 -90 -20 -143 -153 -53 136 6
6273FJ32l83J2J32J77J19k71o3N6j42K55m2K38l0n21n1J18K20L82l05k68M5J09
$$ 6 138 -245 -233 -101 76 195 -76 -139 -83 -225 30 -12 226 196 -325 -376 -258 -38 344 39 -229 -184 -75
6296g5O5K5J74k81j25j73M03m4J15J56L6n57J88J37L02j45k19J6K9j10L16p9j99
$$ -75 -10 15 189 -92 -217 -390 13 -31 84 240 276 -281 -93 44 346 201 -18 -2 27 -83 233 154 -45
6319d5j32N5K76Pj9q8j03k35J9L04J70k4m08P1J45R4J62R9k56l41qK04K29K7Q8
$$ -45 -177 -122 154 161 142 54 -49 -284 -265 39 209 185 -223 -152 -7 87 249 348 92 -249 -257 -53 176 203 291
6344B91l00k09J3K99K50j58j53j40j05K2L96N2m8l42j09N8M70pp5j85j69j95L82
$$ 291 -9 -218 -205 94 344 186 33 -107 -212 -190 206 258 210 -132 -241 -183 287 280 205 20 -149 -344 38
6367C8K52n3l44N3m6o9J13J41J29m34l2L02L1J92j67Jk36lJ01K00k5l21k12L20
$$ 38 290 237 -107 -54 -100 -169 -56 85 214 -220 -252 50 81 273 106 107 -129 -132 -31 169 144 -177 -389 -69
6391f9m6K82j21j0l78PJ61J65K52k28j43kj39J20M78o8j76m92J57k2L02P3K3k36
$$ -69 -115 167 46 36 -342 -335 -174 -9 243 15 -128 -130 -269 -149 329 261 85 -407 -250 -272 30 103 126 -110
6415a10k92K73K64M6p0m27L16k47J67K64N9k17k53R7J42J37m1P0j75l21J87K52
$$ -110 -402 -129 135 181 111 -316 0 -247 -80 184 243 26 -227 -130 12 149 108 178 3 -318 -131 121
6437A21J91k72Q2q7L9o9K27J56k04m31k8L01J91q4L2j13l16K7L53mJ46l07j67
$$ 121 312 40 122 35 74 5 232 388 184 -247 -275 26 217 133 165 52 -264 -237 116 112 258 -49 -216
6460b16j48L67L18o6q9l26k2R9L21j85J73j83k68M4O8N38k8m26J24l10J00L21
$$ -216 -364 3 321 255 166 -160 -182 -83 238 53 226 43 -225 -181 -113 425 397 -29 95 -215 -115 206
6482B06o1K1k25j00J31K36j9R5m05j79P3L35J71n2l0m59j07K91J74k7J07k64m4
$$ 206 145 166 -59 -159 -28 208 189 284 -121 -300 -227 108 279 227 197 -262 -369 -78 96 69 176 -88 -132
6505a32o0K36K40k04r5m0j61L12P0J10n70J77j22Q5K84J10n6l73j09J01L27R9
$$ -132 -192 44 284 80 -15 -55 -216 96 166 276 -294 -117 -239 -154 130 240 184 -189 -298 -197 130 229
6527B29j18k98p1K17k1L64m0j11k76J8j9K10q7J75p2k33j72L70J71j44Jr3j50
$$ 229 111 -187 -258 -41 -62 302 262 151 -125 -107 -126 84 -3 172 100 -133 -305 65 236 92 93 0 -150
6550a50k9L18p7N8l55P7O8M6K27k3j99k78K04K57n1q5P4k7k26R5J99N8M4m55J33
$$ -150 -179 139 62 120 -235 -158 -90 -44 183 160 -39 -317 -113 144 93 8 82 55 -171 -76 123 181 225 -230 -97
6575i7J8k2L39O6j49k83j85M85P3o8q5k3rl26M10L05k67k76k2K69q6Km0M4j10
$$ -97 -79 -101 238 304 155 -128 -313 172 245 177 92 69 60 -266 144 449 182 -94 -116 153 67 69 29 73 -37
6600c7no1J48R8k12J75oj44p5K11J34r1j53l1P5M0O8j87ok54K61l0P1j36J5K49
$$ -37 -42 -103 45 143 -69 106 100 -44 -119 92 226 135 -18 -49 26 66 134 -53 -59 -313 -52 -82 -11 -147 -132 117
6626A17j86j66K22O3L3j72k53K67k8K9O3m1p7j10K09K12k55R4R7p2l10L14R5k05
$$ 117 -69 -235 -13 50 83 -89 -342 -75 -103 -74 -11 -52 -129 -239 -30 182 -73 21 118 46 -264 50 145 -60
6650f0k18Q5K8J37kR6LK8k79m9L46K5O2j75j00r0K96L5J15j17j64k14J46L8R7
$$ -60 -278 -193 -165 -28 -30 66 69 97 -182 -231 115 140 202 27 -73 -163 133 168 283 166 2 -212 -66 -28 69
6675F9J68l40j64R6J37J06Q3j38j98Q1R1N3Q8m8Rk31j7J36N6K30j37n1j7n2n4
$$ 69 237 -103 -267 -171 -34 72 155 17 -181 -100 -9 44 132 84 93 -138 -155 -19 37 267 130 79 62 10 -44
6700d4M04l90k7J37oO7j31R0j43P8k28K25J12o5j61k53r2N49j10r6J93m3j93P5
$$ -44 360 -30 -57 80 74 141 10 100 -43 35 -193 32 144 79 -82 -335 -427 122 12 -84 109 66 -127 -52
6724e2K52k33J51k41j10J25M8L05O3k30m09K92L5r7K80M1k15l06K07n1M6J56M1
$$ -52 200 -33 118 -123 -233 -108 -60 245 308 78 -331 -39 -4 -101 179 220 5 -301 -94 -145 -99 57 98
6747I8j26k12J87J35K49l97j30J12K18m15K78K42m2k76K3O5K80J1l75J49k34R8
$$ 98 -28 -240 -53 82 331 -66 -196 -84 134 -281 -3 239 197 -79 -56 9 289 300 -75 74 -160 -62
6769f2J44K0j76k04P5J85P5J01Nj16n55K04M13K17k13r7o1k05J30K81L09l10j20
$$ -62 82 102 -74 -278 -203 -18 57 158 163 47 -508 -304 109 326 113 16 -45 -250 -120 161 470 160 40
6792D0j89Q1k2J22J94j09k52l09L61K45rp9q5n4j13K85J26n0k14j47K03L9j68
$$ 40 -149 -68 -90 32 226 117 -135 -444 -83 162 153 74 -11 -65 -178 107 233 183 -31 -178 25 64 -104
6815a04L68l6k82k65K92J68J12j94k90J29J26K23L8l5k08k47K78n7J41lok37k98
$$ -104 264 228 -54 -319 -27 141 253 59 -231 -102 24 247 285 250 42 -205 73 16 157 154 148 -89 -387
6838c87M00N07j24l19qj35j59K9O14j36k46l82MN06K7o7K95n36l06M7O43q5P6
$$ -387 13 520 396 77 69 -66 -225 -196 418 282 36 -346 -342 164 191 124 419 -117 -423 -376 267 182 258
6861B58k38N8k90P4L98R9l16l89R4J49R7J93j89Ll11K27L16j35j49j10K0p1J12
$$ 258 20 78 -212 -138 260 359 43 -346 -252 -103 -6 187 -2 1 -310 -83 233 98 -51 -161 -141 -212 -100
6884a00N0M69l73n19L40L04m7M7j60q9q4j23K65M69m47r9o5k11K52J10K89p3o04
$$ -100 -50 419 46 -473 -133 171 124 171 11 -78 -162 -285 -20 449 2 -97 -162 -373 -121 -11 278 205 -399
6907c99j63M37J48k2J04Nm56j02J31M56K11k83k80j55K37K00J06J5j75k93j3M64
$$ -399 -562 -125 23 1 105 110 -346 -448 -317 139 350 67 -213 -368 -131 69 175 190 15 -278 -291 173
6929A73J9j04J7j85l4l2M27j97j26j14N4J49l3J46r8j92j77K13L31o3L5Ml55L4
$$ 173 192 88 105 -80 -114 -146 281 84 -42 -156 -102 47 14 160 62 -130 -307 -94 237 174 209 213 -142 -108
6953a08RL50K2j12k28r0p7K18M35q8l72r9MK47j44K21R3m42j26K45J69J21j08
$$ -108 -99 251 273 161 -67 -157 -234 -16 419 331 -41 -140 -136 111 -33 188 281 -161 -287 -42 127 248 140
6976A40l06J37j06J82J6O3K3j30m1j05K17k30J19q3J0q9K34K43j89k74q5P6J38
$$ 140 -166 -29 -135 47 63 126 149 19 -22 -127 90 -140 -21 -104 -94 -183 51 294 105 -169 -254 -178 -40
6999d0K63j80N2j91LJ30Qj7K03m65k6J02K68J17j02j96j14l5J24K1L21k05k71
$$ -40 223 43 95 -96 -93 37 45 28 231 -234 -260 -158 110 227 125 -71 -185 -220 -96 -75 246 41 -230
7022b30J4N5J55k17L34j52M8k38J27M7J90j57r7p4O8O8L27p6j95j72L4N5L32j54
$$ -230 -216 -161 -6 -223 111 -41 7 -231 -104 -57 133 -24 -121 -195 -127 -59 268 192 -3 -175 -141 -86 246 92
7046I2m1j67q3J9K70N9L0l23J2J1j53L62K5l1k89Q5N1J22o7O3j37q9R4K24L8J54
$$ 92 51 -116 -199 -180 90 149 179 -144 -132 -121 -274 88 113 82 -207 -122 -71 51 -16 47 -90 -179 -85 139 177 331
7072C31j15l55n0J51J65J71k13k19j97K05L16Rqj83Qk79mL20R4Pk05p7K35N9R1
$$ 331 216 -139 -189 -38 127 298 85 -134 -331 -126 190 199 191 8 16 -263 -267 53 147 154 -51 -128 107 166 257
7097B57j16k14O3p4p9K85J14k63j91o0K22K28J9Q8l46j63K43J43p1l1J01l43j90
$$ 257 141 -73 -10 -84 -163 122 236 -27 -218 -278 -56 172 191 279 -67 -230 13 156 85 54 155 -188 -378
7120c78L58K96m3k98n4j89K10P7J46J5K3l05j85L63Q2r6N8j63k11J84J88P4o1
$$ -378 -20 276 233 -65 -119 -308 -98 -21 125 140 163 -142 -327 36 118 22 80 -83 -294 -110 78 152 91
7143I1k30j78J56J18J35J82j16k96j77L75K95k87M3p3k17R5J10K01m3k96k09K28
$$ 91 -139 -317 -161 -43 92 274 158 -138 -315 60 355 68 111 38 -179 -84 26 227 184 -112 -321 -93
7165i3J31r4M2J57l86j42K52K82K69k01j45j98k8Q3M43o8j97l47P2K41R7O5N2
$$ -93 38 -56 -14 143 -243 -385 -133 149 418 217 72 -126 -154 -71 372 304 107 -240 -168 73 170 235 287
7188B87n00r6R1L75J28j90q9l35K12R8J97J05j46m38J86J77J76j2k16j23j28K6
$$ 287 -213 -309 -218 157 285 95 6 -329 -117 -19 178 283 137 -301 -115 62 238 226 10 -113 -241 -215
7210b15L84R8J8l78j13J40Q5J67Q4j02m87l1K31L08p8n7J1l54J32Q1L62J13m89
$$ -215 169 267 285 -93 -206 -66 19 186 270 168 -319 -350 -119 189 111 54 65 -289 -157 -76 286 399 -90
7233i0j77J72R4K74L7p8k63m03K31K96M13m32j17j28R9n0L91R1m36l76K71O9J56
$$ -90 -267 -95 -1 273 310 232 -31 -434 -203 93 506 74 -43 -171 -72 -122 269 360 -76 -452 -181 -112 44
7256D4K26j53k16m20L26K81K4q0r6j05N1j6K79K41m60k55q6M51J16Q1k82k2j94
$$ 44 270 117 -99 -519 -193 88 112 32 -64 -169 -118 -134 145 386 -74 -329 -415 36 152 233 -49 -71 -265
7279b65l0L32K18j92k17o4L8N8J97L06k18m04j43K63K34J82k4k89k44j74K82N21
$$ -265 -295 37 255 63 -154 -218 -180 -122 75 381 163 -241 -384 -121 113 295 271 -18 -262 -436 -154 367
7301C67P4m75o4o7RJ32K05o5k24j87K00K21Q3l2k65M0j89K49K05K1j78k77J75
$$ 367 441 -34 -98 -165 -156 -24 181 116 -108 -295 -95 126 209 177 -88 -48 -237 12 217 238 60 -217 -42
7324d2j54K92R4K37m28j47J35K7L06l71P3L5k98K25J63K13m88q6J98j95K03J85
$$ -42 -196 96 190 427 -1 -148 -13 14 320 -51 22 57 -241 -16 147 360 -128 -214 -16 -211 -8 177
7346A77k3nm02J66J30J4L5J86m34J9K9L58R2l00m5j07j10J93O5J10P1l76Q5J20
$$ 177 154 149 -253 -87 43 57 92 278 -156 -137 -108 250 342 42 -3 -110 -220 -27 38 148 219 -157 -72 48
7370D8J48j9q5k23pJ51J76p1j30j79J51N3l5j02K37q8l86K86L21k06J57l80J43
$$ 48 196 177 92 -131 -138 13 189 118 -12 -191 -40 13 -22 -124 113 25 -361 -75 246 40 197 -183 -40
7393d0r1j17K90K45k61k68R9L3o7K27J52j79k09j38K62Q4n7n2R0K0j15J38J46
$$ -40 -131 -248 42 287 26 -242 -143 -110 -177 50 202 23 -186 -324 -62 22 -35 -87 3 23 -92 46 192
7416A92M8m34K09j41J27J8O9J03k33J7o0K35j55N8N7l5k11K01O3R0k05q1J02L
$$ 192 240 -194 15 -126 1 19 88 191 -42 -25 -85 150 -5 53 110 75 -136 65 128 218 13 -68 34 37
7440C7j00M5J85k05j78J38K34qj71J23J50l11J94p6M6O4l71K13l2m2J64K85m10
$$ 37 -63 -18 167 -38 -216 -78 156 148 -23 100 250 -61 133 57 103 167 -204 9 -23 -65 99 384 -26
7463b6rJ91k58R3J24L6N8k18j44R3J38J72p1k94J66j39N8J23M3m4j51j17r7L45
$$ -26 -35 156 -102 -9 115 151 209 -9 -153 -60 78 250 179 -115 51 -88 -30 93 136 92 -59 -176 -273 72
7487G2P7Q6k21j84k2K06K6P6n6k04J58J05q6Q8Ok57J06p2N5K04k55qj06K75m3
$$ 72 149 235 14 -170 -192 14 40 116 60 -144 14 119 33 121 127 -130 -24 -96 -41 163 -92 -100 -206 69 26
7512B6P2j38j2m3j37J97J98O0j16m18J86l1K72M6k0r5j59J2J42Q4k13K31j15o3
$$ 26 98 -40 -52 -95 -232 -35 163 223 107 -311 -125 -156 116 162 142 47 -112 -100 42 126 -87 144 29 -34
7536c4q7N5J02J14k64o6N7Q8K14J27k51l82J31l0K08J50Lk91q2N9J34J94j48%
$$ -34 -121 -66 36 150 -114 -180 -123 -35 179 306 55 -327 -196 -226 -18 132 135 -156 -238 -179 -45 149 1 1
7560AJ0j37J69m8Q6J27m27J83J34j24J42J1k01mj58L40K11j83j10j02k4q5L40
$$ 1 11 -126 43 -5 81 208 -219 -36 98 -26 116 127 -74 -78 -236 104 315 132 22 -80 -104 -189 151
7583A51Q4l7m87M8J46K06M2j47K2k25K18o7K89q5ml38LQ9J90J35k12Rp5o4J99
$$ 151 235 198 -289 -241 -95 111 153 6 28 -197 21 -46 243 158 154 -184 -181 -92 98 233 21 30 -45 -109 90
7608I0K14j98j0k96K2K22K00l2j33k45j20K24J03J75k1l89p5K21J47K55m89q1
$$ 90 304 106 96 -200 -178 44 244 212 79 -166 -286 -62 41 216 195 -194 -269 -48 99 354 -135 -216
7630b16K06j3m9L51k97R0l96R8Q3L24n8J50n07j7K00j28N08l32k31J65j57K85
$$ -216 -10 -23 -72 279 -18 72 -324 -226 -143 181 123 273 -234 -251 -51 -179 329 -3 -234 -69 -226 59
7652E9o0L02j27l60Q7k19L26R3Q7m63O4P4J63K12j60n5m1k09J60J04M8M4l00k4
$$ 59 -1 301 174 -186 -99 -318 8 101 188 -275 -211 -137 26 238 78 23 -18 -227 -67 37 85 129 -171 -195
7676a95J61R1J16n8ll57N8J32K45j6k01nq4j61K33K62j68o0j02q6K67J19j36J28
$$ -195 -34 57 173 115 112 -245 -187 -55 190 174 -27 -32 -116 -277 -44 218 50 -10 -112 -198 69 188 52 180
7700A80l50j3L40L8m7k21p5L1N1Q8L11q6l08n1P1K88j01J39j91n9k11J39K28l6
$$ 180 -170 -183 157 195 148 -73 -148 -117 -66 22 333 247 -61 -112 -41 247 146 285 94 35 -176 -37 191 155
7724A55k30j8k4P9J08Q2j8j72l83K12L27O1Q2k46j13j49J83K2J32N8j21j76J10
$$ 155 -75 -93 -117 -38 70 152 134 -38 -421 -209 118 179 261 15 -98 -247 -64 -42 90 148 27 -149 -39
7747c9M7R2K8l36%m9K28K36j08q1j03j94J64O2K68o6k32K9j66M70j75J5j08k11
$$ -39 8 100 128 -208 -208 -257 -29 207 99 18 -85 -279 -115 -53 215 149 -83 -54 -220 250 75 90 -18 -229
7771b29J5K20R2J88k00j40k76K37L1L15r6k71J9Qk6Q6pp0K1o4l5K99Jj27m1K17
$$ -229 -214 6 98 286 86 -54 -330 -93 -62 253 157 -114 -95 -87 -113 -27 -34 -104 -83 -147 -182 117 118 -9 -50 167
7797A67l03J52o7J6rk8j2qJ09%O1j03o2J10oJ17l6m3m0j31J14J58qj76O5J12k05
$$ 167 -136 16 -51 -35 -44 -72 -84 -92 17 17 78 -25 -87 23 17 134 98 55 15 -116 -2 156 148 -28 37 149 -56
7824e6J26K9J27k82n3J72L6j39O8%j52L98j57n8j34m6J43K3k9L0m4L6j06L6J24
$$ -56 70 99 226 -56 -109 63 99 -40 28 28 -124 274 117 59 -75 -121 22 45 16 46 2 38 -68 -32 92
7849I2j27O1N5j88K0o0K12M6l21L50n7k44J72l9K25k4k88K72j92Q0j8Ql1L9j69
$$ 92 -35 26 81 -107 -87 -147 65 111 -210 140 83 -161 11 -28 197 173 -115 157 -35 45 27 35 4 43 -126
7874a26R3o9J32r8o1J51j82J21l8Q1p7j85J32J87j5j35J26Q6k41K41j75L2J24
$$ -126 -33 -102 30 -68 -129 22 -160 -39 -77 4 -73 -258 -126 61 46 -89 37 123 -118 123 -52 -20 104
7897A04j35Jl5L1J09j58k4J8Q1k8l6J16j73L9J6k0J62j12Mj3J08j79J69Rk34J25
$$ 104 -31 -30 -65 -34 75 -83 -107 -89 -8 -36 -72 44 -129 -90 -74 -94 68 -44 -40 -53 55 -124 45 54 -180 -55
7923e5K86j88m2j10J4K07J00k49N4k5j51J36Q7R1j81M6J2j40J24QP1k01k8K61
$$ -55 231 43 1 -109 -95 112 212 -37 17 -8 -159 -23 64 155 -26 20 32 -108 16 24 95 -106 -134 127
7947A27o6K39k79r8J39p5J16o0M5m1k8l4n3J34n3M4k1r3Q0P1l9r1J99j11o6N4
$$ 127 61 300 21 -77 62 -13 103 43 88 47 19 -15 -68 66 13 57 36 -57 23 94 55 -36 163 52 -14 40
7973D0N9q4J69j65j76K20O5j24j80J22p0O5J4R3o3j9m6lq8K06M3j01j66N9J93
$$ 40 99 15 184 19 -157 63 128 4 -176 -54 -124 -59 -45 48 -15 -34 -80 -83 -171 35 78 -23 -189 -130 63
7998F3j47R1o0n6j9o6M1K20j86L2p8L15k78J79J25j47j86QQ6J37m0J2k42J43k10
$$ 63 -84 7 -53 -109 -128 -194 -153 67 -119 -87 -165 150 -128 51 176 29 -157 -149 -63 74 34 46 -196 -53 -263
8023b63J77J90k3q9p8k15L17O6n8J5k13j04J11J72k4m7o6l0J54O0o0K0r3k05K25
$$ -263 -86 104 81 -8 -86 -301 16 82 24 39 -174 -278 -167 5 -19 -66 -132 -162 -8 52 -8 12 -81 -286 -61
8048f1j47J78K46k32l8N3j18J18J36k7k25l7J32j49K26J56k42j31L0J44j15l7
$$ -61 -208 -30 216 -16 -54 -1 -119 -1 135 108 -117 -154 -22 -171 55 211 -31 -162 -132 12 -103 -140
8070a40K92M8k63j30M02j96L6j48P5K22l85L69o7p6j33J24jM3j7o5kj74K03N8
$$ -140 152 200 -63 -193 209 13 49 -99 -24 198 -187 182 115 39 -94 30 29 72 55 -10 -12 -186 17 75
8094G5K4M4j50K9k13K01o2J25N5k36J85rLr3l2Q5j50J68L3r3J71r7r4J3J84j43
$$ 75 99 143 -7 22 -191 10 -52 73 128 -108 77 68 71 -22 -54 31 -119 49 82 -11 160 63 -31 -18 166 23
8120B3NL3rr4J46k7q9R3k25l0j35K41K01k00j34J72P1Oj8qj90J39p8K2K1J56O2
$$ 23 28 61 52 -42 104 77 -12 81 -144 -174 -309 -68 133 -67 -201 -29 42 48 30 22 -168 -29 -107 -85 -64 92 154
8147A54j57L9j02R0J27j43k74J92n6R6j1J67m75L39l00J36J06K63j85j11Mj30
$$ 154 -3 36 -66 24 151 8 -266 -74 -130 -34 -45 122 -353 -14 -314 -178 -72 191 6 -105 -101 -231
8169b31M14p4o2J18j60J3L5oj34J15K40m68K63n9J11Q2k28N2k40J71K79k49
$$ -231 183 109 47 165 5 18 53 47 -87 28 268 -200 63 4 115 197 -31 21 -219 -48 231 -18
8191a8
$$ Imaginary data points
##PAGE= N=2
##DATA TABLE= (X++(I..I)), XYDATA
0@%%%Qj6QqJ6k4L2l2M6p0Q0q8J12j36J60j90K20k60L06l46L99m66N30o02O83p73
$$ 0 0 0 0 8 -8 0 -8 8 -16 16 -16 30 -40 40 -48 64 -72 88 -102 118 -142 164 -182 217 -249 281 -321 362 -411
29d11Q77r86J102j239J388j545J720j914K127k359K610k888L201l545L923m347
$$ -411 466 -520 582 -657 731 -814 906 -1008 1119 -1240 1370 -1518 1683 -1862 2061 -2286
45b286M826n367N981o686P513q496R674j1128J2980j5414J8775k3744L1815m7099
$$ -2286 2540 -2827 3154 -3532 3981 -4515 5159 -5969 7011 -8403 10372 -13372 18443 -28656
59b8656Q5854l55253p83596P40669P21178j14509j58088K25245l07582o33018
$$ -28656 57198 -298055 -1081651 -340982 380196 265687 107599 332844 25262 -607756
69f07756K17434Q72283R3881o08984j82201J73298k53398j47787O24064M98118
$$ -607756 -390322 481961 575842 -33142 -215343 -42045 -295443 -443230 180834 678952
79F78952n44465o40797K63733M63012j34600j18677K86944o2139n60821m4109
$$ 678952 134487 -506310 -242577 220435 85835 -32842 254102 191963 -368858 -412967
89d12967O03283J64834m68745j30064L45472L8824k34848J31805K09062l22496
$$ -412967 190316 355150 -113595 -243659 101813 140637 -94211 37594 246656 -75840
99g5840l53697L12940M43789j45413k96525R8658O1664k70470J3372N07636J89019
$$ -75840 -429537 -116597 327192 181779 -114746 -16088 45576 -224894 -211522 296114 485133
110D85133m83669m12824J28313K56299J21896J64005L9982l76048l76586J93722
$$ 485133 1464 -411360 -283047 -26748 95148 259153 299135 -76913 -453499 -259777
120b59777M64264J14207j62192j00630j51903k58012N0684M59079K85043k27369
$$ -259777 204487 318694 156502 55872 -96031 -354043 -303359 155720 440763 213394
130B13394l49822j09203M8802J41098K61278J28618k49267l41722j8671K18455
$$ 213394 -136428 -245631 -196829 -55731 205547 334165 84898 -256824 -275495 -57040
140e7040J57714P5993J3738j78193k54576L0714K98754J43573j38441j42412l2886
$$ -57040 100674 176667 190405 12212 -242364 -211650 87104 230677 92236 -50176 -83062
151h3062l2884K5610J72785J10324j35426j73833J4427Q8817L7626O4445M3897
$$ -83062 -115946 -90336 82449 192773 57347 -116486 -102059 -13242 24384 88829 132726
162A32726j51396k00263Q4976K72102N4873j82358j02583L2890L833K5136J40280
$$ 132726 -18670 -218933 -133957 138145 193018 10660 -91923 -59033 -55200 -30064 110216
173A10216N8917j73737j69148N7762J34472M5950L3680J7296j45658j87302P8717
$$ 110216 169133 -4604 -173752 -115990 18482 64432 98112 115408 -30250 -217552 -138835
184a38835K68033P3847j67097j16238O790j2471J8484J57179J08527j42088k07770
$$ -138835 129198 203045 35948 -80290 -73500 -85971 -67487 89692 198219 56131 -151639
195a51639k614J34337Q3463L7415P584j14692j64588K3999K01348R7716q9304
$$ -151639 -154253 -19916 63547 100962 108546 -6146 -170734 -146735 54613 152329 63025
206F3025q7122j4175l5285j6002J12869J23690n7537j62433m9996P7632P6171
$$ 63025 -24097 -38272 -73557 -89559 23310 147000 89463 -72970 -122966 -45334 30837
217C0837L5985N418o1505r5620o410R4025O4347j9582l3991k4349m1420j0457
$$ 30837 66822 72240 10735 -84885 -91295 2730 67077 47495 13504 -10845 -52265 -62722
229f2722P2700P3409l1984q8347l0036M0128M8210K2883j3763m5903k9351K5378
$$ -62722 9978 83387 51403 -36944 -66980 -26852 21358 44241 30478 -15425 -44776 -19398
241a9398L6089K05n097J0753k1748n3266O694Q0404L8416n6960o0421O073L1109
$$ -19398 16691 16896 11799 22552 804 -52462 -45768 34636 73052 16092 -44329 -38256 -7147
254g147K2028K1340m388n0500l1386L7963M1010j4546j3212K3404j2396n9993
$$ -7147 14881 36221 31833 -18667 -50053 -12090 28920 14374 1162 24566 12170 -47823
266d7823K30Q1512L2024o3544m1352L1662J6474k4388J1561M1649j4923n1119
$$ -47823 -47593 33919 65943 2399 -38953 -7291 9183 -15205 -3644 38005 23082 -28037
278b8037M393L8441o772k0270K5628J5527m5360k2779N2731K8871n3160k8052
$$ -28037 -23644 14797 8025 -12245 13383 28910 -16450 -39229 13502 42373 -10787 -38839
290c8839N6573K8633n9258l6814M9395L8658k9925k2756K0439q31k8824J0238
$$ -38839 17734 46367 -12891 -49705 -310 38348 8423 -14333 6106 5275 -23549 -13311
302a3311L7979o212l1221R061J6781l0189j9689N2408M3870m9116o5178K1105
$$ -13311 24668 18456 -12765 -3704 13077 -17112 -36801 15607 59477 10361 -54817 -33712
314c3712N7291J303k6317N567M297l2251j2702M2742L5730k1798l5687q191K300
$$ -33712 23579 24882 -1435 4132 8429 -23822 -36524 6218 41948 20150 -15537 -23728 -21428
327b1428P792L2648K6755l2428n6367m2M8718K3003j4031p322m110k9630j9379
$$ -21428 -13636 19012 45767 13339 -43028 -43070 5648 28651 14620 7298 3188 -26442 -45821
340d5821L9617N6915m633n8457l7629J4509L7394L1169P438k9316m6424j3299
$$ -45821 -6204 50711 46078 -12379 -50008 -35499 1895 33064 40502 11186 -35238 -48537
352d8537L5033M0864Q790j5497k6301l1451r467M0923N7995M044n9589n3366P744
$$ -48537 -13504 27360 36150 20653 -5648 -37099 -46566 -5643 52352 56396 -3193 -56559 -48815
365d8815M9167M0548M615k9784m3328k2147K1174M8512L2560j2482m8288m4613
$$ -48815 352 40900 45515 15731 -27597 -49744 -28570 19942 52502 40020 -8268 -52881
377e2881J335N2394N5763J947n4914n4997l162M5585M9875J3481l0449m9416k8189
$$ -52881 -51546 848 56611 58558 3644 -51353 -54515 -8930 40945 54426 23977 -25439 -53628
390e3628J8126N1222M1587o727n5193n3975J936N8575N6038q95n0192m9862j0105
$$ -53628 -35502 15720 57307 50580 -4613 -58588 -56652 1923 57961 57066 6874 -42988 -53093
403e3093L3156N1849K8710k4057n9236l8539J8993N7392M4192o752n4121n5647
$$ -53093 -19937 31912 60622 36565 -22671 -61210 -42217 15175 59367 52615 -1506 -57153
415e7153j723N7250N7952N77m8801m7306j1330K5256M6599L6394j2453n9680m9397
$$ -57153 -58876 -1626 56326 56903 8102 -39204 -50534 -25278 21321 57715 45262 -14418 -63815
428f3815J3508O1570M8431o572n2620n4579o959N0616N9998J0769m5285n2852
$$ -63815 -50307 11263 59694 53122 502 -54077 -61036 -10420 49578 60347 15062 -37790
440c7790j7095K6001M8748L6661j2467n8220m8737J1793N9040M6599n072m6234
$$ -37790 -54885 -28884 19864 56525 44058 -14162 -62899 -51106 7934 54533 49461 3227
452C227m8044j0957L7546N5054K1608l3235n6639k9641K3479N6513M0114j4712
$$ 3227 -44817 -55774 -18228 36826 58434 25199 -31440 -61081 -37602 18911 59025 44313
464D4313n7975m5256J0824N3013M3792j855m2520m5917j0191L3523M7502K0935
$$ 44313 -13662 -58918 -48094 4919 48711 46856 4336 -41581 -51772 -18249 29253 50188
476E0188k1871m6722l3966J0620N1704M5273r319n4839m4089O570M4903M2796
$$ 50188 28317 -18405 -52371 -41751 9953 55226 45907 -8932 -53021 -46451 -1548 41248
488D1248P739l4921m9535j6952L3963M8607J6809k3590l9291k7849O111M3218
$$ 41248 48987 14066 -35469 -52421 -18458 30149 46958 23368 -15923 -43772 -37661 5557
500E557M3323m575m8377l8324N582L3418L1628J3528j9234m6393k8932K6576N4925
$$ 5557 48880 44305 -4072 -42396 -36814 -3396 28232 41760 22526 -23867 -52799 -26223 28702
513B8702K2130k6199m0540k2225P583L5949L7178l197m4202l5033Q986L2214K3426
$$ 28702 50832 24633 -15907 -38132 -30549 5400 42578 39381 -4821 -39854 -30868 1346 24772
526B4772P197j1544l3972k8604J5585M8041K4445k3114l8676j8620Q333K8859
$$ 24772 31969 20425 -13547 -42151 -26566 21475 45920 22806 -15870 -34490 -26157 2702
538B702L2434L585l5839l8677Q41L4109K8812K892j8416k9105j9301J3160L8639
$$ 2702 35136 38721 2882 -35795 -34954 -845 27967 30859 12443 -16662 -35963 -22803 15836
551A5836K3810j6086l5367j9060P930K2800K3400P199k0269l4277j3184K3653
$$ 15836 39646 23560 -11807 -30867 -22937 -137 23263 30462 10193 -24084 -37268 -13615
563a3615L5937J2544k0118l0852j4552J1457K7022J9550o258k6943k1038N496
$$ -13615 22322 34866 14748 -16104 -30656 -19199 7823 27373 21115 -5828 -26866 -21370
575b1370K2743J6221n5j1332j6580j3448P528K7605J6371j7394k8029m703J5776
$$ -21370 1373 17594 17539 6207 -10373 -23821 -16293 11312 27683 10289 -17740 -22443 -6667
588f667J3415O377Q25j3808k2024j23K7137J8002j1863j9075n453J24M416J9127
$$ -6667 6748 13125 13950 142 -21882 -22005 5132 23134 11271 -7804 -13257 -13133 -8717 10410
602A0410J6040j7341l2042j784K5371J2900m659l81m094k1908j0710K7672L0692
$$ 10410 26450 9109 -22933 -24717 654 13554 8895 8514 4420 -17488 -28198 -526 30166
615C0166r629k8687q447N311K640J3296K0555p219l3893j1433K4031J5944o061
$$ 30166 20537 -8150 -16597 -11286 -8646 4650 25205 17986 -15907 -27340 -3309 12635 6574
628F574K31N455j7469k1534J6204L3664j592k7107n945J0318k523k046J7089P671
$$ 6574 6805 12260 -5209 -26743 -10539 23125 21533 -5574 -11519 -1201 -3724 -5770 11319 18990
642A8990k2253j5777J6387J4989r466n467J0234l881j7707O158K4774j652k5551
$$ 18990 -3263 -19040 -2653 12336 2870 -2597 7637 3756 -13951 -7793 16981 15329 -10222
655a0222l167J9079K584j1492M668R131j2795j3775J3922J8462p608j4203K400
$$ -10222 -13389 5690 8274 -3218 1450 10581 -2214 -15989 -2067 16395 8787 -5416 -3016
668c016K171p382N073J9076j079k3796q268J6675Q984o569O37O262r461j5141
$$ -3016 -845 -8227 -3154 15922 14843 -8953 -17221 -546 8438 1869 2506 8768 -693 -15834
682a5834O556J9118K865j0901n730o24l636L833J3604K773j3636r165O797N368
$$ -15834 -9278 9840 12705 1804 -3926 -4550 -8186 -4353 9251 12024 -1612 -10777 -3980 1388
696A388k764J951O545l525j2005j156J0567N394m354m014l55q75N24K840J977
$$ 1388 -1376 575 7120 3595 -8410 -9566 1001 6395 2041 -1973 -2328 -3203 -2679 161 2138
711B138k159j972P32Ln95J225J514j166k219R67K097K99j850j734L53L069K350
$$ 2138 -21 -1993 -1261 -1258 -1853 -628 886 -280 -2499 -1532 565 864 -986 -2720 -2367 702 3052
728C052l132m469J824M953j088l787J849M147k965n346K351N423n78k948O84k06
$$ 3052 -80 -4549 -2725 2228 1140 -2647 -798 3349 384 -4962 -2611 2812 2234 -714 -30 -236
744b36l040J823O172j447p722J007P751j168p556K074P631k302p677K653O876
$$ -236 -3276 -1453 4719 3272 -4450 -3443 4308 3140 -4416 -2342 5289 2987 -4690 -2037 4839
759D839l116n950M042N323m005m147L924J981n129Q43P386j430r184Q0Q716K41
$$ 4839 1723 -4227 -185 5138 1133 -3014 910 2891 -2238 -1395 5991 4561 -4623 -4543 4173 4414
775D414o449K449N886n339q753M838J0818q16p585k070P70j579L567Q262j055
$$ 4414 -2035 414 6300 961 -7792 -2954 7864 7048 -537 -2607 -1837 -3416 151 8413 7358
790G358j0874l492O338K572j312M054L219q542j0213M795J2066K818n378m030
$$ 7358 -3516 -7008 -670 1902 590 4644 7863 -679 -10892 -6097 5969 8787 3409 -621
804f21l559l438M458J0673J605q675n680M92Q81L046Q062J655j1044r147N880
$$ -621 -4180 -7618 -3160 7513 9118 443 -5237 -4745 -3864 -818 7244 8899 -2145 -11292 -5412
819e412R432P46k772m42m026n792M113R957P03p571k906R64j734K599R836R89
$$ -5412 4020 4766 1994 1552 -2474 -8266 -4153 5804 6507 -1064 -3970 -3006 -4740 -2141 7695 8684
835H684j4304q227J0706J1235l454n411K90l800n862P126J4152j553j4074n071
$$ 8684 -5620 -13847 -3141 8094 4640 -771 -481 -4281 -10143 -3017 11135 9582 -4492 -9563
849i563N268J514K183J0489J577j7571j2892J2315J6420p46o694p04n861j0621
$$ -9563 -4295 -2781 -598 9891 11468 -6103 -18995 -6680 9740 8994 2300 1596 -4265 -14886
863a4886O119K1506N163j8091j1935M417M461K170J0376N844j5444j7590P195
$$ -14886 -8767 12739 17902 -189 -12124 -7707 -3246 -1076 9300 15144 -300 -17890 -10695
876a0695J7890K107o254R50l198j3347n33K1327J1925j5574j6217L643P359N12
$$ -10695 7195 9302 3048 3998 800 -12547 -13080 8247 20172 4598 -11619 -7976 -617 -105
890a05N849P401r224j8289J974J8504O602q722l847p68p389j751J5999J2657j2315
$$ -105 5744 13145 3921 -14368 -12394 6110 12712 3990 143 -625 -8014 -9765 6234 18891 6576
905F576j8349Q16J1062L690K219M812o321j6963k858J7913J3336n962j1235m658
$$ 6576 -11773 -10957 105 3795 6014 10826 4505 -12458 -15316 2597 15933 9971 -1264 -5922
919e922k987J162J2914J2313p892j9019m847R920Q805L141K145n265j4422o078
$$ -5922 -8909 -7747 5167 17480 9588 -9431 -14278 -4358 4447 7588 9733 4468 -9954 -16032
933a6032J3146J6186m37j1668q306k650K446J0006J0816l141j5586r102N882J1032
$$ -16032 -2886 13300 12863 1195 -7111 -9761 -7315 2691 13507 10366 -5220 -14322 -8440 2592
947B592O018L2n878j1435n584R353J4719K691j0313j0145k584M390Q572P601j179
$$ 2592 8610 8642 2764 -8671 -14255 -4902 9817 12508 2195 -7950 -10534 -6144 2428 10029 8850
962H850j1354r858J904J1136R000R9q497j0589l350Q293J2030M045p872j1106
$$ 8850 -2504 -12362 -10458 678 9678 9777 1280 -9309 -12659 -4366 7664 11709 3837 -7269
976g269m029M734R192O977j387r571r459Q2J0016J0143R75r044r900k238P007
$$ -7269 -11298 -6564 2628 9605 8218 -1353 -10812 -10730 -714 9429 10404 1360 -8540 -10778 -3771
991c771R543M188m569r244o317K404R595P924p42r163r282m34Q719J0309J089
$$ -3771 5772 9960 5391 -3853 -10170 -7766 1829 9753 9011 -152 -9434 -9868 -1149 9160 10249
1006A0249q204r164j781O223P703L475k780p422o398P19Q508Q326m2q367q895
$$ 10249 2045 -7119 -8900 -2677 5026 8501 5721 -1701 -8099 -7380 1128 9454 9412 1045 -7850
1021g850o41P722Q781J718o758q299k510M804P396M014k242p295o085O86P713
$$ -7850 -8491 -769 8012 9730 2972 -5327 -7837 -3033 4363 8377 6135 -1160 -7245 -6559 1154
1036A154P494n98p881o861j15O433O340J256m171o295l219K459O478N092j137
$$ 1154 8648 8050 169 -6692 -6807 -374 5966 7222 3051 -3244 -6463 -4004 2474 7566 6429
1051F429p090o756O35P770O932j206p217n680P32N272M505M90k816m014l063P04
$$ 6429 -661 -7417 -6782 988 7920 6714 -503 -6183 -5451 -179 4326 4816 2000 -2014 -5077 -4373
1067d373M623N286j05n722o390J89O779O050j441n965m314P28L557L468J149j500
$$ -4373 250 5536 5431 -291 -6681 -6492 287 6337 4896 -1069 -5383 -4655 -1098 2370 3519 2019
1083B019l935l327R00N086M010j064n297m051J020N205L388j197l915k521M32
$$ 2019 -1916 -5243 -4343 743 4753 3689 -1608 -5659 -4639 566 3954 2757 -1158 -3679 -3247
1098c247J451K273K490m2l865m796R08O111L940k307n818k004K399L650J520j373
$$ -3247 -1796 477 2967 2925 -940 -5736 -4828 1283 5223 2916 -2902 -4906 -2507 1143 2663 1290
1114A290k135j008K59J70J091K395J023k675m634P2N556L836k740n166q41L178
$$ 1290 -845 -1853 -1594 -1424 -333 2062 3085 410 -4224 -4152 1404 5240 2500 -2666 -3507 -329
1130c29J765j15l12m13j076j038N81J929J403l8k427k538M98L842K239k418l596
$$ -329 1436 1321 1009 596 -480 -1518 -937 992 2395 2357 -70 -2608 -2110 1732 3971 1553 -2043
1147b043O22K915j33j788J146J753j724k899N02L928J237k367k610L8J466K083
$$ -2043 -1421 1494 1361 -427 719 2472 748 -2151 -1649 2279 3516 1149 -1461 -1423 43 2126
1163B126L85k262k309J736K651j088l091J622L339j270m544K2N232J235l764k646
$$ 2126 2511 249 -2060 -324 2327 1239 -1852 -230 3109 1839 -2705 -2683 2549 3784 20 -2626
1179b626J768K269k95p33n29o30M93J360l53k481O88L500n06m826k33N081J276
$$ -2626 -858 1411 1116 383 -146 -776 -283 1077 724 -1757 -1069 2431 1925 -2901 -3134 1947 3223
1196C223m632k042M001J943l579j496K629J224j283r54N36r29K07K393K8l390
$$ 3223 -1409 -3451 550 2493 -1086 -2582 47 1271 -12 -966 -430 -1359 -1152 1241 1269 -2121
1212b121o32M154N79m691j011N676J913o087k996M773L698k701k936J364Q34p89
$$ -2121 -2753 1401 1980 -2711 -3722 1954 3867 -2220 -5216 -443 3255 554 -2382 -1018 -184 -973
1228i73Q25J097j720j147K602O22m018o19N549J994o445l626N873M715l877m187
$$ -973 -148 949 -771 -1918 684 1306 -2712 -3331 2218 4212 -2233 -5859 14 4729 852 -3335
1244c335K028K502j331p27K096K9k433J51J131p58M21L509l48o239k138O972M766
$$ -3335 -1307 1195 -136 -863 1233 1262 -1171 -1020 111 -647 -226 3283 2935 -3304 -5442 1530 6296
1261F296m552m913J956K588j817o59L688J316l711l489P84K671K915J992l076
$$ 6296 1744 -3169 -1213 1375 -442 -1101 2587 3903 192 -3297 -2513 158 3073 5065 1989
1276A989n995j262O748M397l260m146R09O13j841P89M637J698m514m639k05M004
$$ 1989 -4006 -5268 1480 5877 2617 -1529 -620 -7 -1848 -1059 3578 5276 762 -3877 -4082 -78
1292g8M563J289m795o199M52O488L228l097j895K66j799k534L307O551j28o614
$$ -78 4485 5774 979 -5220 -4768 1720 4948 1851 -44 222 -1577 -4111 -804 5747 5619 -995
1308i95m462J078M385M944J201n717o957J425P039K045k815N3M21n246m101O807
$$ -995 -5457 -4379 6 4950 6151 434 -6523 -5098 1941 3986 1171 1224 1645 -3601 -7702 -895
1324h95R667k163j0222m224L991M397L589J434m268q074k33P497L868k480m11
$$ -895 8772 6609 -3613 -7837 -3846 551 4140 5574 1306 -6768 -7001 496 4364 1884 1473
1339A473k36o337m873Q995J2499l476j3824m456O642N212J926K169k763r379l999
$$ 1473 1237 -5100 -9973 -978 11521 8045 -5779 -10235 -3593 1619 3545 5714 2951 -6428 -10427
1354a0427Q046Q401k03k713l065p362m104J0392J4410k515j5591p039O606O187
$$ -10427 -2381 6020 5817 3104 39 -7323 -11427 -1035 13375 10860 -4731 -11770 -5164 1023
1368A023K310L344k71r463q321M473J1207M984k726o341q118k834R327J2609n22
$$ 1023 3333 6677 6406 -3057 -11378 -6905 4302 9286 6560 219 -7899 -10733 -1406 11203 10681
1383A0681j2462p372M102N074K618K894Q93p243q671K207J0807O588l166q821
$$ 10681 -1781 -9153 -5051 23 2641 5535 6428 -815 -9486 -7279 3528 10116 6950 -1871
1397a871p110J108J0109Q767l148j0081n647J974N178O152M343l482j1202p259
$$ -1871 -8981 -7873 2236 11003 7855 -2226 -7873 -5899 -721 5431 9774 6292 -4910 -12169
1411a2169N395J2542P443l772j2051j0718K229J4356J0535l708j0285o918k554
$$ -12169 -6774 5768 13211 9439 -2612 -13330 -11101 3255 13790 10082 -203 -7121 -9675
1424i675K268J1374J1739l808j7647j0349O627J3095P985k9q787j3786l831J2723
$$ -9675 -7407 3967 15706 11898 -5749 -16098 -9471 3624 11609 11580 2793 -10993 -14824 -2101
1438b101J3102r63q029m781m295l627Q395J6192L28j8346j1118Q008J1474J951
$$ -2101 11001 10038 2009 -2772 -7067 -10694 -2299 13893 14221 -4125 -15243 -7235 4239 6190
1452F190n68k165q964p189Q603J4120l61j0636m528R6j625N505J3449J525j9113
$$ 6190 5622 3457 -5507 -12696 -4093 10027 9666 -970 -5498 -5402 -7027 -1522 11927 13452 -5661
1467e661j3194J1510J6190N81o263k121o272q633O324J8692N290j4236j2414j73
$$ -5661 -18855 -7345 8845 9426 3163 1042 -5230 -13863 -7539 11153 16443 2207 -10207 -10380
1481a0380L369O724J2772L995j8021j8649O738J9756N631o135k922m599j1000
$$ -10380 -7011 -287 12485 16480 -1541 -20190 -13452 6304 11935 5800 2878 -1721 -12721
1494a2721o18J8283J3901r472j7023m214N145N981Q495N741r249j6606r61J4226
$$ -12721 -13339 4944 18845 9373 -7650 -11864 -6719 -738 7757 13498 4249 -12357 -13318 908
1508I08Q659l723l261k199p725m306J2266J4706m727j6873n811P776P634K619
$$ 908 9567 5844 2583 384 -7341 -11647 619 15325 10598 -6275 -12086 -4310 3324 5943
1522E943J725l983j0792m103J0040J0587n16o994n170l828p46R059J2089j891
$$ 5943 7668 3685 -7107 -11210 -1170 9417 8901 1907 -3263 -7091 -7837 1222 13311 11420
1536A1420j5693r380P076J1272L814k089m002p203n486M984J1904N319o323j0145
$$ 11420 -4273 -13653 -6577 4695 8509 6420 2418 -4785 -10271 -5287 6617 11936 5613 -4532
1550d532m896K515Q181Q807M41j1019j0134J690J0398O240j518l952m701m885
$$ -4532 -9428 -6913 1268 10075 10516 -503 -10637 -8947 1451 7691 6173 2221 -2480 -7365
1564g365Q8R013Q753k349j1611o611L906Q345M664j180n068o399j589N309P187
$$ -7365 -7277 1736 10489 8140 -3471 -10082 -6176 2169 6833 5653 585 -5814 -7403 -2094 5093
1579E093J096m200m553l280J13N553P725k53r428p303L632Q568K515k407k564
$$ 5093 6189 1989 -2564 -5844 -5731 -178 7547 7294 -2134 -9437 -5805 2763 5278 2871 307
1594C07k978l034J556O652L866l636n731k543J446L903N028P85o435o230K224
$$ 307 -2671 -5705 -4149 2503 6369 2733 -2998 -5541 -4095 -192 4836 5621 -814 -7044 -4820
1609d820O618K099k458j241p01k770r30M622N158j982o156k349K491L391K117
$$ -4820 1798 3897 1439 198 -503 -3273 -4203 419 5577 3595 -2561 -4910 -2419 972 3089
1624C089L6l221l628Q77L794J339j337j32j66k476j543L252M298j047m659j459
$$ 3089 3125 -96 -3724 -2847 947 2286 949 817 651 -1825 -3368 -116 4182 3135 -1524 -2983
1640b983K291J918K06q5q43j151j48R78K19j73R13O21k012j596J291K841q05k017
$$ -2983 -692 1226 1432 1347 504 -647 -795 183 402 229 1142 1763 -249 -1845 -554 2287 1482 -535
1658e35p1J878l07j680l1J164R81J03j086j424l75J685J993q98j524l26N65r11
$$ -535 -606 1272 965 -715 -746 418 1399 1502 416 -1008 -1383 302 2295 1397 -127 -453 112 -799
1676g99m10K639K266k313m246k19L211K729l99j637k360j204J248K590J612p23
$$ -799 -1209 1430 3696 1383 -2863 -3082 129 2858 2459 822 -1538 -2742 -1494 1096 2708 1985
1692A985k257k065j087K089M234K042l613n459r73M217M203O03k903k968j911
$$ 1985 -272 -2337 -3424 -1335 2899 4941 1328 -4131 -5104 -887 3316 3919 1016 -1952 -3863
1707c863L64L721L906L06m325n242m61M420N421J188l963n824k503L755O341L047
$$ -3863 -3499 222 4128 4434 109 -5133 -5594 -1174 4247 5435 1472 -4352 -6855 -3100 3241 6288
1723F288l214n544l218J001M255N423J274m987p765j821O575P688R83n107n890
$$ 6288 3074 -2470 -5688 -4687 -432 4991 6265 1278 -6487 -8308 -1733 5955 6938 1831 -4059
1738d059k798J926P033N835k052q130n544J611O036N872K008m733r560l921P211
$$ -4059 -6857 -4931 2102 7937 5885 -2245 -7789 -6178 -142 5730 7738 3005 -6555 -10476 -3265
1753c265J0797J740o869o900k285J350N879Q257P24j0001r212J363Q986O649J357
$$ -3265 7532 9272 2403 -4497 -6782 -5432 447 8704 9428 -573 -9785 -8422 564 7213 8570
1768H570m523q893o356N491J2638N049p371r332l121J811N532Q646L467r007j3283
$$ 8570 4047 -4846 -11202 -5711 6927 11976 4605 -4727 -7848 -6037 -505 8141 11608 2601 -10682
1783a0682o81J1384R098r0n410p174o445J971J2273R450n532j2736n428L514O664
$$ -10682 -11363 21 9119 9029 3619 -3555 -10000 -8029 4244 13694 8162 -4574 -10002 -6488 176
1798A76P283M060o740j4500m644J1854J3095M26q302p066m581L67J0039J1652
$$ 176 7459 11519 4779 -9721 -14365 -2511 10584 11010 2708 -4358 -8939 -8572 1467 13119
1812A3119j808j4519r743M370R336O697K978m996j2979p798R139J6205L291r451
$$ 13119 11311 -3208 -12951 -8581 755 7452 10430 5434 -7545 -15343 -6204 10001 13292 3841
1826C841r363l484L25P696J2121K581j3915j3925K156J2241Q366Q56m475j0401
$$ 3841 -5522 -9006 -8681 -985 11136 13717 -198 -14123 -11967 274 8640 9496 5021 -5380
1840e380q922N083J5937P918q399j2226m310J884O729J0654M607j0563j5926j587
$$ -5380 -14302 -9219 6718 14636 6237 -5989 -10299 -8415 -1686 8968 13575 3012 -12914 -14501
1854a4501J3093J1090O46o048q646q013K229J4028J0589n031j3821p280K505P897
$$ -14501 -1408 9682 10328 4280 -4366 -12379 -10150 3878 14467 9436 -4385 -11665 -9160 -1263
1868a263R672M584q509j4836m604J1209J3327K352o801r480o980J536J1542J1314
$$ -1263 8409 12993 4484 -10352 -14956 -3747 9580 11932 5131 -4349 -11329 -9793 1749 13063
1882A3063j620j3204j0206J356R685R669L362p233j2564n563P750J2448N393n230
$$ 13063 11443 -1761 -11967 -10611 -926 8743 12105 4872 -7692 -13255 -5505 6943 12336 7106
1896G106j0133p694J267J0365J0862lj1295j0749q37Q875J0885L636p209j1570
$$ 7106 -3027 -10721 -9454 911 11773 11770 475 -10274 -11111 -2236 8649 12285 5076 -6494
1910f494n533N652J1536O905l340j0559r307P17J0934J0733M8r519j0182k735
$$ -6494 -12027 -6375 5161 12066 8726 -1833 -11140 -10423 511 11244 11292 1773 -8409 -11144
1924a1144O687J1396N842n966j2502o349N099J0195P106j194q736j0045j654R696
$$ -11144 -4457 6939 12781 6815 -5687 -12036 -6937 3258 10364 9170 434 -9611 -11265 -1569
1938a569J1423J008q782r104k324M285Q696O721k790j0921p637L588J0088N670
$$ -1569 9854 10862 2080 -7024 -9348 -5063 3633 10354 7564 -3357 -10994 -7406 2682 8352
1952H352j311o464p627k770O931J0512K301q267q764j140M847O298N037j096q733
$$ 8352 7041 577 -7050 -9820 -2889 7623 9924 1657 -7107 -8247 -3400 2898 7935 6839 -1894
1967a894q867K219J0955P290l400p322n413j696L880R610N721o262j1868l501
$$ -1894 -10761 -8542 2413 9703 6303 -1019 -6432 -8128 -4248 5362 11083 4821 -7047 -10548
1981a0548O506P324L555j86n680r454k410R976J0507j419q653m750l99P74N353
$$ -10548 -4042 3282 6837 6651 971 -8483 -10893 -917 9590 8171 -482 -5232 -5631 -4857 496
1996D96Q120j67j1594p190N638Q265J215j354r60n093n876M456J1062J265r127
$$ 496 8616 8449 -3145 -10335 -4697 3568 4783 3429 2469 -2624 -8500 -4044 7018 8283 -844
2011h44m323K940J297l35N118L617p534q989M193J0337M26n832n30M97m507L2
$$ -844 -5167 -2227 -930 -1265 3853 7470 -64 -9053 -4860 5477 5903 71 -459 38 -4469 -4437
2027d437R358M716r158q067L950N617j072J144M332m207j0389L72J2073M432p335
$$ -4437 4921 9637 479 -7588 -3638 1979 907 2051 6383 2176 -8213 -7841 4232 8664 1329
2042A329l495K415k580l580O803Q761m776j0755l8O758O27j706M268J207q692
$$ 1329 -2166 249 -2331 -5911 892 9653 4877 -5878 -5916 842 1469 -237 4031 5238 -3454
2057c454m963Q260O998m690m874L363P55n532N29Q564J073q836k809O462K139
$$ -3454 -8417 -157 6841 2151 -2723 640 1395 -4137 -3608 4956 6029 -2807 -5616 846 2985
2072B985m539M32M667k933n547L072O193k052n918J757M161k789k506M173L217
$$ 2985 -1554 -1122 3545 612 -4935 -1863 4330 2278 -3640 -1883 2278 -511 -3017 1156 4373
2087D373n669m120N114M158l444k735K796O80l610l71M914R99m332j274L132j55
$$ 4373 -1296 -5416 -302 3856 412 -2323 473 1153 -2457 -2828 2086 3085 -1247 -2521 611 456
2103D56k474J773L084k291l948J788L452j174k515J611K106k177j935J521J959
$$ 456 -2018 -245 2839 548 -3400 -1612 1840 666 -1849 -238 1868 -309 -2244 -723 1236
2118A236j018j045J334K83j803n55J879M81q45J49O07j422j192J234K421j51j870
$$ 1236 218 -827 507 790 -1013 -1568 311 792 -53 96 703 -719 -1911 -677 1744 1593 -277
2135b77q48M39L23M68R83J32p62j348m39P77J689R82j344k295l69J894J568Mr08
$$ -277 -1125 -686 -363 105 1088 1220 458 -890 -1329 -552 1137 2119 775 -1520 -1889 5 1573 1577 669
2154F69j063j049L74J992J247o27j596j130l47O66K896J545k741l666J84L098
$$ 669 -394 -1443 -1069 923 2170 1543 -53 -1183 -1530 -864 2032 3577 836 -2830 -2646 452
2170D52J647j95n28j110k469n50K940L304p18k839k132r2J301K929J942j977m307
$$ 452 2099 1904 1376 266 -2203 -2753 187 3491 2773 -66 -2198 -2290 -989 1940 3882 1905 -2402
2187b402j095K681K533P2l02q59k478j665K770M136L08l907k796K82J880K226
$$ -2402 -3497 -816 1717 1789 1487 628 -1850 -3515 -745 3391 3699 -208 -3004 -2722 -842 1384
2203A384J711j273l887j628K316L025Q02o66j922k427j494L033M336Q25m118l745
$$ 1384 3095 1822 -2065 -3693 -1377 1648 2450 1784 -138 -2565 -4059 -1026 3310 4135 17 -3728
2219c728N3L081K790J019j694l258k204J217L470K620n38k870l350r09L157M548
$$ -3728 -3675 -594 2196 3215 1521 -1737 -3941 -2724 746 3366 2828 -42 -3392 -4301 -1144 3404
2235C404J074l569m142j040K797L228J602j249l073k593L22L170L271P89l340
$$ 3404 4478 909 -3233 -4273 -1476 1752 3354 2105 -968 -3561 -3239 -69 3202 3991 651
2250F51m283o12L309M083Q07k907l552p58J450L085K147r12k875l012J99K965
$$ 651 -3632 -4244 -935 3148 3955 1048 -2504 -3262 -1812 1273 3420 2508 -367 -3379 -3180 -215
2266b15L653P39l395m546l03L759L703J90k546k697j129Q21K962K905l39m009
$$ -215 3438 4177 782 -3764 -4067 -308 3395 3585 1039 -1658 -2787 -1966 996 3901 3562 -447
2282d47l237L87L522L390O34l173m379o02L345L750N45k048k661j921L91K910
$$ -447 -3684 -3297 225 3615 4249 1076 -3303 -3905 -560 3190 3735 1687 -974 -2895 -2504 406
2298D06L162K70l806l763K48L685L030L40k684l398o92K041L306J333j778k764
$$ 406 3568 3838 32 -3731 -3483 202 3232 3572 888 -2510 -3202 -1161 2145 3478 1700 -1064
2314a064j944K15K886L448n2l285l781N1L483L143j53k649k619m99J539K542J550
$$ -1064 -3008 -2793 93 3541 3489 204 -3577 -3526 -43 3100 2947 298 -2321 -2820 -1281 1261 2811
2331B811q27k695k644L37L182L112l59l123l412M78K858K854k9k308k146p89R55
$$ 2811 1984 -711 -3355 -3018 164 3276 2917 -206 -3618 -3140 -282 2572 2543 235 -1911 -2700 -1745
2348a745K415J944n00k589k969M16L310K780m24l218k470O51K029K126M44j583
$$ -1745 670 2614 2114 -475 -3444 -3028 282 3062 2638 -580 -3050 -2399 -370 1756 2200 617
2364F17j977j317J034K443J787m79k741k386L69L130K603r83k685j913M74J807
$$ 617 -1360 -2677 -1643 800 2587 2108 -633 -3019 -2650 480 3083 2100 -585 -2498 -2024 -217
2380b17J483P73j021j977j637R25K556J753q00k640j974J096K555J836q68k311
$$ -217 1266 2039 1018 -959 -2596 -1671 885 2638 1838 -802 -2776 -1680 875 2711 1843 -468
2396d68j203L78J004J623N59n46j997j523P94K474J655j240k302j301J097K010
$$ -468 -1671 -1293 -289 1334 1893 1347 -650 -2173 -1379 1095 2750 1510 -792 -2093 -996 1014
2412A014R72m21j626j226p7J240J348N83m81k050j449Q22K711J355j479k381o86
$$ 1014 1986 1565 -61 -1287 -1364 -124 1224 1807 1326 -724 -2173 -1351 1360 2715 1236 -1145 -1831
2429a831J235J401O95n01q74j160m34R93J543R55j245j816j052J279J957J002
$$ -1831 -596 805 1500 999 125 -1035 -1469 -476 1067 2022 777 -1039 -2091 -812 1145 2147
2445B147j649j649m01R13J015M68m9m13j211q75J088J729N18j094j885o70J433
$$ 2147 498 -1151 -1552 -639 376 844 795 382 -829 -1704 -616 1113 1631 537 -1348 -2018 -585
2462e85J737j89r90r56k22P72N49N26N6n88j250l64Q64J747M77j674j404j4J281
$$ -585 1152 963 -27 -983 -1205 -433 116 642 698 110 -1140 -1504 -640 1107 1584 -90 -1494 -1508 -227
2481b27J104l13o34n07k67KP76O95J98p38j265l19J160J404J66j330j185J56J157
$$ -227 877 564 -70 -577 -844 -842 -66 629 827 89 -1176 -1495 -335 1069 1235 -95 -1280 -1124 33
2500C3O85k27o78j13J51o18M28J097M74j061j353J6J478Q92k40j254m48K16Q07
$$ 33 718 491 -187 -300 -149 -767 -339 758 1232 171 -1182 -1166 312 1204 964 -290 -738 -522 285
2519B85J42l6k09j2l41j64K37R90J75r95r35K84J265M77r58m67L39L04k92L4M04
$$ 285 427 391 182 170 -171 -335 -98 892 1067 72 -863 -579 686 1163 205 -262 77 381 89 123 527
2540E27N8o49l72Q1M32N18K44q89n96L41R23J77o40m46M56K21o34k28Q74O18p95
$$ 527 585 -64 -436 -355 77 595 839 -50 -646 -305 618 795 155 -291 165 386 -248 -476 398 1016 221
2561B21q24R5Q51K97n88m0O3r7m3K26j42l00O15L50p36j129J003J066n22j133
$$ 221 -603 -508 343 640 52 12 75 -22 -65 161 19 -281 334 684 -52 -1181 -178 888 366 -767
2581g67M65R68n10j117M05J209N2j216j53N38k9K5L86O1j167k6J102L54j258r3
$$ -767 -302 666 156 -961 -556 653 705 -511 -664 -126 -155 -130 256 317 -850 -876 226 580 -678 -771
2601g71J289k86j742M75K251l7k220o31J614J133j247n0N39n74j257R83J933q00
$$ -771 518 232 -1510 -1035 1216 1179 -1041 -1672 -58 1075 -172 -222 317 -257 -1514 -531 1402 602
2619F02j540M14N61j090J64K619M77l043j892K113K131j014p58R77j91k392l7
$$ 602 -938 -524 37 -1053 -889 1730 2207 -836 -2728 -615 1516 502 -256 721 530 -1862 -1899
2636a899L274J087k109j609O90l80J09K078J536k398l328J509K602M7j366R83
$$ -1899 1375 2462 353 -1256 -566 -946 -837 1241 2777 379 -2949 -1440 1162 1209 -157 826
2652H26K81k469j379L702K639k380k929L88J623k33O73J552j274l402K43L266
$$ 826 1107 -1362 -2741 961 3600 1220 -1709 -1321 302 69 742 2294 1020 -2382 -2139 1127
2668A127R72j478l12M40k075j377L307L564k036m405m43K504J114J63P66k09l470
$$ 1127 2099 621 309 749 -1326 -2703 604 4168 2132 -2273 -2716 -212 902 1065 1831 1622 -1848
2685a848j547K906L242n73j802p38j474q91K615L929o67m534k141K453J958N2
$$ -1848 -3395 -489 2753 2180 378 -360 -1834 -2725 -110 3819 3152 -1382 -3523 -1070 888 940
2701I40O70J74k911k663K021M002Q99k375k007j133K73K094L104r3m162k397J708
$$ 940 1610 1784 -1127 -3790 -1769 2233 3132 757 -1250 -2383 -2110 -16 3088 2995 -1167 -3564 -1856
2718a856K585N95K42k63k528k589J468M531J884l017l208j018J103K780K222N8
$$ -1856 729 1324 1566 1303 -1225 -3814 -2346 2185 4069 1052 -2156 -3174 -2071 709 2931 2989
2734B989l529k962N85K659K503P10j275l339k696J369M770K578k059l910j843
$$ 2989 -540 -3502 -2917 -258 2245 2955 1680 -1659 -4355 -2986 1784 4362 2303 -1607 -3450
2749c450Q11K564K642N09k374l435n74J986K856K004j223l440k929J644M003K336
$$ -3450 -2639 -75 2567 3076 702 -2733 -3307 -1321 1535 3539 2316 -1124 -4053 -2409 1594 3930
2765C930j836l235j473M71K233K250P44k237l287j012K676L110J535j823m115
$$ 3930 2094 -1141 -2614 -2143 90 2340 3084 847 -2440 -3452 -776 2334 3869 2046 -2069
2780b069k211K060M520J920j824l320k318N15K315L548J144k803m500j569L148
$$ -2069 -4280 -2220 2300 4220 2396 -924 -3242 -2727 -412 3136 4280 1477 -3023 -4592 -1444
2795a444M172J730j962l834k820J108M208L042r47l481k439l31J614L491K472
$$ -1444 2728 4458 2496 -1338 -4158 -3050 1158 4200 3253 -228 -2667 -2998 -1384 2107 4579
2810D579j827n029k651K992M132J497j415k708k484k00L273L344l32l224k786
$$ 4579 2752 -2277 -4928 -1936 2196 3693 2278 -430 -2914 -3114 159 3503 3171 -53 -2839
2825b839R7J867K436K201j452m523k448K672M813Q22k378k505j385k38K371L700
$$ -2839 -2742 -875 1561 3762 2310 -2213 -4661 -1989 2824 3646 1268 -1237 -2622 -2860 -489 3211
2841C211P63l962l761R7K968L021J236j520l957k953J959N039J909k470k681j490
$$ 3211 3974 12 -3749 -3652 -684 2337 3573 2053 -1904 -4857 -2898 2141 4050 1580 -1101 -2591
2857b591m34J478M083K069l247m870p91K997L247R55r18k519l183M73M394K479
$$ -2591 -3025 -1547 2536 4605 1358 -3512 -4303 -1306 1941 2896 1978 -541 -3724 -3251 1143 3622
2873C622j565k759j209l14N63L083K535j985m825j203L187L150M6j100j626k049
$$ 3622 2057 -702 -1911 -2225 -1662 1421 3956 1971 -2854 -4057 -870 2280 2326 1226 -400 -2449
2889b449j71L059K929p91l032j698j8J515K246J842j526m359j442L254L022J47
$$ -2449 -2620 439 3368 2577 -455 -2153 -2171 -656 1590 3432 1906 -2453 -3895 -641 2381 2528
2905B528j455j483j582l21K036K923K06k645k577%J721K254J452j312l274j561
$$ 2528 1073 -410 -1992 -2313 -277 2646 2852 207 -2370 -2370 -649 1605 3057 1745 -1529 -3090
2921c090J981K770M71q54j213j331q04J292K757R41k151k699j97J578K119P79
$$ -3090 -1109 1661 2132 1278 65 -1266 -2070 -778 1979 2920 769 -1930 -2127 -549 1570 2349
2937B349j241k166j169J176J887O75l33r82j398p29J187K328N81j560k258j61
$$ 2349 1108 -1058 -2227 -1051 836 1511 1178 196 -1202 -1931 -744 1584 2165 605 -1653 -1814
2953a814J275J685L84q73j364q45N33J252P53K04o25j779q44J348J802N47j439
$$ -1814 -539 1146 1530 657 -707 -1552 -1019 233 986 1190 565 -1214 -2058 -710 1092 1639 200
2970B00j498J3O50J091N14l46r00p70J02N82J029K12m60j313p22J052J652p5j207
$$ 200 -1298 -1285 -635 456 970 624 -276 -1046 -944 -362 667 879 419 -894 -1616 -564 1088 1013 -194
2989a94p14J27N71K33K54J89l87p01k36N14P16L27l28j008k33P60N75O1n82l62
$$ -194 -908 -781 -210 23 277 466 79 -622 -858 -344 372 699 371 -637 -870 -110 465 526 -56 -418
3009d18K93O4l35K41O52J9o95l97M50O58o1k58m21l6K63K13j6l21M80J74j67q76
$$ -418 -125 -61 -396 -155 497 516 -179 -576 -126 532 471 213 -208 -244 19 232 216 -105 375 549 382 -494
3031d94J55Q27K12n53l95L85J22k79r5M17L28k07n71n23N62P27L27n55r40P7N54
$$ -494 -339 488 700 147 -248 137 259 -20 -115 302 630 423 -148 -671 -109 618 945 390 -550 -473 81
3052H1M20O3k79k02k77l83L51P30M24p01p76m81P60J070L77r96p79k42M97N04
$$ 81 501 564 285 83 -194 -577 -226 504 928 227 -549 -1030 -270 800 1177 181 -598 -840 -343 161
3072A61M59J03o30p17p77R98J224N62j170j076l76P26J133O25o23j194o21K01
$$ 161 620 723 93 -624 -1401 -403 821 1383 213 -863 -1239 -513 620 1245 622 -572 -1193 -992
3090i92J069Q77J47o56j441q19J096K172L54j633j564J64N57J211N78j62j454
$$ -992 77 954 1101 445 -996 -1815 -719 1453 1807 174 -1390 -1226 -669 542 1120 958 -496
3107d96j176J67J369J683j85j187j369p81J097K057R24j710k175L6J105J212N61
$$ -496 -1672 -1505 -136 1547 1362 175 -1194 -1975 -878 1179 2103 393 -1782 -1746 -641 571 1132
3124A132J56j181k025k95K086K312l71j665j682l43J153K079R41j244k413o91
$$ 1132 1288 107 -1918 -2213 -127 2185 1814 149 -1533 -1876 -723 1356 2297 1053 -1360 -2051
3140b051J342J320P51J65j034k275p81K378K884n02k416j509L3J161J573J174
$$ -2051 -709 611 1362 1527 493 -1782 -2563 -185 2699 2197 -219 -1728 -1695 -534 1039 2213
3156B213o27k565j359J121K362P54j78j367j813j016K336K727J45k781j941N62
$$ 2213 1586 -979 -2338 -1217 1145 1899 1721 354 -1459 -2475 -139 2588 2733 -48 -1989 -1427
3172a427J350J134R39j67k319k155Q01K839J538q07j781j600n03J691K717P15
$$ -1427 -77 1057 1996 1829 -490 -2645 -1844 995 2533 1726 -55 -1655 -2158 -467 2250 2965
3188B965k743k592K03J957J182R50j63j963k489K51L381K098j134k591j290q1
$$ 2965 222 -2370 -2167 -210 972 1922 1759 -204 -2693 -2442 939 3037 1903 -688 -1978 -2059
3204b059J399K268J223j904l121m69J957J922N08j98j609k661k38L380K760q37
$$ -2059 -660 1608 2831 927 -2194 -2663 -706 1216 1724 1526 -83 -2744 -2982 398 3158 2321
3220B321l165j440M95J256J603J020p82k797k002K159K740R59r90k027j838p5
$$ 2321 -844 -2284 -1789 -533 1070 2090 1308 -1489 -3491 -1332 1408 2367 1377 -650 -2488 -2563
3236b563K760K925o27l251j943J005J611J403Q44p24k720k129J723L277J602j704
$$ -2563 197 3122 2495 -756 -2699 -1694 -83 1320 2164 1440 -1280 -3409 -1686 1591 3193 1489
3252A489k557j295J45K219K715r3k694k326J21J924J743P52m92k427k174R60L250
$$ 1489 -1068 -2363 -2218 1 2716 2623 -71 -2397 -2276 -352 1391 2143 1651 -776 -2950 -1990 1260
3269A260J879j431k953j181J056J570J961L43k070k343o52K174K373N38j340k138
$$ 1260 3139 1708 -1245 -2426 -1370 200 2161 2504 434 -1909 -2561 -387 1986 2524 1184 -954
3285i54j615Q43K897K042j287l106j264Q15K182J314K80j342k385j180J682L233
$$ -954 -2569 -1726 1171 3213 1926 -1180 -2444 -1629 553 1867 2147 805 -1580 -2760 -1078 2155
3301B155R60k019k476j138R88K380J882m66k631k048N81K151J570j50p75k136
$$ 2155 3115 1096 -1380 -2518 -1530 850 2732 2266 -365 -2413 -1832 319 1889 1739 964 -1172
3317a172j683J356L144J585k083k812n73J123J607J281j1j795k112K89J844J967
$$ -1172 -2855 -1499 1645 3230 1147 -1665 -2238 -1115 492 1773 1762 -33 -2145 -1856 -12 1955
3333A955j06j348j690j241J188K700J411k018k757m53J391J508R65J58j548k270
$$ 1955 1849 501 -1189 -2430 -1242 1458 2869 851 -1906 -2359 -968 540 1505 1663 115 -2155
3349b155l29K252K453J4j901k109o69R69K635J524j457k683q07Q91J880R22J52
$$ -2155 -2484 -232 2221 2235 334 -1775 -2444 -1475 1160 2684 1227 -1456 -2263 -1372 508 1430 1582
3366A582j128k194j012J950K530L56j565j738o47O76J750J279q34j763j001Q25
$$ 1582 454 -1740 -2752 -802 1728 2084 519 -1219 -1866 -1190 560 1839 1005 -758 -1759 -934
3382i34J014Q44M57q97j746n62J601J739J7j341j304l19R95J337O06p03j570n33
$$ -934 80 924 1381 484 -1262 -1824 -223 1516 1533 192 -1112 -1431 -436 901 1507 804 -766 -1299
3400a299O20R08J053K76r11k345n23K223J872m57j211j137k08K32J305J419m56
$$ -1299 -679 229 1282 1558 647 -1698 -2221 2 1874 1417 206 -931 -1139 -907 398 1817 1361
3417A361j744o88J37N72J165R47l86k726p13J892J427k33r81K45n32r98P26J687
$$ 1361 -383 -1071 -934 -362 803 1750 1364 -1362 -2075 -183 1244 1011 30 275 -257 -1255 -529 1158
3435A158K34j555n81N42J29j63P94N50j572r22J467J328j230j077R41O39j281
$$ 1158 1392 -163 -744 -202 -73 -236 558 1108 -464 -1386 81 1409 179 -898 43 682 -599
3452e99n81K057M65j817j131J352J175j025J82P20r44j302J000J669o85j223M65
$$ -599 -1180 877 1342 -475 -1606 -254 921 -104 78 798 -146 -1448 -448 1221 536 -687 -222
3469b22Q31j110j135J675J828j511k083J071J409r15p37J494N22j467q50J158
$$ -222 609 -501 -1636 39 1867 356 -1727 -656 753 -162 -899 595 1117 -350 -1200 -42
3485d2L31q39N70J032o95k146P71K170o26j422N56J415j498j547J480K178p88
$$ -42 289 -550 20 1052 357 -1789 -1018 1152 526 -896 -340 1075 -423 -1970 -490 1688 900
3502I00j614p1Q25k24j75J138L15j670o39J182N29r43N74J201j109j937P37K655
$$ 900 -714 -785 40 -184 -359 779 1094 -576 -1215 -33 496 -447 127 1328 219 -1718 -981 1674
3520A674l12j878o07J173J39m04O04Q53j290j167O36J215K57k67k18r53j222Q64
$$ 1674 1362 -516 -1123 50 189 -215 389 1242 -48 -1215 -579 636 893 626 408 -545 -1767 -903
3538i03K697K12j964j606Q53P82Q7P92O67j279k078m3J870J609j63j294j223p69
$$ -903 1794 2006 42 -1564 -711 71 158 950 1617 338 -1740 -1783 87 1696 1533 239 -984 -1753
3556a753Q63K374Q57j632j767k92P25O70J017R11j344k365m92J902K132J33j697
$$ -1753 -890 1484 2341 709 -1058 -1350 -625 45 1062 1973 629 -1736 -2228 -326 1806 1939 242
3573B42j505m54P41J832J116r43j809p85L04J223J451N34j568k443l77K220K326
$$ 242 -1263 -1717 -976 856 1972 1029 -780 -1565 -1261 -38 1413 1947 379 -2064 -2441 -221 2105
3590B105K18k170j858k71R88J747J383o11k188j723J31K117K184M82k140k978
$$ 2105 2323 153 -1705 -1976 -988 759 2142 1531 -657 -2380 -2249 -132 2052 2534 394 -2584
3606b584l91K276K657N66j769k169r32O20J960K061M5k555k115m50K385K485O76
$$ -2584 -2975 -699 1958 2524 755 -1414 -2346 -1726 234 2295 2340 -215 -2330 -2780 -395 2090 2766
3623B766k055k862p20K020K609P75j538j988j264L09J963K250L68k476k862J0
$$ 2766 711 -2151 -2871 -851 1758 2533 995 -993 -2257 -1948 15 2265 2633 157 -2705 -2695
3639b695K520K582O41k131l144n98J986K357J222j398k112j627L19K214K481K90
$$ -2695 -175 2407 3048 917 -2227 -2825 -839 1518 2740 1342 -770 -2397 -2078 136 2617 2907
3655B907k673l013k33K813K692Q05k142k957j024J572K498J524n65k460k417l5
$$ 2907 234 -2779 -3012 -199 2493 3298 1156 -1801 -2825 -1253 1245 2769 2204 -256 -2673 -2708
3671b708K710K929L63k534l651k66K607K765R67j964k572j324Q05K825J901j34
$$ -2708 2 2931 3294 760 -2891 -3157 -550 2215 3182 1218 -1354 -2678 -1873 952 2853 2719
3687B719k887k552l36K923L133J46k806k765m43J990K575J214j443k597j866R73
$$ 2719 -168 -2720 -3056 -133 3000 3146 340 -2425 -2868 -878 1697 2911 1468 -1129 -2995 -2022
3703b022K459K337J33k670k986m19K794L359J69k588k747o39J707K312J527p34
$$ -2022 437 2774 2907 237 -2749 -3168 -374 2985 3154 566 -2181 -2820 -1113 1199 2726 1992
3719A992k787k451N69K967K525m9k827k696n08K569L107O66k282k745p63J201
$$ 1992 -795 -3246 -2677 290 2815 2766 -61 -2757 -3265 -696 2411 3077 795 -1950 -2713 -1512
3735a512K190J740j48k457l096O0L454K798l78k749k402j41J747K512J075j584
$$ -1512 678 2418 2270 -187 -3283 -3223 231 3029 2651 -98 -2500 -2641 -894 1618 2693 1109
3751A109k908r03J129K042J755J64k401k872k61L294K771k40k925j846j80J553
$$ 1109 -1799 -2702 -1573 469 2224 2388 -13 -2885 -3146 148 2919 2679 -246 -2092 -2272 -719
3767g19J592J719r73k746j577R88K553J540l1k186k408o34K572L045k93k496j693
$$ -719 873 2592 1619 -1127 -2704 -1716 837 2377 2346 160 -2248 -2882 -310 2735 2442 -54 -1747
3784a747M6R11J558J177K04k512k441P13L073J374m29j880j794l21J512K552M37
$$ -1747 -1701 -790 768 1945 2149 -363 -2804 -2091 982 2356 1927 47 -1747 -2068 -556 1996 2433
3801B433j940j935q8P95J055J436M58k065k843M08L153J745r38j980q65m21P50
$$ 2433 493 -1442 -1530 -735 320 1756 2214 149 -2694 -2286 867 2612 1674 -306 -1171 -1592 -842
3818h42J822J342j538j955q53J242J142J177K30j569k366j03K552K043q13k042
$$ -842 980 2322 784 -1171 -2024 -782 360 1537 1767 198 -2168 -2271 281 2324 1511 -531
3834e31p30J81L82R99J352k65k011j406R74J420J034l51r66j460n45J804J671
$$ -531 -1261 -1080 -698 301 1653 1388 -623 -2029 -1055 365 1399 1048 82 -1378 -1923 -119 1552
3851A552l85j333r04K54K20N08J384Q8j787j504O89J933M96k40j144p23j77O74
$$ 1552 1167 -166 -1070 -816 -596 -88 1296 1384 -403 -1907 -1218 715 1211 971 -173 -896 -1073 -399
3869c99J262J38r85q14j08K35P02P69L54j189j410L00J473R17q07n68k96j00K74
$$ -399 863 1001 16 -798 -906 -671 31 800 1154 -35 -1445 -1145 328 1245 438 -130 -426 -526 -252
3888b52O27K60k46n54m28j51P72P51J3p97r42L30R96L76l07k93j72k71%M92K94
$$ -252 375 635 389 -165 -593 -744 28 779 792 -5 -947 -617 379 755 448 155 -17 -288 -288 204 498
3909D98K1k69p08j94P78O34r6r78k48N38L17r3j38L68q4o78Q4K84L09J60j41m98
$$ 498 519 250 -458 -652 126 760 664 -314 -562 -24 293 200 62 430 346 -332 -248 36 345 505 364 -134
3931a34j54J02O79J42n89j50M92r6p05j6J054J98r93l73L23M33l94K05L75k81
$$ -134 -288 -186 493 635 46 -104 388 292 -413 -429 625 823 -170 -543 -220 213 -181 24 399 118
3951A18l32j8Q6J92O7L03M1j139j17R18P18p32q13L23O96m01j44O15L8o07o88
$$ 118 -214 -232 -146 46 113 416 457 -682 -799 119 837 105 -708 -385 311 -90 -234 381 419 -188 -876
3972h76M60P75R3m16j80o77R9P56R04o10j064j41O67J26K3N02M30j010j349O91
$$ -876 -416 359 452 36 -144 -821 -722 34 938 328 -736 -877 -210 -84 -61 441 871 -139 -1488 -797
3992g97J418N52r87o86l01J39M89Q24K79p30r13m9M95K91P65K65j004j621K28
$$ -797 621 1173 186 -500 -801 -662 -173 651 930 200 -713 -762 -267 24 789 1054 50 -1571 -1343
4011a343J989R62q08j309k62L55lR04N88m70j163o26Q45P50O39l20r45q68P1J406
$$ -1343 646 1608 800 -509 -771 -416 -419 485 1073 603 -560 -1186 -341 409 1048 728 -217 -1085 -1014 392
4031C92J147p34j333l93M95N57R2Q53J18j798r52P05K113L35r09j314o03L39J348
$$ 392 1539 805 -528 -921 -426 131 223 1076 1194 -604 -1556 -851 1262 1597 688 -626 -1229 -890 458
4050D58J195m18j328j055J32Q22P20J041l29j641j646Q86K095R69j056j578n84
$$ 458 1653 1235 -93 -1148 -1016 -194 526 1567 1238 -403 -2049 -1163 932 1901 845 -733 -1317
4067a317L12Q03J065P64j074j447m28Q54J270O07m03j208j479M56J807J115r16
$$ -1317 -1005 -202 863 1627 553 -894 -1322 -468 802 1409 1006 -202 -1681 -1225 582 1697 781
4084G81j469m85N58O70N31N93o06j468r56J049K037N10j054j523r41P44J482J361
$$ 781 -688 -1173 -615 55 586 1179 573 -895 -1851 -802 1235 1745 691 -832 -1773 -1029 453 1814
4102A814o18j831j039K48J375J075O44r40j850j244J027K393J085j245j880o59
$$ 1814 1196 -635 -1674 -1426 -51 1024 1668 728 -1122 -2366 -1339 1054 2139 894 -986 -1645
4118a645M91J160J299K99j373j748l16J297J547N70p06j563j332P21K263J179
$$ -1645 -1154 6 1305 1604 231 -1517 -1833 -536 1011 1581 875 -688 -2020 -1299 964 2143
4134B143j384j687o11P73J089N38M19o23j811o94J468J840L56j434j385n69N59
$$ 2143 759 -928 -1539 -766 323 861 1280 657 -1154 -1848 -380 1460 1816 382 -1003 -1572 -1013
4151a013J977J082q87k084p29J006J019O98N00q89j854r60J550K434J95j431j797
$$ -1013 964 2046 1159 -925 -1654 -648 371 1069 1569 680 -1174 -2134 -584 1850 2045 614 -1183
4168a183l10O71J358J313l62j670j490M87J346J013M34n95k103j247J429K355
$$ -1183 -1493 -822 536 1849 1487 -183 -1673 -1186 160 1173 1607 1012 -1091 -2338 -909 1446
4184A446M02j214j588l40N23R42J122L1j363j447M1J451J499k44p24j524p69R19
$$ 1446 1848 634 -954 -1294 -771 171 1293 1324 -39 -1486 -1445 6 1505 1261 537 -987 -1756 -837
4202h37K378K88j594j285k5L95P93J074J63j587j345m5J667J282J88j143j544
$$ -837 1541 1829 235 -1050 -1075 -680 113 1187 1350 -237 -1582 -1627 40 1322 1510 367 -1177
4219a177q55J178K111L63j076j364l97K51O30J472M55j374j823k93J878J287K09
$$ -1177 -2032 -854 1257 1620 544 -820 -1217 -966 -336 1136 1591 217 -1606 -1899 -21 1266 1475
4236A475r89j501n69N38J753O19p53j004o99L4P93J496L52j160j716k27J382J310
$$ 1475 486 -1015 -1584 -1046 707 1326 573 -431 -1130 -1096 -303 1193 1545 385 -1331 -1558 -176 1134
4254A134l72n84q59n76M39J391O46o79j011n73J34P51J327K53j365j466J14J392
$$ 1134 762 178 -681 -1257 -818 573 1219 540 -471 -1044 -910 -159 1168 1421 56 -1410 -1296 96
4272I6J064p8p08p38p05J62J151J227o17j160o44L2P82J175M72r44j595l96J431
$$ 96 1160 1082 374 -364 -1069 -907 244 1471 854 -306 -950 -918 -136 1039 1511 567 -1028 -1424 7
4291GJ067k63l34n53o11j65P69J227n8r16j166n7R31R00L05p79r84j23O46P05
$$ 7 1074 811 477 -76 -687 -852 -83 1144 1086 170 -996 -1053 -122 778 1083 304 -680 -803 -157 548
4311E48J44k47n91p37M1O75J051j30p71q93J69J010L28mk89p94l5J59O20N25k48
$$ 548 692 445 -146 -883 -842 -167 884 754 -17 -910 -741 269 597 593 304 -490 -525 -366 254 779 531
4332E31m87o80k82P00R74m8p75m17k57Q03L18Q6j38n77j00o8L68K89M89n77q06
$$ 531 44 -636 -918 -218 756 708 -67 -484 -741 62 380 466 328 -249 -349 -417 -49 240 729 152 -654
4353f54J5N98M41j09l34k96Kk1K93K95j30j64j89r7Q3M50L09k97m95k53N45K07
$$ -654 -639 -41 400 291 -43 -339 -337 -358 -65 230 100 -64 -253 -350 -267 183 492 195 -300 -553 -8 199
4375A99p9j61j11K64l27O1J90Q3J12m57j38M59KK77k25j71j92l4N02j19k42L17
$$ 199 120 -41 -152 112 -215 -154 36 119 231 -226 -364 95 97 374 149 -22 -214 -248 254 135 -107 210
4397B10L8m53j36L63N62m96k05L7K3j19L02K16j15l25j72J14K66J6K94J68n04
$$ 210 248 -205 -341 22 584 88 -117 -80 -57 -176 126 342 227 -98 -270 -156 110 126 420 588 84
4418H4o59K05R47j9m18l22J70m2l28Q00K99k66p51n7k4M99L03L9n25m79J1P56
$$ 84 -575 -370 577 558 140 -182 -12 -54 -382 418 717 451 -300 -357 -381 118 421 460 -65 -544 -533 223
4440B23M31j49m25k42j77J06J36J009l71j089m43M64O46O02j00n08m45l40N52
$$ 223 654 505 80 -162 -339 -233 -97 912 541 -548 -991 -527 119 721 621 113 -332 -672 -120
4459a20P64l3l71m03m73j24Q43Q63k13j017p73M77R19M22l43j28p91l25N35P21
$$ -120 644 611 240 -163 -636 -760 83 946 733 -284 -1057 -580 339 761 418 290 -501 -826 -291 430
4479D30L60l90q43m75J91J053P63k41j063q32J21P53R35r8l57r12l04K06R15Q00
$$ 430 790 400 -443 -918 -727 326 1089 848 -215 -1047 -926 -173 762 664 307 -605 -909 -703 212 1012
4499A012k28j104p84K07J129R49m40q57p55q1P67P83L60l62j055o97L48J284O77
$$ 1012 784 -320 -1104 -897 232 1181 741 -116 -871 -952 -185 598 958 596 -459 -1156 -808 476 1153
4518A153l24j122r26J79J227J021p1j324p28o5O23Q44Q08m82j229r73M70J452
$$ 1153 829 -293 -1219 -1040 187 1208 1137 -187 -915 -980 -357 487 1295 813 -416 -1389 -919 533
4536E33P75n04j152n54j3R24J117N0j251q11k51R10Q89M86j28j363j107M85J491
$$ 533 1308 804 -348 -902 -915 9 1126 1176 -75 -886 -1137 -227 662 1148 1020 -343 -1450 -965 526
4555E26J039n82j544m87L95M41J179N67r51j764j98J032J266L50m29j009j413
$$ 526 1565 983 -561 -1048 -653 -212 967 1534 583 -1181 -1379 -347 919 1269 840 -169 -1582
4572a582K72J824J202o12j599n63M04L66R16Q40m75j963q20J161J713J52q35q69
$$ -1582 -1310 514 1716 1104 -495 -1058 -654 -288 628 1468 993 -970 -1790 -629 1084 1236 401 -468
$$ [...]
8191g3
##END NTUPLES=NMR FID
##END=
