##TITLE=1H_AEDB-4
 CDCl3
 8 sc, 
 28.5.2024
##JCAMPDX= 6.0         $$ Bruker NMR JCAMP-DX V2.0
##DATA TYPE= NMR FID
##DATA CLASS= NTUPLES
##ORIGIN= UXNMR, Bruker Analytische Messtechnik GmbH
##OWNER= root
$$ XWIN-NMR		Version 3.5
$$ Tue May 28 14:04:36 2024 Russian Standard Time (UT+4h)  she@DPX200
##.OBSERVE FREQUENCY= 200.1309
##.OBSERVE NUCLEUS= ^1H
##.DELAY= (6, 6)
##.ACQUISITION MODE= SIMULTANEOUS
##.ACQUISITION SCHEME= undefined
##.AVERAGES= 8
##.DIGITISER RES= 18
##SPECTROMETER/DATA SYSTEM= spect
##.PULSE SEQUENCE= zg30
##.SOLVENT NAME= CDCl3
##.SHIFT REFERENCE= (INTERNAL, CDCl3, 0, 15.7039)
##AUDIT TRAIL= $$ (NUMBER, WHEN, WHO, WHERE, WHAT)
$$ ##TITLE= Audit trail, XWIN-NMR		Version 3.5
$$ ##JCAMPDX= 5.01
$$ ##ORIGIN= Bruker BioSpin GmbH
$$ ##OWNER= she
$$ F:/spectra/data/she/nmr/H-F/1/audita.txt
$$ ##AUDIT TRAIL=  $$ (NUMBER, WHEN, WHO, WHERE, WHAT)
(   1,<2024-05-28 14:03:25.75 +0400>,<she>,<DPX200>,
      <created by zg, POWCHK disabled, PULCHK disabled
       configuration hash MD5:
       00 E9 B6 7A A2 85 ED C7 34 08 36 98 17 FE 4E 26
       data hash MD5: 16K
       EE FB 2F F3 A5 97 C7 34 62 92 73 FC 40 2B BD 84>)
$$ ##END=
$$ 
$$ hash MD5
$$ DE F9 66 19 4E EC 65 07 87 58 5E 65 3E 16 F2 2D
##$RELAX= 
##$RELAX= 
##$RELAX= 
##$RELAX= 
##$RELAX= 
##$RELAX= 
$$ Bruker specific parameters
$$ --------------------------
##$DU= <F:/spectra>
##$EXPNO= 1
##$NAME= <H-F>
##$PROCNO= 1
##$TYPE= <nmr>
##$USER= <she>
##$AMP= (0..31)
100 100 100 100 100 100 100 100 100 100 100 100 100 100 100 100 100 100 
100 100 100 100 100 100 100 100 100 100 100 100 100 100 
##$AQSEQ= 0
##$AQ_mod= 1
##$AUNM= <au_zg>
##$AUTOPOS= <>
##$BF1= 200.13
##$BF2= 200.13
##$BF3= 200.13
##$BF4= 200.13
##$BF5= 200.13
##$BF6= 200.13
##$BF7= 200.13
##$BF8= 200.13
##$BYTORDA= 1
##$CFDGTYP= 0
##$CFRGTYP= 5
##$CHEMSTR= <none>
##$CNST= (0..31)
1 1 145 1 1 1 1 1 1 1 1 1 1 1 1 1 1 1 1 1 1 1 1 1 1 1 1 1 1 1 1 1 
##$CPDPRG= <>
##$CPDPRG1= <>
##$CPDPRG2= <>
##$CPDPRG3= <>
##$CPDPRG4= <mlev>
##$CPDPRG5= <mlev>
##$CPDPRG6= <mlev>
##$CPDPRG7= <mlev>
##$CPDPRG8= <mlev>
##$CPDPRGB= <>
##$CPDPRGT= <>
##$D= (0..31)
0 1.2 0 0 0 0 0 0 0 0.06 0 0.03 0 0 0 0 0.0002 0 0 0 0 0 0 0 0 0 0 0 0 
0 0 0 
##$DATE= 1716890605
##$DBL= (0..7)
120 120 120 120 120 120 120 120 
##$DBP= (0..7)
150 150 150 150 150 150 150 150 
##$DBP07= 0
##$DBPNAM0= <>
##$DBPNAM1= <>
##$DBPNAM2= <>
##$DBPNAM3= <>
##$DBPNAM4= <>
##$DBPNAM5= <>
##$DBPNAM6= <>
##$DBPNAM7= <>
##$DBPOAL= (0..7)
0.5 0.5 0.5 0.5 0.5 0.5 0.5 0.5 
##$DBPOFFS= (0..7)
0 0 0 0 0 0 0 0 
##$DE= 6
##$DECBNUC= <off>
##$DECIM= 32
##$DECNUC= <off>
##$DECSTAT= 4
##$DIGMOD= 1
##$DIGTYP= 9
##$DL= (0..7)
0 120 120 120 120 120 120 120 
##$DP= (0..7)
150 150 150 150 150 150 150 150 
##$DP07= 0
##$DPNAME0= <>
##$DPNAME1= <>
##$DPNAME2= <>
##$DPNAME3= <>
##$DPNAME4= <>
##$DPNAME5= <>
##$DPNAME6= <>
##$DPNAME7= <>
##$DPOAL= (0..7)
0.5 0.5 0.5 0.5 0.5 0.5 0.5 0.5 
##$DPOFFS= (0..7)
0 0 0 0 0 0 0 0 
##$DQDMODE= 0
##$DR= 18
##$DS= 0
##$DSLIST= <SSSSSSSSSSSSSSS>
$$ [...]
##$SUBNAM2= <"">
##$SUBNAM3= <"">
##$SUBNAM4= <"">
##$SUBNAM5= <"">
##$SUBNAM6= <"">
##$SUBNAM7= <"">
##$SUBNAM8= <"">
##$SUBNAM9= <"">
##$SW= 18.0517689322627
##$SWIBOX= (0..15)
0 0 2 0 0 0 0 0 0 0 0 0 0 0 0 0 
##$SW_h= 3612.71676300578
##$TD= 16384
##$TD0= 1
##$TE= 0
##$TE2= 300
##$TE3= 300
##$TEG= 300
##$TL= (0..7)
0 120 120 120 120 120 120 120 
##$TP= (0..7)
150 150 150 150 150 150 150 150 
##$TP07= 0
##$TPNAME0= <>
##$TPNAME1= <>
##$TPNAME2= <>
##$TPNAME3= <>
##$TPNAME4= <>
##$TPNAME5= <>
##$TPNAME6= <>
##$TPNAME7= <>
##$TPOAL= (0..7)
0.5 0.5 0.5 0.5 0.5 0.5 0.5 0.5 
##$TPOFFS= (0..7)
0 0 0 0 0 0 0 0 
##$TUNHIN= 0
##$TUNHOUT= 0
##$TUNXOUT= 0
##$USERA1= <user>
##$USERA2= <user>
##$USERA3= <user>
##$USERA4= <user>
##$USERA5= <user>
##$V9= 5
##$VALIST= <valist>
##$VCLIST= <CCCCCCCCCCCCCCC>
##$VD= 0
##$VDLIST= <DDDDDDDDDDDDDDD>
##$VPLIST= <PPPPPPPPPPPPPPP>
##$VTLIST= <TTTTTTTTTTTTTTT>
##$WBST= 1024
##$WBSW= 4
##$XGAIN= (0..3)
0 0 0 0 
##$XL= 0
##$YL= 0
##$YMAX_a= 321710
##$YMIN_a= -437413
##$ZGOPTNS= <>
##$ZL1= 120
##$ZL2= 120
##$ZL3= 120
##$ZL4= 120
##$ABSF1= 10
##$ABSF2= 0
##$ABSG= 5
##$ABSL= 3
##$ALPHA= 0
##$AQORDER= 0
##$ASSFAC= 0
##$ASSFACI= 0
##$ASSFACX= 0
##$ASSWID= 0
##$AUNMP= <proc_1d>
##$AZFE= 0.1
##$AZFW= 0.1
##$BCFW= 1
##$BC_mod= 2
##$BYTORDP= 1
##$COROFFS= 0
##$CY= 11.3945322036743
##$DATMOD= 1
##$DC= 2
##$DFILT= <>
##$DTYPP= 0
##$F1P= 15.6554695791079
##$F2P= 12.8336369535428
##$FCOR= 0.5
##$FTSIZE= 0
##$FT_mod= 4
##$GAMMA= 1
##$GB= 0.15
##$INTBC= 1
##$INTSCL= 1
##$ISEN= 128
##$LB= 0.24
##$LEV0= 0
##$LPBIN= 0
##$MAXI= 10000
##$MC2= 0
##$MEAN= 0
##$ME_mod= 0
##$MI= 1.114404
##$NCOEF= 0
##$NC_proc= 0
##$NLEV= 6
##$NOISF1= 3.799351
##$NOISF2= 2.8
##$NSP= 1
##$NTH_PI= 0
##$NZP= 0
##$OFFSET= 15.70392
##$PC= 1
##$PHC0= -25312.26
##$PHC1= 11.18748
##$PH_mod= 1
##$PKNL= yes
##$PPARMOD= 0
##$PSCAL= 0
##$PSIGN= 0
##$REVERSE= no
##$SF= 200.130013532006
##$SI= 16384
##$SIGF1= 3
##$SIGF2= 2
##$SINO= 400
##$SIOLD= 16384
##$SREGLST= <1H.CDCl3>
##$SSB= 0
##$STSI= 0
##$STSR= 0
##$SW_p= 3612.71676300578
##$SYMM= 0
##$S_DEV= 0
##$TDeff= 0
##$TDoff= 0
##$TI= <>
##$TILT= no
##$TM1= 0
##$TM2= 0
##$TOPLEV= 0
##$USERP1= <user>
##$USERP2= <user>
##$USERP3= <user>
##$USERP4= <user>
##$USERP5= <user>
##$WDW= 1
##$XDIM= 8192
##$YMAX_p= 0
##$YMIN_p= 0
$$ End of Bruker specific parameters
$$ ---------------------------------
##NTUPLES= NMR FID
##VAR_NAME=  TIME,          FID/REAL,        FID/IMAG
##SYMBOL=    X,             R,               I
##VAR_TYPE=  INDEPENDENT,   DEPENDENT,       DEPENDENT
##VAR_FORM=  AFFN,          ASDF,            ASDF
##VAR_DIM=   8192,          8192,            8192
##UNITS=     SECONDS,       ARBITRARY UNITS, ARBITRARY UNITS
##FACTOR=    0.0002768,     1,               1
##FIRST=     0,             0,               0
##LAST=      2.2672688,     0,               0
##MIN=       0,             -437413,         0
##MAX=       2.2672688,     321710,          0
$$ Real data points
##PAGE= N=1
##DATA TABLE= (X++(R..R)), XYDATA
0 0 0 0 0 0 0 0 0 0 0 0 0 0 3 -1 8 -8 8 -8 11 -16 16 -20 24 -27 32 -37 43 -48 56 -63 74 -83 92 -104 117 -131
36 -131 145 -163 182 -204 224 -249 274 -302 334 -368 404 -445 491 -538 594 -656 724 -801 889
55 889 -987 1103 -1239 1398 -1594 1835 -2141 2545 -3104 3913 -5179 7393 -11981 25013 -131146
70 -131146 -437413 118504 99414 -262714 158553 321710 -209929 -165084 174678 -43009
80 -43009 -97522 210306 64478 -203233 -44676 54318 -48733 41450 152642 5880 -144650
91 -144650 -51823 47187 -16849 25366 147045 -14341 -185055 -23291 54512 -56553 60768
102 60768 145474 -76840 -111436 48544 -20207 -17870 130682 -1879 -119782 17512 -14879
113 -14879 -66630 122680 104193 -90522 -24200 31121 -80159 859 113884 1629 -50263
124 -50263 -11922 -46802 -3787 57465 16526 32617 11695 -96809 -30605 60424 -22397 2635
136 2635 76003 -56402 -85321 62217 15371 -42403 86569 27126 -119447 4307 65552
147 65552 -58558 6716 97225 -37215 -84586 39491 41959 -33031 14507 62773 -23278 -77163
159 -77163 9322 51629 -27926 -19073 66277 -9789 -83385 39867 53882 -63354 9570 59185
171 59185 -75025 -39582 78303 -18107 -46995 73360 4746 -87126 35129 54936 -57968
182 -57968 1227 58866 -37847 -38970 37885 14108 -15281 8222 11642 -3431 -12282 -1109 19814
195 19814 3233 -20299 3295 7590 -19849 5243 23270 -16277 -3490 17831 -27705 -10780
207 -10780 35404 -15150 -28263 32054 2824 -42462 16548 36786 -27235 -15816 33117 -4280
219 -4280 -28729 15282 20599 -14072 -9655 15813 5436 -13974 7623 17426 -15743 -5821 19882
232 19882 -13381 -14133 28140 -2258 -34382 22577 23359 -42823 -1164 47408 -31288 -38183 46154
245 46154 6281 -48577 19879 33090 -36175 -13662 36359 -5927 -24227 22969 9193 -25557
257 -25557 6783 17822 -14630 -171 22330 -7457 -18421 18878 11631 -26368 4253 30368
269 30368 -20169 -24146 29615 8201 -33629 7573 29636 -22707 -22520 27483 2707 -29138 10899
282 10899 17680 -19834 -5417 17220 -6251 -10926 14916 2816 -17010 9758 13444 -19789 -898
295 -898 25812 -9047 -18995 23030 13509 -28803 -199 31444 -14379 -24638 27206 10840 -31179
308 -31179 3190 24930 -15786 -15867 20408 1797 -22673 7591 11298 -19074 727 17160 -14199
321 -14199 -8623 20481 -3528 -21151 16573 17146 -26298 -3801 32090 -11665 -25458 27139 15799
334 15799 -29242 1936 29811 -14073 -21123 24106 6899 -25501 8578 16328 -19432 -3780
346 -3780 18007 -10620 -11236 17376 -1563 -22109 11169 13149 -24678 -2132 27006 -11594 -21259
359 -21259 21331 11978 -25325 -578 27656 -9092 -21629 19940 11375 -23018 3335 22293
371 22293 -10148 -10105 16974 -501 -15940 11985 7689 -18340 6321 14432 -20390 -5256 22919
384 22919 -8432 -18570 16546 8604 -24292 -2471 21780 -7916 -18100 13188 10386 -16659
396 -16659 -4845 19613 1162 -18275 8341 13726 -17190 -1692 21925 -9304 -11482 19955
408 19955 -2926 -18578 20980 11129 -29242 7417 24975 -28953 -11518 38159 -9403 -32016
420 -32016 22710 12717 -31273 1855 28306 -12415 -20112 15131 4206 -19094 5529 18198
432 18198 -9418 -10941 12823 -447 -15985 16225 17216 -24492 -1539 26517 -22606 -15676 42848
445 42848 203 -39021 23450 20660 -40879 3861 42402 -23708 -24303 29536 -6424 -25560 22022
458 22022 10389 -19673 3585 3924 -14231 3523 11561 -5043 -4011 2362 -3251 -3185 2766 9412
472 9412 5804 -13272 -3971 16455 -9397 -11035 27974 2231 -29835 12251 17299 -20753 3827
485 3827 23579 -15262 -13764 13457 -5733 -6263 16109 -4076 -13302 7559 -3445 -9224 11434
498 11434 6066 -7496 -4919 -3009 3370 925 -5789 13233 9267 -25080 -2820 28927 -14211
511 -14211 -15707 36442 -3338 -39357 25053 18795 -33783 15484 28022 -35346 -5248 33569
523 33569 -21065 -14443 35632 -9672 -33175 24252 11461 -29502 8144 21143 -17593 -12645
535 -12645 12949 5961 -9896 -6191 11758 2218 -18294 5226 20725 -12746 -11514 20954 -3533
548 -3533 -17936 20440 8023 -21634 10410 8914 -21542 10948 20107 -19262 -2111 15798 -16129
561 -16129 -7274 19740 -2103 -10132 4249 -7307 -3795 10186 -4705 1971 12634 -20024 -12065
574 -12065 24210 -5067 -13554 23455 -2239 -26888 12363 11491 -12621 14194 10012 -23407 1993
587 1993 13509 -15780 8905 24963 -20667 -15369 18541 -5639 -9965 21386 6521 -19906 -7025
600 -7025 4276 -831 2287 7560 2876 -10284 -13786 4133 9693 -2376 7844 5456 -23377 -5294
614 -5294 19106 -8772 825 29005 -16329 -31018 24082 10259 -23770 22154 23895 -36462 -13349
627 -13349 27146 -7953 -6550 27217 -3260 -23929 1922 1977 -2001 13069 4556 -11128 -6694
640 -6694 -5240 -1992 10416 8011 -864 -4688 -12960 -4278 12818 1652 -333 12982 -10511 -21734
654 -21734 12548 14756 -7707 6251 9996 -16483 -11823 11544 7684 1036 3943 -4092 -8510 -3168
668 -3168 924 9861 6759 -6594 -5252 -4953 -6618 8425 8991 -5091 1950 -788 -18503 1493
682 1493 22523 -5868 -10699 16474 -7557 -25331 17848 20275 -15920 1178 13069 -16636 -9361
695 -9361 19352 4640 -7991 7291 -1454 -15447 4414 12765 -4057 -472 6883 -8343 -13117
708 -13117 7330 12111 -7511 -5332 10977 -6830 -17371 12459 14931 -13281 -3717 12801 -9714
721 -9714 -12561 15742 7282 -12613 4532 5837 -12356 2770 13351 -5579 -3054 9693 -5718
734 -5718 -10284 10887 7965 -11051 -248 10443 -8068 -9424 11489 6900 -11577 -3106 9359
747 9359 -5537 -10442 10276 6613 -12242 -724 8061 -7231 -3456 11053 -1283 -8943 6072
760 6072 2182 -10444 6689 11613 -10940 -3708 13320 -4352 -11403 11944 8707 -14046 -2648
773 -2648 13902 -5364 -11584 11535 6582 -12832 -604 9352 -5992 -7182 7918 1299 -9377
786 -9377 3632 4613 -8964 1474 9076 -7449 -4791 10263 -1198 -11031 7741 8927 -11600
799 -11600 -2520 14885 -3307 -11295 10369 7424 -11452 -1095 11395 -3505 -8302 7048 3366
812 3366 -8664 2092 6420 -5696 -1664 5981 -4488 -5528 6700 413 -9676 4454 7944
825 7944 -10442 -3561 12722 -2739 -10864 8126 7446 -10818 -2400 11728 -2017 -8934 7831
838 7831 5113 -7949 745 7043 -3470 -3056 5373 -161 -5515 4036 2431 -7422 1878 7735 -7320
853 -7320 -4794 10008 -1677 -11471 5853 8525 -11281 -4030 12635 -2823 -10813 8196 5599
866 5599 -9004 -154 7892 -3353 -4403 5634 1444 -4184 3160 2968 -4774 1204 4884 -3631 -3192
881 -3192 6344 1401 -8133 2081 8226 -7442 -6093 11304 577 -11977 4424 8056 -9967
894 -9967 -4298 10516 -2013 -8422 5804 3215 -7300 1961 4364 -4039 181 4203 -2869 -1893
908 -1893 4637 779 -4379 2845 5492 -4438 -3916 6936 2524 -7835 767 9355 -5371 -9025 9603
923 9603 3724 -12168 3266 9004 -8911 -4100 8651 -2773 -6765 6505 839 -7346 3978
936 3978 3896 -6998 1774 7117 -5587 -3441 6899 1188 -6738 1714 8188 -3693 -6926 8271
950 8271 5345 -9985 387 11342 -5928 -9368 10889 2718 -12682 5594 8091 -12229 114
963 114 10556 -9073 -4241 11961 -5739 -10652 11075 3080 -13400 5900 11006 -11836 -4981
976 -4981 12590 -1174 -8830 6056 6494 -7231 -4688 8270 2495 -6928 4219 6403 -8239 -2979
990 -2979 8769 -2466 -5337 8944 -677 -12389 6438 6691 -12739 3355 13229 -12719 -8277
1003 -8277 13854 -2348 -11320 9930 6194 -12493 -1760 8652 -2719 -2250 6036 294 -4471
1016 -4471 -1019 1756 2244 407 933 1510 -4247 -1019 5373 -1558 -1168 7400 -3304 -10356 6500
1031 6500 6043 -9776 2644 11071 -10649 -8518 11554 409 -8319 6448 3098 -9560 -1565
1044 -1565 5085 527 -131 2129 -1186 -3206 -588 2625 2922 304 961 -376 -6627 503 8860 -3068
1060 -3068 -3430 9835 -4299 -13281 9634 9046 -11903 904 10952 -11068 -8947 13358 2139
1073 2139 -8659 6206 1652 -10871 715 6539 -2517 30 3927 -4116 -5896 4182 5243 -2956
1087 -2956 355 5107 -4386 -8256 6519 9202 -7319 -2564 10497 -6147 -11047 12752 6711 -12316
1101 -12316 2703 7285 -11740 -2654 12259 -2821 -6220 6927 -3110 -9562 7456 5698 -7876
1114 -7876 1579 5092 -8044 -4481 8937 3845 -6105 351 5320 -5751 -5916 9092 5883 -7732
1128 -7732 -1002 6498 -5433 -4850 11120 2946 -8931 3468 2502 -9555 3554 9148 -6806 -3046
1142 -3046 7109 -5921 -7491 9905 3947 -9717 1892 5785 -8271 -3502 9201 1344 -6701
1155 -6701 378 4261 -3614 -2923 7021 2904 -6286 349 3962 -3867 -183 7123 -1558 -4852 4819
1170 4819 2 -6380 6322 5502 -9465 -424 7650 -5911 -5353 9373 1188 -9512 1589 5737
1184 5737 -5300 -2220 6792 -698 -5913 1198 2567 -1850 90 3584 -188 -3490 1752 1452 -2969
1199 -2969 2369 4149 -4480 -2510 5258 -852 -4745 6084 4209 -8610 -1236 8087 -3858 -5189
1213 -5189 6745 1623 -7587 10 5039 -2645 -2574 4152 -66 -4463 1175 2196 -2140 367 2396
1228 2396 -1920 -2052 3536 1103 -4127 2643 4705 -5485 -2091 7745 -674 -6420 4784 4412 -7008
1243 -7008 -1268 8171 -1937 -5903 4805 1261 -6327 976 3939 -2911 -1558 2899 -1702 -2970
1257 -2970 3293 962 -4349 1884 3384 -5334 -1478 6477 -645 -5756 3976 4767 -6706 -1624 7997
1272 7997 -1363 -6177 5046 3252 -6054 79 5891 -2420 -3022 4237 6 -4614 2866 1566 -5102
1287 -5102 818 3733 -4620 -2448 5552 -617 -6214 3342 4884 -6460 -2323 7363 -1358 -6396 4675
1302 4675 4465 -5650 -779 6604 -1790 -5087 4638 2253 -4799 1655 3888 -3566 -895 4350 -1852
1317 -1852 -3257 4376 834 -5963 1642 4662 -5482 -2825 6518 -814 -6769 2959 5159 -5609
1331 -5609 -2360 6892 -1358 -6175 4070 3397 -5109 105 4882 -2346 -2132 4398 4 -3959 3529
1346 3529 2055 -5069 1581 4982 -4489 -2926 6155 -4 -6303 3270 4768 -6064 -2586 6536 -1719
1361 -1719 -5945 3905 3319 -5186 -1066 4788 -1784 -3602 4290 734 -4610 2507 2389 -4401 1027
1376 1027 5119 -3523 -3063 6044 313 -6370 4062 5271 -6459 -1742 6987 -1868 -5636 4341 3496
1391 3496 -5063 -1068 4683 -2152 -4009 3344 1017 -4216 1207 2562 -2980 -518 3375 -1559 -2887
1406 -2887 4138 944 -5527 2350 4612 -4996 -2001 6624 -257 -5819 3602 3977 -4758 -1222 5342
1421 5342 -1123 -3854 3014 1623 -3121 14 2618 -1063 -1409 1739 -316 -2745 1045 1356 -3002
1436 -3002 -184 3454 -2271 -3253 4053 2201 -5498 1026 5514 -4532 -4106 6160 733 -5612 2895
1451 2895 4470 -4121 -1366 5081 -590 -3123 3036 757 -3574 1439 2318 -2724 129 3214 -1615
1466 -1615 -3451 3306 1867 -5445 209 5193 -4071 -4344 6039 1391 -6155 2075 5259 -5286 -2605
1481 -2605 6651 -831 -4532 4271 1604 -4686 2076 3642 -2925 184 4007 -2580 -3072 4354 872
1496 872 -4237 2523 3195 -4837 -2052 4323 573 -3778 1416 3373 -3889 -2917 4256 867 -3655 1492
1512 1492 2121 -3722 -1049 3787 -466 -1554 2614 -288 -3548 2441 2475 -2834 1372 3675 -3004 -2379
1528 -2379 3718 1590 -3820 1073 3504 -3140 -3273 3715 1851 -3662 168 3348 -2876 -3799 3918
1543 3918 983 -4047 1697 1883 -4138 67 3911 -1973 -1266 3878 -1677 -4370 4309 2836 -4876
1558 -4876 1217 4908 -4332 -2654 5523 1191 -3880 1453 2904 -3635 -1575 3750 511 -2321 879
1573 879 488 -1953 84 1928 -624 -846 1097 -1696 -2641 2353 1545 -2811 772 2789 -2735 -1929
1589 -1929 3490 1137 -2838 665 2607 -2093 -2119 2741 1583 -1304 34 1453 -210 -1733 1229
1604 1229 1844 -1519 -621 1084 -1256 -936 1869 39 -2105 1466 626 -3974 529 4139 -3330 -2571
1620 -2571 5014 -451 -5320 3466 4198 -4802 -1507 5451 -1419 -4550 4189 2440 -4559 1209 4175
1635 4175 -2892 -1487 4503 -802 -3743 3501 1380 -5218 1648 4577 -4631 -2573 6280 -1097 -6151
1650 -6151 4173 3663 -6481 -1061 6347 -3012 -4478 5052 1031 -5215 2133 3307 -3477 -436 3691
1665 3691 -1922 -1678 3953 197 -3593 2543 2414 -3651 137 4340 -1548 -3539 2868 1852 -4556
1680 -4556 137 4306 -2108 -3362 2892 915 -3448 372 2682 -1598 -1750 1419 -395 -1926 1762
1695 1762 1048 -2048 710 1112 -1867 -413 3179 -175 -2793 1444 2371 -2866 -754 4332 -286 -3387
1711 -3387 1993 2650 -3538 -1208 4082 -951 -4088 2128 986 -3233 749 2822 -2206 -1312 2403
1726 2403 -1046 -3055 3302 1432 -4347 1332 3691 -3398 -1469 5146 -210 -4962 2542 3501 -4201
1741 -4201 -1131 5546 -1065 -4175 2974 2065 -3555 448 3419 -2192 -2088 2626 -712 -3149 2454
1756 2454 1628 -3768 585 2918 -3168 -1710 4131 -192 -4558 1747 3170 -4015 -1203 5009 -468
1771 -468 -3752 2388 2338 -3052 -219 3430 -1040 -2448 2423 695 -2212 1316 2160 -2293 -602 2192
1787 2192 -1487 -1884 2589 612 -4066 921 3210 -3204 -1461 4202 219 -3768 1558 2673 -3329
1802 -3329 -1574 3842 -382 -3091 1896 1593 -2318 546 2416 -1322 -809 2208 -488 -1871 2391
1817 2391 1284 -2717 1139 3127 -2735 -1982 3544 109 -4025 1025 2924 -3145 -2052 4031 -227
1832 -227 -3779 2051 1712 -2924 -703 2636 -1448 -2047 2149 222 -2310 1788 1633 -2628 550 3078
1848 3078 -1914 -2145 3475 902 -3803 965 3869 -3383 -1933 4392 177 -3979 1221 2534 -2841
1863 -2841 -1663 3365 -511 -2715 1723 971 -2885 683 2240 -2117 -598 2488 -1072 -2697 2742
1878 2742 1541 -3595 772 3582 -2590 -2430 3822 980 -3798 925 3359 -2606 -2083 3647 107
1893 107 -2971 1602 1840 -2263 -209 2351 -1372 -2026 1836 -89 -2641 1668 1684 -3306 252 3537
1909 3537 -1931 -2626 3198 1040 -3979 915 3662 -2494 -2091 3769 237 -3316 1545 2126 -2135 -911
1925 -911 2718 -459 -2012 2186 264 -2008 1491 1700 -2408 -153 2409 -1720 -2527 2750 883 -3748
1941 -3748 641 3123 -2445 -2475 3383 418 -2982 641 2363 -2033 -1445 2506 195 -1595 1320 1046
1957 1046 -1639 248 1251 -616 -244 1723 -304 -1921 1378 1122 -2220 -215 2665 -1101 -3087
1972 -3087 1753 1742 -3132 -657 3575 -1524 -3354 2415 1699 -2996 487 2705 -1842 -2072 2237 438
1988 438 -2447 2200 1599 -3142 524 3036 -2473 -1281 4020 -454 -4379 2230 3203 -4083 -539 5116
2004 5116 -2003 -4353 3792 1810 -4750 934 4028 -3714 -2647 3709 -232 -3448 3366 1434 -4531
2019 -4531 1316 3067 -3505 -384 4588 -1557 -4033 3607 2213 -4380 1532 4382 -2972 -2946 3724
2034 3724 749 -3278 2050 2881 -3201 -1495 2792 -743 -1792 2424 324 -2952 467 1107 -2194
2049 -2194 -60 2662 -1243 -2631 2154 914 -2577 1318 2907 -2021 -2215 1838 1207 -1791 479
2064 479 2908 -1019 -1951 1389 788 -1232 527 1950 -1076 -1794 1341 577 -1236 1480 1084 -2763
2080 -2763 -249 2088 -1960 -1074 3542 -151 -4269 1441 2746 -3527 -369 4736 -1729 -3752 2492
2095 2492 1518 -3095 1009 3735 -1999 -1986 2928 -229 -2059 2995 1550 -3408 93 2443 -2421 -1291
2111 -1291 4479 -524 -4204 2355 2207 -4051 520 4776 -2291 -3561 2765 755 -3562 1727 2965
2126 2965 -2693 -1643 2231 -993 -1100 2526 541 -2018 230 351 -1389 463 2742 -444 -1881
2141 -1881 899 728 -1702 542 2504 -758 -2298 531 1213 -1706 103 2794 -891 -2783 392
2156 392 681 -1130 466 1682 -772 -1655 353 -129 -914 1553 1171 -2203 -447 1092 -857 -537 2826
2173 2826 660 -3073 469 2618 -2079 -545 3678 -544 -3693 1340 2206 -2522 0 3365 -1188
2188 -1188 -3063 2373 439 -2485 2094 984 -3360 -445 2350 -1637 -1243 3619 -284 -4043 1540
2203 1540 2238 -3056 -188 3688 -1409 -3303 1974 1946 -2226 860 3254 -1543 -2354 1745 421 -1664
2219 -1664 1137 1229 -1992 -567 1538 -1101 -753 2242 -102 -3026 765 1579 -1762 -40 2573 -835
2235 -835 -2612 1044 1594 -1472 -211 2262 -472 -2116 1073 1588 -964 -324 1500 -693 -1255 1363
2251 1363 533 -1002 985 601 -2356 -372 1648 -761 -1307 1629 211 -3230 750 2749 -1941 -1607
2267 -1607 2564 -565 -2655 1130 2285 -1704 -727 1996 -652 -2027 1652 959 -1595 559 1176 -1650
2283 -1650 -419 2357 -260 -1650 2065 650 -2614 1041 2772 -2126 -1661 2701 -264 -2901 1106
2298 1106 2731 -2250 -999 2236 -995 -2018 1724 1034 -1743 62 1292 -1007 -972 1855 118 -1633
2314 -1633 1250 936 -2402 621 2801 -1193 -1265 2364 637 -2565 734 2589 -1908 -1264 2589 -386
2330 -386 -2463 1251 1550 -1779 -734 1626 -826 -1348 1542 208 -1822 687 796 -1818 -232 1991
2346 1991 -813 -1869 1867 1244 -2864 430 2930 -1593 -1839 2389 612 -2216 658 2469 -1710
2361 -1710 -1059 2155 -431 -1918 1424 698 -1731 83 1276 -1615 -658 1816 -188 -1869 1187 929
2377 929 -2725 -22 2246 -1640 -2124 2385 848 -2739 245 2919 -1641 -1423 2750 -140 -2441 1293
2393 1293 1680 -1588 167 2105 -1050 -965 2100 -588 -2023 1671 614 -2499 606 1863 -1529 -1524
2409 -1524 1964 762 -2901 446 2311 -1977 -1662 1852 224 -1891 700 1729 -1301 -779 1763
2424 1763 -467 -1316 1719 351 -1502 1127 1125 -1699 -222 2063 -882 -1749 1576 432 -2346 343
2440 343 2095 -1435 -1387 1627 497 -2030 321 1873 -1059 -1538 1463 -176 -1749 624 867 -1463
2456 -1463 7 1444 -706 -904 1837 -8 -2092 1316 1270 -2337 500 2765 -1453 -1964 2068 475
2472 475 -2404 761 2163 -1614 -1325 1499 -429 -1381 1166 1041 -1322 -513 1179 -734 -654 1797 170
2489 170 -1620 889 710 -1566 131 2155 -461 -1684 1544 608 -2041 793 2281 -1508 -1090 1467
2505 1467 44 -1284 760 1351 -768 -646 158 -401 -472 438 277 -613 -441 202 -194 -187 828 605 -1195
2524 -1195 -174 1113 -1277 -625 2026 698 -1901 500 1695 -1895 -365 2794 -643 -2166 1531
2539 1531 606 -1901 626 1434 -977 -1124 1296 -559 -1287 1661 607 -1814 -103 1351 -1672 -834
2555 -834 2776 492 -2877 930 1899 -3008 -268 3629 -825 -2687 2053 605 -2609 1349 2553
2570 2553 -2016 -711 2067 -1495 -1341 2707 240 -2117 1260 915 -2221 335 2737 -696 -1835
2585 -1835 1367 371 -2478 487 2270 -935 -1379 728 -221 -1432 774 1750 -826 -1115 380 -434
2601 -434 -737 1408 711 -664 45 255 -1116 98 1498 -251 -946 425 321 -1056 1 1113 287
2618 287 -1231 -461 790 -1210 -1040 1860 701 -1662 -357 1009 -946 -605 1928 -328 -1989 1143
2634 1143 247 -1920 1307 1547 -1955 -51 1889 -1161 -1386 2589 623 -2314 716 1997 -2187 -992
2650 -992 2776 -281 -2193 1073 1038 -1959 -175 1851 -873 -1506 1098 -212 -1842 1267 1221 -1899
2666 -1899 -226 1455 -1481 -1411 2412 95 -2471 984 1925 -2572 -109 2795 -739 -1420 1390 1059
2682 1059 -1614 37 1373 -465 -645 884 -39 -700 503 476 -649 -283 488 -293 -892 779 393
2699 393 -1442 467 1384 -1170 -1103 1656 294 -2060 645 1597 -1937 -939 1961 89 -1690 1203
2715 1203 740 -1222 -3 1262 -595 -526 1101 -8 -1157 761 824 -1527 -24 1606 -865 -1470
2731 -1470 1593 780 -2494 438 2201 -1846 -1521 2506 307 -2030 1308 1388 -2197 -316 2037 -1219
2747 -1219 -864 1694 -83 -1580 1189 933 -1483 293 1715 -1109 -1021 1869 896 -1767 640 1760
2763 1760 -1468 -1472 1897 522 -1635 505 1270 -1772 -772 1988 -260 -1511 1152 239 -1327 433
2779 433 1012 -960 -221 1462 -908 -1289 1576 648 -1461 595 1425 -1059 -1063 1719 580 -1505 410
2796 410 1412 -1320 -850 1613 242 -1346 698 831 -1311 -245 1260 -825 -994 1288 -180 -1593
2812 -1593 1001 838 -1573 -76 1607 -894 -1381 1661 589 -1899 474 1599 -1143 -694 1789 434
2828 434 -1716 470 1014 -956 -919 1142 -285 -1348 883 215 -1186 224 1300 -894 -713 1223
2844 1223 -873 -1283 1380 907 -1851 -78 1520 -1169 -1068 1506 706 -1716 308 1238 -696 -515
2860 -515 1494 179 -792 662 1106 -676 -188 998 -318 -940 954 158 -1062 684 983 -1836 -325
2877 -325 1522 -727 -1365 1200 986 -2202 -206 1777 -1298 -1259 1146 239 -1466 324 1087 -1107 -606
2894 -606 1017 -62 -902 1135 652 -1057 353 1130 -1042 -721 1568 107 -1826 1027 1391 -1936
2910 -1936 -518 2176 -771 -1855 1605 821 -1931 61 1819 -1208 -1090 1509 -240 -1180 964 876
2926 876 -1171 226 1135 -862 -911 1798 86 -1743 942 1365 -1556 -690 2231 -594 -1877 1514
2942 1514 867 -2258 59 2228 -1160 -1248 1567 -20 -1690 910 443 -1638 -345 1308 -997 -741
2958 -741 1518 -522 -1370 907 857 -1432 -204 1665 -184 -1265 1109 920 -1330 -210 1942 -459
2974 -459 -1472 783 459 -1433 -30 1220 -975 -746 1052 -367 -1148 1035 220 -1140 261 730
2990 730 -1070 -746 1112 149 -1054 987 715 -1294 -689 1487 -190 -1468 796 1374 -1227 -883 2219
3007 2219 -314 -1451 1581 850 -1805 316 1376 -1124 -859 1675 -1101 -1324 1710 542 -2320 1161
3023 1161 1533 -2150 -670 2040 -334 -1977 1227 1184 -1733 4 2241 -428 -1234 1504 186 -1583
3039 -1583 526 1353 -903 -519 1327 -364 -1374 1656 697 -1652 785 1295 -1939 -1048 2240 -438
3055 -438 -1862 1511 1035 -2145 -99 1864 -609 -738 746 7 -1096 21 881 -309 -405 788 -281
3072 -281 -840 750 816 -650 -243 1135 -654 -1194 1598 625 -1552 505 1330 -1365 -780 1820 -68
3089 -68 -1541 1097 982 -1857 -314 1969 -208 -762 1093 -172 -1324 267 1056 -711 -442 1217
3105 1217 -556 -1516 1553 817 -1387 352 1465 -1677 -1209 2136 500 -1855 992 1399 -2144 -171
3121 -171 2362 -439 -1374 1237 -416 -1803 570 1097 -1061 -31 1164 -1321 -922 1403 193 -1079
3137 -1079 401 926 -1184 -675 1424 168 -1282 914 1100 -1357 -470 1546 164 -797 986 418
3153 418 -1278 -58 1267 -432 -390 867 -558 -1063 766 69 -922 350 583 -849 -737 916 188
3170 188 -915 252 1161 -723 -896 929 617 -1115 -101 1218 -718 -860 1305 487 -1067 478
3186 478 527 -1184 -93 1238 -582 -993 1300 -465 -1361 1125 840 -1283 -68 1032 -1044 -1616 1327
3203 1327 905 -1727 469 1200 -1124 -805 1596 188 -1057 417 819 -1491 -421 1684 -448 -771
3219 -771 1328 -184 -1424 1101 881 -1328 155 1707 -842 -899 1681 425 -1578 540 1223 -1568
3235 -1568 -750 1379 -24 -1132 597 651 -1179 -291 1095 -170 -789 631 180 -797 151 528 -652
3252 -652 -258 1058 -233 -1011 1260 692 -1029 278 1354 -760 -956 1268 412 -1603 722 1308 -1010
3269 -1010 -723 1343 92 -1001 451 392 -807 115 976 -209 -880 750 129 -1203 647 927 -1128
3286 -1128 -135 1495 -381 -1296 1137 927 -1418 102 1504 -910 -849 1414 31 -1462 432 1020
3302 1020 -1087 -355 996 -466 -774 917 9 -920 722 591 -760 -253 883 -321 -1329 1009
3318 1009 793 -1483 -69 1372 -643 -849 1562 336 -1634 208 1316 -698 -634 1320 -378 -604
3334 -604 962 423 -963 312 912 -889 -377 1268 -493 -1135 947 657 -1163 -40 1307 -576
3350 -576 -971 875 452 -1155 -56 1313 -782 -924 1383 222 -1192 555 714 -1015 107 951
3366 951 -687 -587 1220 -61 -1058 632 822 -1084 -180 1261 -213 -1210 844 508 -1164 213 832
3383 832 -472 -995 837 507 -1022 94 1010 -542 -327 941 -256 -801 1048 284 -1160 250 1060
3400 1060 -670 -269 1465 -393 -1207 820 817 -1289 -447 1189 -488 -951 769 576 -995 -109 942
3417 942 -798 -590 749 -111 -1004 620 689 -766 -58 954 -395 -874 1167 41 -1279 849 1318
3434 1318 -1135 -524 1497 -409 -1307 1264 835 -1142 -169 1151 -442 -666 833 245 -868 159
3450 159 702 -632 -570 811 -251 -954 1023 52 -1105 124 999 -706 -828 1039 90 -1420 644
3467 644 1142 -1438 -404 1244 -155 -1018 1127 691 -827 238 949 -813 -451 992 -122 -721 903
3484 903 486 -776 277 928 -818 -896 914 247 -1168 779 994 -1430 -396 1384 -249 -1135 1126
3501 1126 718 -1375 -164 1101 -879 -446 808 -420 -839 744 359 -441 437 858 -726 -526 688
3518 688 -167 -661 776 494 -817 -499 850 -48 -802 594 669 -1061 -643 872 -157 -723 575 323
3536 323 -542 251 591 -71 -232 524 -147 -706 604 179 -253 236 574 -458 -597 641 491 -650 106
3555 106 799 -604 -982 902 425 -939 -14 1157 -835 -807 1049 148 -962 880 535 -1195 169
3572 169 1027 -720 -197 1194 -694 -1348 1183 580 -1267 254 1106 -772 -921 1224 394 -1019 647
3589 647 899 -1552 -423 1118 -135 -824 691 276 -1223 337 1031 -598 -169 1349 -517 -1192 840
3606 840 269 -1242 741 951 -1044 -741 1106 182 -542 607 544 -1106 -416 725 -154 -51 573 329
3624 329 -464 -377 504 -334 -262 563 -178 -653 128 704 -521 -354 728 -121 -946 720 533 -747 367
3643 367 1038 -681 -897 828 466 -799 389 855 -499 -632 891 464 -320 673 491 -597 -64 871
3661 871 -117 -238 1003 -107 -1491 786 1204 -1126 139 1508 -901 -997 1108 663 -1361 412 1307
3678 1307 -1085 -826 974 1 -548 987 365 -859 -247 738 -587 -325 1183 -372 -1039 797 595
3695 595 -752 155 1025 -280 -1083 828 335 -1294 303 1110 -963 -648 893 26 -667 296 521 -769
3713 -769 -138 672 -384 -289 770 232 -768 288 182 -543 305 706 -67 -951 625 574 -981 -178 924
3732 924 -438 -801 631 680 -637 237 715 -548 -669 1235 41 -946 680 256 -870 9 644 -495
3750 -495 -466 639 62 -1323 860 474 -899 -119 993 -217 -1163 696 498 -1191 350 918 -358
3767 -358 -372 894 172 -864 361 721 -635 -245 653 -515 -646 886 -295 -1234 590 715 -860
3784 -860 -265 1204 -440 -697 748 655 -1097 245 969 -473 -558 1030 119 -911 232 610 -645
3801 -645 -327 739 -110 -542 679 558 -668 131 642 -844 -464 974 -12 -870 500 926 -1307 -341
3819 -341 924 -477 -833 914 474 -1095 -172 853 -303 -600 772 132 -651 450 417 -805 -380
3836 -380 1018 -255 -569 664 101 -964 387 810 -851 -425 792 -127 -976 533 500 -1054 -133
3853 -133 1000 -203 -710 629 265 -842 330 535 -718 -167 793 -400 -721 650 120 -606 544
3870 544 423 -773 -355 1028 -141 -1049 408 774 -917 -253 686 -512 -541 582 721 -677 -152 716
3888 716 -519 -646 729 160 -843 384 456 -709 -40 834 -683 -542 886 102 -927 447 822
3905 822 -713 -397 805 102 -926 437 850 -574 -352 918 -29 -760 700 277 -718 -33 598 -778
3923 -778 -294 521 -304 -759 801 304 -980 -57 749 -433 -609 890 109 -869 307 679 -467 -80
3941 -80 874 71 -504 623 796 -732 37 847 -392 -676 797 -285 -905 608 390 -540 -109 1167
3959 1167 -691 -598 822 275 -962 373 636 -1028 -469 924 -299 -645 338 610 -729 -102 764
3976 764 -515 -259 626 6 -619 373 637 -739 -300 982 -746 -871 903 178 -998 248 647 -847
3994 -847 -605 591 -102 -777 272 613 -414 -487 395 -169 -589 438 402 -336 -80 802 -425 -338 806
4013 806 139 -829 616 632 -666 -134 951 -351 -948 767 399 -1266 191 908 -1055 -524 836
4030 836 66 -952 553 635 -765 -153 650 -606 -672 806 -122 -941 200 622 -575 -564 873 -453
4048 -453 -784 712 397 -1117 412 1126 -836 -107 1198 155 -703 766 441 -755 -335 344 -561
4065 -561 -257 903 -265 -985 187 431 -544 -107 529 -54 -789 519 138 -615 463 541 -176 -577 479
4084 479 106 -493 594 519 -821 -240 558 -189 125 594 39 -612 -90 602 -43 -443 518 93 -383 237
4104 237 435 -385 -264 631 -174 -669 211 552 -941 -88 844 -251 -1057 468 464 -926 242 987 -835
4123 -835 -539 751 -101 -523 840 440 -837 14 706 -481 -101 1057 -109 -986 565 561 -775 85
4141 85 949 -528 -914 794 580 -1087 403 997 -911 -501 525 -208 -666 752 283 -561 204 561
4159 561 -877 -202 990 -85 -678 687 181 -815 240 538 -617 -616 423 14 -599 153 385 -418
4177 -418 -249 294 -175 -377 306 396 -335 -218 468 302 -116 249 123 -545 104 236 -307 -212 898 290
4197 290 -805 259 359 -590 -104 782 -92 -661 384 374 -782 -43 780 -466 -590 396 -113 -503 186
4216 186 188 -656 -190 571 -335 -511 991 72 -1050 114 587 -751 -563 1068 -258 -834 768 450
4234 450 -628 69 1019 -455 -358 812 -146 -671 461 410 -655 -100 451 -182 -536 743 121 -502 313
4253 313 334 -803 -242 696 -216 -585 477 410 -745 -307 547 28 -402 364 -103 -596 209 297 -587 -56
4273 -56 433 -148 -414 539 101 -650 240 494 -216 -299 420 -11 -768 136 453 -579 -281 520 -48 -747
4293 -747 299 341 -709 -61 744 -525 -31 421 191 -629 555 232 -533 -8 669 -346 -552 782
4311 782 160 -897 219 300 -292 -191 609 -140 -619 486 573 -411 -136 548 -80 -715 389 126 -692
4330 -692 115 567 -405 -258 538 -109 -478 406 386 -978 371 591 -434 -201 862 -160 -765 130 388
4349 388 -641 -70 699 -307 -350 473 152 -376 -209 311 -274 -383 608 -24 -743 442 170 -697 214
4368 214 581 -103 -343 530 67 -909 342 548 -449 -233 465 -13 -554 262 442 -574 104 531 -247
4387 -247 -570 621 -79 -378 -134 441 -477 -247 426 -203 -431 279 181 -949 252 766 -314 -277 768
4406 768 217 -631 281 457 -866 169 434 -173 -256 448 261 -654 155 390 -265 -135 578 -12 -912 103
4426 103 333 -710 -27 546 -284 -403 589 182 -779 221 671 -866 -229 507 17 -804 488 135 -679
4445 -679 -39 399 -444 -191 548 157 -163 251 168 -316 -229 722 19 -377 444 221 -581 65 572 -345 -361
4466 -361 552 112 -758 212 426 -439 -368 242 -302 -295 437 283 -429 87 460 -89 -232 658 -365 -795 409
4487 409 308 -534 -44 515 92 -344 24 236 -712 98 716 -411 -227 841 107 -682 548 387 -448
4506 -448 -343 425 -534 -231 679 -17 -606 210 346 -463 18 697 -445 -353 526 367 -1031 254 686
4525 686 -139 -298 533 -215 -662 290 415 -636 33 439 -426 -341 259 -97 -342 138 304 -447 -74 508
4545 508 -237 -356 499 121 -414 205 452 120 -482 83 181 -596 -36 479 -256 -255 217 52 -418 108 437
4566 437 -186 -314 353 -105 -571 531 137 -404 101 346 -487 -174 668 -113 -545 289 516 -688 71
4585 71 914 -304 -422 363 88 -630 224 529 -435 -252 508 -135 -453 698 270 -716 328 579 -663
4604 -663 -437 712 -76 -431 309 25 -1120 88 553 -377 -315 474 -195 -824 172 479 -738 -281 528
4623 528 -287 -296 386 376 -264 84 191 -543 -241 745 70 -459 499 238 -529 -63 578 -175 -293 336 179
4644 179 -317 -135 477 -297 -292 108 129 -296 53 459 -396 -396 379 -180 -186 246 152 -367 212 397 -307 -245 459
4667 459 4 -687 384 239 -835 -166 757 249 -373 378 313 -642 166 642 -360 -504 460 -199 -545
4686 -545 468 311 -527 279 268 -861 -465 736 -49 -501 143 59 -719 -163 782 -148 -510 537 112
4705 112 -417 124 872 -506 -361 582 -77 -146 141 394 -527 7 57 -224 -386 227 56 -742 495 35
4725 35 -262 -198 689 -335 -392 343 241 -237 245 644 -340 -254 383 -124 -408 11 401 -322 -159 169 -472
4746 -472 -289 401 350 -319 389 351 -494 -337 626 289 -474 244 519 -509 -102 455 -63 -315 263 383
4766 383 -378 17 490 -105 -430 441 -6 -337 383 330 -387 -47 489 -434 -414 415 224 -364 442 440 -558
4787 -558 -196 604 -14 -384 326 461 -836 124 92 -336 -51 320 -26 -573 245 360 -486 28 386 -299
4807 -299 -486 448 -161 -343 147 439 -67 -307 499 166 -436 47 226 -351 16 519 99 -231 297 162
4827 162 -532 -141 359 -137 -169 241 -39 -342 258 198 -148 -65 365 -255 -226 436 208 -402 22 391 -285
4848 -285 24 358 -95 -428 328 353 -526 -348 150 -99 -289 209 -359 -472 76 164 -286 -135 337 -324 -429
4869 -429 611 259 -704 -1 114 -273 -389 359 -88 -447 358 396 -398 139 290 96 -124 279 123 -357
4889 -357 181 142 -188 -336 511 -265 -438 285 -3 -413 -87 442 -157 -308 281 42 -492 96 450 -325
4909 -325 52 525 -181 -173 195 284 -146 115 308 -201 -372 606 2 -418 139 444 -276 22 388 -94 -269
4930 -269 308 120 -180 7 287 -349 -94 378 23 -440 242 326 -594 -271 53 -505 -404 282 -235 -430
4950 -430 91 416 -393 -46 396 -218 -343 161 379 -328 30 486 44 -238 529 -184 -381 188 431 -245
4970 -245 -273 513 -113 -229 -57 163 -401 107 176 -186 -359 583 309 -191 148 99 -376 -196 417 -166 -573
4991 -573 290 -184 -312 85 499 -238 -59 655 152 -241 138 332 -77 42 132 -328 -132 214 198 -168 71
5012 71 29 -263 189 428 16 -248 1 291 -410 -9 398 31 -138 435 -127 -542 -123 411 -338 53 90
5033 90 -60 -189 276 228 -198 -273 290 -251 -513 475 10 -320 13 234 -794 81 515 -88 -465 382 195
5054 195 -407 -64 731 -92 -466 464 -183 -362 187 365 -375 -230 250 -337 -230 557 -101 -325 419 194
5074 194 -496 105 537 -223 -281 212 315 -435 391 477 -298 -173 269 -24 -520 226 340 -310 -267 236 -256
5095 -256 -1 633 80 -129 88 230 -404 153 342 86 -318 279 49 -422 -97 65 38 -166 -200 -84 -356
5116 -356 -41 348 -119 -297 155 128 -231 -178 317 -154 -74 122 50 -400 377 52 -314 349 342 -625 28 455
5138 455 -193 -395 464 408 -475 -123 139 -239 -227 381 -78 -416 199 616 -370 -148 281 -48 -198 377 -38
5159 -38 -385 440 439 -282 -88 252 -180 -347 417 271 -412 17 317 -312 -236 472 131 -335 184 88 -398 55
5181 55 237 -3 -250 317 117 -331 191 196 -235 -77 432 -282 -106 216 180 -164 -100 166 58 -261 468 261
5203 261 -590 155 258 -118 -109 292 217 -113 158 48 -117 -79 301 -133 -242 357 20 -32 265 114 -398 -319
5225 -319 187 -55 -384 296 295 -239 82 397 5 -235 168 96 -303 243 330 -411 66 184 123 -323 511 153
5247 153 -367 128 188 16 -237 466 -167 -422 387 258 -415 82 494 -141 -354 97 294 -558 -38 448
5267 448 -368 -3 316 -48 -686 48 267 -20 169 206 -268 -18 207 -191 66 175 396 -448 -335 156
5287 156 129 -484 352 199 -186 80 76 -63 -390 156 99 -352 -86 194 -198 49 395 -185 72 316 68
5308 68 -443 -111 90 -305 -233 404 -4 -124 209 333 -310 -253 255 114 -228 34 168 -363 53 16 -265
5329 -265 -225 224 -110 -177 177 -98 -106 -207 149 -100 -112 326 161 -536 208 111 -485 -26 97 -109 -407 49
5351 49 177 -473 192 289 89 -429 338 109 -214 -5 -76 -497 117 235 -471 -27 536 88 -232 -21 76
5372 76 -170 87 374 72 -325 -109 200 -511 -156 259 -50 -70 297 28 -342 110 -78 -64 -193 268 -64
5393 -64 -219 400 53 -336 -45 114 -256 -257 364 252 -499 218 144 -207 -161 509 -147 -172 301 321 -308 74
5415 74 154 -318 -240 263 198 -439 265 271 -384 -40 419 -203 -455 133 -92 -245 285 237 -265 -300 675 159 -313
5438 -313 -169 196 40 147 195 -1 -223 194 180 -296 95 53 -179 142 387 11 -369 390 172 -238 243
5459 243 299 -439 12 196 101 -392 -220 449 -105 -184 160 -102 -276 201 110 -129 -27 132 -391 49 119 -215
5481 -215 -60 -45 31 -130 4 257 -143 -227 90 41 -328 -40 201 -328 -330 243 372 -354 -8 73 -158 -132 301
5504 301 -146 -342 181 323 -494 -167 198 -372 -205 245 -141 -226 127 258 -122 29 373 -352 -398 469 30
5525 30 -492 -205 149 -507 -146 77 -28 -163 345 255 -18 8 2 -242 -241 371 7 -255 247 186 61 57 304
5548 304 -83 -554 374 -119 -122 153 107 -473 -249 358 129 -39 41 167 -102 48 60 -143 -41 -2 79 -152
5570 -152 -16 189 -272 90 71 438 -265 142 223 -583 4 167 -261 -328 228 122 -207 -303 176 -126 -351
5591 -351 126 -110 -361 34 95 -144 -178 245 -512 -196 311 -56 -358 232 -7 -369 -85 485 2 -273 228
5612 228 157 -297 63 176 47 -248 344 -38 -520 202 298 -280 157 117 -229 -185 248 -39 -221 160 -142
5633 -142 -212 -355 249 -131 -39 250 -30 -655 206 -28 -7 -358 165 -77 -318 33 189 -112 -77 201 -140
5654 -140 -33 115 301 -213 76 -85 22 15 356 93 -163 390 103 -85 -99 162 66 -237 154 215 -359 -64
5676 -64 317 -85 -219 575 60 -251 22 411 12 -10 229 97 -85 121 163 -121 -17 134 -152 -37 599
5697 599 199 -516 180 -45 -278 9 429 -15 -196 370 214 -82 60 231 -333 46 132 -100 -96 252 55
5718 55 -125 285 367 -231 -216 313 -84 -485 214 38 -221 37 277 -96 -75 -25 198 -360 141 29 107 166
5740 166 125 164 -90 -175 182 -175 273 93 -159 -19 178 122 -284 217 126 -403 -149 314 102 -247 91 217
5762 217 -50 224 383 246 -27 335 17 -136 -113 303 -219 12 238 229 -41 343 -50 -445 36 427 -58
5783 -58 -62 344 233 -431 144 238 -252 -132 480 10 -146 208 -118 -162 -162 -292 -399 87 -40 -78 -189 396 117
5806 117 -253 -95 280 -54 -198 281 95 -298 48 170 -81 -417 135 -53 -284 13 63 -351 -92 101
5826 101 -187 -121 285 32 -76 211 42 -154 32 50 62 -173 110 -54 -105 -128 185 59 -303 -35 -199 -194
5848 -194 19 248 -246 80 -107 22 -190 115 215 -206 -103 180 -41 146 205 -195 -216 137 -28 -18 274
5869 274 562 -405 -46 -71 4 -341 42 188 -138 -100 407 127 -271 -122 29 -63 -280 -5 -62 -23 79 212
5891 212 -48 -33 223 -293 32 385 120 -468 392 228 -287 147 484 51 70 245 -312 -125 135 103 -192
5912 -192 -21 353 18 -131 50 162 21 16 233 -319 136 -27 -45 -105 -122 20 -234 80 346 -57 -422 338
5934 338 81 -71 325 272 -365 -94 206 -83 23 129 165 -337 -161 -40 -182 30 283 -78 -301 26 92
5955 92 -322 13 93 -53 -335 44 -97 -163 326 163 177 -434 -328 73 -158 -166 156 -116 -277 260 79 -56
5977 -56 -107 153 -320 75 80 -70 -250 -3 -143 -219 -144 204 -184 86 242 -181 -63 -68 143 -253 149 141 -125
6000 -125 -73 218 -276 156 57 220 55 -55 57 -84 -373 5 -25 -22 264 47 -78 130 -109 170 -72 386
6022 386 -25 -272 137 -2 94 26 -62 -48 -203 -10 252 -108 -36 249 229 -118 -31 93 -70 176 -165 -36
6044 -36 -44 420 16 19 119 -49 -324 109 21 -47 -105 444 107 -342 149 227 -434 -210 322 84 -224 329 -138
6067 -138 -186 -103 94 -42 -113 240 160 -291 569 5 -230 -321 167 -189 -305 303 302 -317 -12 366 -78 -356
6089 -356 334 31 -374 -4 -104 -79 81 324 -228 -80 202 -58 -79 130 189 -218 -359 286 -127 56 41
6110 41 346 -553 -52 113 -75 18 -30 -39 -165 -247 147 19 69 629 -106 -29 294 -229 -156 249 -110 46 -206
6133 -206 307 -11 -92 42 45 9 28 228 12 -303 178 -27 -559 -179 219 -245 -268 -137 46 -211 13 136
6155 136 28 -252 -45 -193 -356 129 -9 -341 -48 404 -387 -127 242 -262 -127 352 2 -31 -321 330
6175 330 -261 -135 446 -20 -203 150 221 -361 93 178 -30 -295 116 -27 -362 -189 154 -251 -408 146 -147
6196 -147 -438 265 299 -336 84 435 218 -213 197 77 -210 -296 286 48 -25 -157 -19 -55 63 -100 -247
6217 -247 34 285 -92 71 18 161 62 -4 137 -143 194 -4 54 -98 64 131 -271 171 195 153 -40 121
6239 121 58 -163 -6 113 -378 -127 62 -148 -134 256 268 -281 206 73 -89 -303 64 158 -135 80 81 -8
6261 -8 92 121 -31 -3 177 -21 -179 -90 216 70 30 -50 120 -236 78 19 -257 133 104 -307 -79 197 13
6284 13 -164 106 295 -152 -329 359 -61 0 216 313 -46 -38 263 -169 196 316 -139 -327 233 -63 1 15
6306 15 314 -248 -86 125 -111 -8 -131 90 -354 -206 -140 129 -182 -37 182 -256 4 -101 71 -283 5
6327 5 -19 -305 -62 -33 -79 -193 -50 108 128 167 112 -46 -55 200 -389 -114 158 -93 -498 -11 57 -76 -135 -129 -61
6352 -61 -280 303 330 -109 -135 269 13 -92 -70 117 -87 13 20 -212 35 150 -170 -7 393 129 -22 209
6374 209 192 -73 -121 291 168 -419 274 101 -133 -20 126 -45 -288 78 1 -284 106 354 -92 -143 -24
6395 -24 -45 -9 70 0 -372 32 315 -47 70 173 -17 -79 -249 139 -73 -323 73 301 -172 -27 91 -303
6417 -303 110 96 235 179 216 178 139 228 16 142 50 105 -67 -308 106 -24 3 6 257 -313 -87 99 -219 -114
6441 -114 231 194 53 -170 279 -26 -46 75 -171 -171 -71 -45 -161 18 -54 142 -95 13 169 -202 66 197
6463 197 66 116 105 182 -526 -1 96 149 49 353 -57 48 185 -5 -256 -15 91 -427 -137 30 39 -271
6485 -271 158 251 -289 -132 285 -295 -235 371 -127 -168 122 -169 -132 190 265 154 -50 -49 55 -271 8 -98
6507 -98 -151 114 214 -18 -162 -60 141 42 -225 237 182 -352 -109 175 126 41 144 -38 -82 67 269 111
6529 111 -24 -53 -186 -40 196 -13 -45 85 -2 -87 196 214 -37 -236 294 -83 -294 -50 106 30 64 308
6551 308 -3 -244 -11 39 -201 158 101 -179 -26 113 17 -158 131 218 -72 278 168 -78 10 141 229 -139
6573 -139 -8 118 -171 33 226 -8 -42 177 103 -11 -32 60 56 -259 -59 285 83 158 2 -162 21 -31 -75
6596 -75 -61 20 -257 -174 -103 240 -142 -158 180 -47 -106 67 21 -159 271 -13 -46 -88 4 346 -26 -61 65 -357
6620 -357 -311 -84 -27 -111 -165 433 -100 47 152 -172 24 407 24 12 13 125 50 -117 108 -108 -333 110 -59
6643 -59 -183 43 83 37 -304 170 17 -97 -54 35 121 -45 208 -34 -131 -304 -87 -167 -189 148 114 -44 65
6666 65 -27 20 27 -20 -405 210 493 -251 -97 -25 -100 76 171 -56 -200 -188 5 16 59 183 -104 -1 -176 93
6690 93 262 -386 -21 182 -232 -72 349 225 -183 144 -123 -162 158 219 -157 52 107 93 -173 383 -72 -51
6712 -51 71 114 -100 -73 244 292 -423 61 145 -294 -44 28 28 -41 122 -177 78 231 -61 80 -192 239 -174
6735 -174 -206 -47 -273 -181 -235 303 -143 168 152 -19 77 87 295 -313 -181 30 -36 -49 44 -258 -288 -17 190
6758 190 72 34 -98 124 -281 -127 80 -83 -84 -37 -252 -63 190 -107 -56 -171 88 70 176 68 -188 -265
6780 -265 75 -56 -71 -72 113 -63 -138 185 430 -296 -4 301 -98 263 38 -3 122 166 -199 -270 86 129 -200
6803 -200 -52 17 -212 -330 129 -59 -105 -83 -20 -103 271 80 109 -191 -250 368 -288 -43 92 135 -300 -56 135
6826 135 247 101 -57 -143 -3 38 5 -68 -84 -147 -84 179 -81 52 -143 114 -91 -508 -123 11 117 -269
6848 -269 198 -274 -155 47 104 -202 -206 61 172 -111 144 -11 117 213 90 39 -305 81 55 -147 -504 268
6870 268 -554 -136 37 -158 6 91 137 -101 -5 -33 -159 -296 -183 10 -36 14 23 114 193 289 -139 -262 315 25
6894 25 208 -27 118 -188 291 155 32 -166 3 178 15 133 16 -90 146 160 -234 -237 -110 -42 300 38
6916 38 -47 -37 78 -55 -208 -494 -25 223 -42 -154 220 13 -79 113 5 -282 -49 285 -161 -140 237 200
6938 200 -318 60 202 43 -104 -165 -361 26 -62 38 -65 125 109 50 -135 -136 60 -8 123 -89 -94 -166 58
6961 58 -66 32 20 -82 40 -166 -158 25 -115 21 201 -18 -87 44 -296 72 -26 -54 52 30 -76 -18 76 323
6985 323 -238 -168 350 -31 -97 166 299 -27 -12 254 -169 -148 47 -104 136 48 -74 -139 64 308 -92 -53
7007 -53 46 190 67 164 23 125 -54 213 85 -148 105 143 165 44 372 105 72 61 -65 -88 55 63 -173
7030 -173 -244 130 -75 -139 91 90 -69 -227 341 -24 11 53 -249 78 200 41 136 -254 109 88 -120 -77 193
7053 193 193 5 136 -196 -255 125 -3 -178 -263 84 -29 -33 213 130 -274 283 89 91 286 132 -181 122 65
7076 65 -36 -201 54 -25 -219 -227 109 -94 -145 442 272 -268 -92 215 -363 6 93 256 121 188 -26 -209
7098 -209 192 163 -140 219 231 130 -178 93 81 38 386 273 45 -116 174 -163 -63 444 -193 -66 192
7119 192 264 -203 43 249 152 -113 -78 201 47 -185 343 230 172 -160 94 163 47 -69 110 -38 51 36
7141 36 135 -72 380 106 24 -9 -94 56 -126 63 -97 -251 276 68 52 -59 264 -76 -49 266 -306 101
7163 101 97 191 -136 -158 32 -66 -220 222 -68 -117 93 247 230 -47 -54 -7 -48 6 -363 -108 -176 122 -264 -58
7187 -58 -107 -67 -15 78 -154 -104 -11 -22 47 -57 58 111 -152 -80 300 -151 -221 -9 81 90 154 107 16 24 11 -63 27 60
7215 60 162 -23 85 -69 -100 278 6 -374 -224 -43 -37 -85 208 -142 -5 4 115 293 -63 -105 -187 -30 -147
7238 -147 116 -104 18 20 -136 -327 -24 45 89 -2 -36 -20 -413 190 127 -73 -31 90 -1 -226 33 -225 75
7261 75 185 437 125 120 44 0 -5 123 -163 -356 239 70 -112 161 117 65 -174 29 308 -153 -128 13 137
7284 137 -327 -227 277 -137 -49 19 -24 -28 -18 -141 -95 -74 165 76 -39 161 -63 40 75 -72 -250 134 -229
7307 -229 -135 -5 252 2 -350 -150 122 -7 4 217 38 -134 11 170 -253 51 62 77 -102 -23 145 -76
7329 -76 325 -125 -312 -39 162 -287 -269 226 104 -171 23 227 156 58 95 -157 -38 109 171 55 167 267
7351 267 -49 -241 207 -250 46 183 68 95 -63 -132 -114 -36 159 -18 114 274 235 -145 0 130 48 -21
7373 -21 44 186 -6 64 330 54 -175 270 13 -265 219 65 323 21 129 -175 -162 529 -151 -175 228 171
7395 171 59 82 190 -143 -93 -97 13 -48 -232 -26 73 74 4 118 -40 158 171 144 -117 96 139 -38 360 71
7419 71 38 -156 -65 -68 12 87 -353 32 -64 -28 43 -59 235 -16 -46 -153 310 18 132 -47 -72 -173 -39 -196
7443 -196 4 66 -258 275 -318 -220 -109 24 -10 64 -214 32 -176 -110 -2 39 -74 149 -98 -237 46 84
7465 84 156 136 146 -36 13 43 -126 20 -134 -97 79 62 -251 71 -140 16 82 122 -27 -159 185 -255 -91
7488 -91 85 -121 -156 -13 149 203 -12 83 160 117 -140 114 -102 208 -39 -222 -232 46 -87 -118 311 128 45
7511 45 28 109 277 71 10 -57 220 -84 246 -17 163 -34 -182 -32 83 87 119 35 153 35 -149 181 -164
7534 -164 -175 210 -100 219 -141 252 -22 -57 250 100 -125 215 36 -352 -279 11 -30 -239 -18 33 -237 0
7556 0 79 -371 231 4 -30 28 22 147 -159 220 282 81 9 54 261 -259 62 84 -93 86 32 -57 -329 130
7580 130 -158 191 -89 269 219 -102 7 116 -134 182 28 -10 -42 52 -70 -63 -63 -60 -17 -349 -123 71 2 -173
7604 -173 -177 85 314 6 -148 130 133 -125 -279 -76 -167 -32 30 252 6 -59 -6 -68 -219 41 185 -55 255
7627 255 192 -167 -246 34 20 68 -135 -167 152 -104 330 58 -255 -260 34 71 144 -97 109 64 -183 314 -120
7650 -120 -134 214 29 -170 8 -251 102 -133 32 -237 -205 193 -165 -40 114 84 -359 -1 200 141 -13
7671 -13 7 -122 -68 220 123 -117 -70 -212 -171 -82 37 38 -127 56 130 -154 45 -143 128 -246 -254 134 -194 -66
7695 -66 48 13 -138 38 -65 -301 -221 90 149 -286 40 -3 76 -123 183 -32 -340 156 53 -114 86 -77
7717 -77 -1 79 -153 21 -164 194 139 23 -66 -42 103 138 -6 80 -40 65 202 -70 195 -28 166 -89 26
7740 26 25 -250 -86 73 -155 40 -119 104 81 180 132 -42 -64 -70 -294 301 311 289 -47 -224 273 36 -159 238
7764 238 -86 -23 176 -37 -2 41 -164 -286 -78 113 238 -1 -108 -168 -457 109 -111 181 -20 251 199 1
7786 1 20 225 93 214 -69 -38 202 -125 73 -292 10 -123 -114 -17 143 139 74 55 -7 -81 -64 -65 7 24 -6 13 -382
7813 -382 -212 -170 -23 -136 -204 172 -235 -109 -7 -267 -96 325 143 228 -194 -76 209 16 121 359 -92
7834 -92 169 -43 -198 -90 115 -40 63 276 -88 -46 49 -58 -43 -234 27 -98 476 15 -147 -13 289
7855 289 57 -2 -22 -126 -213 -32 182 28 -40 12 -175 34 -205 99 41 266 -114 -1 -124 -61 -8 136 127
7878 127 -236 8 81 -230 11 -102 56 27 -229 -100 53 312 70 158 193 32 -9 -13 -199 -129 81 124 8
7901 8 130 28 -194 -57 48 67 -101 -92 -221 -304 -46 77 18 196 -53 161 -32 1 369 -134 -23 -30 329
7924 329 -305 80 162 -31 -79 153 -44 -89 30 -20 1 209 104 61 242 169 -75 -13 154 6 58 -130 77
7947 77 127 -183 148 192 79 171 -137 -59 135 -31 -3 -62 120 6 187 152 30 136 -90 194 197 49 12 -110
7971 -110 141 -337 150 -261 -161 -103 50 -331 -282 84 -55 -11 242 -152 209 0 317 91 69 235 -72
7992 -72 39 -89 74 -163 77 223 -140 160 114 23 -247 -104 69 -154 -205 112 206 143 245 -286 62 -51
8014 -51 -214 33 180 122 -44 -250 156 25 -214 78 170 -43 -122 -173 -12 157 49 -240 46 218 169 132
8036 132 105 104 3 -65 144 247 16 -192 -7 -183 -171 -1 155 -182 -187 52 -38 91 -97 -139 -4 -182 161
8059 161 2 50 5 98 333 67 36 -298 -3 13 -128 -124 173 136 131 148 21 79 73 -310 27 15 -40 57 120 91
8085 91 44 -150 119 -229 -201 26 -86 38 -92 -51 14 37 -366 227 234 -174 -94 230 -98 -65 119 239 -97
8108 -97 198 256 -185 101 -28 96 -25 -73 137 -225 -66 111 -357 -88 231 50 5 185 77 -421 1
8129 1 -85 34 -16 -138 -177 93 68 79 55 106 228 -197 -159 111 245 126 81 61 -88 -218 235 -15 -91 -130 56
8154 56 -187 325 132 -116 72 21 -100 -39 71 75 -102 -479 336 148 -190 -60 144 22 -6 73 -220 29
8176 29 -19 -33 -99 -127 -59 -42 -4 -1 -41 -375 233 62 -399 -12 113
8191A13
$$ Imaginary data points
##PAGE= N=2
##DATA TABLE= (X++(I..I)), XYDATA
0 0 0 0 0 0 0 0 0 0 0 -8 8 -8 9 -16 16 -24 25 -32 40 -48 64 -72 88 -104 120 -142 166 -190 217 -251 287 -327
32 -327 374 -423 479 -535 603 -676 756 -843 939 -1044 1159 -1282 1418 -1567 1728 -1907
48 -1907 2102 -2316 2549 -2809 3099 -3418 3773 -4177 4637 -5159 5772 -6487 7347 -8396
62 -8396 9712 -11422 13737 -17062 22271 -31630 53654 -217034 24614 318121 -209291 74720
74 74720 303341 -192491 -273330 206775 52364 -129779 134132 78353 -236080 -54323 134481
85 134481 14212 12466 115607 -28508 -158959 -38361 105561 33358 916 82742 -28657
96 -28657 -189025 -11931 130778 -3072 13501 110260 -81510 -148449 60833 47581 -36123
107 -36123 82485 2599 -146811 5151 59371 -38808 83622 95781 -119218 -76385 58895
118 58895 -32102 -9079 111224 -348 -89819 -5485 1082 10335 71228 16998 -16557 -5343
130 -5343 -75910 -27894 88646 10407 -29345 51939 -34740 -90829 63588 57915 -55304 35519
142 35519 31770 -118554 -17772 97608 -32138 -27968 82215 -27742 -96473 41731 67576
153 67576 -32810 -10541 46394 -23871 -73324 17161 70287 -11579 -32235 49953 7282 -77897
165 -77897 25780 75318 -53734 -25357 63365 -47719 -53901 82997 13091 -66157 47465
176 47465 24262 -88848 13824 73314 -51515 -28978 59713 -25530 -51848 41897 27067
187 27067 -26071 -9 11735 -7202 -10245 1899 17494 4831 -19573 348 16913 -9070
199 -9070 1188 26056 -10155 -15907 18562 -13053 -16506 34333 -1877 -35232 23919 15278 -40361
212 -40361 6474 40216 -25024 -29176 29134 3356 -33387 10022 24060 -15598 -15176 14851 8212
225 8212 -14218 1401 17101 -11076 -11668 20519 -1922 -16971 23473 8800 -31365 13720 32266
238 32266 -32469 -13192 47356 -15672 -45428 40534 22639 -50554 7260 41117 -31240 -24975
250 -24975 36483 1914 -33224 14045 15680 -27223 -1607 22363 -11731 -8850 19571 -3708
262 -3708 -20818 13740 16976 -21215 -3055 30955 -10988 -27009 27581 18503 -30968 794 33214
275 33214 -15109 -26847 26249 13361 -29802 4345 23547 -17645 -12620 18124 -2493 -16108
287 -16108 9441 5597 -17821 1776 15058 -15989 -8332 23630 -3961 -22674 16837 16815 -25895
300 -25895 -6777 32006 -5406 -27998 22920 19787 -28693 -1847 30128 -8962 -20186 18853
312 18853 9052 -22492 2852 17571 -14655 -5925 18525 -9224 -14685 16754 1178 -22882 8696
325 8696 18619 -22997 -12217 29242 -4278 -30244 20132 21739 -29036 -6620 30879 -7848 -25168
338 -25168 21288 15840 -24670 2247 23442 -13876 -9175 20844 -3124 -14623 14845 5499 -20395
351 -20395 6241 17962 -19224 -8784 26310 -5760 -26265 15851 15793 -25325 -7772 26076 -4991
364 -4991 -26628 14257 16662 -22504 -3296 23984 -7222 -16179 14703 5720 -16056 7948 14060
377 14060 -14779 -34 19028 -12577 -9375 23907 -1119 -21387 12802 13508 -21427 -6234 23478
390 23478 -3409 -21207 10294 13141 -15985 -8589 16941 2003 -20286 2174 15859 -13751
402 -13751 -8912 20797 -4013 -17603 15982 5564 -19896 13213 17351 -25611 -1731 29802
414 29802 -17574 -18070 36793 1823 -36480 17427 23368 -27880 -4729 30229 -8611 -25932 13054
427 13054 11692 -17585 751 18417 -9228 -16469 9892 5082 -14938 7458 17219 -21967 -11426
440 -11426 27350 -9920 -21863 35186 9454 -42855 12299 32417 -32481 -7539 45585 -14048
452 -14048 -34436 29499 9574 -28335 16983 18707 -23196 -3182 11372 -10791 449 13202
464 13202 -6120 -9052 2913 -1426 -3408 3168 5487 775 -12131 -7071 14911 -1752 -14840
477 -14840 19519 7747 -30885 5346 26233 -16388 -5453 24412 -10466 -19153 16499 5269
489 5269 -9673 13622 1547 -16271 6756 5126 -9040 8825 7269 -11762 -6369 835 3072
502 3072 2976 -5055 4261 7013 -20744 -7921 28043 -4962 -24690 25822 6810 -40959 15685
515 15685 32680 -30436 -846 33936 -27291 -16954 37973 -7394 -24382 31581 3053 -36475
527 -36475 18858 23842 -28141 -132 26271 -14988 -17003 15220 7809 -11417 -6395 8816 3789
540 3789 -15742 217 19996 -10007 -18297 17036 4182 -21192 12986 14290 -23176 1566 17430
553 17430 -16786 2351 24167 -16069 -11324 19749 -7090 -11039 21200 3036 -16262 4131
565 4131 694 -4625 10926 293 -6379 8498 -12471 -14905 23592 4172 -21148 13923 4531
578 4531 -28298 7859 20759 -13781 1297 11485 -21487 -4906 21194 -8364 -2014 22583
590 22583 -16230 -21629 22164 6141 -13386 16133 8386 -22455 -6620 13059 4378 1092 4454
603 4454 -1351 -10232 -9222 6854 13437 -2845 -2799 2763 -18288 -7882 23138 -598 -10392 19263
617 19263 -10408 -33771 21093 22930 -24291 6838 24912 -32287 -19825 35389 4650 -15975
629 -15975 20308 750 -27643 4019 14614 -656 8215 2959 -14496 -6380 3051 2912 9518
642 9518 5452 -7733 -8366 -7465 -1003 14506 4263 -8254 4445 -6871 -19492 12679 20234 -10109
656 -10109 -4885 7746 -13205 -11541 16237 11392 -4252 -1214 -3613 -6930 1967 6104 8125 4526
670 4526 -8831 -7421 945 -226 7985 9631 -7346 -5184 1591 -11424 866 22213 -3457 -19055
684 -19055 9643 670 -22672 13532 24454 -18046 -10815 14493 -10611 -11281 20344 7931 -14001
697 -14001 1444 3064 -11545 4506 16170 -3518 -6572 5210 -4461 -9734 9081 13968 -6928
710 -6928 -9325 8389 -1099 -14824 10371 17167 -13684 -10837 12102 -4271 -13724 13356 10181
723 10181 -15711 -2361 8903 -9952 -1301 14057 -4850 -8909 7672 -1640 -10130 9521 10326
736 10326 -10453 -3811 11623 -3539 -9402 11126 8628 -11445 -5236 10721 -780 -9789 8304
749 8304 8993 -12422 -4551 10168 -4247 -6423 9254 447 -11349 2712 5269 -8943 1800
762 1800 11892 -9177 -8341 12858 -241 -12551 8891 10726 -12825 -5407 14882 -572 -11997
775 -11997 9914 9932 -12425 -3292 11916 -2480 -8316 7504 4341 -9282 1052 7212 -6491
788 -6491 -2189 8855 -5281 -8051 8682 1050 -11943 4033 10020 -9936 -6341 13654 -433
801 -433 -13788 7160 9512 -10821 -4012 12014 -488 -9655 5820 6778 -7817 -331 8320 -3737
815 -3737 -4180 6607 -1417 -6024 5561 3084 -8753 1569 9032 -7849 -6574 11654 20 -13031
829 -13031 4996 8757 -10627 -5360 11086 -55 -11047 5318 7381 -8262 -2094 8015 -2127
842 -2127 -4659 5012 1648 -5336 2668 5198 -5799 83 8542 -4571 -6096 9128 1577 -11084
856 -11084 3681 10131 -8666 -6855 12088 228 -12902 5455 8151 -9606 -3576 8055 -2425
869 -2425 -6738 4224 2762 -5162 1028 3956 -3576 -963 5135 -2132 -3644 5409 2619 -6722 817
884 817 9215 -4258 -6946 9936 3810 -11840 2286 10377 -7603 -6535 10515 1285 -9997 3921
898 3921 5376 -7681 -908 6156 -3963 -2758 3785 -2123 -3398 3542 1659 -4362 759 4902 -3454
913 -3454 -4463 5751 3485 -6654 -546 9408 -2423 -9163 8301 6990 -10880 320 11289
926 11289 -6616 -6923 9155 442 -8242 4795 3514 -7599 1322 5424 -6446 -1490 7023 -4723
940 -4723 -6147 6397 2237 -7236 24 7440 -2635 -7759 6312 7166 -9095 -2575 11517 -2549
954 -2549 -10460 9441 7067 -12001 1871 11434 -9243 -4198 12550 -4956 -8070 11148 -1005
967 -1005 -12454 8505 7016 -13108 1397 12161 -10239 -8739 12404 1382 -11221 3293 7136
980 7136 -7269 -5723 8269 4194 -7502 926 6829 -6300 -4733 9367 780 -6734 6492 3018
994 3018 -10772 4202 11107 -9200 -1669 13723 -8536 -11777 14159 3316 -13157 6441 8427
1007 8427 -12588 -4223 10614 -1426 -5825 4537 481 -6055 -808 2828 2214 -137 -719 630
1021 630 -2565 -1383 5622 560 -3501 4838 -687 -8744 5491 9422 -7919 -1882 10893 -7065
1035 -7065 -10503 11923 4985 -10498 3137 5026 -9106 -2433 7442 598 -2897 495 -1496 -3780
1049 -3780 396 3037 1747 -1042 -1370 -311 -3562 394 8838 -1241 -6647 6373 -410 -11965
1063 -11965 7525 12776 -10559 -3847 11867 -6440 -10337 13358 6237 -11376 2019 4851 -9826
1076 -9826 66 9266 -1923 -3480 2690 -2930 -5185 4394 5932 -3903 -3327 3166 -2667 -6751 5594
1091 5594 9485 -6579 -6292 8955 -1734 -10640 10398 10199 -13109 -2122 10254 -7585 -4389
1104 -4389 13385 139 -9808 5385 1630 -9341 5787 8289 -8389 -2502 6136 -5978 -5203
1117 -5203 8850 4181 -8184 -2687 5073 -3085 -5773 7614 6223 -9060 -4055 7510 -1819 -5300
1131 -5300 9545 4956 -10393 507 6197 -6472 1202 10299 -5318 -6483 7306 -1405 -7487
1144 -7487 8660 6155 -10745 -1655 7813 -5841 -4867 9126 2395 -8285 -1208 4991 -2418 -3706
1158 -3706 5220 2834 -7174 -1510 4849 -2285 -1623 5980 -525 -5914 3611 3072 -5581 3742 6741
1173 6741 -7921 -3353 9366 -2697 -6146 8339 3329 -9883 256 7709 -3971 -4230 6187
1186 6187 514 -6898 472 3761 -1702 -1416 2373 -133 -3770 501 2723 -2606 450 3809 -3820
1201 -3820 -3526 5374 1172 -4946 3902 5219 -7374 -2731 9193 -1109 -6296 6103 3345 -7568
1215 -7568 -239 6716 -1600 -3839 3343 1117 -4963 325 3143 -1861 -854 1924 -1328 -2716 2287
1230 2287 1765 -3848 420 4298 -4531 -3737 7130 1014 -7176 3308 5968 -5806 -2553 8136
1244 8136 -91 -6740 3889 3397 -5409 322 5621 -1911 -2723 2883 -92 -3251 2517 2103 -4319
1259 -4319 196 3566 -3915 -2990 5896 493 -6226 2082 4923 -5761 -3556 7384 201 -7605 3250
1274 3250 4665 -5853 -1209 6647 -1193 -4203 3913 1651 -4919 2108 3750 -4224 -622 4661 -2876
1289 -2876 -3220 5012 959 -6109 1817 5792 -5284 -3980 6893 -108 -7450 3001 5499 -5416
1303 -5416 -2943 6088 -452 -6088 3357 3943 -5281 -216 4697 -2483 -1771 4375 -306 -3846 3473
1318 3473 2325 -5147 825 5776 -3826 -3834 6504 1097 -6988 2104 5832 -4954 -4049 5941 459
1333 459 -7057 2742 4485 -4934 -1797 5157 -1486 -3792 3236 1303 -4385 1621 3362 -4529 63
1348 63 5328 -2885 -3755 5944 1540 -6056 2291 5982 -4684 -3905 6625 472 -6608 2872 4643
1363 4643 -4791 -2104 5049 -814 -4672 2782 2054 -5025 588 3487 -3943 -947 4871 -2210 -4253
1378 -4253 4743 1752 -6357 1730 6296 -5289 -3602 7343 303 -6453 3652 4925 -4553 -1781
1392 -1781 5297 -309 -4442 2956 2355 -3732 232 3285 -2152 -1682 3049 -848 -3538 2435 1863 -5263
1408 -5263 272 5184 -4095 -3772 5881 996 -6125 1985 5113 -4379 -2575 5876 364 -4441 2307
1423 2307 2824 -2648 -479 3119 -384 -1715 1382 623 -2065 779 2339 -2013 -1117 3138 -1325 -3607
1439 -3607 3084 2764 -4927 -892 5543 -2884 -5402 5199 2485 -6272 1123 4879 -3987 -3071 4866
1454 4866 583 -4208 2542 2484 -3505 541 3570 -1823 -1087 2914 -738 -3632 2573 3069 -3960 -763
1470 -763 5542 -2566 -5110 5129 3139 -6550 181 5883 -4224 -4645 5902 806 -6124 2552 3350
1485 3350 -5145 207 4320 -2735 -1663 3811 -1228 -3781 3954 1897 -4229 1211 4118 -3108 -2503
1500 -2503 4706 1465 -4387 325 3910 -2727 -3226 4453 2121 -4292 411 3305 -2891 -1970 3398
1515 3398 164 -3127 1287 545 -3833 1552 3298 -2858 -581 2975 -2309 -2942 3770 2825 -3883 -198
1531 -198 4004 -1842 -3164 3731 3385 -3922 -801 3675 -1474 -3730 3515 2404 -4271 148 2931
1546 2931 -3277 -1129 4266 -1481 -2976 3114 -350 -4828 3144 3757 -5257 -910 5321 -3025 -3739
1561 -3739 5506 1850 -4583 695 3503 -2627 -1906 4343 1121 -3033 527 1426 -1765 115 2407
1576 2407 -371 -1549 921 -178 -1937 1893 2405 -3020 -743 2849 -2291 -2629 3232 1716 -3539
1591 -3539 -648 2575 -1501 -2131 3012 1897 -2201 -766 1216 55 -1610 1261 2450 -1362 -1134
1606 -1134 1393 -97 -661 2003 507 -2034 772 1357 -2597 -135 4320 -1949 -3838 4341 1274
1621 1274 -5782 1786 4622 -4412 -3288 5132 -79 -5673 2770 3493 -4614 -1031 4427 -1844 -2754
1636 -2754 3854 649 -3959 2126 3091 -4361 -19 5707 -3093 -3642 5962 944 -6163 2652 4852
1651 4852 -5554 -2537 6723 -1261 -6031 4231 2899 -5606 483 4154 -3110 -1920 3503 -966
1665 -966 -3279 2856 1182 -3938 1510 3464 -3302 -1214 4473 -903 -3792 2486 2871 -3557 -889
1680 -889 4556 -862 -3710 2664 2075 -3181 -97 3121 -1003 -2652 1478 688 -2067 1157 1041 -2299
1696 -2299 -548 1299 -1332 -1061 2390 -26 -3276 486 2803 -2150 -1287 3920 200 -3997 1030
1711 1030 3219 -2288 -1685 4031 634 -3921 1822 2798 -2750 -167 3308 -1665 -2266 2506 -97 -2896
1727 -2896 2258 2050 -4053 -466 3745 -2776 -2693 4373 634 -5160 1233 4130 -3596 -2124 5006 -67
1743 -67 -4996 2374 3551 -3250 -493 3733 -1222 -2884 2567 1081 -2704 1761 2107 -3177 -442 3432
1759 3432 -1978 -2399 3658 828 -4684 911 3846 -3178 -2257 4382 28 -4804 1417 2920 -3049
1774 -3049 -1559 3138 -378 -3234 1624 1787 -2197 885 2504 -1740 -826 2423 -205 -1852 2294
1789 2294 1815 -3470 257 3376 -2438 -2411 3471 623 -4207 549 3215 -2585 -2273 3622 364 -3763
1805 -3763 930 1951 -2584 -530 2452 -1223 -1736 1720 257 -1995 1490 1689 -2752 152 3386
1820 3386 -1568 -2187 3409 1350 -4034 634 3971 -2414 -2524 3965 779 -4062 1139 2714 -2541
1835 -2541 -1717 2643 -391 -2664 1505 1360 -2405 768 2084 -2405 -936 2738 -1180 -2739 2653
1850 2653 1529 -3539 148 4203 -1907 -2742 3868 1510 -4344 389 3565 -1655 -2044 3423 746
1865 746 -3192 1165 1963 -2518 -55 2160 -1706 -1887 1999 -468 -2632 1695 2230 -3255 -784 3597
1881 3597 -1932 -3262 3356 1351 -3829 -15 3554 -1690 -2666 3404 1025 -3143 908 2619 -2100
1896 -2100 -716 2829 -298 -2063 1700 686 -2530 1000 2472 -2731 -1086 3177 -1254 -3385 2574
1911 2574 1792 -3784 -552 3749 -1744 -3302 3424 1282 -3658 750 3126 -2076 -1566 2668 437
1926 437 -2022 1408 1473 -2173 482 2425 -1884 -896 2647 -589 -2408 2018 2220 -3270 -179 3461
1942 3461 -1534 -3034 2997 1214 -3378 44 2761 -1641 -2068 2395 667 -2152 530 1065 -1784
1957 -1784 -147 1207 -456 -709 1343 150 -1658 661 1970 -1581 -819 2637 -566 -2937 1570
1972 1570 2717 -2653 -1114 3116 -539 -3401 1829 2881 -2912 -700 2941 -1607 -2693 1956 1135
1987 1135 -2310 779 1867 -3021 -428 3159 -1174 -1905 3231 588 -3872 1386 4020 -2811 -1870
2002 -1870 5143 -597 -4930 3369 3358 -4148 -306 4429 -2359 -3250 3945 1077 -3955 2186 2090 -4291
2018 -4291 -303 3864 -2444 -1996 4021 -780 -4625 2653 3168 -4415 -625 4737 -2750 -3819 3706
2033 3706 1732 -3614 774 3365 -2270 -2336 3134 624 -2662 1849 1178 -2782 116 2285 -875 -394
2049 -394 2414 -594 -2751 1483 1725 -2368 65 2816 -1809 -2676 1783 1489 -1774 -21 2498 -942
2065 -942 -2822 1166 1508 -1338 -142 1430 -802 -1716 1372 1530 -1024 848 1438 -2422 -862 2802
2081 2802 -1035 -1259 2908 506 -3919 539 3585 -2726 -1565 3929 -1051 -4472 2125 2619 -3007
2096 -3007 -10 3327 -1833 -3001 2438 1473 -2500 1863 1992 -3329 -655 3232 -1116 -1415 3409 713
2112 713 -4558 1370 3589 -2948 -672 4444 -1663 -4791 2729 2024 -2899 391 3250 -2479 -2610 2561
2128 2561 261 -1787 1602 807 -2574 -325 1416 -804 71 2006 -461 -2598 551 1602 -1342
2143 -1342 225 2364 -525 -2649 644 2093 -909 -445 2581 -353 -2835 565 2076 -775 149
2158 149 1162 -913 -2009 609 1025 -933 714 492 -2447 -1020 1716 -235 -677 2002 537 -3133
2174 -3133 -510 3062 -1274 -2014 3457 -97 -4299 1309 3529 -1754 -965 3377 -668 -3683 2245
2189 2245 1858 -2121 977 1724 -3021 -962 3133 -734 -1890 2849 480 -4458 570 3184 -2446
2204 -2446 -1513 3320 -933 -3947 1750 2738 -2097 -720 2813 -1278 -2890 1802 1578 -1539 457 984
2220 984 -1686 -1075 2016 -61 -1470 1885 44 -2889 636 2436 -1594 -972 2075 -250 -2562 693
2236 693 2252 -1582 -1376 1722 -216 -2129 629 1652 -859 -834 1139 -67 -1638 1053 1160 -1406
2252 -1406 145 1049 -1584 -458 2235 -90 -1606 1652 1181 -2639 57 2972 -1484 -2035 2062 250
2268 250 -2772 853 2616 -1689 -1740 1598 -15 -2062 1386 1257 -1707 -231 1504 -1359 -971 2381
2284 2381 290 -1817 1168 1283 -2994 309 3385 -1335 -2029 2571 729 -2620 992 3116 -1660
2299 -1660 -1562 2298 181 -2536 1336 1362 -1928 -435 1578 -413 -972 1609 292 -1981 663 1097
2315 1097 -2002 -273 2248 -955 -2017 1811 1103 -2392 426 3031 -1381 -2099 2470 577 -2248
2330 -2248 1112 1988 -1570 -1103 1829 -256 -1497 1018 715 -1737 275 1155 -1251 -577 2028 -605
2346 -605 -2113 900 1173 -2375 -485 2638 -835 -2633 2193 1253 -2435 154 2853 -1359 -1857 2195
2362 2195 562 -1978 1123 1437 -1491 -4 1751 -952 -796 1664 -12 -2013 817 1315 -2059 -488
2378 -488 2701 -642 -2283 1529 1033 -2625 -202 2830 -1178 -2106 2225 730 -2784 686 1915 -1449
2394 -1449 -575 2001 -726 -1631 1696 497 -1924 1074 1709 -2209 -22 2463 -1130 -1817 1861 985
2410 985 -2525 -67 2541 -1448 -2219 2036 626 -2191 450 1999 -1394 -1650 1493 -27 -1719 1127
2426 1127 1158 -1764 33 1242 -1593 -516 2258 -64 -1792 1275 1807 -2118 -142 2516 -517 -1589
2442 -1589 1552 1010 -1717 231 1888 -503 -1812 1143 612 -1817 709 1462 -1110 -873 1453 -719
2458 -719 -1103 1566 474 -2176 938 1616 -1935 -755 3077 -645 -2231 2062 1147 -2399 204 2490
2474 2490 -980 -1807 1714 541 -1712 580 1639 -844 -947 1069 -138 -863 1156 397 -1603 344
2490 344 1197 -1140 -856 2117 -410 -2390 955 1391 -1947 -43 2623 -1164 -1789 1544 619 -1044
2506 -1044 159 1320 -732 -994 643 305 -253 833 238 -721 -443 -57 -204 -188 669 551 -1604 -627
2524 -627 1334 -684 -872 1552 492 -2469 202 2011 -1314 -978 2373 -175 -2712 746 1603 -1101
2540 -1101 247 1951 -651 -1420 1193 383 -1147 1349 1058 -1920 -492 1873 -712 -1353 2269 571
2556 571 -3161 292 2255 -2242 -1376 3109 -171 -3456 1308 1405 -2374 361 2255 -2021 -1726 1976
2572 1976 -250 -1617 2332 655 -2503 707 1719 -1660 -124 2786 -463 -2302 1038 895 -2042
2587 -2042 342 2333 -668 -1954 700 769 -1002 111 1231 -597 -1586 626 -55 -755 973 536
2603 536 -1112 -494 397 -631 -42 1405 97 -1376 158 686 -786 30 1562 155 -1358 -351
2619 -351 1241 -55 -768 1317 981 -1916 -161 1729 -286 -787 1355 38 -2022 560 1004 -1352
2635 -1352 156 1477 -1906 -866 1791 -794 -1694 1840 937 -2899 -223 2076 -1380 -1126 2927 395
2651 395 -2525 549 1607 -1270 -313 2092 -372 -2055 1095 960 -1357 850 1356 -1455 -1096 1964
2667 1964 -818 -1863 1920 787 -2933 267 2041 -1965 -951 3140 -280 -2180 980 949 -1574
2682 -1574 -363 1731 -378 -1440 1046 459 -869 488 907 -701 -373 701 -185 -1200 912 929
2698 929 -1233 -129 1547 -752 -1541 1775 726 -1916 -148 1760 -1194 -1505 1997 464 -1892 613
2714 613 1131 -1274 -716 1097 -248 -700 1019 462 -1266 619 1204 -1095 -418 1610 -527 -1527 1439
2731 1439 1697 -1976 -490 2788 -1137 -2046 2213 889 -2578 718 1764 -1654 -648 2172 -429
2746 -429 -1822 1106 425 -1560 568 1263 -1560 -208 1324 -794 -1537 1293 1186 -1452 -183 1926
2762 1926 -1034 -1469 1692 819 -2189 81 1756 -1100 -1365 2044 342 -1784 759 445 -1470 0
2778 0 1212 -802 -750 1175 -196 -1307 1451 1141 -1662 38 1596 -872 -1037 1450 985 -1375 236
2795 236 1751 -654 -871 1906 776 -1688 320 1367 -852 -466 1384 -315 -1255 742 360 -1442
2811 -1442 601 1170 -1604 -898 1423 -429 -1673 1192 1156 -2038 -64 1643 -1102 -1425 1392 842
2827 842 -1646 -159 1633 -614 -929 1426 402 -1321 516 797 -1005 88 1148 -667 -829 1587
2843 1587 17 -1413 1015 1158 -1695 -338 1865 -783 -1746 1140 674 -1327 -552 1578 -730 -1120
2859 -1120 1391 333 -1320 60 749 -688 -621 1044 -215 -1009 1128 691 -1189 346 1356 -1088
2875 -1088 -602 1459 262 -1677 885 1257 -1882 -464 2027 -529 -1683 1143 724 -1507 -50 1192
2891 1192 -773 -653 871 43 -988 589 1254 -925 -82 1504 -499 -1000 1170 499 -1580 487
2907 487 1857 -1810 -914 2360 -200 -2042 1051 1409 -1924 -307 1624 -869 -1588 1414 409 -1339
2923 -1339 699 984 -1166 -393 1362 -339 -943 1301 783 -1892 799 1557 -1252 -997 1903 191
2939 191 -2065 963 1573 -1672 -449 2447 -613 -1599 1688 790 -1585 406 1274 -1506 -342 1125
2955 1125 -294 -887 1395 326 -1763 470 1213 -1280 -260 1438 -331 -1699 1171 1470 -1326 -409
2971 -409 1704 -224 -1522 912 871 -1173 -233 1344 -497 -1043 1026 220 -1202 766 601 -832 51
2988 51 1312 -912 -680 1343 317 -1546 459 1202 -1230 -683 1489 253 -1353 398 1371 -1229
3004 -1229 -985 1617 564 -1729 591 1103 -1435 -177 1595 -764 -883 1645 -410 -1662 1528 976
3020 976 -2026 131 1958 -1618 -1300 1934 138 -2345 761 1381 -1648 -647 1969 196 -1930 1069
3036 1069 648 -1597 -150 1496 -578 -686 1391 2 -1522 1386 1001 -1778 -18 1542 -1104 -940
3052 -940 1973 488 -1918 795 1309 -1804 -480 1789 -434 -1492 900 218 -1057 -103 1236 -390
3068 -390 -697 583 81 -902 431 818 -545 -404 822 -294 -1044 1109 1220 -1414 -291 1799 -1219
3085 -1219 -1084 1947 745 -1978 323 1562 -1067 -335 2047 -336 -1322 575 191 -1588 300 1325
3101 1325 -563 -769 758 -284 -1442 739 1247 -1719 -483 1489 -1220 -1467 1899 982 -2341 267
3117 267 1709 -1496 -799 2510 -66 -1757 1146 473 -1809 483 1730 -624 -620 1089 -434 -1348 1327
3134 1327 609 -1516 -3 967 -1018 -897 1386 610 -1352 393 820 -1305 -548 1615 172 -1126
3150 -1126 535 590 -944 -149 1363 -26 -542 496 -58 -833 809 663 -695 -117 530 -691 -737 969
3168 969 581 -952 153 529 -601 -706 831 793 -984 -483 1083 -551 -1339 1020 613 -1318 -100
3185 -100 1080 -1050 -541 1483 -60 -1130 843 302 -1470 593 1180 -1254 -407 1304 -591 -1145
3201 -1145 1145 929 -1609 -399 1227 -596 -1231 1543 891 -1578 289 1031 -1014 -348 1326 119
3217 119 -1243 495 419 -1264 715 1096 -1126 -675 1509 -534 -1221 1213 872 -1814 -6 1627 -1012
3234 -1012 -848 1417 91 -1209 358 1011 -833 -531 1014 69 -957 738 338 -865 180 763
3250 763 -646 -613 802 24 -1340 813 846 -1349 -152 1456 -462 -1127 1327 672 -1639 138 1248
3267 1248 -827 -393 1210 187 -1168 530 620 -618 -155 642 -476 -804 813 187 -1072 361 619
3284 619 -1061 -739 1515 135 -1513 509 1340 -1379 -370 1604 -831 -1227 1108 500 -1208 589
3300 589 1215 -889 -400 1008 -60 -1063 1051 346 -942 328 861 -558 -502 1125 68 -1295 352
3317 352 1277 -1471 -440 1545 -670 -1358 932 355 -1413 -99 1402 -674 -1137 1216 -33 -1225
3333 -1225 681 450 -783 -87 977 -755 -557 1234 -12 -1334 808 848 -1170 -566 1243 -296
3349 -296 -1128 744 977 -1323 -469 1360 -472 -1194 1079 326 -1121 162 1092 -903 -468 1099 -147
3366 -147 -958 981 310 -1336 328 868 -899 -268 1354 -182 -1339 626 1157 -850 -378 1211 -480
3383 -480 -1119 746 579 -1048 113 982 -578 -736 925 -64 -1136 620 471 -1334 -125 976 -747
3400 -747 -751 972 296 -1376 545 1397 -995 -264 1113 -165 -1044 428 1005 -963 -505 1465 -405
3417 -405 -933 712 276 -1027 230 517 -729 -398 743 -163 -919 822 230 -1326 626 977 -958
3434 -958 -589 1240 -130 -1464 699 790 -1016 -436 1457 -85 -757 867 550 -861 233 803 -517
3451 -517 -294 883 -36 -1129 639 444 -955 116 956 -810 -908 1135 322 -1105 162 1343 -1300
3468 -1300 -630 1143 20 -1183 781 854 -1287 -285 1267 -701 -856 802 -137 -960 623 682 -729
3485 -729 -35 1046 -202 -976 863 582 -1350 243 1220 -1285 -607 1394 -21 -1198 399 690 -1374
3502 -1374 -284 1423 -443 -877 705 92 -976 613 476 -568 -330 544 -459 -865 1196 321 -719
3519 -719 543 617 -732 -526 781 31 -822 150 864 -857 -458 959 -125 -426 504 545 -339 -339 607
3538 607 -126 -260 429 -244 -919 446 590 -188 -260 655 -67 -942 607 472 -699 -152 709 -491 -976
3557 -976 920 949 -935 -122 1043 -567 -1107 1127 763 -1160 407 448 -984 -49 1169 -493 -959
3574 -959 954 -644 -1533 930 1141 -1231 -70 1015 -887 -985 1324 584 -1233 293 913 -924 -497
3591 -497 1184 29 -693 547 551 -1137 -76 991 -137 -665 886 -257 -1342 768 623 -1061 -53
3608 -53 877 -874 -806 978 349 -1348 296 800 -1112 -454 807 111 -290 24 385 -624 -437 654
3626 654 217 -219 172 -240 -681 336 597 -525 -293 501 -28 -807 329 1091 -710 -274 789 -632
3644 -632 -1130 834 791 -981 -97 413 -554 -668 720 508 -801 161 423 -663 -354 977 232 -664
3662 -664 661 319 -1159 318 1298 -811 -528 1500 -318 -1546 1057 875 -1221 -182 1362 -853
3678 -853 -836 1394 171 -1183 302 750 -876 -215 879 -340 -664 797 -185 -961 498 665 -676
3695 -676 -464 1092 -224 -835 736 776 -1192 227 1328 -928 -861 852 305 -888 344 599 -678
3712 -678 -559 837 22 -739 556 261 -631 73 464 -342 -161 518 62 -796 102 874 -551 -27 843
3731 843 -261 -934 494 780 -722 33 1120 -231 -980 953 366 -770 268 612 -663 -105 858
3748 858 -195 -925 639 184 -1227 387 1158 -791 -337 1127 -58 -1184 403 885 -900 -355 1101
3765 1101 -333 -1090 914 528 -853 89 518 -647 -350 760 -61 -754 509 469 -794 -4 882 -554
3783 -554 -643 896 43 -1424 694 803 -997 -16 776 -386 -832 697 283 -1006 91 773 -814
3800 -814 -478 682 -36 -699 502 768 -381 41 971 -397 -596 765 92 -913 151 1073 -696
3817 -696 -225 1044 -87 -991 466 552 -596 -256 964 -175 -533 850 11 -715 188 435 -570 -218
3835 -218 731 -97 -522 513 485 -956 117 841 -358 -636 746 76 -998 312 1034 -799 -542 1027
3853 1027 9 -603 588 356 -892 272 690 -438 -611 552 -237 -592 582 388 -578 -32 584
3870 584 -268 -577 874 108 -795 181 790 -715 -519 814 -281 -864 300 444 -873 -210 828 -270
3888 -270 -568 625 168 -1050 228 447 -664 31 743 -373 -472 517 428 -650 -12 697 -520 -503 797
3907 797 660 -1034 191 663 -439 -214 890 93 -729 687 542 -391 -299 397 -350 -582 679 -50
3925 -50 -859 774 384 -615 84 759 -546 -691 544 168 -662 -189 998 -534 -560 502 204 -906
3943 -906 245 727 -512 -370 995 185 -553 525 389 -786 319 842 -558 -174 1055 -404 -811
3960 -811 691 621 -940 274 852 -802 -1079 879 63 -859 250 590 -699 -451 746 -295 -746
3977 -746 722 211 -683 182 511 -317 -121 643 -35 -850 610 761 -917 44 903 -566 -427 971
3995 971 423 -774 172 656 -831 -405 356 -264 -789 143 190 -399 -299 792 30 -367 592 197 -723
4014 -723 20 540 -456 -373 810 -146 -958 652 562 -995 -55 1037 -496 -891 886 422 -734 196
4032 196 747 -444 -550 738 -213 -810 549 -103 -996 -97 671 -417 -157 976 -81 -947 519 764
4050 764 -755 84 1146 -659 -1089 800 327 -928 395 530 -674 -208 884 -293 -491 828 -114
4067 -114 -570 51 521 -515 -185 881 43 -992 342 550 -612 97 577 -555 -645 443 230 -332
4085 -332 188 527 -413 -491 403 351 -538 158 415 -770 -178 723 -70 -455 277 23 -740 94 534 24
4105 24 -66 674 -212 -894 61 701 -484 -272 891 -6 -943 738 517 -953 -24 737 -522 -853 1021
4124 1021 36 -650 588 531 -891 -175 450 -420 -268 1015 116 -1076 213 925 -980 26 894 -363
4142 -363 -958 576 244 -1013 242 1095 -774 -619 629 31 -728 546 310 -1064 137 746 -317
4159 -317 -448 960 93 -681 527 134 -741 -53 770 -368 -527 583 367 -469 42 648 -308 -315 213
4178 213 -46 -351 110 207 -211 -225 391 -260 -539 411 -271 -752 -298 486 -117 -206 656 -107 -705 -55 824
4199 824 -346 -299 619 -245 -675 251 649 -574 -155 752 -183 -570 423 204 -614 189 574 -374 -149 380
4219 380 -131 -765 705 373 -848 346 907 -470 -351 768 -510 -901 602 542 -674 -262 1062
4236 1062 -490 -946 475 114 -482 153 452 -705 100 585 -409 -359 809 280 -502 1 665 -608
4254 -608 -121 564 109 -846 132 712 -499 -164 671 -447 -487 559 147 -432 131 752 -124 -212 624 183
4274 183 -570 228 270 -480 253 421 -143 -142 737 273 -540 225 538 -303 -63 500 -88 -652 153 627 -308
4295 -308 -425 866 -198 -819 200 446 -592 73 441 -259 -274 685 79 -475 707 385 -628 -148
4313 -148 692 -510 -616 784 194 -828 144 758 -531 -36 899 -79 -483 19 324 -668 -184 549 -408
4332 -408 -509 435 157 -543 166 212 -949 -63 713 -32 -462 893 332 -877 238 500 -559 -633 454
4351 454 -170 -447 510 421 -505 -127 459 -217 -628 479 45 -578 214 447 -410 -279 716 -228 -676 772
4371 772 458 -1036 75 892 -611 -207 488 101 -481 279 370 -107 -30 657 -59 -593 573 -210 -361
4390 -361 86 544 -360 -357 624 -78 -464 410 158 -336 169 608 -451 -599 459 212 -850 12 751 -365
4410 -365 -448 758 -101 -596 364 456 -548 -239 234 -291 -324 289 -34 -590 400 246 -517 208 511 -262
4430 -262 -470 552 179 -571 -19 828 -489 -210 498 -50 -263 121 221 -621 -340 409 -358 -629 332
4449 332 86 -731 212 263 -479 -87 517 -98 -781 420 332 -223 127 555 -78 -619 154 184 -432 -36 661
4470 661 -274 -677 258 -251 -480 447 453 -93 -30 454 -217 -350 516 -187 -407 118 357 -557 -163 727 175
4491 175 -689 272 597 -443 -156 600 -109 -416 541 224 -892 70 396 -393 -124 542 -258 -393 703
4510 703 132 -495 315 350 -503 -337 603 83 -587 268 482 -696 15 306 -164 -397 208 -29 -588 256
4530 256 517 -843 -273 455 -332 -412 470 240 -406 61 314 -456 -349 481 152 -508 -65 -34 -339 278
4550 278 390 -86 -238 240 192 -440 -130 253 -264 -351 153 322 -314 302 489 -202 -232 417 -95 -511 38
4571 38 324 -593 -27 584 -290 -241 649 193 -551 218 436 -169 -153 967 -347 -446 170 278 -403 -40 562
4592 562 -108 -477 470 -149 -466 552 445 -204 52 501 -482 -630 615 268 -778 516 507 -820 -124
4611 -124 783 -344 -554 474 222 -668 267 509 -597 -617 404 -92 -89 345 346 -532 -56 364 -10 -246
4631 -246 647 94 -654 288 231 -322 -154 496 15 -837 57 401 -275 199 640 16 -551 362 6 -243
4651 -243 276 314 -428 -462 175 -177 -108 269 216 -425 -38 331 -193 -92 79 187 -539 -88 501 -350 -208
4672 -208 610 -197 -505 252 494 -645 -84 815 -389 -680 169 -13 -529 70 463 -552 -261 522 -296
4691 -296 -499 608 -203 -739 168 294 -362 -64 596 -231 -770 252 349 -445 102 747 -238 -473 502 -183
4711 -183 -511 240 347 -283 -135 456 -101 -272 743 160 -258 221 265 -342 -24 759 180 -380 257 334
4731 334 -290 92 217 -95 -472 5 292 -562 -118 238 86 -71 587 69 -526 188 364 -250 -75 470
4751 470 -51 -418 475 135 -684 195 317 -155 77 516 -9 -562 367 240 -584 -122 690 69 -157 383
4771 383 142 -271 55 410 -427 -339 367 -352 -590 359 130 -843 -3 695 -198 -270 589 69 -576 226 361
4792 361 -460 -279 404 -207 -651 354 112 -382 -226 410 -105 -179 459 -116 -277 417 186 -673 6 561
4812 561 -212 -326 482 149 -340 -48 602 -271 -319 567 51 -503 31 335 -350 51 376 -114 -199 301 7
4833 7 -366 44 120 -285 -177 151 55 -237 97 135 -413 53 573 -184 -199 333 112 -387 264 420 -314 -214
4855 -214 559 39 -323 379 248 -245 -23 507 -335 -270 343 -38 -530 260 295 -304 19 418 -238 -338 378
4876 378 231 -523 -22 345 -289 -131 644 52 -493 393 225 -355 -16 338 -231 -187 271 186 -349 29 354
4897 354 -128 -297 125 -166 -306 504 123 -677 327 267 -230 -298 666 141 -358 -6 419 -271 -180 245 -386
4918 -386 -336 353 266 -320 168 -254 -207 -88 183 -83 -603 269 253 -94 -223 133 24 -319 372 246 -463
4939 -463 -14 753 -305 -302 181 -184 -473 290 205 -349 -160 421 -405 -506 431 -30 -689 415 582 -358
4959 -358 -100 377 -195 -477 290 58 -494 154 562 -269 -217 765 -51 -388 103 376 -193 -120 332 -149 -638
4980 -638 266 164 -469 366 431 -362 -12 500 201 -386 515 199 -603 -43 479 -417 -291 258 58 -600
5000 -600 -72 210 -538 -135 151 -154 -375 290 186 -156 -25 340 93 -109 380 190 -269 24 146 -321
5020 -321 -72 403 -129 -514 237 174 -250 -195 463 -174 -325 299 -30 -102 -23 223 -243 -127 307 -47 181
5041 181 622 151 -256 313 325 -449 -118 371 134 -540 302 416 -767 -86 730 -308 -338 333 42 -264
5061 -264 248 524 -376 -178 577 -23 -305 480 -95 -241 179 471 -46 139 489 -156 -451 236 370 -698
5081 -698 -15 308 -243 -200 194 225 -242 64 147 -397 -263 441 -172 -398 182 128 -441 27 457 -286 -39
5102 -39 315 -178 -464 292 238 -297 -81 249 -131 145 120 220 -176 -120 251 -118 -348 187 76 -444 279
5123 279 152 -332 -167 500 199 -477 109 40 -321 -212 640 -115 0 538 71 -466 254 373 -386 -132
5143 -132 475 -50 -380 119 356 -147 81 139 -304 -272 179 19 -580 351 281 -433 36 429 -175 -388 456
5164 456 157 -558 508 101 -369 -44 639 162 -324 195 247 -302 -36 404 -189 12 486 -79 129 365
5184 365 124 -108 182 172 29 -155 332 -199 -300 355 128 -196 -135 129 72 -203 36 232 -127 -272 235
5205 235 -386 -321 171 -166 -72 -176 393 -204 -112 386 -118 -317 64 39 -379 96 214 14 -308 227 77
5226 77 -210 -35 267 -260 -314 280 -63 -597 -130 558 -175 -5 395 -48 -343 120 309 -778 73 73 -238
5247 -238 172 152 -181 -132 307 235 -555 25 125 -187 -3 492 246 -13 56 172 -398 -72 594 -343 -279 226
5269 226 10 -486 101 -161 -176 -109 402 -69 -350 104 -45 -564 129 373 -96 -33 779 240 -273 96 93 -257
5291 -257 -70 133 147 -71 58 247 -412 28 159 -157 -217 10 -155 38 140 41 -180 -179 332 -153 -409 129
5313 129 25 -233 89 161 -82 -384 279 -63 -280 -122 355 -419 -175 171 -192 -24 332 191 -231 -166 99
5334 99 -117 125 339 118 -307 207 378 -354 188 20 12 -308 370 49 -333 -8 164 -167 -48 343 -136
5355 -136 -236 281 315 -107 119 354 -39 -76 428 173 -267 140 592 -198 218 166 -100 -309 -18 15 -312
5376 -312 151 542 -211 -255 283 36 -164 210 144 -222 -107 266 -42 -109 432 -124 -364 203 -33 -49 -232
5397 -232 290 -84 -276 397 220 40 -7 321 -243 -343 271 138 -289 171 242 -373 -135 281 -145 -345 427
5418 427 -17 -116 94 30 -260 -190 55 14 -140 169 290 -419 287 429 134 -279 -39 78 -114 268 127
5439 127 -57 -81 338 -122 -433 224 216 -232 124 145 -119 -218 44 119 -349 209 415 -331 43 77 -456 -248
5461 -248 245 189 -577 22 389 32 -300 438 68 -336 93 406 -191 69 171 -231 -49 358 -1 -213
5481 -213 259 113 -381 14 347 -166 -453 36 288 -462 -23 492 -313 3 258 -24 -212 211 317 -249
5501 -249 -386 197 77 -94 -122 382 -85 56 90 -54 -3 317 230 -462 210 269 -597 42 367 -167 -293 204
5523 204 241 -406 -373 59 -100 -236 262 -5 -231 388 58 -137 50 186 -297 -379 173 6 -329 -32 598
5544 598 -215 3 392 -133 -206 165 39 -316 -45 -179 -181 -165 -44 210 -406 -85 304 -171 -80 114 -175 -297
5566 -297 -79 -3 -200 141 -20 -399 -181 138 126 -85 181 -4 -389 -105 83 -63 -260 226 9 -421 -202
5587 -202 340 -75 -112 163 -9 -434 -185 203 -148 -67 -86 -65 -88 124 138 -144 33 343 -410 -152 486 -184
5609 -184 -161 62 212 -366 8 474 207 -420 153 234 -112 -143 550 -146 30 169 -32 69 187 24 -158
5630 -158 11 209 -213 -136 565 -28 -159 -113 217 -702 -97 234 -30 -288 136 115 -159 276 195 -263 -71
5651 -71 288 97 -124 249 107 -154 45 528 -219 80 6 -17 -194 162 196 -186 229 367 231 -341 38
5672 38 178 -101 -80 46 29 -105 175 87 -123 -179 89 -227 3 283 170 -283 401 10 -13 -99 -63 -341 -140
5695 -140 151 23 -392 22 219 -238 -54 438 112 -116 112 -21 -507 -14 91 -255 -220 49 92 -385 8
5716 8 147 -154 14 466 -339 -111 449 226 -357 96 227 -159 -234 261 -249 -37 244 52 -213 -115 83
5737 83 61 38 248 9 100 142 330 -213 -79 64 -242 -117 132 -32 -189 2 -28 -81 -456 298 132 -217
5759 -217 -98 178 -426 -82 243 326 -351 -4 -18 -171 -141 218 -112 -421 -146 -63 -214 258 224 -72 210 477
5781 477 -213 -121 108 266 -126 -93 483 -443 -221 40 90 -50 -24 216 -155 -82 112 -111 -202 276 140 -278
5803 -278 -105 17 -399 -227 290 -248 -385 267 -217 -297 -147 137 -99 -97 60 190 -107 105 72 -487 -155
5824 -155 -63 -50 116 242 -44 -47 -121 139 -72 34 90 56 -253 194 178 75 -203 115 -106 -140 403 -153 -203
5847 -203 -423 235 -373 -80 303 -255 -173 -83 -73 -1 -2 156 -52 -158 160 240 108 139 351 -173 -297 158 -205
5870 -205 -276 -26 -30 -354 -74 303 -290 -168 209 -43 -194 257 346 -103 -182 134 -50 -114 85 178 -223 -333
5892 -333 182 -88 -91 220 260 -221 187 21 -302 -77 4 -131 13 398 88 -47 -66 290 -188 160 393 12
5914 12 -109 175 80 -138 -236 177 147 -254 -75 78 -129 260 109 -125 -271 205 -61 -340 104 -68 -14 178
5936 178 218 -143 -331 105 223 -295 4 242 -140 108 232 0 153 29 118 -135 -89 400 -309 -241 323
5957 323 -79 -223 237 404 -247 98 193 87 -243 278 12 -121 200 214 -96 -141 221 59 -266 123 -104
5978 -104 -81 9 328 -161 -225 564 48 14 52 288 -325 -27 183 11 -66 100 234 -162 -17 212 -124 -123 212
6001 212 -24 -121 89 166 -27 191 76 -154 182 93 -141 -235 5 33 -74 -47 -16 -52 147 276 67 -3 -235
6024 -235 353 62 -151 148 94 -102 90 157 98 45 -70 -114 -419 140 -119 -180 411 77 -297 -30 250 -267
6046 -267 -303 -57 306 -112 -189 175 -57 -166 -156 -38 -263 -284 294 -210 -284 257 -133 -432 -32 190 -67 41
6068 41 308 -55 -120 343 210 -278 41 232 -231 -245 351 45 -429 309 397 -341 -206 393 -145 -250 -127
6089 -127 236 -173 -23 218 -27 -192 278 -78 -280 143 242 -182 -41 35 -213 103 172 152 -189 -24 -12 -145
6111 -145 -153 344 101 -193 117 169 -20 -6 105 26 -158 82 31 -33 -95 -7 -126 222 268 -168 -262 -138 -35 -285
6135 -285 -200 206 -241 -96 256 -116 -71 292 355 -206 158 195 -6 -311 191 1 62 -255 237 -97 -210 141
6157 141 -146 141 169 454 -330 -380 52 -529 -478 278 75 -119 180 99 -326 56 231 74 -111 224 160 -194
6179 -194 203 494 -185 -174 352 -202 -108 67 3 -220 14 127 -138 -257 256 176 -236 135 302 -466 -122
6200 -122 168 -184 -360 -140 222 -183 -186 176 -63 -181 290 225 -175 129 -2 -16 195 57 -259 40 -96
6221 -96 -35 -310 99 409 -146 -338 90 180 -204 -25 276 11 -162 376 1 -49 355 -102 20 -175 13
6242 13 -230 -9 176 124 -115 -174 172 -181 -97 128 -107 0 487 515 -240 122 257 -248 -135 140 -165 -258
6264 -258 -10 203 -307 -211 125 192 89 122 17 -161 -77 -200 -360 201 228 65 -166 125 148 -146 159 39
6286 39 -23 -24 -164 71 -173 39 206 -164 -123 349 98 -63 257 37 -175 -81 202 -244 -250 147 -251 -319 38
6309 38 348 -62 30 126 29 9 -57 -36 150 63 237 -144 72 265 -39 -199 43 222 -115 148 84 -140 147
6332 147 49 -220 -281 189 425 -232 47 128 -231 -349 -47 144 -260 -106 308 -278 -130 87 185 -327 -458
6353 -458 155 -201 -220 318 -91 -281 43 -128 -106 -232 102 -139 -11 102 17 -29 175 -11 -483 169 438
6374 438 -221 -124 275 7 -269 244 126 -188 -27 240 12 -56 7 -32 -7 220 -9 -41 -21 208 -19 -163
6396 -163 76 -147 -78 -75 358 -58 -211 -13 184 -207 232 381 -369 -270 -212 -92 -228 -13 388 -74 116 344
6418 344 -96 -362 167 -89 -461 252 -72 -498 -109 193 -105 -79 69 176 -132 -36 60 -243 -304 27 217
6439 217 -376 -54 43 -240 -184 326 101 -55 23 70 -52 16 324 -311 -7 198 5 -360 71 -72 -116 -223
6461 -223 191 -29 -48 -52 91 10 148 270 -46 82 23 -143 -52 91 5 -314 150 -208 216 -125 1 148
6483 148 -380 41 66 -20 -13 99 157 -266 -6 195 23 83 20 -10 -55 69 -16 -254 103 33 -84 -254 64 2
6507 2 -65 -72 -46 -138 146 36 -87 -128 153 -191 -228 149 140 -81 -43 291 237 -59 0 22 -232 -147 137 -83 -69 124
6533 124 -75 -81 -106 23 -291 145 92 -132 -213 137 14 -178 -91 85 -352 120 76 -154 -340 348 45 -267
6555 -267 -123 48 -380 -84 72 54 -126 -137 133 -289 14 136 -139 105 302 -58 -111 383 219 -131 48
6576 48 11 123 -125 183 59 26 62 45 -8 -89 -35 5 -14 -187 95 -404 -125 407 112 -14 314 53 -96
6599 -96 111 177 -33 124 -19 62 -532 100 -198 187 -212 -24 50 19 114 127 -62 -220 65 28 9 76 191
6622 191 -4 93 139 -179 -245 170 83 -226 -22 139 6 -45 179 197 -252 439 -71 -321 154 27 -61 143
6644 143 -65 -95 -388 76 17 -63 179 38 -205 33 263 -515 -15 -39 -104 -262 16 63 341 -152 260 1
6666 1 84 245 131 -229 88 344 -19 -87 26 -318 -43 -12 220 -120 -75 50 103 -168 -8 -212 187 67
6688 67 57 -91 -16 42 135 -163 -95 333 4 -252 -21 40 -153 -174 66 -190 -163 98 119 -110 -7 -101 168 117
6712 117 -79 66 -201 150 -150 -119 125 -170 -59 29 249 -171 -27 4 118 54 -157 182 -216 -108 422
6733 422 -23 191 378 -237 -284 -115 48 -124 -97 65 -10 -12 70 33 15 -124 70 42 -379 78 103 -232 -29
6756 -29 323 -214 71 254 -364 -456 199 120 23 -7 81 69 22 31 121 197 -236 -135 -207 -114 215 172 -193 131 147
6781 147 -319 -282 386 140 -55 18 -45 -41 40 143 -75 -108 -273 178 -248 38 58 -36 -44 163 93 -116 -6 240
6805 240 -123 311 -42 -263 -80 208 163 -199 -54 184 -60 -131 66 -21 51 370 -20 -134 28 41 -44 140
6827 140 175 8 -139 137 -157 32 28 193 -149 -184 175 -59 -197 133 -96 -228 -63 134 47 -12 22 103 -101
6850 -101 29 14 -153 -60 -123 234 -84 256 277 -220 111 35 74 35 160 394 -90 328 36 -166 -28 305
6872 305 38 -224 -11 140 126 56 0 -160 -80 -158 -129 -198 61 -23 178 0 -30 99 152 243 155 -86 209 174
6896 174 44 -365 157 141 -157 72 -173 -182 206 381 -81 -127 37 356 77 24 159 -68 114 -11 -234 6
6918 6 -28 -227 -349 -249 97 -82 -229 187 65 -9 -29 8 -145 -200 421 36 -323 44 382 -100 -72 -34 -19
6941 -19 -266 183 33 -274 319 3 -281 -96 -335 85 -18 424 193 97 115 165 -226 -34 82 -223 27
6962 27 7 -87 -193 -177 91 -101 -246 45 113 24 10 206 29 101 119 -240 182 -63 -80 -526 9 -129 -179 20
6986 20 186 -400 -282 -28 162 -205 -6 -90 101 -35 -173 123 30 -45 173 -29 -159 188 -49 90 174 -32
7008 -32 74 80 300 -200 -185 242 -71 84 -138 81 275 62 -275 95 -95 -137 -20 -116 -171 -230 92 99 230
7031 230 -43 -254 -57 -309 -198 -209 119 131 -315 361 -33 -40 -138 157 -46 -114 -177 101 -62 -212 73 -110
7053 -110 324 93 298 -9 -77 152 -160 -114 -159 40 12 -227 61 160 -180 -67 -101 -131 210 -137 -304 50
7075 50 283 -150 92 233 -213 -70 -129 -45 -200 -47 -12 65 -48 115 32 -226 -293 216 68 237 358 -164
7097 -164 -37 85 -83 -58 -250 23 -331 133 10 -147 37 -138 -98 -230 13 129 -190 -138 136 166 -204
7118 -204 78 -58 -109 27 -189 -64 113 3 35 -104 67 -2 -386 -39 179 101 41 -236 188 104 -3 288
7140 288 60 -30 -284 64 39 74 -38 214 -174 -146 -104 -232 287 -247 -56 4 -97 -207 -44 8 54 -7 63
7163 63 97 -162 23 -12 221 -381 62 -27 45 7 -32 -312 242 92 -66 24 -72 128 -92 -218 42 -78 -219
7186 -219 282 -4 -195 14 238 -125 -41 70 124 5 39 -20 -215 -18 -69 158 -126 102 -269 57 130 59
7208 59 27 -101 2 -157 135 197 214 -268 -8 192 -78 -310 293 105 -62 201 -171 -96 7 54 -187 -221
7230 -221 -215 35 244 107 2 -60 -23 64 90 212 83 -34 30 -135 293 -131 -101 47 -33 -196 -190 156 -98 186
7254 186 -10 -122 -358 255 287 -146 -134 157 1 -258 89 -139 -263 150 5 -177 12 281 -71 -55 117
7275 117 -184 -150 269 29 58 -154 -26 187 220 51 204 19 -86 150 -207 132 -74 -181 -23 -54 -327
7296 -327 162 133 -113 -37 43 289 17 -111 -23 348 -188 126 132 137 50 96 83 -329 -137 257 -53 227 80 104
7320 104 -159 60 24 -162 -55 36 -106 86 -59 129 110 140 255 -157 -187 268 -121 -137 263 -167 -210 -37
7342 -37 -32 -58 -97 290 254 -139 177 -71 -155 -40 138 -109 -49 60 516 117 156 201 -56 -86 212 -82 -188 152
7366 152 134 -145 234 152 28 20 -78 71 -195 30 125 19 -148 353 -239 -109 -103 140 -118 -171 -35 247 78
7389 78 92 -120 -90 169 101 151 316 284 237 -172 -46 324 79 -222 173 212 -326 76 143 -131 102 37 87 137
7413 137 134 -187 196 89 -195 -3 158 318 66 241 68 280 -124 -179 -119 -263 -3 238 -267 -14 57 27
7435 27 26 -3 272 -176 -123 93 -471 9 -158 187 138 92 134 -101 -47 35 344 -173 120 78 -54 -34 285 102
7459 102 -300 9 300 -116 59 46 -107 -287 -190 184 -6 43 -27 -125 -34 45 -306 40 200 11 -240 75
7481 75 224 -184 -149 222 109 -325 -79 8 80 45 -225 -22 -266 240 57 -89 -121 2 377 -106 -70 -48 -186
7504 -186 176 -42 -39 38 -395 20 -152 137 361 -14 -29 113 -279 -374 -29 -10 -23 -74 -139 -65 -377 -68 184
7527 184 -244 124 -266 -137 -129 53 -63 -34 -26 -40 108 192 -276 -73 36 9 -159 -107 -36 202 14 219 36
7550 36 -320 -256 201 238 -95 45 254 -79 -247 221 -1 21 345 -195 218 -124 58 -212 -27 202 -246
7571 -246 -223 104 -26 -195 133 117 150 -83 -106 157 97 49 179 -99 141 195 207 -82 80 35 7 -15 -26 -163
7595 -163 140 -47 -85 -72 132 158 -112 -42 -28 -252 -154 -170 -51 -125 -33 -176 -131 1 34 -148 240 -63 -9 212
7619 212 173 264 -183 33 180 -91 -130 90 19 -123 -160 57 -77 -283 -19 -181 70 -25 4 -40 -215 -239 69
7642 69 -143 -71 -16 -138 60 -114 -276 -368 243 55 -57 119 51 37 -47 94 -103 -72 191 337 -42 214 -63
7665 -63 -30 243 8 47 -138 74 -54 76 -271 -203 -140 -146 -72 33 5 10 -52 -130 40 61 108 -213 41 135 204 51
7691 51 11 55 95 -206 -55 57 389 114 -128 -136 -206 -64 -139 -106 -274 180 -109 -105 9 -6 46 77 -256 52 -152
7716 -152 -169 -247 149 13 -228 155 94 37 -207 151 -17 -145 -2 -176 -185 138 131 -336 -44 12 -230 -111 -137
7739 -137 123 -93 -36 -74 146 397 48 173 -192 -346 -243 -115 47 -84 101 -152 164 -127 -99 -375 11
7760 11 -21 -12 196 -193 -80 63 146 -177 234 27 357 25 208 -222 108 80 -10 -164 -172 -73 69 -246 61
7783 61 212 -21 -70 146 -60 -160 31 113 -44 -160 190 20 177 26 79 27 195 -94 144 -22 283 -152
7805 -152 -79 242 33 -194 193 260 -7 18 20 220 -49 68 256 -56 -127 164 78 79 -101 -117 -67 -268 -13 -44
7829 -44 -15 37 -112 -331 66 37 -234 428 136 -80 137 -21 82 86 -59 244 -17 -195 -34 -24 58 -46 86
7852 86 -313 0 -82 56 -338 58 -30 -271 87 -196 -106 -38 -82 -336 -51 284 79 -63 197 -103 84 -76
7874 -76 141 150 -145 -22 191 133 -2 70 23 -44 -1 206 -50 311 86 -145 154 101 -96 -119 124 -120 -164 127
7898 127 -216 -14 -168 34 257 -67 -243 177 -238 -101 29 224 142 151 118 14 -73 42 -64 150 10 -115
7920 -115 -57 241 22 -327 140 189 -28 124 -97 9 -182 -107 -33 55 66 74 -138 -155 -47 245 140 -15 28
7943 28 -70 107 -100 60 -122 51 268 153 44 329 -52 -77 45 -74 144 -74 96 71 34 -40 291 164
7965 164 -79 -52 -8 -140 113 -99 -105 455 -155 -174 125 -86 -63 86 -82 54 -30 103 65 -6 267 -66 160
7988 160 -37 -212 177 -211 -101 -109 -278 125 -126 -104 -130 48 -132 -30 150 -136 -151 -56 -99 68 22 250 154
8011 154 84 1 96 23 -4 216 80 113 337 49 131 -110 -156 -74 46 83 -26 -11 -62 47 -100 -272 230 -50
8035 -50 -220 38 -191 1 304 137 -21 -115 106 -174 -31 -104 165 -12 110 -191 193 -139 215 -52 -226
8056 -226 -28 239 -10 193 -24 39 100 -128 104 -191 45 -51 -48 -116 7 -191 -113 -56 179 -286 -417 -3 38
8079 38 -86 9 -78 -86 218 168 128 -29 145 58 -79 79 298 -213 62 -43 366 -47 28 228 -142 47 89
8102 89 191 -70 -195 -77 -146 -184 132 -121 3 143 -229 -223 88 -6 334 174 45 78 84 -67 87 -24 23
8125 23 66 -260 248 214 120 -16 175 154 -67 209 65 -195 -84 -125 115 102 376 368 -113 87 -12 18 -44 -146
8149 -146 125 50 -88 -79 -30 -143 -4 -12 -177 75 -29 115 -173 -137 -72 -333 314 65 -4 -44 -353 -80 -214
8172 -214 -14 30 113 167 199 57 -33 -214 -148 -225 95 127 -86 196 335 9 -127 -77 70
8191G0
##END NTUPLES=NMR FID
##END=
