##TITLE=1H_AEDB-3
 CDCl3
 8 sc, 
 28.5.2024
##JCAMPDX= 6.0         $$ Bruker NMR JCAMP-DX V2.0
##DATA TYPE= NMR FID
##DATA CLASS= NTUPLES
##ORIGIN= UXNMR, Bruker Analytische Messtechnik GmbH
##OWNER= root
$$ XWIN-NMR		Version 3.5
$$ Tue May 28 13:57:43 2024 Russian Standard Time (UT+4h)  she@DPX200
##.OBSERVE FREQUENCY= 200.1309
##.OBSERVE NUCLEUS= ^1H
##.DELAY= (6, 6)
##.ACQUISITION MODE= SIMULTANEOUS
##.ACQUISITION SCHEME= undefined
##.AVERAGES= 8
##.DIGITISER RES= 18
##SPECTROMETER/DATA SYSTEM= spect
##.PULSE SEQUENCE= zg30
##.SOLVENT NAME= CDCl3
##.SHIFT REFERENCE= (INTERNAL, CDCl3, 0, 15.7039)
##AUDIT TRAIL= $$ (NUMBER, WHEN, WHO, WHERE, WHAT)
$$ ##TITLE= Audit trail, XWIN-NMR		Version 3.5
$$ ##JCAMPDX= 5.01
$$ ##ORIGIN= Bruker BioSpin GmbH
$$ ##OWNER= she
$$ F:/spectra/data/she/nmr/H-F/1/audita.txt
$$ ##AUDIT TRAIL=  $$ (NUMBER, WHEN, WHO, WHERE, WHAT)
(   1,<2024-05-28 13:56:30.68 +0400>,<she>,<DPX200>,
      <created by zg, POWCHK disabled, PULCHK disabled
       configuration hash MD5:
       00 E9 B6 7A A2 85 ED C7 34 08 36 98 17 FE 4E 26
       data hash MD5: 16K
       D8 B1 9E DB C5 AD 12 8D BA 15 80 15 BA 14 F8 F7>)
$$ ##END=
$$ 
$$ hash MD5
$$ A9 F2 40 C8 39 D8 DF AA A7 CC 98 63 5D 38 1D F0
##$RELAX= 
##$RELAX= 
##$RELAX= 
##$RELAX= 
##$RELAX= 
##$RELAX= 
$$ Bruker specific parameters
$$ --------------------------
##$DU= <F:/spectra>
##$EXPNO= 1
##$NAME= <H-F>
##$PROCNO= 1
##$TYPE= <nmr>
##$USER= <she>
##$AMP= (0..31)
100 100 100 100 100 100 100 100 100 100 100 100 100 100 100 100 100 100 
100 100 100 100 100 100 100 100 100 100 100 100 100 100 
##$AQSEQ= 0
##$AQ_mod= 1
##$AUNM= <au_zg>
##$AUTOPOS= <>
##$BF1= 200.13
##$BF2= 200.13
##$BF3= 200.13
##$BF4= 200.13
##$BF5= 200.13
##$BF6= 200.13
##$BF7= 200.13
##$BF8= 200.13
##$BYTORDA= 1
##$CFDGTYP= 0
##$CFRGTYP= 5
##$CHEMSTR= <none>
##$CNST= (0..31)
1 1 145 1 1 1 1 1 1 1 1 1 1 1 1 1 1 1 1 1 1 1 1 1 1 1 1 1 1 1 1 1 
##$CPDPRG= <>
##$CPDPRG1= <>
##$CPDPRG2= <>
##$CPDPRG3= <>
##$CPDPRG4= <mlev>
##$CPDPRG5= <mlev>
##$CPDPRG6= <mlev>
##$CPDPRG7= <mlev>
##$CPDPRG8= <mlev>
##$CPDPRGB= <>
##$CPDPRGT= <>
##$D= (0..31)
0 1.2 0 0 0 0 0 0 0 0.06 0 0.03 0 0 0 0 0.0002 0 0 0 0 0 0 0 0 0 0 0 0 
0 0 0 
##$DATE= 1716890190
##$DBL= (0..7)
120 120 120 120 120 120 120 120 
##$DBP= (0..7)
150 150 150 150 150 150 150 150 
##$DBP07= 0
##$DBPNAM0= <>
##$DBPNAM1= <>
##$DBPNAM2= <>
##$DBPNAM3= <>
##$DBPNAM4= <>
##$DBPNAM5= <>
##$DBPNAM6= <>
##$DBPNAM7= <>
##$DBPOAL= (0..7)
0.5 0.5 0.5 0.5 0.5 0.5 0.5 0.5 
##$DBPOFFS= (0..7)
0 0 0 0 0 0 0 0 
##$DE= 6
##$DECBNUC= <off>
##$DECIM= 32
##$DECNUC= <off>
##$DECSTAT= 4
##$DIGMOD= 1
##$DIGTYP= 9
##$DL= (0..7)
0 120 120 120 120 120 120 120 
##$DP= (0..7)
150 150 150 150 150 150 150 150 
##$DP07= 0
##$DPNAME0= <>
##$DPNAME1= <>
##$DPNAME2= <>
##$DPNAME3= <>
##$DPNAME4= <>
##$DPNAME5= <>
##$DPNAME6= <>
##$DPNAME7= <>
##$DPOAL= (0..7)
0.5 0.5 0.5 0.5 0.5 0.5 0.5 0.5 
##$DPOFFS= (0..7)
0 0 0 0 0 0 0 0 
##$DQDMODE= 0
##$DR= 18
##$DS= 0
##$DSLIST= <SSSSSSSSSSSSSSS>
$$ [...]
##$SUBNAM2= <"">
##$SUBNAM3= <"">
##$SUBNAM4= <"">
##$SUBNAM5= <"">
##$SUBNAM6= <"">
##$SUBNAM7= <"">
##$SUBNAM8= <"">
##$SUBNAM9= <"">
##$SW= 18.0517689322627
##$SWIBOX= (0..15)
0 0 2 0 0 0 0 0 0 0 0 0 0 0 0 0 
##$SW_h= 3612.71676300578
##$TD= 16384
##$TD0= 1
##$TE= 0
##$TE2= 300
##$TE3= 300
##$TEG= 300
##$TL= (0..7)
0 120 120 120 120 120 120 120 
##$TP= (0..7)
150 150 150 150 150 150 150 150 
##$TP07= 0
##$TPNAME0= <>
##$TPNAME1= <>
##$TPNAME2= <>
##$TPNAME3= <>
##$TPNAME4= <>
##$TPNAME5= <>
##$TPNAME6= <>
##$TPNAME7= <>
##$TPOAL= (0..7)
0.5 0.5 0.5 0.5 0.5 0.5 0.5 0.5 
##$TPOFFS= (0..7)
0 0 0 0 0 0 0 0 
##$TUNHIN= 0
##$TUNHOUT= 0
##$TUNXOUT= 0
##$USERA1= <user>
##$USERA2= <user>
##$USERA3= <user>
##$USERA4= <user>
##$USERA5= <user>
##$V9= 5
##$VALIST= <valist>
##$VCLIST= <CCCCCCCCCCCCCCC>
##$VD= 0
##$VDLIST= <DDDDDDDDDDDDDDD>
##$VPLIST= <PPPPPPPPPPPPPPP>
##$VTLIST= <TTTTTTTTTTTTTTT>
##$WBST= 1024
##$WBSW= 4
##$XGAIN= (0..3)
0 0 0 0 
##$XL= 0
##$YL= 0
##$YMAX_a= 341193
##$YMIN_a= -477658
##$ZGOPTNS= <>
##$ZL1= 120
##$ZL2= 120
##$ZL3= 120
##$ZL4= 120
##$ABSF1= 10
##$ABSF2= 0
##$ABSG= 5
##$ABSL= 3
##$ALPHA= 0
##$AQORDER= 0
##$ASSFAC= 0
##$ASSFACI= 0
##$ASSFACX= 0
##$ASSWID= 0
##$AUNMP= <proc_1d>
##$AZFE= 0.1
##$AZFW= 0.1
##$BCFW= 1
##$BC_mod= 2
##$BYTORDP= 1
##$COROFFS= 0
##$CY= 11.3945322036743
##$DATMOD= 1
##$DC= 2
##$DFILT= <>
##$DTYPP= 0
##$F1P= 15.6554695791079
##$F2P= 12.8336369535428
##$FCOR= 0.5
##$FTSIZE= 0
##$FT_mod= 4
##$GAMMA= 1
##$GB= 0.15
##$INTBC= 1
##$INTSCL= 1
##$ISEN= 128
##$LB= 0.24
##$LEV0= 0
##$LPBIN= 0
##$MAXI= 10000
##$MC2= 0
##$MEAN= 0
##$ME_mod= 0
##$MI= 1.114404
##$NCOEF= 0
##$NC_proc= 0
##$NLEV= 6
##$NOISF1= 3.799351
##$NOISF2= 2.8
##$NSP= 1
##$NTH_PI= 0
##$NZP= 0
##$OFFSET= 15.70392
##$PC= 1
##$PHC0= -25311.57
##$PHC1= 9.387482
##$PH_mod= 1
##$PKNL= yes
##$PPARMOD= 0
##$PSCAL= 0
##$PSIGN= 0
##$REVERSE= no
##$SF= 200.130013532006
##$SI= 16384
##$SIGF1= 3
##$SIGF2= 2
##$SINO= 400
##$SIOLD= 16384
##$SREGLST= <1H.CDCl3>
##$SSB= 0
##$STSI= 0
##$STSR= 0
##$SW_p= 3612.71676300578
##$SYMM= 0
##$S_DEV= 0
##$TDeff= 0
##$TDoff= 0
##$TI= <>
##$TILT= no
##$TM1= 0
##$TM2= 0
##$TOPLEV= 0
##$USERP1= <user>
##$USERP2= <user>
##$USERP3= <user>
##$USERP4= <user>
##$USERP5= <user>
##$WDW= 1
##$XDIM= 8192
##$YMAX_p= 0
##$YMIN_p= 0
$$ End of Bruker specific parameters
$$ ---------------------------------
##NTUPLES= NMR FID
##VAR_NAME=  TIME,          FID/REAL,        FID/IMAG
##SYMBOL=    X,             R,               I
##VAR_TYPE=  INDEPENDENT,   DEPENDENT,       DEPENDENT
##VAR_FORM=  AFFN,          ASDF,            ASDF
##VAR_DIM=   8192,          8192,            8192
##UNITS=     SECONDS,       ARBITRARY UNITS, ARBITRARY UNITS
##FACTOR=    0.0002768,     1,               1
##FIRST=     0,             0,               0
##LAST=      2.2672688,     0,               0
##MIN=       0,             -477658,         0
##MAX=       2.2672688,     341193,          0
$$ Real data points
##PAGE= N=1
##DATA TABLE= (X++(R..R)), XYDATA
0 0 0 0 0 0 0 0 0 0 0 0 0 -7 8 -7 8 -8 8 -12 16 -16 18 -24 24 -32 36 -40 48 -54 62 -70 83 -93 103 -117 131
35 131 -146 164 -184 203 -226 252 -277 307 -338 373 -411 454 -501 548 -605 667 -735 810 -896
54 -896 995 -1107 1236 -1386 1565 -1784 2053 -2399 2851 -3476 4379 -5797 8274 -13398 27927
69 27927 -145785 -477658 149383 112686 -295844 172009 329258 -259490 -192460 167532 -45065
80 -45065 -58044 238973 63123 -187110 -73761 -10355 -30713 69955 119502 36848 -97224
91 -97224 -110164 30077 45654 504 116090 42946 -198891 -87110 86587 -28635 33544
102 33544 168599 -55892 -146016 40084 -17185 -25384 163323 9454 -150754 36386 -12989
113 -12989 -123368 150389 158353 -140357 -35060 85513 -122701 -36621 184983 9870 -101641
124 -101641 18652 -37821 -64724 69630 58044 7503 8725 -67208 -46504 45190 -2146 9473
136 9473 66630 -63696 -91739 60528 9123 -40219 114646 34355 -140591 11847 71685
147 71685 -83942 15348 120286 -56537 -87733 52031 20341 -26052 44415 37751 -30766
158 -30766 -45713 -22255 25411 25438 -21397 16092 23858 -66985 -17273 72433 -13346 -25765 49280
171 49280 -36036 -63873 54164 18739 -42993 49036 19658 -82042 11319 58977 -38376 2140
183 2140 54449 -38425 -34288 32597 -2670 358 29077 -18993 -15161 21267 -16890 -5005 46237
196 46237 -6848 -41478 14167 1864 -28665 19536 18676 -17322 850 -6131 -15529 22669 6020
209 6020 -23241 14244 6461 -35611 4826 35959 -8453 -10513 18767 -6115 -15462 9778 5404
222 5404 2084 5133 -11559 -1501 12575 -4871 -298 11740 -5754 -9326 -446 -3568 5891 7720
236 7720 -14514 -2655 17458 -17479 -17807 32224 2166 -37315 15000 21967 -28645 -1707 29757
249 29757 -9533 -17192 13541 2492 -9373 11131 5572 -8653 7062 2186 -11865 8065 12970
262 12970 -9411 -6269 9628 1942 -12436 225 15066 -4207 -16797 4830 9774 -11446 -7875
275 -7875 13306 3664 -16005 -1063 10359 -5923 -5750 5778 2557 -1106 -1572 297 4491 2875
289 2875 -2428 -1306 5400 3342 -6721 -670 10717 -610 -9666 3766 10061 -5474 -11056 9304
303 9304 8511 -14739 -4424 14347 -3583 -14664 3803 8297 -8061 -6494 8961 2154 -6796
316 -6796 862 1142 -2422 1995 -1632 -2411 6807 4149 -6270 1122 13283 -2373 -12946 10277
330 10277 9729 -16531 -4005 17918 -1056 -13968 8455 11403 -13235 -7845 10707 -3313 -9960
343 -9960 4794 933 -4117 3115 -1714 -4531 5296 1942 -10615 961 11526 -6902 -8974 14126
357 14126 6377 -12627 765 11789 -2641 -10210 5079 12118 -4828 -6830 10085 3731 -10684
370 -10684 -1877 7244 -2570 -5687 3273 657 -3124 2996 -3102 -3414 7592 -5532 -12973 8033
384 8033 5692 -11867 1668 13697 -3856 -9812 5572 6108 -4916 -3589 4378 6477 -3611 -7130
398 -7130 11739 9629 -13496 438 13211 -11953 -7554 13901 -2284 -7184 10019 -4580 -10882
411 -10882 13825 -416 -18885 14163 8950 -28731 3214 25440 -16642 -11459 22233 -3556
423 -3556 -20372 8693 11936 -6502 -330 6234 -2203 -3192 973 3799 4278 -1793 -1188 -673 -5303
438 -5303 6914 7821 -11018 4947 11485 -23737 -8123 29459 -7801 -23752 24712 5979 -36443
451 -36443 10596 26647 -22305 -4511 20731 -18047 -10317 19074 -5415 -3184 17288 -11599
463 -11599 -13495 18217 393 -11107 16147 4244 -17513 3012 5704 -3203 9852 -1221 -9577
476 -9577 9292 -5863 -14056 19900 7331 -22635 3789 8962 -17498 2358 16600 -8118 -2710
489 -2710 4029 -15449 3111 17571 -13058 -1550 19149 -16937 -14421 24411 4493 -12673 9264
502 9264 1676 -11853 1498 3826 5747 9783 -10855 -8542 13807 -8590 -11248 25536 -490
515 -490 -26564 14221 4749 -23875 19398 15634 -31557 4342 20737 -31293 -1423 40776 -18390
528 -18390 -25692 30822 -2202 -29579 22540 16475 -21670 -254 8218 -5651 5778 5149 -1918
541 -1918 6045 -7617 -14078 13241 8953 -11796 5881 5873 -16775 546 11508 -4757 4341 735
555 735 -18253 1294 8712 -7824 9864 12042 -18042 -7538 8977 -7972 6174 18449 -14808
568 -14808 -8042 15105 -15923 -4900 38091 -5434 -30296 19059 1968 -28954 20987 27046
580 27046 -20427 -6424 8097 -16146 762 18320 -4693 -125 3103 -23494 -2036 24098
592 24098 -5344 -4687 15492 -15991 -21716 14593 10421 -2144 10288 -2205 -17435 -135 6319
605 6319 2383 12570 3058 -14622 -6329 614 5463 13572 2311 -3998 -1377 -17849 -7671 25818
619 25818 6937 -15475 9987 378 -30508 5528 29358 -8101 -7904 9976 -17655 -13918 17878
632 17878 6030 1122 10852 -15628 -17470 13217 4985 -3841 18480 1885 -25539 -1162 11527
645 11527 -2461 10744 11302 -14781 -8675 2004 -5534 9719 17641 -8344 -13585 1219 -3944
658 -3944 -4236 13041 10794 -7792 -12767 -4611 3092 3398 2734 8821 -58 -18437 -4544 12208 882
673 882 3269 10288 -9041 -11651 4866 573 2799 16011 -3212 -17922 5570 4467 -12178 12537
687 12537 18358 -17347 -12370 10964 -3777 -5203 14312 3175 -12744 -4600 -178 -1433 7430
700 7430 6309 -4519 -3829 -2456 -5869 2064 9414 3865 -4195 -5623 1038 1800 -2558 6166 9490
715 9490 -8495 -10589 5951 4244 -5255 6248 8277 -8967 -7458 4644 -203 -172 4446 -2797
729 -2797 -4596 751 -2593 -388 7194 1139 -7818 -2271 3826 -2483 -1944 7110 3655 -6644 -4108
744 -4108 5438 3164 -4411 1576 6805 -5559 -6164 7391 4235 -3332 1705 1414 -5287 -1894 3222
759 3222 -800 1349 4438 -5373 -4781 6364 -579 -6861 4672 4417 -9065 -4673 8592 1984 -6341
774 -6341 3327 6265 -6860 -5122 6061 2942 -3793 1002 3932 -1469 -2000 3105 1209 -536 1142
789 1142 -2612 -2195 3994 441 -3488 3082 3717 -5564 -4020 5834 622 -7360 1513 5864 -4243
804 -4243 -4045 4875 3019 -5080 -2204 4077 -178 -3542 2159 2508 -574 -221 -85 808 1674 -115 -1646
821 -1646 1551 2774 -2746 -2536 5580 1609 -6222 1030 4828 -3858 -4623 4105 3364 -4986 -2120 4507
837 4507 -613 -4772 592 2595 -1245 -2559 808 1715 -657 -374 676 609 1705 -1465 -2125 3743
853 3743 1948 -4082 565 5907 -1792 -5013 4368 4138 -6129 -1342 5924 -1015 -4469 1203 2231
868 2231 -1345 -2448 638 1711 -1219 -2060 286 1601 -757 -2243 832 1882 -547 -1178 58 2738
884 2738 491 -3842 1437 4991 -3758 -3112 6178 1934 -5167 1281 5444 -1975 -3489 2916 1685
899 1685 -2391 -931 1203 1695 -1037 -3034 1718 1310 -3737 -326 2151 -1371 -772 32 -1196 1570
915 1570 1189 -3788 882 5634 -5082 -4612 9419 1437 -8556 5652 6457 -8012 -1962 7348 -1323
930 -1323 -4216 3776 1632 -3434 1330 1116 -1636 1285 402 -3535 -913 2147 -657 -2568 1923 4542
946 4542 -4699 -5528 7110 983 -9502 4331 8399 -8854 -4212 11879 -843 -8270 8197 2754
960 2754 -10157 4139 4774 -7050 3500 6699 -8627 -648 8703 -5864 -5273 9699 -230 -10489
974 -10489 3745 5889 -5808 -970 4623 -1113 -4657 -1696 2838 1592 -2964 1418 3652 -3958
988 -3958 -2352 4244 192 -940 3385 -2102 -3806 5629 779 -4582 7071 2714 -10846 619
1002 619 7449 -5813 -1377 8153 -1780 -6073 1221 1046 -383 1160 -1545 -439 553 -5637 -245
1017 -245 8016 -1969 -4207 5014 -2903 -5538 5712 1544 -3345 5008 -1040 -7589 6076 5135 -7626
1032 -7626 3681 8023 -9825 -4388 10926 -1113 -5623 6222 902 -6633 -60 2503 545 743
1046 743 -1558 -1419 188 -1776 -481 3752 253 -2180 -7 -2353 328 5094 -2477 -1607 6455 -4695
1062 -4695 -7289 9873 3831 -8948 3894 6224 -9067 -1576 8997 -1901 -3274 4388 -3068
1075 -3068 -3521 4312 -1068 -1456 4713 -3215 -4680 3283 941 -2061 2309 -34 -2595 -134 -2092
1090 -2092 512 5981 -2465 -5545 6607 546 -8688 7287 7912 -9351 -1569 7275 -4580 -2599
1104 -2599 7717 253 -4509 2379 -787 -3188 4060 1470 -4274 781 772 -3743 125 4240 1401
1119 1401 -3546 -3236 2702 195 -4974 4092 6396 -6824 -4572 7671 -1319 -6076 7754 3389
1133 3389 -9273 2051 4784 -6071 3676 7846 -7468 -2441 7203 -6031 -4373 11057 236
1146 236 -9865 3815 4445 -7448 496 7504 -2871 -5007 815 272 -516 874 1538 859 -2332
1161 -2332 -2783 666 990 663 1004 -703 -1189 1412 -257 -864 5172 1007 -6766 1017 4194 -4452
1177 -4452 277 7096 -1831 -4776 1596 284 -1590 1845 354 -1786 -89 -2409 -1708 5021 1222
1192 1222 -4067 1355 847 -4531 409 4184 -137 -301 -283 -2168 485 2000 -1204 1571 3686 -3976
1208 -3976 -3710 5127 1627 -3819 2566 2927 -3986 -2997 2781 1938 -1098 -276 1691 -1288 -2999 162
1224 162 2307 10 -1287 229 -857 -1343 1659 376 -260 2523 -1539 -4056 2987 2704 -3512 674
1240 674 4613 -2656 -4175 3636 2574 -2951 -6 2509 -1589 -1684 416 1195 1117 -1163 -1379 571 -172
1257 -172 -1419 160 1824 -286 -2503 -546 1603 331 -1389 412 2695 -1147 -3428 2215 2927
1272 2927 -2507 -635 3237 -952 -2492 1321 1895 -600 -258 829 -757 -963 417 -597 1124 1524
1288 1524 -1737 -1387 1495 404 -2559 -119 3139 -798 -4544 2018 2820 -3426 -1524 4236 236
1303 236 -4866 794 3898 -2321 -1629 3673 -140 -2380 1069 1039 -533 971 562 -1141 200 1428
1319 1428 -1390 -751 2817 -411 -3674 847 2034 -2629 -1903 3159 1092 -4380 -295 3702 -1938
1334 -1938 -3045 2898 1149 -2958 -59 2151 -297 -333 1129 -604 -544 1042 -1367 -291 3241 -441
1350 -441 -2600 2177 2201 -2834 -849 3077 -419 -3460 959 2874 -1638 -1354 2170 571 -2428 -823
1366 -823 1832 -427 -1391 1226 5 -683 1002 -802 -797 2245 -107 -3205 1241 3106 -2415 -1301
1382 -1301 5119 -69 -4564 2280 2655 -3019 -769 2560 167 -1584 -88 1452 -245 -1081 -101 -242
1398 -242 -465 -693 52 624 -32 -44 -631 -133 1175 -1369 -2033 2812 875 -3897 1089 4005 -2328 -2267
1416 -2267 3521 674 -3139 942 2042 -1162 -261 893 -310 906 -412 -1170 1752 220 -2279
1431 -2279 288 1563 -1137 -823 723 412 -726 -561 -833 1002 518 -2805 981 2965 -2399 -1928
1447 -1928 3559 115 -2620 1615 1874 -1218 -685 1172 421 -175 -549 -80 1194 -337 -1886 1030
1463 1030 895 -1488 140 505 -230 409 -1190 -963 2312 -717 -3367 2556 2034 -4595 -50 5240
1479 5240 -2639 -3240 4693 157 -3934 2282 1301 -2821 1462 1146 -2306 1238 1821 -2892 109 3649
1495 3649 -1519 -2783 2854 514 -3000 523 2332 -680 -2217 404 1432 -1603 -1784 2218 1280
1510 1280 -2580 240 1534 -1225 -234 1580 -862 -535 1250 -2195 -688 4229 -895 -2759 4013
1525 4013 608 -4760 1739 3377 -2466 -927 2352 -1014 -1141 1637 -324 255 812 -2606 -948 2597
1541 2597 -1457 -1751 3183 -154 -3658 672 1593 -1140 -131 1108 -436 -567 -351 -108 1790 1186
1557 1186 -1792 -36 727 -1276 -403 2039 1261 46 -1234 -152 1326 -813 -1095 2717 438 -3848
1573 -3848 -548 2973 -1035 -904 2937 -817 -3037 595 -33 -215 2356 -240 -1852 1136 -37 -2579
1589 -2579 1836 3102 -2352 -2036 2422 -379 -1515 2169 1693 -542 -1538 -821 728 333 -737 1236
1605 1236 720 -2318 -1396 1204 494 -143 698 -589 -1191 767 -841 84 3218 -669 -3430 1905 1680
1622 1680 -3082 877 4358 -1525 -3398 1952 1803 -2182 669 2481 -1325 -2181 483 747 31 583
1638 583 911 -1077 -1222 534 -689 -340 2427 -420 -3795 624 2053 -2692 -679 4554 -1097 -4899
1654 -4899 2215 2674 -4033 466 4345 -1939 -2605 2176 490 -1320 2036 776 -1818 215 674 -1995
1670 -1995 842 2828 -1799 -1844 1862 76 -2341 859 2620 -1594 -2644 1665 1296 -1996 -11 2041
1686 2041 -711 -1943 469 779 -635 98 261 -482 187 99 -870 1791 1194 -1571 -804 1589 -30
1703 -30 -1500 1361 2420 -1390 -1574 1100 277 -807 16 1213 410 -1761 -607 1493 -281 -1278 631
1720 631 420 -792 -799 774 197 200 255 -404 -90 853 -1032 -720 2236 218 -2439 1368 2332 -1585 -1358
1739 -1358 2657 554 -3210 625 2389 -1148 -1651 2136 673 -2061 -209 1138 -649 -520 1274
1754 1274 -676 -691 1011 -533 -965 1736 610 -2453 5 2333 -1475 -1901 3152 1132 -3010 378
1770 378 2498 -1235 -1709 1976 1277 -2178 -225 1531 -118 -731 485 219 -721 -351 -442 285 545 353
1788 353 -744 -428 832 -931 -1362 1633 757 -2103 -393 1882 -144 -1337 1482 1443 -1898 -1092 1664
1805 1664 206 -1057 816 882 -322 -868 11 644 81 -55 -450 -245 295 -738 -461 1282 368 -1481
1823 -1481 -834 1535 -36 -1742 953 1845 -1918 -1338 2121 -3 -1325 706 1418 -1147 -887 1009
1839 1009 35 -218 745 -56 -506 659 -259 -304 1042 592 -1469 -773 1580 -277 -2320 1062 1615 -2007
1857 -2007 -1708 2165 198 -2117 508 2193 -1502 -1665 1642 435 -1260 995 498 -1074 92 647
1873 647 -406 526 1166 -1287 -1078 1875 -34 -1641 1583 1606 -1817 -1372 1518 905 -1710 -183 1813
1890 1813 -1161 -1893 778 1191 -1280 -473 1236 -50 -948 613 449 -273 297 -147 -1123 685 693 -907
1908 -907 719 1618 -1068 -1190 1629 413 -1965 151 1699 -1258 -1243 1261 798 -583 -441 492 185
1925 185 -1482 102 1037 -446 -599 258 -42 -290 273 -7 -267 1038 -125 -1655 1092 1598 -2009
1942 -2009 -325 2281 -768 -2368 1548 1705 -1440 -159 1621 -288 -1861 420 780 -346 -539 336
1958 336 530 -564 -180 598 -24 -232 231 -1072 -364 1194 -400 -1023 2276 975 -2462 530 2919
1975 2919 -1774 -1723 2787 149 -2866 1354 1921 -1570 -289 1477 -339 -1174 613 153 -603 783
1991 783 365 -734 140 725 -714 -844 1507 644 -2502 133 2717 -1669 -2214 2850 672 -3791 966
2008 966 3041 -2196 -1075 3234 -395 -2416 2266 767 -2213 1468 1015 -2451 994 1995 -1919
2023 -1919 -639 2836 -455 -2683 1477 1539 -2599 -603 2505 -490 -1974 740 1944 -1332 -1066 1838
2039 1838 87 -1986 746 1036 -954 501 970 -1300 63 1583 -942 -922 2277 -519 -2466 2205
2055 2205 984 -2583 287 2309 -1022 -940 1143 271 -694 20 366 90 -232 -549 -11 814 -836 -583
2073 -583 1062 -190 -811 391 156 129 508 -766 -55 1206 -936 -1277 1550 518 -2210 587 2007
2090 2007 -1309 -1305 1426 266 -1031 -221 588 -187 -650 -142 1123 83 -694 151 101 -372 -226 244 -454
2109 -454 628 350 -1428 726 1745 -1707 -886 2300 -828 -2374 2065 1671 -2235 -136 1895 -1301
2125 -1301 -1708 1564 358 -885 416 -117 -359 493 -42 16 811 -133 -1074 -402 701 184 -155 388
2143 388 515 -563 -1365 84 1857 -633 -943 1653 87 -1787 975 1691 -763 -217 447 -508 -326
2160 -326 429 408 610 434 -975 -714 870 -96 -540 906 281 -1016 -619 401 1038 133 -631 504
2178 504 278 -1472 140 2293 -32 -1481 950 162 -1665 525 1788 -620 -379 501 -993 420
2194 420 1444 -319 -349 833 -800 -1810 1187 1825 -1264 -401 1325 -625 -1627 675 1610 -374
2210 -374 -1493 88 345 -1317 224 1984 38 -1241 -150 48 -292 520 751 -276 254 -95 -1185
2227 -1185 646 1603 -690 -565 880 -521 -1014 494 1324 -302 -1045 89 321 -420 -182 949 588
2244 588 -1287 -850 932 -35 -735 774 365 -1071 -490 65 190 834 -53 -528 -150 324 -1153 -202
2262 -202 2031 -132 -1699 780 385 -1140 263 1354 133 -1243 -306 938 38 -115 952 238
2278 238 -1087 -612 451 686 484 153 -548 -481 296 -627 -275 1840 172 -2023 623 1296 -1030 -214
2296 -214 1961 24 -1886 398 1137 -447 49 884 -88 -797 -274 169 254 -53 -42 -322 -330 68 -253 20
2316 20 927 -186 -1285 194 1106 -644 -787 1616 913 -1951 -79 1669 -758 -557 1100 44 -1174
2333 -1174 122 1240 -4 -177 551 -164 -442 -30 -130 185 530 35 -674 -206 922 -129 -918 313
2351 313 611 -1263 -327 1817 -107 -1362 1120 985 -1679 -301 1610 -461 -699 1087 510 -527
2367 -527 89 106 -159 -50 183 -510 -174 1009 -324 -689 958 412 -995 -186 812 -432 -1265 642
2385 642 928 -1370 -483 1698 -290 -1042 607 592 -667 -2 582 -578 -137 736 -590 -206 1388 -930
2403 -930 -685 1569 -27 -1426 680 1108 -784 -1230 700 513 -1067 -274 923 -76 -967 -21 846
2420 846 -444 -1272 459 -56 -724 139 132 54 319 -67 48 704 314 -763 98 1101 -901 -855 1196
2439 1196 445 -1067 118 615 -198 -573 15 909 159 -663 79 430 -205 -370 850 401 -774 -603
2457 -603 276 -277 -162 -76 -165 595 57 -977 411 1018 -791 -389 845 112 -904 618 893 -475
2475 -475 -182 192 190 -157 -437 525 700 -837 -239 797 58 -596 269 72 -437 -278 -281 -306 543 162 -913
2496 -913 381 816 -1122 -201 1426 -326 -1317 613 667 -495 -247 875 142 -1003 -136 737 13 -506
2514 -506 124 775 -439 -625 545 12 -90 430 -718 -466 757 -455 -912 1339 266 -1858 181
2531 181 1540 -1191 -1060 1742 246 -1567 507 794 -536 -13 570 114 -284 -225 -270 251 481 -48
2549 -48 -422 203 355 -708 -112 981 273 -1164 30 1196 -979 -1097 1453 506 -1800 142 993
2566 993 -886 -444 1290 42 -820 254 -96 -198 515 -276 -690 741 61 -803 540 612 -470 -414
2584 -414 183 392 -482 -358 751 293 -713 -402 709 307 -1003 245 1120 -685 -461 664 324 -534
2602 -534 401 92 -134 -110 -225 -16 722 137 -557 444 496 -35 161 451 481 -652 -715 512 534 -1420
2622 -1420 322 1273 -634 -1309 1173 617 -955 210 902 -991 -729 1101 -161 -201 524 -475 -679
2639 -679 1107 -187 -1025 783 1077 -1141 -263 1423 -261 -1158 751 609 -1009 -596 956 187 -993
2656 -993 61 643 -937 -343 816 -9 -403 323 -159 -972 614 442 -591 518 997 -1309 -575 1760
2674 1760 -44 -1170 963 835 -1034 -389 1164 264 -938 111 453 -498 -326 635 342 -180 -250 109
2692 109 -4 -165 390 -610 -170 543 -431 -612 1310 255 -1364 -21 1067 -976 -909 1730 273
2709 273 -1570 443 888 -676 -87 991 146 -789 -287 332 -22 305 276 -168 -60 -188 -631 36 716
2728 716 342 -793 -303 1058 -513 -889 1210 361 -1649 -30 1271 -358 -370 1004 -14 -946 273
2745 273 195 -284 355 479 -669 -108 256 -257 -73 706 -248 -993 -95 584 -367 -582 983 563 -1384
2764 -1384 -758 840 26 -1188 540 948 -1536 -492 1212 -123 -258 448 -109 -569 238 -9 -37 452
2782 452 548 -546 10 259 -400 -89 675 223 -714 -496 710 276 -652 642 638 -1166 -566 776 317
2801 317 -815 -137 540 -620 -379 716 86 69 -130 -540 -562 381 162 -209 849 237 -1019 -282 769
2820 769 -42 -469 695 587 -770 -472 904 722 -476 -124 751 -487 -653 1001 484 -554 111 334
2838 334 -235 75 107 -131 59 819 -553 -537 1050 91 -986 289 563 -454 -449 926 299 -921 0
2857 0 1124 -274 -923 576 700 -598 -504 361 -107 -888 626 382 -538 358 12 -639 237 520 -673
2876 -673 3 1051 -251 -1150 985 722 -1236 -13 1146 -374 -925 889 686 -692 -710 827 -119
2893 -119 -574 531 178 -315 188 347 -304 31 525 -735 -293 910 -188 -1153 759 981 -1442 -123
2911 -123 1402 -591 -1234 696 495 -1165 -33 1001 -39 -618 502 52 -142 297 329 -109 65 192
2929 192 -384 -234 803 12 -1027 750 976 -948 -313 1318 -66 -1646 676 1044 -1124 -225 1078
2946 1078 -356 -845 481 -179 -545 220 439 -122 106 292 -444 -196 539 -364 -482 404 210 -403 -128
2965 -128 564 220 -894 281 970 -609 -669 1122 487 -1332 41 943 -433 -593 651 -236 -766 623
2983 623 105 -489 492 -64 -774 626 90 -374 -5 751 73 -1124 124 913 -820 -617 543 590 -1113
3002 -1113 -97 1232 -278 -991 1262 242 -1105 343 760 -448 -131 787 -557 -459 720 -102 -745
3019 -745 1067 152 -1340 126 1125 -386 -453 944 305 -1294 -84 1141 -383 -629 534 273 -794
3036 -794 -451 1048 -19 -768 423 -51 -875 614 226 -678 514 693 -798 -390 975 -196 -1012
3053 -1012 1061 491 -1353 144 1090 -607 -425 801 114 -396 101 882 -124 -412 169 122 -425 112
3071 112 242 -339 527 281 -591 -324 804 -3 -891 598 824 -1393 28 1526 -671 -1140 893 94
3089 94 -1273 161 965 -630 -76 411 -292 -265 480 -123 -56 247 -326 -179 37 227 39 -457 425 242
3109 242 -608 -375 715 -112 -612 238 405 -781 -244 802 -422 -646 547 330 -483 78 -79 -4 358
3128 358 -277 -212 440 205 -408 30 534 -140 97 120 -132 -27 -243 -188 469 66 -686 322 599 -891
3148 -891 -16 1005 -298 -717 657 425 -289 204 258 -540 139 307 -200 -65 169 -472 -243 395 248
3167 248 -359 25 325 -337 -335 -102 549 -389 -328 819 -205 -1254 686 665 -695 -369 718 -228 -570
3186 -570 371 79 -327 289 -24 -592 402 229 -566 289 517 -588 -221 438 285 -317 -290 590 85 -477
3206 -477 313 563 -453 -413 608 389 -570 -139 729 -431 -501 669 -513 -203 401 -410 -247 432 -282
3225 -282 -578 339 352 -989 -203 619 -252 -389 415 215 -245 -195 239 438 -465 -202 540 -415 -243 522
3245 522 242 -209 -134 121 -616 208 289 -433 39 482 -811 -912 823 -292 -806 409 539 -723 -372
3264 -372 991 66 -870 277 779 -172 -309 231 214 -186 -124 154 -4 -309 317 -25 -94 498 -181 -576
3284 -576 538 2 -448 -26 598 -525 -626 884 226 -1060 307 535 -503 -423 364 228 -563 -313
3302 -313 408 -270 172 100 -50 199 -100 -348 -307 251 58 -300 93 437 -115 -729 629 714 -658 11
3322 11 795 -153 -394 603 385 -754 -65 920 -349 -12 320 -387 -56 -138 -121 -164 374 188 -269 -239 284
3343 284 -245 -451 361 200 -493 -276 270 -156 -811 296 557 -1091 -440 371 120 -210 275 291 -429 75
3363 75 412 -94 226 315 -342 16 467 -30 -293 484 356 -133 -209 704 170 -678 372 439 -323 -253 274
3384 274 369 -530 -212 558 -503 -199 676 104 -570 285 34 -185 87 -126 -622 162 236 -20 -273 582
3404 582 105 -841 305 414 -522 -433 674 151 -399 -46 738 -38 -354 393 135 -160 53 439 -215 -105
3424 -105 391 -77 -221 406 -170 -671 564 83 -765 -113 439 -647 -587 326 -47 -668 399 508 -450
3443 -450 -153 322 309 -8 -118 164 164 -270 13 -77 84 -99 -42 -273 324 140 -126 -209 516 -304 -507 628
3465 628 331 -998 24 510 -347 -486 45 -126 -272 15 77 33 214 129 -86 -34 65 -137 69 273 -57
3486 -57 277 -30 123 123 -213 340 437 -348 -578 562 23 -567 185 385 -278 -850 349 -120 -320 -145 -175
3507 -175 120 -9 102 602 37 -39 -192 39 -79 237 -242 -4 -25 -117 -146 191 170 -492 -310 747 -160
3528 -160 -703 452 20 -533 -10 257 -236 -116 262 -9 -474 223 239 -196 123 73 -139 17 -78 -205 -21
3549 -21 257 117 -315 -221 360 -256 -499 182 433 -620 -387 741 9 -815 266 526 -600 422 521
3568 521 -414 -324 422 -142 -217 159 -90 -555 400 432 -695 193 694 -226 -16 200 236 -441 -170 370 50
3589 50 -709 357 724 -853 -182 642 -198 -432 668 261 -464 334 -57 -322 159 417 -460 -329 490
3608 490 -85 -791 301 405 -667 55 777 -343 -434 389 199 -334 -402 506 209 -159 104 515 -213 56
3628 56 41 35 -77 375 -66 -124 293 -95 -668 418 269 -696 -289 790 -301 -836 336 427 -285 -451 453
3649 453 110 -432 126 192 -12 -76 236 353 -95 -78 191 -95 -162 256 -195 -253 476 -150 -395 653 68
3670 68 -606 -4 891 -466 -578 557 172 -575 93 360 -253 -300 158 -75 -218 84 -49 -297 194 127
3690 127 -369 204 -15 -280 -53 390 68 -420 39 953 -416 -650 511 380 -640 -85 731 -512 -377
3709 -377 735 159 -165 111 369 -526 38 267 -248 -26 99 15 -352 275 261 -285 -53 409 -156 -379
3729 -379 379 287 -660 -245 309 45 -527 243 381 -385 -50 645 -303 -520 559 -256 -89 80 8 89 157
3750 157 130 -415 -179 213 -239 -37 303 294 -207 -278 757 79 -498 168 568 -247 -293 138 50 -440 56 480
3772 480 -245 -30 147 -214 -277 175 -170 -168 434 -44 -268 350 311 -414 -273 383 -4 -668 227 239 -393 -305
3794 -305 432 242 -569 53 455 -5 -363 514 57 -256 -256 286 -45 82 181 -315 -28 448 -326 -317 356 65
3816 65 -556 107 610 -358 -186 701 263 -392 -8 454 -260 -350 425 -3 -100 83 334 -44 -86 500 227
3837 227 -37 62 -13 -317 484 41 -350 -242 335 -228 -352 622 190 -519 -30 351 -422 -354 87 281 57
3858 57 -258 166 -72 12 179 86 -10 25 2 37 278 245 -44 -83 247 -11 -362 350 333 -165 -177 694 -157 -137
3882 -137 94 590 -632 -313 513 -166 -142 275 224 -400 261 41 -47 56 347 -15 -208 236 -14 -338 189
3903 189 251 -351 -472 299 210 -395 308 756 -384 -63 555 75 -337 206 76 -393 -156 187 -55 107
3923 107 257 116 -48 421 229 -506 45 210 -225 -489 19 89 -230 209 620 -92 -206 504 128 -567
3943 -567 -60 745 -161 -127 359 -59 -486 487 129 -506 233 168 -385 52 163 -110 -483 376 96 -511 -33
3964 -33 553 -676 -352 332 178 -547 -140 445 -316 -546 303 -91 -424 54 3 13 -174 305 -98 -9 406
3985 406 -206 -228 274 59 -569 -37 366 -486 -91 525 355 -373 15 230 -279 -307 289 308 -261 -9 257
4006 257 -47 -90 257 126 -330 158 -94 -345 336 291 -240 87 447 -132 -371 474 106 -541 -191 287 -228
4027 -228 -275 287 32 -384 -140 390 92 -470 148 -3 -219 -213 187 -116 2 219 58 -136 -81 414 -102
4048 -102 323 313 -197 -249 603 152 -401 3 400 -102 -118 317 -71 -420 44 108 -190 -259 62 -3 -246 109
4070 109 -5 -236 82 181 -252 67 338 -327 -76 157 93 -322 -328 460 -413 -335 410 378 -395 312 401 -218
4092 -218 -290 56 121 -15 -200 -23 -356 171 126 -204 -106 56 -156 -56 180 170 -453 -226 456 -159 -291 328
4114 328 524 -394 -33 464 -135 -153 330 -2 -392 93 22 -134 133 92 -116 -238 200 -111 -109 400 490 -303
4136 -303 -31 303 -92 -221 247 -15 -294 -105 373 85 -383 267 138 -47 -153 171 172 -27 249 -240 68
4157 68 29 98 -73 -53 -8 104 144 487 -5 -189 -120 318 25 -214 554 127 -57 220 207 -106 65 186 -150
4180 -150 -251 -52 74 -128 2 160 -77 -8 57 -194 83 14 46 -147 -185 247 -47 -294 545 -102 -575 89
4202 89 497 -355 -457 381 -51 -540 109 205 -116 -303 271 267 -117 80 -14 -261 25 86 75 -36 431 -37
4224 -37 -286 562 29 -314 105 307 15 -423 420 188 -300 232 105 -349 93 169 103 -312 24 -96 -257
4245 -257 37 288 -92 -103 192 11 -207 12 29 -500 -311 394 -29 -188 404 60 -458 -44 503 -122 -150
4266 -150 298 157 34 102 2 -159 -150 261 -337 -171 275 141 -271 87 210 -234 -297 290 71 -622 454
4287 454 267 -205 -218 463 134 -139 -95 364 -229 -415 278 45 -435 177 132 -367 -19 -7 -384 234 -40
4308 -40 -227 -313 129 -12 -349 390 203 -236 -190 240 13 -270 147 506 -113 -302 310 95 -209 237 288
4329 288 -135 224 305 8 -84 312 -295 -395 38 -118 -542 19 391 -294 -44 383 -94 -646 -26 141 -74
4350 -74 -245 232 151 -389 83 115 -47 -15 286 -151 -4 221 50 -102 20 339 -40 -63 129 -82 -91 8 -21
4373 -21 -315 236 156 -170 -189 177 167 -223 -171 169 -104 -360 170 37 -278 198 378 6 10 144 193 -103 40
4396 40 -130 -27 57 -4 27 -95 30 -177 -247 166 126 -401 -239 159 94 -262 -2 -279 -34 -92 -43 -33 -147
4419 -147 203 302 -169 -127 12 96 -237 -12 -129 0 246 223 -187 210 298 -508 73 403 43 -308 90 115
4441 115 -71 -53 146 -338 -474 -42 -63 -78 -42 71 -58 -143 -27 133 -56 47 128 -94 -59 368 -159 -19
4463 -19 308 155 -326 157 566 -299 -90 385 105 -15 153 271 55 51 84 -77 -322 38 -192 -111 232 4
4485 4 -22 -4 74 104 -276 -115 179 -358 -256 660 -296 -349 334 -81 -164 27 401 -213 19 150 -33 128 5
4508 5 34 -196 -10 -107 -90 -17 131 -62 -123 258 142 -294 -65 524 -238 -317 285 251 -7 -113 144 -250 -265
4531 -265 -26 71 -38 246 250 -316 -30 266 93 28 146 -144 54 -24 195 131 14 338 88 -219 -149 375
4553 375 -272 -203 217 54 -396 20 69 -410 -264 165 262 -405 -95 180 -241 112 389 -111 240 234 -4 -132
4575 -132 245 232 -137 -148 194 -222 -219 144 -14 -391 -249 248 -210 -456 298 -44 -553 168 234 -281 -52 55
4597 55 -271 -100 351 -267 -335 283 94 -234 -25 403 -103 -301 255 149 -442 -70 203 -395 -131 358 234
4618 234 -319 90 243 -249 -158 202 59 82 -105 95 -330 194 4 -378 -67 105 -157 -160 423 215 -348
4639 -348 -35 292 84 -372 73 290 -351 -100 123 -39 27 -2 206 -345 -58 5 -269 19 349 -247 99
4660 99 200 44 -81 183 54 -295 -162 481 172 -273 207 -175 94 -234 57 17 -69 248 104 -559 150
4681 150 294 -111 15 101 92 68 357 -7 -218 150 313 -280 -94 159 -175 -269 328 -115 -65 -212 71 281
4703 281 -277 169 431 -165 -139 423 -326 -406 293 -83 -2 39 318 -66 125 88 -38 -254 232 -6 -233 19
4725 19 374 -221 -75 -10 206 -122 234 117 -21 -192 158 299 -194 137 -153 -167 39 230 -123 73 99
4746 99 -133 -61 270 111 -2 29 547 -362 -254 151 -51 -178 236 168 -87 -288 70 370 -227 -227 -43 26
4768 26 -38 342 89 3 -178 72 -275 -80 327 -52 -213 175 -131 -179 216 -182 -220 -68 241 -43 81 236
4790 236 -31 -127 146 -34 -83 -195 253 -44 42 -98 -31 -15 8 -132 20 5 -75 89 -159 180 19 -264 -170
4813 -170 322 -188 -448 421 115 -418 22 467 91 -102 278 381 93 80 200 -182 -11 9 17 -81 -228 -156
4835 -156 -341 67 138 -339 -307 195 112 -388 -66 153 -80 -247 415 235 -266 195 -15 -377 -80 355 26
4856 26 -364 18 -5 -144 368 29 107 -34 356 -90 -169 -147 -309 -161 -110 241 -298 -173 128 121 -323 -47 478
4879 478 -357 -142 139 -337 -243 374 113 -95 -325 76 117 -14 192 63 -26 134 106 -65 42 269 -283
4900 -283 -74 56 138 -371 -96 12 -125 -361 119 -123 -261 -84 127 -18 -272 194 181 -15 216 -203 -150
4921 -150 30 355 0 -57 462 -25 64 124 107 -301 -272 -127 10 -264 111 379 -13 213 623 63 -83 336
4943 336 115 -113 2 177 54 -254 61 202 -337 388 204 -82 142 156 -167 -37 349 248 -285 292
4963 292 148 -310 -224 73 -250 -279 293 52 -127 -20 70 51 -221 135 133 -371 140 -211 -223 141 282 -134
4985 -134 13 306 124 -209 -173 357 -112 157 215 -15 149 13 289 -147 -131 238 -126 -122 98 80 -332 -16
5007 -16 142 -194 -20 113 -92 -145 88 195 -304 157 274 -146 -97 200 154 -312 -139 166 86 -128 205 -20
5029 -20 -226 191 -58 -201 -25 133 -33 -169 201 -28 -95 147 11 -96 -114 152 -92 97 371 101 -56
5050 -56 -287 26 42 -182 456 -213 -260 167 -10 -114 103 138 -123 -47 293 156 -144 119 251 -166 -217 -9
5072 -9 159 -119 17 141 -172 62 14 -156 -238 314 326 -152 127 -10 -186 -323 233 201 -313 136 -10 -61
5094 -61 -53 6 44 76 263 248 -22 120 322 -50 26 179 -282 -225 341 -117 120 -315 518 -32 -196 62 -60
5117 -60 -267 -411 38 249 -144 -174 -2 -298 -226 -57 -106 -36 303 -251 -136 15 -147 -98 -93 173 -95 -298 37
5140 37 -14 -206 256 288 -113 -11 33 67 -279 -173 172 -132 -10 217 -304 -114 267 25 155 143 -6 13
5162 13 -188 218 -346 -296 193 160 -220 155 323 -34 -181 101 -71 -181 434 116 -94 69 276 96 -35
5183 -35 32 -83 -10 121 -125 -39 -25 -86 -19 -164 174 322 -130 98 118 -250 -203 272 224 -282 111 187 104 -84
5207 -84 27 254 -53 59 264 -183 445 317 10 -144 28 75 -21 78 275 -205 -170 266 -183 -426 231 192
5229 192 -174 -368 135 -225 -159 16 222 -222 -9 68 -18 208 164 162 -7 397 55 -1 203 251 -196 -439 163
5252 163 -292 -86 98 273 -397 83 172 -237 -106 -224 91 -170 38 47 -32 212 159 -51 -50 53 273 -286
5274 -286 -6 70 -134 -21 373 -4 -183 299 148 5 -135 406 18 -124 239 194 48 -22 54 44 -8 -118
5296 -118 -38 -128 -177 103 62 -52 87 257 -141 122 497 -149 -29 313 -57 13 184 399 -187 -179 99 -187
5318 -187 -36 165 187 -86 48 42 -189 74 176 -69 -340 79 -50 -201 60 -73 -163 -143 187 340 -15 60
5340 60 83 -9 -25 53 -38 -290 -11 74 -356 -35 200 -190 35 65 315 -250 -130 -76 106 15 129 -68 -147 61
5364 61 -114 1 149 -19 -64 -223 240 -218 -26 353 113 -323 -285 327 -17 -98 270 209 -188 -137 -10 -101
5386 -101 -32 173 -109 -20 291 -53 -215 -79 -35 -51 35 186 -27 -127 293 160 -74 -166 -231 -115 -162 -283 194
5409 194 115 -91 153 -221 -172 62 110 -1 -110 109 -52 217 212 -313 -93 151 -72 -269 -171 -249 -158 -42 -28
5432 -28 47 -291 -305 -33 -183 -132 268 -308 -208 -72 -87 -124 37 -12 -102 -211 254 9 -113 -18 78 -140 66
5455 66 66 344 -103 228 28 151 136 36 -90 -322 197 119 -76 -190 -105 -180 -189 148 -84 -420 36 278 -114
5478 -114 -11 310 -94 -123 312 -28 -185 120 308 -137 118 195 -128 -156 82 81 339 -86 96 -263 -109 252
5500 252 -60 118 -20 25 -357 -54 252 40 -186 -105 -9 -72 82 160 -148 -6 261 -59 -249 -86 89 -309
5522 -309 -39 322 -140 -154 -106 218 187 -212 177 263 -10 66 182 -138 106 142 -189 -181 -87 -77 32 -33 -119 -184
5546 -184 -12 195 -67 -143 60 -228 -20 35 341 18 15 -88 -81 233 -104 253 -57 145 -31 -213 77 118
5568 118 99 -249 -312 61 -304 -179 -24 -197 -177 386 127 -192 77 84 -73 -87 93 -65 -265 -2 71 -330
5590 -330 -188 199 -9 132 9 52 -125 -134 -244 -183 470 71 58 -392 109 -86 -128 -71 -4 -185 -167 281 266
5613 266 -223 47 16 -90 -303 22 -30 -10 -103 267 -54 -280 221 -31 -205 20 -133 -107 31 0 68 -156
5635 -156 162 -78 -111 -71 -181 -162 78 126 -212 -105 188 342 -248 13 -20 -420 -146 -124 -222 70 -84 223
5657 223 195 111 177 105 5 358 -198 -266 362 257 -173 42 355 -124 -3 192 317 -61 -43 194 42 -111
5679 -111 67 -187 -220 185 178 28 -366 228 -210 -89 93 37 -89 -26 -102 -40 -194 33 87 -151 270 120 3
5702 3 88 87 33 -26 110 -48 -465 31 144 -146 -115 196 -92 0 111 177 -244 -265 215 -80 -229 198 95 148
5726 148 -227 82 -30 -341 5 123 -449 -117 257 47 224 182 39 80 -7 223 -121 150 35 -143 -69
5747 -69 12 8 -119 -178 91 -338 -126 -26 -26 -12 73 71 -5 -165 229 -210 -135 155 117 97 -167 -115 -51 -11 1 162
5773 162 119 105 -223 -111 264 333 -121 154 97 -165 -309 -133 30 -138 -197 57 -111 -28 226 145 -373 149
5795 149 222 17 96 63 154 -318 207 119 21 -19 4 207 136 193 -170 -104 209 -81 76 116 111 117 -56 -136 206 7
5821 7 105 232 102 -65 55 160 -355 -81 230 -103 73 10 -397 31 267 104 -142 -2 190 175 196 17
5843 17 180 -221 -134 482 -159 72 325 101 -89 258 -25 -160 -150 225 -211 -292 165 198 -179 75 240 77
5865 77 129 31 -84 -448 223 52 -154 92 34 -132 -54 186 14 -293 278 60 186 -18 107 -106 -38 77
5887 77 -90 27 -204 47 -60 168 254 180 -414 -117 61 -231 228 447 124 -359 -58 96 -292 -13 365
5908 365 -20 -110 -96 33 100 111 77 -338 -453 75 -55 -182 -30 280 -104 -126 -157 -62 294 78 -109 -33 -62
5931 -62 -29 -55 75 226 -59 -193 17 58 170 117 454 -245 -201 284 -283 99 -277 293 -22 29 155 -430
5953 -430 63 163 101 -277 271 294 -136 34 300 126 76 -147 -34 -59 -122 269 -166 -170 218 -85 -76 -161 6
5976 6 -224 66 -11 7 291 81 71 133 -94 -101 72 -41 327 -117 -102 16 -36 34 -187 -45 163 -119 -104 -92
6000 -92 1 55 333 21 9 381 -4 -129 -72 31 16 -155 154 -17 -12 244 -167 128 189 432 -45 -210 454
6023 454 -347 -69 -313 133 240 -125 255 47 -192 174 -46 78 -235 -67 -346 98 177 -16 -210 98
6043 98 86 -250 65 92 -73 -445 97 49 42 -3 13 -151 -198 56 124 -222 152 -4 -86 133 121 -85 -288 137
6067 137 -80 -340 206 250 10 107 -34 -233 52 165 -271 115 299 89 -73 -90 -34 46 -332 20 157 356
6089 356 -122 -290 -19 -17 -192 53 -73 -248 -88 -167 -201 47 -127 -67 63 65 -270 -162 129 103 -367 -28 87
6112 87 389 -6 121 -38 -238 69 -38 155 18 124 -59 -38 139 106 74 55 98 39 -304 54 89 -186 -141
6135 -141 123 10 6 476 26 119 -234 -290 -108 29 290 27 203 -285 -6 -204 110 96 -419 -67 94 56
6157 56 -267 329 180 -156 -146 -51 -81 40 79 -291 -169 161 264 -52 -59 148 -115 -5 212 -56 -135 99 75
6180 75 -34 198 101 -182 69 24 135 -205 46 -23 -128 -210 144 200 -263 25 -219 -197 -148 -75 265 -75 273
6203 273 83 158 163 -129 -58 -260 129 -15 346 35 175 -224 199 67 -56 80 318 -69 187 -83 40
6224 40 -80 117 139 114 -58 131 -6 -37 -102 3 -24 -30 13 -14 -105 -68 85 -438 68 135 -104 -87 -42 8 -266
6249 -266 -336 389 141 -1 -93 253 -74 206 -213 -51 38 345 -37 118 -1 163 100 -310 164 90 -132 108
6271 108 -64 -209 218 -152 -104 -53 58 -187 83 -87 79 -282 -128 244 -36 -153 -97 -84 -107 -82 30 -47
6293 -47 28 167 -148 8 220 3 -101 200 53 -152 112 271 129 256 98 197 -50 -39 16 80 -88 -73
6315 -73 19 -27 -167 137 295 -156 192 274 -35 294 39 -109 34 94 -10 44 273 87 -140 41 243 -213
6337 -213 60 205 -175 -436 -25 298 -69 -104 234 -38 65 413 -46 -2 94 42 299 -24 -37 56 -107 -38
6359 -38 -10 92 -57 45 -367 -238 52 29 34 -26 -126 -60 35 137 -96 -122 -49 107 -138 -49 321 -129 42 130
6383 130 -107 -203 -329 263 -104 99 -32 -281 57 76 -145 -203 205 176 52 -264 204 -30 114 162 55 -261
6405 -261 -92 70 -92 -181 60 113 -444 67 79 -375 63 -1 -66 -17 -42 56 89 314 -162 -208 -304 -241 145 -82
6429 -82 -28 237 -24 -191 -4 279 -135 -177 308 -111 141 281 -97 -14 -3 -56 -128 142 129 234 -379 -40 -35
6452 -35 -88 25 -2 -365 -200 38 193 -251 189 144 99 180 37 138 86 254 -190 -203 -95 -204 20 347 263
6475 263 -116 -454 -21 256 41 212 124 66 -224 98 -132 229 -105 -216 -161 -141 140 -288 -113 -35 40 -81
6497 -81 74 20 -11 -76 20 -126 39 128 -116 87 -245 -35 -149 -113 148 18 70 34 63 -107 -340 84 118 145
6521 145 196 15 44 42 261 89 -44 -43 26 -79 -315 188 -68 -12 -212 102 101 -186 -81 -57 -92 96 87 -348 -37
6546 -37 0 -281 184 94 98 83 62 -71 -178 -129 76 76 4 11 140 78 20 112 -98 -195 94 -31 -20 109 -168 -297
6572 -297 -22 -133 -368 -69 -102 215 -101 -189 245 -212 -55 125 -127 -11 -173 -32 -110 1 -94 136 0
6593 0 112 163 -51 104 236 281 -66 160 -125 -232 -126 282 -7 4 -193 -154 -27 -6 117 177 -87 -75 -39
6616 -39 134 302 -57 127 74 58 49 -120 203 -207 -152 51 -17 -155 37 96 -216 -32 359 -50 -313 109 53
6639 53 -87 189 -173 -66 30 197 149 -19 301 117 -34 -169 184 163 38 -89 -339 -92 272 -77 -303
6660 -303 6 -18 47 -80 70 -53 -123 -95 -62 -124 4 82 -24 70 -15 171 21 233 -119 -81 -207 146 111 -30
6684 -30 -35 46 -66 -141 272 -213 -56 -72 32 -219 131 89 -337 -246 -110 296 -182 -309 -30 -276 -70 -207 -126
6707 -126 -356 -90 171 -35 -134 38 -252 -134 99 175 -362 316 25 -193 157 96 111 -94 115 43 -386 308
6729 308 -181 -19 -69 -30 32 -188 131 -36 15 -25 122 -121 34 87 6 -33 372 263 -408 -143 384 47 14
6752 14 290 188 -121 -56 190 58 25 -154 302 -258 -25 270 -75 2 -65 -16 50 -186 -329 -101 59 164
6774 164 -128 103 147 93 8 31 58 -50 -25 111 296 -164 -215 72 -248 -102 160 -103 -247 -57 145 -128
6796 -128 28 -32 -23 -194 140 -192 -211 82 63 -165 -220 -13 -38 -165 -3 208 -256 87 7 -34 21 120 406 60
6820 60 -23 -96 -121 -226 183 32 -9 -68 -78 -172 229 -5 -57 -2 35 114 40 215 117 112 -94 97 -18 -89 -1 65
6846 65 -199 54 161 -208 -92 -177 -95 65 24 31 -61 31 175 -139 -89 147 27 46 175 142 -55 -98 77 68 -141
6871 -141 -38 51 -29 -176 122 29 120 -14 -106 18 25 -303 75 216 305 -122 44 112 279 -222 -89 260 4
6894 4 -23 129 -11 -162 3 10 -215 344 2 216 -29 96 -28 -91 218 30 -46 136 -211 -289 -44 58 28
6917 28 -416 -200 212 -79 -164 -114 18 12 49 97 -60 -10 -34 -31 -67 8 123 -67 -55 276 -152 -165 -4 -22 90
6942 90 123 309 -111 -74 -62 75 -452 -169 -203 83 -240 -77 -61 174 -8 -76 -25 97 61 -74 32 -76 -117
6965 -117 -286 36 38 8 -154 89 -112 59 184 108 112 234 349 -45 78 -62 -46 1 68 54 -148 -163 -105 -29
6989 -29 -196 -19 -94 -258 193 460 -69 -99 -376 33 -118 -114 4 -55 306 172 155 168 -61 48 142 53 -26 213
7013 213 -180 -38 184 -121 67 216 -22 81 34 234 93 6 145 187 -86 29 -46 -111 198 -74 -334 -53
7035 -53 -117 -34 131 72 -140 -402 -65 -83 -84 107 -17 41 -144 29 206 174 197 -186 72 -45 13 43 -69 90
7059 90 -79 70 212 51 -62 19 25 101 -40 194 293 -191 -3 -95 -183 -183 190 -3 237 -207 -61 -100 -29 66
7083 66 80 260 144 -6 32 -13 117 42 -46 -277 -197 -97 -250 105 -47 -20 348 -122 -3 163 -3 -125 -60
7106 -60 275 145 -131 359 -13 68 99 -81 85 -65 247 4 -115 -57 126 -101 54 12 -80 150 -61 143
7128 143 -83 307 -44 140 -64 154 62 80 186 1 -55 -46 165 -33 -45 260 -200 -130 104 -39 86 73 34
7151 34 -133 231 110 -164 246 -47 -136 -76 -5 211 105 -149 171 -39 46 -172 -272 81 105 143 54 -7 -72
7174 -72 -238 -62 -145 -53 -40 -281 87 245 -46 -145 -21 204 -41 101 -202 25 -35 -40 7 -125 91 28 -289
7197 -289 -33 213 163 238 51 17 322 91 -39 -5 -157 37 47 69 288 -57 -82 9 -114 -257 18 106 -55
7220 -55 -102 233 -8 -228 0 -75 132 -20 -34 -47 -44 99 -22 117 81 68 13 65 102 135 108 -330 172 55 184
7245 184 210 43 -300 177 25 -195 146 -166 170 169 156 172 -69 -157 69 -164 121 -117 -203 199 -204 -38
7267 -38 66 48 279 23 -205 -22 3 -242 -343 172 -251 -141 60 -140 37 -40 -127 -84 102 88 -65 34 182
7290 182 -210 184 198 -10 74 -112 -38 -136 -147 182 114 -299 -6 -39 -25 -121 -171 236 -246 59 -69 110 -9
7313 -9 280 -172 -158 288 193 -158 66 18 -110 135 139 -199 -214 -123 229 -493 109 12 28 -51 -73 68 -192 37
7337 37 -118 47 -12 41 -19 -117 255 62 -90 -22 -8 -14 -358 -51 -71 55 208 220 -60 -227 -16 -135 66 46
7361 46 -76 -283 114 138 175 89 34 178 -203 130 3 68 97 -151 -372 59 -35 71 -227 164 23 67 -132
7384 -132 116 -53 36 44 66 -156 -177 62 33 -35 127 179 -190 -200 83 57 100 -9 91 -147 -77 -20 -161 26
7408 26 -42 -1 323 119 -135 -14 123 107 -179 29 218 64 -322 323 -58 -55 78 -160 2 -30 7 53 135
7431 135 24 241 -42 -46 28 -21 -58 40 -48 -217 -96 -69 -101 -57 130 110 99 -89 -97 150 -98 136 197 -146 107
7456 107 152 34 221 103 -17 -166 218 -30 73 199 371 59 -109 411 160 -18 184 119 -71 -186 -81
7477 -81 121 -75 -90 118 -245 -17 96 54 43 76 -61 -76 -101 -79 -83 185 34 388 -89 -102 73 27 -141 -35
7501 -35 5 -79 97 85 -169 -96 0 58 69 -31 272 -195 178 101 -214 189 70 -292 -199 -18 210 -71 -43 -3
7525 -3 95 211 376 -22 50 -289 48 -368 11 143 -86 -33 65 0 -374 -244 303 293 77 203 -127 194 68
7548 68 35 -298 282 -52 -41 -122 -165 169 208 46 -53 -41 96 -30 -46 -135 -127 53 -247 117 127 -23 228 -79
7572 -79 42 108 -82 218 103 169 -148 94 -203 22 14 136 16 111 232 111 385 20 -48 23 -117 -31 42
7595 42 96 -94 -224 18 194 56 -22 331 64 -22 217 -116 -59 128 -54 217 49 -74 -80 -68 -352 -47 -228
7618 -228 -30 156 -84 133 65 193 -64 1 171 -12 -6 137 77 -205 -356 216 93 -264 -101 250 10 -98
7640 -98 104 -51 156 255 -113 -336 -270 121 -20 -176 68 -289 11 178 3 -136 108 -238 -86 -301 -65
7661 -65 -68 -65 355 183 55 95 -9 69 -125 -54 62 -250 45 115 -270 164 87 97 53 32 49 319 -27 -118 -239
7686 -239 101 166 192 3 94 68 17 -11 -103 145 89 -216 -173 -1 101 195 -27 -276 162 19 177 -34 -196
7709 -196 -333 141 77 -310 226 -14 -2 -65 111 -152 58 -240 -178 -289 -97 -56 -113 -349 -245 118 -107 176
7731 176 8 -288 -99 -204 183 -207 31 171 10 185 313 -60 -120 198 99 -92 61 -61 61 182 138
7752 138 4 177 70 68 152 287 253 -58 121 6 -177 -14 -91 -33 -180 -63 23 64 170 153 136 0 132
7775 132 161 -38 -202 -150 -96 -232 215 140 -58 -300 64 -26 -158 83 151 -200 -148 349 -31 -141 129 -77
7797 -77 -79 27 32 -329 -187 16 173 162 171 280 19 57 132 -92 37 -68 142 -282 -64 44 -242 -272 -158 -138
7821 -138 -11 90 7 -108 60 -55 34 -40 -140 145 -24 10 192 98 -186 0 -56 136 -52 -149 -99 -217 -283
7844 -283 -148 -84 -121 -172 -153 100 168 335 -244 33 -48 -119 11 16 -33 -35 263 -18 -298 50 321 241 199 22 69
7869 69 -76 335 -36 -129 -239 107 6 -36 53 24 -280 148 51 98 20 -55 166 -181 -7 -115 177 20 86
7892 86 -294 30 42 155 -102 -196 -78 -61 -162 120 -91 -298 70 -81 9 45 63 -62 143 9 -149 198
7914 198 251 -21 46 125 77 -33 -80 -197 -26 67 -47 -162 -175 182 9 -321 18 106 139 -195 394 23 184
7937 184 -23 -57 115 -14 64 260 -307 -44 0 -97 176 -31 0 89 66 -84 -97 51 83 27 -387 -75 48
7960 48 -54 -6 32 -98 -32 212 -59 -103 74 15 -268 12 14 -338 -114 110 14 -117 53 41 -190 -165 -239 -68
7984 -68 68 -48 5 -156 -196 264 -110 -48 -80 -153 -194 -17 47 68 -229 85 -213 14 -91 2 120 389 201
8007 201 -79 -3 25 156 -103 209 22 132 -298 2 311 -92 -188 108 57 -333 -22 -190 -1 182 -23
8028 -23 -51 -7 -188 -101 -173 76 -19 -26 31 -206 -302 -238 -116 27 86 -95 22 141 3 145 22 -16 216 251 -101
8053 -101 125 -35 -206 94 34 -9 279 -127 93 -74 226 -142 86 -81 -126 120 -40 128 -81 -244 15
8074 15 241 -148 -21 76 -290 154 94 53 101 -347 -55 28 11 104 8 50 47 58 258 -10 -26 -53 106 -163 15
8099 15 44 -3 81 -175 -297 125 97 -314 43 128 23 255 234 56 -112 -542 -509 25 -56 -253 116 94 14 -4
8123 -4 -167 157 -3 -137 -120 216 -115 22 -51 420 -324 -145 -107 113 166 -17 487 -210 106 -177 -180 -395 49
8146 49 -2 3 -97 -26 5 -308 71 -86 -73 104 2 -3 -37 -311 -73 -313 216 158 14 -160 88 -177 -76 2
8170 2 -318 1 -80 -122 88 -96 245 340 181 44 -48 102 -19 101 130 -160 79 -38 -60 -86 102
8191A02
$$ Imaginary data points
##PAGE= N=2
##DATA TABLE= (X++(I..I)), XYDATA
0 0 0 0 0 0 0 0 0 0 8 -8 8 -8 16 -16 16 -24 32 -40 48 -56 65 -80 96 -112 132 -153 179 -209 241 -274 314
31 314 -359 408 -463 522 -589 661 -742 827 -923 1029 -1143 1269 -1406 1555 -1716 1895 -2089
48 -2089 2304 -2538 2794 -3079 3395 -3744 4136 -4578 5079 -5654 6323 -7108 8049 -9197
62 -9197 10636 -12505 15033 -18665 24344 -34531 58422 -234032 37552 341193 -254472 71110
74 71110 318927 -228691 -289589 237805 71833 -96465 155895 54380 -248917 -70772
84 -70772 89516 42228 70564 94584 -26373 -117445 -90238 65779 95373 -2971 32601 16127
96 16127 -180383 -76711 156948 46213 -19296 108582 -57352 -182553 47377 72673 -34361
107 -34361 100623 14216 -186177 2335 75564 -79295 98435 159814 -156519 -109933 115018
118 115018 -48696 -58332 171603 21435 -157722 5152 31984 -37695 77202 74892 -36246
129 -36246 -28202 -48494 -39902 63479 29493 -19524 36674 -41149 -90376 66499 59808 -52869
141 -52869 53103 34211 -146426 -18920 113318 -48534 -25431 109568 -43802 -112202 59726
152 59726 57920 -34872 21511 32344 -43733 -42177 5140 37574 31578 -20367 -8012 23993 -42159
165 -42159 -21303 78480 4792 -55195 29402 -10756 -65729 48180 46658 -50703 16744 32762
177 32762 -72650 -5635 75403 -28600 -32431 46825 -27164 -48824 41745 17848 -14943 21352
189 21352 -11099 -26054 22918 1071 -12135 36761 1510 -46329 13264 24806 -21553 12364
201 12364 25925 -22836 -10203 5965 -10863 15912 12663 -27286 819 12558 -29366 -2237
213 -2237 37475 -7198 -24406 14235 1001 -18888 9775 10111 -5749 401 -7600 -3246 15827
226 15827 1414 -3875 11894 -2758 -11623 3195 3232 3471 7836 -8803 -5260 17846 -6131 -19452
240 -19452 24607 8605 -39537 4502 29675 -23726 -11561 30937 -5703 -25615 10588 7233
252 7233 -14381 3877 7323 -10675 2187 8125 -8726 4782 13973 -9543 -10035 9410 4873
265 4873 -8886 1651 16575 383 -15086 4852 12877 -8956 -9700 11692 5392 -15423 -2858
278 -2858 13658 -3248 -10028 4297 981 -6252 -3426 -577 2895 1851 -2930 -1432 3616 1791
292 1791 -6337 -2424 9281 1109 -8271 4498 12337 -2062 -9507 7774 10267 -12533 -7089 15488
306 15488 988 -13188 5249 11965 -5651 -7959 6821 2283 -10469 -2172 3037 -2839 483
319 483 600 -2727 3147 1786 -8058 -2761 9038 -1156 -12688 7292 13323 -12214 -5946 18501
333 18501 1726 -15486 5902 14133 -9449 -8280 13739 3124 -10385 4372 4808 -5931 482
346 482 996 -4496 3618 3218 -8846 -2266 9095 -5706 -12850 9593 7226 -13888 -2058 12724
360 12724 -1618 -10592 3816 11014 -5179 -9494 8614 6648 -8803 -561 10938 891 -5911
373 -5911 3468 3344 -3783 2083 864 -3478 6024 -640 -11940 6037 8561 -11655 -2762 12167
387 12167 -4108 -13034 4350 7260 -6382 -5249 3549 3457 -3618 -6713 8034 10536 -11841 -4293
401 -4293 15009 -6379 -11079 14462 3343 -10542 8037 2849 -10234 11169 7292 -17849 5969
414 5969 14212 -23618 -3925 28707 -10807 -19412 20174 2497 -23616 5901 14977 -9989 -7030
427 -7030 5941 -1977 -4161 3034 3836 1980 -3253 -4337 692 -1376 4991 9615 -7265 -1407 12963
442 12963 -13995 -10626 28575 771 -28095 16922 16081 -31697 3510 33962 -17964 -17902 21307
455 21307 -10266 -18188 20225 1881 -12468 12892 -5207 -17740 15305 6702 -16507 7958
467 7958 7825 -18119 909 14328 -2393 4185 2444 -11967 5228 3235 -12231 14931 13143
480 13143 -22013 -1203 17409 -11539 -2937 18082 -7882 -12131 6759 -7194 -1034 18942 -8321
493 -8321 -12149 15543 -10258 -19309 21946 9715 -19567 3311 7066 -11886 1560 9332 1537
506 1537 3434 -8125 -10788 14569 3482 -12034 19472 7559 -28604 7485 17713 -20714 8130
519 8130 22510 -27735 -6678 28448 -19046 -12374 37981 -10518 -37528 25217 11340 -32714
531 -32714 14324 24038 -25119 -8686 15229 -4530 -388 6808 -5252 1068 -1429 -10003 12204
544 12204 14018 -13128 -1611 9599 -12351 -1611 17191 -2422 -3377 3162 -13296 -163 15502
557 15502 -5463 -75 9937 -16668 -11532 14920 -94 -1953 13739 -13063 -17262 16141 -2905
570 -2905 -10249 29831 576 -37166 12161 16849 -24680 12202 30574 -22653 -17242 15862 -4554
583 -4554 -1676 21265 -3256 -11352 3513 -13094 -2834 27624 -790 -15915 10200 -8224 -21003
596 -21003 16598 16649 -9596 -1069 -1835 -16266 1534 13764 1625 3129 -870 -16676 -5929 9067
610 9067 7475 9617 -60 -10555 -2310 -6378 -3306 24435 9671 -22160 643 8110 -20302 4469
624 4469 33858 -7085 -21801 7742 -7475 -13114 20954 11383 -9479 1896 -10572 -17177 15035
637 15035 12450 -9121 6409 1465 -24363 -1028 21664 858 775 7218 -15725 -12042 9834
650 9834 2937 6385 14661 -9426 -17029 5119 5440 -1655 9743 7360 -12387 -13262 1448 8848
664 8848 5913 318 1112 -3771 -16382 -3825 16457 3731 -4292 4907 -7682 -12467 7977 6915
678 6915 -1177 8188 -3440 -18538 4991 13640 -7336 5570 16685 -16680 -17037 14888 4781
691 4781 -6811 11261 4625 -14844 -4089 6241 1546 4294 3972 -8217 -7004 786 -876 3210
705 3210 8490 21 -8153 -6278 1054 4020 -1129 2248 6468 -7616 -10818 8115 8787 -5176 1627
720 1627 7116 -8254 -7891 8092 5068 -1559 3361 -1635 -5418 1621 906 -414 5417 660 -8262
735 -8262 -2539 5336 -419 -3247 3988 1918 -7796 -4359 5970 4345 -4445 -1106 5558 -4037 -6828
750 -6828 7085 5969 -5438 -715 3004 -3588 -715 5118 838 -1174 2504 -3434 -4928 7044
764 7044 3362 -6409 2629 5349 -7894 -5073 8575 3092 -8066 206 6211 -5923 -6251 6398
778 6398 3519 -5381 -1255 3354 -1242 -2654 3016 2339 -1830 111 -1011 -2097 3827 2257 -3059
793 -3059 2104 4328 -3662 -3852 6005 2730 -7190 -89 6383 -3281 -5040 4873 3492 -5003 -2809
808 -2809 3468 -173 -4460 898 2654 -1783 -1282 491 417 1008 -402 -1837 481 2275 -1853 -2476
824 -2476 5156 2866 -5431 189 6082 -2575 -4733 4358 4336 -4160 -2390 5140 1123 -4525 520 2945
840 2945 -2113 -3002 506 1620 -930 -1148 603 97 9 -1425 -2661 2113 1681 -4033 -94 5488 -713
857 -713 -5365 2976 4968 -4989 -2733 6045 432 -4613 2251 3996 -731 -1614 712 1483 -1335 -2529
873 -2529 722 1853 -527 -1807 756 1606 -1404 -2039 -222 1153 -96 -3403 323 5019 -2270 -4236
889 -4236 4982 2298 -5777 -369 5327 -1419 -4057 3481 3244 -1867 -492 1883 1291 -725 -2353 1648
905 1648 2949 -2784 -718 3336 -897 -2052 1 -1109 177 426 -3046 -748 4936 -2945 -6056
920 -6056 7240 2961 -9783 1931 7912 -7568 -3773 8730 872 -5362 3370 2841 -3817 87
934 87 2569 -1155 703 1480 -2485 -127 2988 109 -2331 939 2917 -3561 -5378 6034 3735 -8860
950 -8860 912 8899 -7455 -7425 10476 1694 -10534 4900 6120 -9934 781 8077 -6013 -548
964 -548 7665 -6299 -3446 9877 -1802 -6606 8339 2993 -10575 2206 8711 -4648 -2708 5890
978 5890 -649 -4556 -545 3290 1728 -3268 -1184 2926 -2977 -2924 4014 1205 -3320 1526 -895 -4229
994 -4229 3553 2665 -4943 3517 4692 -9325 -978 10195 -3289 -4433 7526 -269 -7138 2300
1008 2300 4475 -225 660 -1009 -2040 980 -2619 -885 7383 -748 -6962 3343 254 -6504 4493
1023 4493 3533 -5409 1395 1229 -6878 4158 7490 -6960 -1162 8100 -7523 -6855 11430 2303 -7954
1038 -7954 4668 3538 -6440 91 4714 127 -383 -1130 -1682 1145 515 2 3026 9 -4157 -369
1054 -369 -346 -518 3993 -1275 -3972 4670 -1517 -7183 7444 5864 -10044 -385 7698 -6724 -3499
1069 -3499 10222 369 -6242 3463 -185 -4513 4460 1718 -2812 3627 -946 -5049 3754 3417 -2864
1084 -2864 481 202 -3427 -16 586 53 4307 -1395 -7003 3798 3159 -8652 2894 8767 -8728
1099 -8728 -4641 9039 -1548 -4886 6659 1348 -6567 1273 2296 -2246 3697 2932 -4227 97
1113 97 2750 -2707 -45 4190 412 -3556 -2474 2789 1987 -3781 1704 5550 -6174 -6623 7333
1128 7333 2024 -7367 4693 5121 -9691 -677 7904 -4763 -398 7576 -5933 -5361 8292 -1282
1142 -1282 -5502 9212 2366 -11203 1719 7468 -5715 -1245 8476 -2345 -6414 1986 2002 -746
1156 -746 602 506 -312 -2388 -2033 1401 2032 -187 -328 -1823 -1848 1010 497 -863 2925 1085 -5920
1173 -5920 -186 5925 -2364 -1536 6369 -1147 -5791 2279 2994 -1350 1317 1035 -2483 -325 -176 -931
1189 -931 3921 2047 -5008 -413 2415 -3945 -71 4711 -607 -2574 -230 -1388 338 2478 -1018
1204 -1018 -725 2277 -3208 -4028 5355 3280 -4046 1077 3494 -3799 -2815 3707 2627 -1479 -1187 1713
1220 1713 38 -1913 1239 2860 -200 -2049 -524 -171 -911 1378 1063 -976 885 -843 -3843 1903
1236 1903 3437 -3607 -1135 4184 -1649 -4205 3258 3772 -3251 -1380 2571 -1089 -1800 1728 2032 902
1252 902 -705 -986 1025 557 -1217 -57 1831 174 -2358 -233 2163 243 -1537 -36 1614 -1632
1268 -1632 -3509 1402 3409 -2346 -1382 3124 -568 -3318 1186 2412 -1099 -1182 1174 -123 -305 986
1284 986 335 589 1450 -1322 -1749 1881 1041 -1836 100 2854 -366 -3977 1232 3577 -2976 -2435 3626
1301 3626 807 -4903 228 4449 -1696 -2971 2792 558 -3628 627 1859 -415 364 1104 -824
1316 -824 -227 1543 -788 -1094 2519 714 -2907 1031 3473 -1527 -1909 3080 1531 -4393 -1010 4122
1332 4122 -637 -3436 2319 1770 -3258 -887 2482 -722 -1603 722 69 -1093 909 -409 -1096 1906
1348 1906 -227 -2873 1495 2487 -1974 -916 3417 572 -3351 740 3306 -1305 -1810 2322 1079
1363 1079 -2177 -770 2409 399 -1612 508 343 -1564 510 6 -1271 1174 176 -3136 227 2779
1379 2779 -2253 -2368 4045 895 -4657 1799 3894 -2805 -1617 3043 479 -2145 377 1937 52
1394 52 -839 374 889 -315 -301 262 699 -81 -120 -285 66 933 -276 -2226 1770 1232 -3754 -306 3914
1413 3914 -1648 -3290 2722 1282 -3619 -22 2761 -1099 -991 1187 40 553 329 -948 1075 939
1429 939 -2230 98 2044 -624 -859 1093 696 -876 -518 -282 214 447 -2092 -275 3080 -1430 -2435
1446 -2435 3049 608 -3661 472 2000 -1486 -1448 1033 614 -535 -117 233 1004 71 -1629 830 1536
1463 1536 -909 -98 1436 -162 91 -546 -879 1655 46 -3154 1826 2870 -3902 -1302 5106 -1238
1479 -1238 -4854 3454 1033 -4989 945 2675 -2543 613 2330 -2114 -221 2328 -2103 -725 3567
1494 3567 -459 -3055 2942 1931 -3174 220 2883 -712 -2197 327 1774 -547 -1745 2102 1500
1509 1500 -2797 -764 1896 -1084 -1214 1660 -718 -1571 901 -820 -1250 3185 -266 -3698 2522 1852
1525 1852 -4249 768 4586 -2320 -1861 2839 27 -1656 1664 926 -569 919 -1405 -1529 2787 -216
1541 -216 -2583 2393 802 -3510 126 2749 -726 -1186 982 -595 -1451 -190 -111 1083 908 -1812
1557 -1812 -647 1435 -814 -347 1897 681 -634 -1184 -217 1746 440 -1003 2003 892 -3201 -754
1573 -754 3715 -451 -1949 2338 -64 -3338 866 1681 -586 1489 -79 -2503 721 738 -1907 1049
1589 1049 2627 -2597 -3011 2237 599 -1751 1841 2180 -1452 -1696 85 1178 654 -670 866 723
1605 723 -1613 -651 1937 800 -828 302 -278 -1568 640 352 -810 1881 -628 -4090 1404 2375
1621 2375 -2706 -304 3573 -1443 -4118 1714 2858 -2089 -397 2291 -1354 -2514 958 1915 428
1636 428 169 530 -637 -1178 997 235 -576 1528 3 -3278 307 3076 -1725 -1497 4155 -469 -5400
1653 -5400 1431 4202 -3224 -974 4181 -1525 -3466 1792 1291 -1743 673 1134 -1720 -406 1679
1668 1679 -1070 577 2683 -1253 -2362 1765 694 -1881 1061 2908 -1198 -2632 1493 2196 -1698
1683 -1698 -531 2048 -784 -1904 470 1197 -351 -351 546 -668 -450 273 -642 761 1347 -1745 -978
1700 -978 1676 179 -1405 1070 1915 -1540 -1591 1398 1041 -922 309 1032 492 -1661 -784 1453 253
1717 253 -1565 444 745 -1326 -606 980 392 -551 -43 -524 -673 879 -208 -950 2009 460 -2469
1734 -2469 446 2361 -1121 -1715 2588 981 -2981 -263 2938 -510 -1866 2200 1289 -2207 -571
1749 -571 1896 -248 -970 1341 -25 -1400 698 329 -1316 1125 769 -2266 -359 1798 -929 -2266
1765 -2266 2293 1440 -3370 -348 2940 -747 -2039 1834 1222 -1966 -858 1617 523 -926 540
1780 540 977 -694 -355 213 185 598 412 -674 -191 782 -187 -1260 1190 1075 -2259 -1027 2207 142
1798 142 -1537 1030 1446 -1773 -1417 1674 509 -1335 635 978 -458 -724 341 836 278 -325 -297
1815 -297 -237 431 -11 -20 1172 439 -1594 -563 1163 336 -1819 817 1879 -1600 -1687 1989 687 -1884
1833 -1884 155 1160 -1222 -1624 1189 714 -335 332 38 -538 227 103 -369 814 982 -1043 -672
1850 -672 1724 543 -1433 818 1953 -1777 -1699 2178 1106 -1942 -207 1957 -1218 -2328 1490 876
1866 876 -1737 193 781 -1128 -104 997 -158 120 789 -987 -1410 1546 571 -1689 809 1972
1882 1972 -1219 -1505 1872 1000 -1470 -475 1631 -448 -1975 1213 1627 -898 -853 809 -126 -1254 405
1899 405 1008 -475 170 158 -766 476 608 -1104 414 1532 -985 -1297 1441 1095 -1618 169 1867
1916 1867 -721 -1591 1160 1124 -521 -740 759 828 -777 -97 1411 -156 -974 395 180 -786 235
1933 235 -253 -267 341 183 -1544 263 1726 -1353 -1026 2311 -170 -2220 1411 1864 -1479 -931 1690
1950 1690 -237 -1528 606 1467 -189 -668 239 391 -541 -204 641 155 -480 174 -486 -316 1200 -549
1968 -549 -1354 1275 862 -2391 -147 2756 -1332 -2286 2576 1070 -3058 595 2538 -1216 -860 1772
1984 1772 105 -1384 363 804 -444 322 688 -846 69 1043 -370 -963 1127 717 -2112 -651 2760
2001 2760 -679 -2672 2433 1335 -3749 -214 3366 -1859 -2438 2868 449 -3082 1124 1443 -2427
2016 -2427 725 1607 -2097 -295 2351 -1168 -1046 2935 483 -2789 1192 2087 -2232 -1051 2523 -23
2032 -23 -2087 365 1830 -1425 -1499 1510 466 -2144 372 1562 -1350 109 1376 -1232 -579 1384
2048 1384 -630 -1281 1955 410 -2502 1616 1969 -2396 -441 2529 -983 -1751 1477 660 -1052 -204
2064 -204 950 220 -92 -492 3 840 -468 -759 1051 82 -954 601 -85 -159 268 -346 -84 1290
2082 1290 -639 -1022 1216 1147 -1731 -181 1959 -969 -1731 1515 788 -1474 156 1080 -298 -617 -59
2099 -59 571 -27 -456 118 225 -299 -283 359 43 91 -108 -953 5 1521 -1099 -1381 2361 132 -2562
2118 -2562 1698 2126 -2280 -986 2230 -462 -1615 1501 1101 -1225 -16 375 -680 530 199 -487
2134 -487 856 -41 -939 -40 675 294 -325 -115 649 -487 -948 -11 1390 -262 -1585 1191 526 -2013
2152 -2013 559 1914 -844 -791 552 -173 -332 348 690 291 64 -959 -211 1228 216 -635 336 406
2170 406 -1336 -462 773 994 -343 -1119 239 388 -1177 -67 1818 -81 -1751 358 841 -1362
2186 -1362 287 2005 -1000 -1177 748 -950 -3 1449 -196 -619 584 -100 -1527 1008 1898 -1338
2202 -1338 -1193 1259 -281 -1619 977 1543 -748 -1700 147 778 -632 -181 1769 -245 -1619 -7
2218 -7 250 29 175 692 -543 -437 159 -616 469 1645 -609 -1309 257 -201 -1292 630 1933 -197
2236 -197 -1518 129 816 -443 -258 862 478 -1200 -1052 1336 725 -562 600 222 -997 -482 424
2253 424 106 334 -14 -888 -142 445 -477 -124 1292 -381 -1986 435 1435 -604 21 1536 -235
2270 -235 -1636 -528 1122 70 -598 456 345 -781 -251 597 670 8 -317 -548 -891 558 10 -404
2288 -404 1370 253 -1921 47 1525 -700 -638 1951 261 -1962 221 1736 -714 -299 936 57
2304 57 -998 -447 308 339 -126 -295 -99 -594 230 228 -287 687 206 -1022 -224 1120 26 -1112 763
2323 763 678 -1931 33 1878 -452 -1279 1071 600 -1129 -177 1177 308 -364 556 295 -369 460 480
2341 480 124 269 86 -454 -210 524 209 -916 570 928 -1133 -547 1429 370 -1763 399 1392 -1329
2359 -1329 -853 1791 116 -1364 564 713 -639 131 383 -43 327 294 -415 27 1010 -483 -550 894
2377 894 717 -1186 -334 1163 -381 -1179 326 1204 -1101 -1250 1622 173 -1279 791 1026 -680 -384
2394 -384 566 -363 -270 681 -190 -284 983 -415 -1034 1021 464 -1170 466 1330 -529 -1044 855 848 -1160
2413 -1160 -285 1100 -3 -893 328 964 -496 -882 603 323 -810 182 524 -492 51 229 -211
2430 -211 558 782 -828 -153 774 -275 -894 1019 817 -861 -261 665 -134 -677 225 525 285 -749
2448 -749 -49 706 -378 -480 414 490 -952 -290 335 125 318 -127 -302 51 163 -884 315 850 -757
2467 -757 -949 899 455 -1250 397 1081 -590 -853 523 432 40 -369 381 459 -442 -826 704 400 -855
2486 -855 282 241 -362 67 57 -108 290 239 -776 121 827 -856 -507 1459 -292 -1458 578 868 -556
2505 -556 -357 430 295 -747 -97 757 431 -533 -36 558 -389 -769 632 224 -461 309 -98 -453 664
2524 664 10 -885 1248 652 -1494 -96 1751 -800 -1421 1556 632 -1965 202 1031 -723 -282 642
2541 642 -9 -430 14 39 52 247 150 -307 31 450 -448 -360 1057 -55 -1074 -280 1113 -315 -803 1361
2561 1361 592 -1708 -21 1374 -704 -676 1024 185 -1119 435 326 -588 421 52 -1050 685 330
2578 330 -881 346 767 -346 -608 678 248 -476 -236 576 474 -383 -417 770 423 -1078 -39 1252
2596 1252 -435 -694 961 313 -631 317 345 -145 -177 -165 280 315 101 -430 66 439 -165 -196 581 342 -357
2617 -357 -733 604 721 -843 -53 1287 -568 -1104 789 1044 -1240 -197 1207 -502 -699 954 -143
2634 -143 -638 605 -416 -744 742 178 -1058 486 758 -1107 -743 1504 440 -1421 504 898 -786
2651 -786 -509 936 374 -715 -144 932 -957 -462 709 225 -662 330 416 -527 325 549 -964 -193
2669 -193 1102 -763 -807 1421 186 -1364 605 863 -1062 -636 1171 606 -996 43 753 -339 -317
2686 -317 501 171 -551 -469 493 216 -405 82 26 -307 520 -118 -711 881 729 -1357 -489 961 -502
2705 -502 -836 1531 732 -1939 -100 1208 -719 -293 862 149 -400 -143 40 66 376 71 -322 -131
2723 -131 431 76 224 575 267 -1169 -347 957 -224 -1200 913 767 -1888 -183 1231 -484 -922
2740 -922 603 144 -1109 -29 711 -473 -403 320 -764 -353 148 -412 185 648 -299 -689 -17 340 -197
2759 -197 -456 824 317 -881 -563 990 338 -1145 464 850 -1099 -539 1130 267 -844 240 174
2776 174 -479 -214 480 198 -62 158 -303 -156 639 -232 -421 696 243 -691 -498 891 595 -511 74
2795 74 697 -875 -846 1015 481 -748 -103 346 -356 -687 549 73 -234 73 -232 -601 698 225 -384
2814 -384 471 533 -792 -265 965 -22 -518 440 721 -569 -430 970 521 -775 -121 692 -172 -644 722
2833 722 539 -790 -218 466 -42 -55 288 -32 -92 28 -208 -575 742 836 -983 -4 531 -402 -673 1000
2853 1000 873 -804 -234 695 236 -811 452 645 -494 -730 669 473 -760 88 144 -593 -12 345
2871 345 -724 349 718 -535 -385 921 -202 -1220 598 851 -1347 -675 1066 -399 -1093 632
2887 632 605 -691 -297 542 236 -894 342 697 -711 134 466 -191 -375 544 -346 -531 984 221 -1279
2906 -1279 427 1141 -1322 -760 1608 -79 -1464 722 631 -1054 -474 1210 -139 -736 630 352 -652
2923 -652 118 157 -126 -234 236 -132 -269 699 12 -842 654 623 -770 -755 936 50 -1257 152 1100
2942 1100 -1071 -707 1503 79 -1308 513 560 -624 -91 305 -376 -77 239 -52 -245 341 -185 -776
2960 -776 140 393 -305 -281 815 412 -931 -44 780 -296 -1016 1119 722 -847 -157 1036 -455 -652
2978 -652 636 44 -804 93 487 -317 242 -145 -487 227 513 -462 -550 590 100 -815 -21 790 -230
2997 -230 -988 606 415 -596 -719 1139 247 -1297 787 844 -1199 -46 1079 -429 -484 523 -386
3014 -386 -605 795 -57 -634 581 409 -1190 11 1057 -611 -727 661 322 -936 211 1162 -112
3031 -112 -1209 315 758 -726 -329 1032 190 -735 261 59 -806 106 476 -688 -28 774 -813 -384
3049 -384 1227 -252 -1055 768 642 -1518 -147 1378 -516 -809 830 214 -868 -474 532 269 -776
3066 -776 -81 302 -358 -12 584 -116 -255 325 -371 -520 435 334 -842 180 732 -1234 -563 1454 -447
3085 -447 -1200 1028 469 -1123 -9 965 -547 -573 389 -136 -87 107 12 -101 223 56 -62 234 34 -24
3105 -24 -204 362 334 -617 -306 1073 240 -722 361 637 -587 -582 873 172 -958 151 118 -603 -115 142
3125 142 -98 148 -219 -492 258 104 -365 5 644 -574 -174 297 -90 250 53 -309 624 125 -215 228
3145 228 638 -773 -318 1099 -208 -849 283 766 -639 -420 679 -159 18 604 30 -48 -81 -240 191
3164 191 318 162 -27 -49 255 -114 -359 390 340 -261 -413 435 289 -947 277 1026 -807 -361 1012
3183 1012 155 -689 232 384 -146 227 262 -310 307 344 -743 -82 629 -436 -468 517 234 -451 -95 679
3203 679 139 -608 29 418 -135 -316 465 452 -747 -180 761 -494 -545 497 9 -718 409 -8 -376
3222 -376 506 -2 -565 127 565 -513 -476 743 -262 -606 500 666 -381 -94 333 427 -476 -12 778
3241 778 -14 -485 513 242 -103 3 247 -61 -73 373 -440 82 834 -506 -596 929 155 -1062 71
3260 71 880 -778 -436 804 411 -691 217 856 -395 -155 268 370 -165 -281 404 -4 -219 380 198
3279 198 -393 201 10 -325 371 532 -306 -361 739 -359 -745 958 467 -882 -45 677 -524 -754 499
3298 499 87 -301 216 327 -104 35 204 -139 -115 -17 -109 -98 384 230 -82 -209 517 77 -601 501 591
3319 591 -697 -245 593 57 -787 323 636 -727 -195 575 -250 -490 373 -125 -241 176 -67 87 233
3338 233 114 -585 -119 495 -234 -164 182 257 -632 -275 393 199 -859 379 504 -530 -521 629 106 -450
3358 -450 307 458 -278 -204 256 -153 -115 417 -65 -50 215 -150 -348 473 328 -546 -192 470 63 -488 391
3379 391 126 -408 -334 459 647 -605 -55 445 -27 -606 394 408 -469 222 117 -378 202 48 -192 59
3399 59 289 -215 -394 499 394 -893 100 696 -458 -388 484 300 -506 -299 783 31 -413 345 128 -227
3419 -227 -295 251 -302 -173 332 352 -77 203 197 -536 384 272 -792 -139 670 -531 -614 884 347 -746
3439 -746 -9 678 -357 -457 377 78 -123 74 142 362 -211 -50 72 -30 -14 283 50 171 193 -268 -181
3460 -181 696 -94 -560 488 394 -944 -154 739 -114 -276 237 221 -367 224 79 -177 -102 -53 74 121 164
3481 164 -152 179 42 -267 -51 6 318 276 87 18 342 -206 -499 639 208 -476 138 809 -102 -400 467
3502 467 85 -326 -39 262 -496 -173 -257 -76 -210 -213 230 -43 213 -389 134 193 165 -325 -143 -96 365 -223
3524 -223 -386 666 157 -751 305 493 -1057 -290 648 -175 -492 409 160 -486 -68 307 -347 36 91
3543 91 -161 66 93 -253 -261 216 146 -208 -124 372 -35 -496 211 630 -349 -434 596 312 -860 690 815
3564 815 -679 -324 787 -84 -210 497 47 -309 184 -177 -297 -3 2 -481 34 313 -444 -480 198 145 -414
3585 -414 -546 556 312 -889 137 715 -355 -137 630 129 -867 135 504 -425 33 212 -348 -215
3603 -215 573 -555 -353 342 -171 -658 390 439 -773 66 918 62 -513 337 353 -482 -386 177 253 -425
3623 -425 -232 586 -174 84 225 25 -363 308 239 -531 189 102 -392 -268 810 -521 -378 750 -75 -582
3643 -582 304 472 -486 -96 316 301 -415 -115 321 -225 -306 44 484 -154 -115 289 -193 -23 155 136 -415
3664 -415 34 -23 -399 504 271 -595 -242 633 -133 -704 509 490 -694 43 653 -341 -525 541 -94 -439
3684 -439 -203 66 -218 37 359 36 -428 267 60 -149 280 382 -474 -96 438 -250 -626 467 545 -648
3704 -648 -177 418 -112 -358 353 416 -491 36 629 -63 -88 87 -385 -358 473 -147 -93 314 222 -209 -330 296
3726 296 -90 -457 104 262 -325 -304 489 104 -666 158 565 -349 -358 497 197 -233 85 93 -308 121 218 -130
3748 -130 30 236 -320 -213 459 -125 -470 252 513 -102 -283 308 -31 -478 -175 332 -259 -639 267 241
3768 241 -390 22 581 -228 -401 -83 -129 151 440 112 -405 514 -59 -146 110 245 -130 -349 594 149 -477
3789 -477 115 103 -636 -165 80 239 -379 29 334 -165 -482 86 14 -44 -152 -276 63 241 566 54 -141
3810 -141 437 -53 -512 595 246 -682 -275 719 -475 -621 369 186 -477 -466 461 75 -352 339 182 53
3830 53 -204 -62 -40 -275 -44 -124 -146 19 292 -395 288 672 -345 -34 570 -71 -359 83 643 -202 -119
3851 -119 643 166 -317 199 160 -541 -278 64 -96 -397 393 106 -117 -237 -65 -459 114 40 -293 41 368
3872 368 345 -465 10 623 -495 -580 627 53 -575 177 295 -529 -413 581 124 -583 410 85 -291 115
3892 115 33 -64 32 216 -28 -409 249 161 -212 289 220 -166 -164 376 281 -480 -33 567 44 -345 580 398 -330
3915 -330 243 301 -460 -99 622 -4 -262 236 51 -354 201 236 -493 -80 585 217 -194 204 10 -578 -129
3936 -129 399 -328 -647 669 297 -264 -68 460 -427 -539 348 51 -562 259 242 -218 143 185 49 103 516
3957 516 -121 -225 375 273 -606 181 506 -269 -490 400 135 -518 -198 277 -219 -324 123 256 -315 -203
3977 -203 412 -301 5 157 -246 65 232 300 -275 431 524 -536 119 559 -41 -364 299 110 -317 39
3997 39 358 -323 -419 302 332 -244 -246 96 40 -289 -3 210 -239 -120 310 -312 -266 504 -183 -225 346 -43 -321
4020 -321 76 319 -314 -425 365 -29 -466 12 484 -35 -40 59 -108 -455 -159 -56 2 -425 104 -85 -145 -141
4042 -141 37 -284 146 153 -222 -34 427 -164 -244 522 108 -306 37 329 -422 -169 481 448 -266 186 433
4063 433 -126 -9 186 -99 3 134 89 205 208 610 31 -209 186 -134 -476 357 229 -383 -157 435 -397
4084 -397 -508 245 41 -460 318 383 -287 -77 237 198 90 2 189 69 -122 10 -194 47 100 -40 -181
4105 -181 -141 147 -285 -423 255 44 -377 316 347 -286 -328 573 98 -393 207 -38 -206 -118 445 -284 -22
4126 -22 411 216 -54 368 119 -207 220 244 -241 -313 286 -81 -334 91 184 -479 -154 459 -69 -345 181
4147 181 431 -282 -481 16 55 71 -145 -137 -56 169 112 183 48 239 -69 -150 20 -44 -213 314 121 -308 -439
4170 -439 258 246 -607 203 390 -291 6 409 159 -357 -293 255 -210 -142 393 -203 -302 -3 -32 -74 27 150
4192 150 -200 42 447 -189 -233 315 69 -273 -58 511 -210 -188 398 159 -357 34 670 -246 -204 129 168
4213 168 -90 -37 222 -161 -14 196 -54 -311 92 -131 -254 167 431 -376 -72 507 173 -190 368 409 -245
4234 -245 -390 241 18 -313 230 257 -231 -152 535 68 -164 -45 -361 -197 320 -148 -247 328 113 -178 -140
4255 -140 53 116 -317 213 70 -260 -164 345 -49 -314 270 253 -234 -69 459 -132 -121 79 34 -227 39 -190
4277 -190 -229 67 -308 -2 -97 329 -177 -260 -12 -63 -246 -387 401 161 -533 3 367 -350 -227 329 116
4298 116 -434 386 143 -236 52 171 126 -233 59 -45 23 59 185 -197 215 398 -360 -195 41 339 -359
4319 -359 -85 388 -415 -309 389 145 -214 -110 402 -238 -65 373 -27 -22 274 135 97 335 -20 -106 178
4340 178 224 -185 -266 463 -58 -378 168 283 -396 36 275 121 -171 -474 -175 -376 -135 282 -225 -244 153
4361 153 -82 -236 230 33 -179 -226 259 48 -149 315 145 -191 125 565 -294 30 203 335 -393 -129
4381 -129 205 158 -330 227 -24 -83 105 205 -180 -150 150 -71 -200 -31 -105 -335 285 175 -305 -190 113
4402 113 -31 -337 333 413 -473 -75 288 -268 -84 -19 -22 -35 -78 -68 285 -353 74 63 -137 -214 -2 -37 -66 -15
4426 -15 -231 -153 108 189 -113 156 240 -176 -301 507 -126 -96 206 113 -61 -223 172 -288 -254 -67 -123 -82 -46
4449 -46 -52 127 101 -105 37 -291 -202 213 -348 66 403 -141 -103 -28 553 -232 -176 222 -220 -535 227 -3 -327
4472 -327 59 -42 -218 239 106 162 -45 133 437 -31 -180 72 -266 -15 338 40 -424 -109 228 -280
4492 -280 -171 340 -257 -404 -174 377 -375 96 401 -3 -145 400 -54 -90 -21 -73 -106 288 34 68 -93 164
4514 164 41 11 243 -47 -265 -315 195 176 -210 -148 328 -442 -211 243 -28 -243 160 58 -304 125 313
4535 313 145 -48 118 179 -32 -81 -84 24 169 238 -94 -199 0 -42 104 90 179 -280 -364 384 182 -300 236
4558 236 301 -350 -155 273 126 -210 31 71 -340 -3 65 -355 -79 312 58 -17 163 -16 -217 -127 539 69
4580 69 -319 515 217 -609 -78 113 -49 -303 351 397 -513 -416 218 -380 -40 326 -26 -364 444 -111 -19
4601 -19 21 287 -199 -350 236 -163 118 120 222 -253 -74 320 -17 -286 381 158 -116 89 265 19 -243
4622 -243 148 226 -205 -93 19 -230 21 -239 -435 -201 240 -213 -304 346 94 -179 96 188 -238 -380 203
4643 203 -56 -710 134 211 86 115 189 135 -107 -6 168 -6 149 224 -312 2 -3 110 -241 19 129 -160
4665 -160 -122 485 -197 -92 162 160 -153 -73 191 238 -123 325 102 -417 56 140 -203 41 302 -189 98 81
4687 81 240 26 -60 234 15 -338 347 48 -117 133 245 -349 -349 43 92 -280 -76 -24 -488 -124 277 -160
4709 -160 -252 197 -26 -128 -116 516 -248 -27 119 -29 -331 93 -208 -306 303 277 -17 53 477 313 -109 56
4731 56 323 -18 43 -106 254 -149 -118 215 -101 -529 44 -310 -282 -116 -80 -5 -68 281 -193 160 221 193 -342
4754 -342 388 409 -155 152 218 -108 -115 289 304 -159 100 367 215 -187 -124 -198 -262 -88 207 -97 -69 195 -71
4777 -71 -191 -178 59 -425 -177 17 -152 -140 329 -119 -258 183 84 -213 180 458 -21 -39 165 -20 51 148
4799 148 58 33 -300 59 80 44 -307 72 -107 -132 17 -146 -250 85 108 -191 159 205 -251 -291 496 -48 -242
4822 -242 -4 290 -162 -172 7 -289 -127 -2 -43 -94 98 -28 -363 -309 202 58 223 173 -1 -455 74 229
4844 229 -50 -74 205 -29 -48 181 348 -171 -168 182 -146 -132 520 -163 -284 114 215 75 6 207 -29 -63
4866 -63 278 154 -106 52 153 -148 -142 239 -1 -308 -77 456 -292 -74 222 60 -405 92 233 -242 -197
4887 -197 312 -171 57 -80 -246 -109 188 64 -188 84 -21 -53 -232 106 282 38 -45 251 -28 -224 26
4908 26 26 -322 -71 173 -112 -333 171 125 -99 80 -55 -31 49 -30 -294 -138 63 -8 58 446 162 -226 -69
4931 -69 260 -213 -52 16 154 -22 -85 259 -16 -219 182 32 -87 -190 49 -241 87 152 -106 -340 -18
4952 -18 16 -8 -188 6 -86 -320 157 -221 -374 -77 208 9 -152 66 218 -284 178 129 -48 -9 193 131
4974 131 -425 163 37 -415 -21 352 -160 -184 216 63 -290 29 37 -516 35 83 -370 -380 55 82 -38 202
4996 202 201 103 -200 327 34 -177 81 67 -394 145 170 -87 138 -107 224 -3 168 243 -47 -236 217 -317
5018 -317 45 -45 135 -247 -131 192 -19 -400 147 294 -54 91 172 -376 74 203 16 -181 -139 276 -267
5039 -267 89 193 64 163 170 140 -224 124 265 -181 109 -40 -227 57 415 341 -145 -83 99 -237 -210 -54
5061 -54 -8 -26 143 7 -76 -97 386 -202 57 382 112 110 269 -183 -286 -256 320 197 10 102 268 -134 -321
5084 -321 242 -248 100 -14 202 -104 110 -16 55 -156 180 -256 -5 48 114 -14 2 -53 -342 -320 73 161
5106 161 -139 -225 -84 -100 -84 20 -29 -15 -128 277 -132 -131 102 139 -248 64 78 5 94 177 -400 68 106 -263
5130 -263 -66 -111 148 -267 -214 287 -152 -114 467 -6 236 -72 222 -238 -66 166 130 -219 183 44 -357
5151 -357 -19 141 -248 -154 45 27 -81 -107 180 -117 -40 -244 -37 -179 192 94 -44 0 146 -37 -58 -54 224
5174 224 -115 68 -39 -102 -146 329 -107 67 36 312 -34 142 364 61 -212 266 -265 -209 285 -53 -28 -132
5196 -132 -39 224 -115 -83 253 -281 35 95 -177 -225 -2 332 -352 -176 51 -92 88 -74 122 -194 129
5217 129 127 -269 91 432 -104 -144 -74 -143 -101 -29 118 -131 -109 0 -100 -149 87 396 2 -153 -100 -42 -280 31
5241 31 59 41 353 102 33 -17 122 -15 -12 475 108 -410 -72 122 34 81 -1 136 -55 -166 154 -273 32
5264 32 75 -326 -204 -60 19 -9 -36 -161 51 -292 69 -179 14 40 -25 -83 80 232 -78 -215 248 225 -404
5287 -404 81 89 -256 113 158 87 -301 78 31 -11 -105 184 31 -175 249 -183 -63 -105 100 -187 40 33 85 -63
5311 -63 249 -68 -57 -7 85 -91 -159 174 -13 -341 -23 526 -26 112 -155 -83 39 188 -121 183 -41 236
5333 236 -234 74 242 7 -128 -237 228 -58 -288 149 -179 -248 -116 13 -163 242 242 -132 -110 379 -143
5354 -143 -68 202 -62 73 -3 -48 112 -1 313 -3 -271 194 320 -60 -168 226 295 31 -102 59 -172
5375 -172 -111 -146 -75 -148 200 7 -73 -143 278 -98 -62 218 144 -86 234 211 37 159 453 -230 -408 81 241
5398 241 -50 166 504 -60 -405 110 -31 -301 -26 216 73 -306 118 360 -207 69 -173 -258 -177 208 -269
5419 -269 -250 86 -150 -155 179 42 22 -63 -198 27 341 149 96 -90 -98 109 64 -285 27 223 -105 162 89
5442 89 -267 -213 -3 126 -90 60 -232 -378 259 198 -158 170 128 -132 -204 234 35 16 99 152 178 68 20
5465 20 73 -72 -331 136 -41 -55 225 431 49 -136 -40 -305 -77 -73 -173 -212 85 -84 -280 -79 190 -162
5487 -162 -110 212 107 -170 -163 320 -121 -182 -2 -334 -72 -77 111 26 118 70 -60 -195 58 69 -252 -155 175 30
5511 30 37 385 -284 -135 204 12 -206 -35 96 -75 -88 196 218 -126 274 33 17 -30 -54 181 -332 218 135
5534 135 -41 146 -28 -174 91 -58 -109 -151 192 46 -137 55 211 -246 -168 109 -7 27 165 224 -152 -106
5556 -106 -53 36 15 140 -283 112 -11 99 263 -129 418 172 30 24 295 16 50 26 182 -81 366 -70
5578 -70 -50 83 378 257 80 196 145 -274 101 242 -142 -157 115 -347 -99 -81 9 -331 -226 337 -461 -275
5600 -275 246 126 129 183 67 -62 -38 142 128 -154 214 60 -115 -203 -4 -204 -54 155 -62 -210 -86 -7
5622 -7 185 133 -11 -481 -322 -157 274 8 -143 110 -59 -262 86 362 111 -79 -7 69 -8 256 112 -29
5644 -29 350 -39 -231 -221 236 119 11 95 38 -196 -85 149 -207 103 84 -86 -61 -36 87 -87 0 56 -243
5667 -243 -108 198 22 -42 278 -5 -139 62 18 -164 -163 133 -89 32 -26 29 110 -104 46 45 85 244 71
5690 71 -220 -153 274 -50 -161 -97 326 -204 -27 316 22 -149 -96 275 -164 35 546 -555 -52 241 -74
5711 -74 -48 16 -130 -29 192 102 -117 -368 -127 73 -211 69 123 -64 81 102 -15 -179 161 -89 -180 -170 95
5734 95 -23 -43 -243 -130 -5 150 226 193 325 42 13 162 204 -351 -25 65 -63 -17 -20 15 -28 -224 -98 -111
5758 -111 -204 25 278 44 -224 98 -34 -158 -132 167 -114 -31 82 -37 27 35 -180 4 -12 492 -89 81
5780 81 186 -215 -196 121 346 -130 175 109 144 35 25 -117 -3 32 -2 16 34 -293 44 8 165 -198 -219 103
5804 103 69 -175 -174 79 -55 17 -29 85 -318 -54 234 218 -292 41 172 -200 -197 93 167 -175 35 118 189 -72
5828 -72 101 87 -122 195 -417 123 84 37 -72 -100 -235 -41 73 99 168 -247 25 -205 -43 -148 79 -162
5850 -162 -129 124 289 -180 -186 100 -125 215 46 61 269 168 258 -332 -70 24 -279 -492 123 146 -51 -72 220
5873 220 -226 -52 175 -184 -85 38 -155 -129 -11 74 -89 217 -109 -73 -191 -235 298 -156 -194 196 143 -385
5895 -385 110 -21 -196 -413 124 -119 -181 -72 22 31 -222 323 -45 -314 130 -78 58 37 180 379 -195 -258
5917 -258 58 -164 173 16 13 78 125 69 7 173 84 73 165 -90 -3 -145 -82 -217 -297 275 -5 -231 91 6
5941 6 80 -91 215 68 -290 155 131 -80 -21 -76 127 -24 92 266 -107 -11 403 43 -61 164 213 -157 -167
5964 -167 173 27 51 119 -231 -100 115 121 -44 -101 177 -163 -17 -252 -8 26 6 144 -102 100 -28 172
5986 172 -116 156 -140 29 196 0 -237 -177 19 352 -130 141 45 11 -90 246 -86 -292 -72 40 -384
6007 -384 34 406 18 24 53 209 -84 8 329 54 -241 176 -22 -2 36 -57 120 43 351 124 -183 -46 -91
6030 -91 -79 -32 233 -172 211 106 -80 -150 276 -16 -189 -66 8 -371 80 203 -138 33 26 -117 48 -201
6052 -201 -90 179 -194 -212 -92 183 29 101 -142 33 118 130 -77 213 137 -78 177 64 -188 -19 -70 42
6074 42 -63 113 184 -83 -134 104 -109 -384 140 162 -22 -113 229 -184 -65 42 -34 -60 -249 -121 58 -77
6096 -77 173 151 -168 89 187 -109 -175 62 13 -270 128 -62 -96 48 44 113 -230 -202 -62 -152 181 111 -181 -57
6120 -57 65 41 -30 165 -23 6 -72 -67 40 156 -92 85 171 134 276 -69 -75 274 -146 -192 257 -163 -72 -143 91
6145 91 -39 -229 35 58 -118 267 -65 -6 9 -143 -27 -69 77 -192 -323 73 2 -243 -49 389 422 191
6167 191 -45 95 122 66 4 -255 84 -109 87 -122 -133 551 -86 -70 15 -161 -240 37 1 -158 94 -128 211
6190 211 -45 -76 1 -251 110 199 75 -298 18 235 -221 -6 253 189 -108 115 -137 -108 196 -135 -27 8
6212 8 -195 -94 337 50 -178 -98 -15 -72 -174 -225 12 84 25 -248 -89 -219 118 147 -183 -29 64 173 24
6235 24 51 62 102 -295 -34 187 -273 -116 114 -192 183 151 -45 -187 202 148 164 197 181 -196 -151 25 19 169
6259 169 150 7 -351 160 -31 -133 3 96 23 -147 128 2 1 -167 -66 -247 -151 393 -119 -193 5 -42 -107
6282 -107 115 -286 192 -182 178 94 -68 1 313 -5 -129 164 84 -11 85 -212 -229 129 -28 45 -269 85
6304 85 145 -14 199 115 122 32 -100 378 -90 140 113 67 157 77 -168 -31 175 -74 109 181 127 -117 64 107
6328 107 47 -76 41 -158 -89 -183 18 35 -207 -131 6 -114 -34 199 81 114 -181 26 -87 -88 -36 16 -74 40
6352 40 -190 139 278 -180 48 -272 -133 48 288 -284 -78 -248 57 309 -406 -5 276 9 150 121 218
6373 218 -369 12 243 -67 69 48 -16 -131 -199 161 83 148 49 163 84 153 132 -428 33 -148 -64 -135 282 -150
6397 -150 -263 86 -7 -156 6 57 -104 34 159 -154 -165 -15 195 -181 91 -85 -73 115 238 42 -155
6418 -155 204 -276 -76 209 244 -37 -221 66 32 -235 -110 84 106 -168 19 -75 120 129 45 -98 -84 119 -128
6441 -128 -133 -12 158 80 -51 211 -56 56 -80 -315 -20 190 275 -141 -5 282 35 0 59 -157 277 -19
6463 -19 50 -36 -108 69 19 -167 101 69 82 -149 232 -80 -156 66 60 -138 -107 -123 209 -7 -138 11 -122 -174
6487 -174 -206 -243 -259 139 295 232 -37 17 -25 -86 187 -124 -268 -196 158 -198 123 361 -56 -41 95 54 -31 146
6511 146 139 92 7 78 -98 137 -48 52 -272 160 -39 -283 -7 47 48 -273 -188 79 -106 182 -17 81 -40
6534 -40 -112 -253 -187 -28 42 -237 4 -91 -206 -255 159 16 16 -149 213 165 -216 -110 109 104 90 -3 35 0 -193
6559 -193 352 -59 36 48 -266 168 -76 -4 -125 -107 262 -90 3 -238 -287 -14 292 63 99 426 155 -80
6581 -80 3 -128 108 -50 -19 70 109 -83 140 -201 102 63 -262 -141 27 385 -18 -261 177 53 295 12
6603 12 -157 -299 13 266 -185 -39 150 -72 -9 -209 -213 78 -25 204 -307 212 7 135 98 6 367 -230
6625 -230 0 -27 -215 166 31 -100 -34 -198 155 133 76 174 389 -256 -100 -24 -223 -247 25 -216 48 89 167
6648 167 -506 6 212 63 -272 101 93 -57 81 -145 257 125 -135 65 27 135 -18 -314 356 159 -9
6669 -9 -112 -100 158 -58 80 18 210 147 95 -164 32 -19 104 -280 -271 -18 23 22 -67 -5 -76 -134 -114 -375 -87 43
6695 43 46 46 92 69 135 -15 -109 -112 140 -125 -223 -130 4 299 -87 -10 337 34 -93 18 -12 -57 151 157 79 -199
6721 -199 116 -107 -28 -98 72 170 -49 247 11 35 192 73 -90 221 26 51 96 -80 -60 52 -128 -51 32
6744 32 -113 307 -35 -369 104 87 28 -121 -46 118 -101 78 71 -57 104 238 -123 38 529 -8 -268 186
6766 186 136 -282 -63 -92 -200 57 234 79 49 84 -21 -123 -33 -17 168 280 -135 -36 -277 145 89 143 -3
6789 -3 18 -69 -308 -197 -67 -2 -149 -47 -102 -143 -16 -35 -95 239 282 100 -31 -189 218 -64 155 -218 95
6812 95 96 226 -91 -341 141 -286 -136 -364 107 -24 -43 -138 -36 -43 138 82 -264 -119 169 -344 30 30 -192
6835 -192 72 199 31 75 135 -28 64 110 36 -141 -18 227 61 -169 19 -60 72 270 111 233 34 -169
6857 -169 46 -155 -9 67 198 -182 159 224 10 -150 167 -36 -279 105 216 12 -224 -99 -39 -189 67
6878 67 140 214 -119 180 -310 134 50 29 -96 165 324 0 -35 55 36 -44 -185 40 -22 -370 -6 -74 60 -233
6902 -233 89 89 -95 191 232 103 -44 -81 298 120 -307 -183 -148 -177 83 -114 38 -24 -155 254 123 -110
6924 -110 -93 241 81 185 -50 6 -177 111 163 256 38 -15 -195 43 70 73 -17 -165 20 13 -114 214 -87 -157
6948 -157 19 134 -296 -161 291 58 -174 -3 199 195 138 27 29 -194 179 -213 -228 280 65 54 1 30 48
6971 48 -140 -34 89 100 -86 60 -75 154 -90 121 -289 -170 32 39 -61 -1 -167 -126 34 192 -347 -285
6993 -285 -128 159 -203 104 85 -51 109 -170 -347 6 -90 -241 -26 256 -319 54 68 -127 -64 -139 165 -39
7015 -39 87 -22 192 309 -195 -39 -242 -223 29 -249 -29 259 88 289 18 -59 -225 -69 -118 70 -223
7036 -223 51 72 -15 147 119 401 93 127 -61 204 -331 206 148 -301 21 15 -128 -387 123 -90 97 162 330
7059 330 37 25 92 -1 -84 -7 -1 -299 232 -12 -1 180 40 -155 -262 194 75 -96 -106 240 -152 147 -31
7082 -31 -30 169 56 123 -85 -182 62 -156 190 182 -18 98 -17 27 -18 -229 160 85 -77 343 -88 214 218 158
7106 158 -148 -14 134 6 -252 -5 -16 -109 -187 -110 -390 60 -154 67 -50 -49 -48 306 -201 265 -74 -107 202
7129 202 -26 -256 -109 -81 -111 -8 65 60 38 145 -138 -158 115 90 -135 169 45 333 -189 93 -26 18 -78
7152 -78 0 -152 -52 7 273 -62 66 -61 -122 106 228 -8 -250 -159 141 -56 -15 68 51 -274 29 16 -106
7175 -106 -25 57 96 -260 110 172 24 -143 -87 -132 -63 -7 31 -92 155 96 -62 -181 -209 -85 230 -175 -49 -115
7199 -115 -26 183 -9 140 -180 126 102 -78 314 -201 -9 -51 217 112 -60 151 -134 -181 76 37 20 196
7221 196 131 3 -64 37 278 269 96 -96 -38 128 -81 200 -187 -201 180 -140 229 215 348 -167 -308 234
7243 234 228 109 -147 34 -127 162 118 156 250 72 267 -63 19 -263 -81 -188 67 43 0 25 -43 -64 135 -15
7267 -15 71 -63 335 -294 -20 -159 -243 -51 -91 -382 46 255 16 4 46 11 -67 16 -5 36 -233 -41 41 -230
7291 -230 -2 205 -35 -100 -33 -31 136 113 -170 130 -40 -107 -142 -106 339 152 -44 99 -5 52 -195 -188 -54 50
7315 50 189 113 -102 -235 -108 135 -74 181 6 -247 -212 -23 -241 98 -123 -66 -6 30 64 44 148 77 95
7338 95 -215 -79 -38 0 -92 25 -88 -33 43 -31 123 -132 61 -114 123 -6 80 -33 -126 -107 27 20 -100 -26
7362 -26 159 113 68 -89 128 -95 30 -272 -49 -3 -72 167 142 -76 -133 -73 -52 34 236 21 -101 7 -31 9
7386 9 -71 123 54 -48 53 -118 92 -128 95 83 40 157 78 100 -45 138 149 -123 133 50 -120 -153 -209 -207 87
7411 87 -148 -143 -259 -82 -22 5 33 -136 3 -261 58 -73 -17 113 11 97 111 263 126 24 224 44 -168
7434 -168 73 91 -50 28 56 103 37 98 -24 8 84 9 2 -95 166 -318 -85 35 -97 204 -294 -70 -94 14
7458 14 39 -173 38 168 51 15 -10 54 118 -74 111 145 -243 19 -23 -53 -108 145 -48 17 123 -290 100 -164
7482 -164 58 -135 -94 89 8 -176 158 213 -64 -137 135 118 57 34 172 149 -240 59 292 22 -175 -57 104
7505 104 -203 69 -172 157 130 131 -228 -66 -72 -33 165 -135 105 -156 150 15 -140 28 -107 91 74 128 38
7528 38 10 58 -15 233 -71 -99 -168 -312 95 -37 -71 58 -125 149 -225 199 39 145 20 3 40 90 -114
7551 -114 103 -189 214 -223 -352 17 -40 -84 -99 -80 69 -113 -171 247 213 -97 73 0 -68 172 -54 302 -36
7574 -36 48 201 -192 -97 -34 66 -192 58 -186 49 109 84 -80 -13 183 28 35 -129 -292 -378 218 128 -29 -69
7598 -69 75 26 79 -27 94 -344 -15 66 -154 24 -196 1 -9 314 220 -178 -45 52 85 -34 146 24 14
7621 14 63 -257 -14 -109 -177 -141 115 -227 64 -191 -174 -47 90 191 -2 -6 171 322 -78 -15 -105 -256 -184 -87
7645 -87 136 125 -100 0 -124 236 -159 -44 -66 -134 119 -62 -208 -66 43 -20 58 12 28 49 28 291 71
7668 71 217 2 -8 -99 11 48 46 85 113 115 -267 132 -40 -399 265 -126 -2 -228 -177 80 -177 182 34 25
7692 25 -63 -35 -172 106 74 27 -77 30 62 -35 -104 67 242 -65 -99 0 -408 179 28 -146 107 -198 225
7715 225 -177 72 114 64 -110 39 -30 -140 63 -222 -80 -177 204 -143 10 76 -105 267 -91 -59 -22 -74 -163
7738 -163 -221 -54 -62 262 -99 221 13 -211 184 -105 -120 127 137 90 82 -52 -59 -92 -25 224 36 -283 246 -103
7762 -103 -42 166 11 -139 -68 74 -83 4 76 206 -158 -215 -263 192 85 252 136 -18 37 38 41 215 40 29
7786 29 91 -30 136 51 -83 276 12 40 233 333 -35 -66 -55 -32 -334 -92 -89 -45 105 -27 262 -41 -5 -247
7810 -247 34 206 36 -158 -164 -118 -104 -47 -2 -25 296 -62 114 -18 142 -94 138 -96 216 0 -22 86 220
7833 220 -70 -164 -3 194 163 30 335 40 -3 18 325 -162 204 -40 -143 -66 114 158 -103 221 -288 209
7855 209 -189 -284 75 -116 -229 -52 -43 266 56 -1 -283 142 215 15 -230 -165 162 -51 -76 -264 -75 88
7877 88 -59 5 126 -141 -141 27 -48 -196 187 49 55 -221 97 -121 -87 -80 58 204 46 290 -57 16 -181 269
7901 269 116 136 102 -113 134 210 -225 23 -25 66 87 -1 -24 249 -204 -72 -19 199 232 24 -147 -313 9
7924 9 -119 -150 -187 32 220 -25 -28 374 -159 28 -32 5 -172 67 187 -16 -140 -8 -64 79 -83 105 -119
7947 -119 141 36 -184 357 78 -3 9 526 -19 -194 209 94 173 -142 18 -103 -232 -99 3 255 56
7968 56 -14 -70 -201 -184 -161 157 5 211 -86 150 -30 85 -82 82 -81 39 -10 -44 -207 -146 -112 55 -23
7991 -23 -127 -172 73 -4 104 75 -2 264 -203 -206 -12 -51 31 239 248 186 -243 -175 -68 -63 -81 289 -178 -22 201
8016 201 -111 -95 -2 85 71 -251 60 14 48 -228 6 293 228 -59 118 -62 -4 15 27 108 32 136 41 99 86
8041 86 362 114 -78 127 105 71 155 53 100 77 30 18 84 -39 -40 81 -22 -21 186 -145 -88 -101 25 -87 -16
8066 -16 64 78 200 -234 56 89 -240 68 73 190 305 -349 -90 191 228 54 -40 -168 -66 123 -60 358 60
8089 60 17 145 139 -236 187 -21 -138 94 113 -21 -1 20 -1 143 118 79 -183 25 -87 -10 -16 143 101 -68 -47
8114 -47 -104 22 -168 -121 269 -250 245 85 -101 -196 103 -281 -37 -4 236 -130 -24 247 -105 160 -238 90
8136 90 -216 249 156 -280 -156 91 -93 53 29 -228 -235 -347 -157 -104 8 42 -290 -92 -122 -115 32 -31 33 137
8160 137 -73 93 127 10 -1 43 -420 50 82 143 219 -410 291 -18 -240 -13 -57 -72 77 -141 -126 211 -38
8183 -38 -36 71 46 -293 -167 -46 43 -231
8191b31
##END NTUPLES=NMR FID
##END=
