##TITLE=1H_AEBCO-0208
 CDCl3, 8 sc, 
 3.08.2021
##JCAMPDX= 6.0         $$ Bruker NMR JCAMP-DX V2.0
##DATA TYPE= NMR FID
##DATA CLASS= NTUPLES
##ORIGIN= UXNMR, Bruker Analytische Messtechnik GmbH
##OWNER= root
$$ XWIN-NMR		Version 3.5
$$ Tue Aug  3 08:51:15 2021 Russian Standard Time (UT+4h)  she@DPX200
##.OBSERVE FREQUENCY= 200.131506
##.OBSERVE NUCLEUS= ^1H
##.DELAY= (6, 6)
##.ACQUISITION MODE= SIMULTANEOUS
##.ACQUISITION SCHEME= undefined
##.AVERAGES= 8
##.DIGITISER RES= 18
##SPECTROMETER/DATA SYSTEM= spect
##.PULSE SEQUENCE= zg30
##.SOLVENT NAME= CDCl3
##.SHIFT REFERENCE= (INTERNAL, CDCl3, 0, 15.7039)
##AUDIT TRAIL= $$ (NUMBER, WHEN, WHO, WHERE, WHAT)
$$ ##TITLE= Audit trail, XWIN-NMR		Version 3.5
$$ ##JCAMPDX= 5.01
$$ ##ORIGIN= Bruker BioSpin GmbH
$$ ##OWNER= she
$$ F:/spectra/data/she/nmr/H-F/1/audita.txt
$$ ##AUDIT TRAIL=  $$ (NUMBER, WHEN, WHO, WHERE, WHAT)
(   1,<2021-08-03 08:49:49.60 +0400>,<she>,<DPX200>,
      <created by zg, POWCHK disabled, PULCHK disabled
       configuration hash MD5:
       00 E9 B6 7A A2 85 ED C7 34 08 36 98 17 FE 4E 26
       data hash MD5: 16K
       30 5E 4A D2 FF F5 2B 64 5C A5 65 E2 30 02 BB B0>)
$$ ##END=
$$ 
$$ hash MD5
$$ 9B A1 FB D1 22 42 07 DA ED 82 5B 1F 19 CF DC D9
##$RELAX= 
##$RELAX= 
##$RELAX= 
##$RELAX= 
##$RELAX= 
##$RELAX= 
$$ Bruker specific parameters
$$ --------------------------
##$DU= <F:/spectra>
##$EXPNO= 1
##$NAME= <H-F>
##$PROCNO= 1
##$TYPE= <nmr>
##$USER= <she>
##$AMP= (0..31)
100 100 100 100 100 100 100 100 100 100 100 100 100 100 100 100 100 100 
100 100 100 100 100 100 100 100 100 100 100 100 100 100 
##$AQSEQ= 0
##$AQ_mod= 1
##$AUNM= <au_zg>
##$AUTOPOS= <>
##$BF1= 200.13
##$BF2= 200.13
##$BF3= 200.13
##$BF4= 200.13
##$BF5= 200.13
##$BF6= 200.13
##$BF7= 200.13
##$BF8= 200.13
##$BYTORDA= 1
##$CFDGTYP= 0
##$CFRGTYP= 5
##$CHEMSTR= <none>
##$CNST= (0..31)
1 1 145 1 1 1 1 1 1 1 1 1 1 1 1 1 1 1 1 1 1 1 1 1 1 1 1 1 1 1 1 1 
##$CPDPRG= <>
##$CPDPRG1= <>
##$CPDPRG2= <>
##$CPDPRG3= <>
##$CPDPRG4= <mlev>
##$CPDPRG5= <mlev>
##$CPDPRG6= <mlev>
##$CPDPRG7= <mlev>
##$CPDPRG8= <mlev>
##$CPDPRGB= <>
##$CPDPRGT= <>
##$D= (0..31)
0 1.2 0 0 0 0 0 0 0 0.06 0 0.03 0 0 0 0 0.0002 0 0 0 0 0 0 0 0 0 0 0 0 
0 0 0 
##$DATE= 1627966189
##$DBL= (0..7)
120 120 120 120 120 120 120 120 
##$DBP= (0..7)
150 150 150 150 150 150 150 150 
##$DBP07= 0
##$DBPNAM0= <>
##$DBPNAM1= <>
##$DBPNAM2= <>
##$DBPNAM3= <>
##$DBPNAM4= <>
##$DBPNAM5= <>
##$DBPNAM6= <>
##$DBPNAM7= <>
##$DBPOAL= (0..7)
0.5 0.5 0.5 0.5 0.5 0.5 0.5 0.5 
##$DBPOFFS= (0..7)
0 0 0 0 0 0 0 0 
##$DE= 6
##$DECBNUC= <off>
##$DECIM= 32
##$DECNUC= <off>
##$DECSTAT= 4
##$DIGMOD= 1
##$DIGTYP= 9
##$DL= (0..7)
0 120 120 120 120 120 120 120 
##$DP= (0..7)
150 150 150 150 150 150 150 150 
##$DP07= 0
##$DPNAME0= <>
##$DPNAME1= <>
##$DPNAME2= <>
##$DPNAME3= <>
##$DPNAME4= <>
##$DPNAME5= <>
##$DPNAME6= <>
##$DPNAME7= <>
##$DPOAL= (0..7)
0.5 0.5 0.5 0.5 0.5 0.5 0.5 0.5 
##$DPOFFS= (0..7)
0 0 0 0 0 0 0 0 
##$DQDMODE= 0
##$DR= 18
##$DS= 0
##$DSLIST= <SSSSSSSSSSSSSSS>
$$ [...]
##$SUBNAM2= <"">
##$SUBNAM3= <"">
##$SUBNAM4= <"">
##$SUBNAM5= <"">
##$SUBNAM6= <"">
##$SUBNAM7= <"">
##$SUBNAM8= <"">
##$SUBNAM9= <"">
##$SW= 20.0188882624521
##$SWIBOX= (0..15)
0 0 2 0 0 0 0 0 0 0 0 0 0 0 0 0 
##$SW_h= 4006.41025641026
##$TD= 16384
##$TD0= 1
##$TE= 0
##$TE2= 300
##$TE3= 300
##$TEG= 300
##$TL= (0..7)
0 120 120 120 120 120 120 120 
##$TP= (0..7)
150 150 150 150 150 150 150 150 
##$TP07= 0
##$TPNAME0= <>
##$TPNAME1= <>
##$TPNAME2= <>
##$TPNAME3= <>
##$TPNAME4= <>
##$TPNAME5= <>
##$TPNAME6= <>
##$TPNAME7= <>
##$TPOAL= (0..7)
0.5 0.5 0.5 0.5 0.5 0.5 0.5 0.5 
##$TPOFFS= (0..7)
0 0 0 0 0 0 0 0 
##$TUNHIN= 0
##$TUNHOUT= 0
##$TUNXOUT= 0
##$USERA1= <user>
##$USERA2= <user>
##$USERA3= <user>
##$USERA4= <user>
##$USERA5= <user>
##$V9= 5
##$VALIST= <valist>
##$VCLIST= <CCCCCCCCCCCCCCC>
##$VD= 0
##$VDLIST= <DDDDDDDDDDDDDDD>
##$VPLIST= <PPPPPPPPPPPPPPP>
##$VTLIST= <TTTTTTTTTTTTTTT>
##$WBST= 1024
##$WBSW= 4
##$XGAIN= (0..3)
0 0 0 0 
##$XL= 0
##$YL= 0
##$YMAX_a= 567560
##$YMIN_a= -351909
##$ZGOPTNS= <>
##$ZL1= 120
##$ZL2= 120
##$ZL3= 120
##$ZL4= 120
##$ABSF1= 10
##$ABSF2= 0
##$ABSG= 5
##$ABSL= 3
##$ALPHA= 0
##$AQORDER= 0
##$ASSFAC= 0
##$ASSFACI= 0
##$ASSFACX= 0
##$ASSWID= 0
##$AUNMP= <proc_1d>
##$AZFE= 0.1
##$AZFW= 0.1
##$BCFW= 1
##$BC_mod= 2
##$BYTORDP= 1
##$COROFFS= 0
##$CY= 11.3945322036743
##$DATMOD= 1
##$DC= 2
##$DFILT= <>
##$DTYPP= 0
##$F1P= 2.36226072786647
##$F2P= -0.459571619588291
##$FCOR= 0.5
##$FTSIZE= 0
##$FT_mod= 4
##$GAMMA= 1
##$GB= 0.15
##$INTBC= 1
##$INTSCL= 1
##$ISEN= 128
##$LB= 0.24
##$LEV0= 0
##$LPBIN= 0
##$MAXI= 10000
##$MC2= 0
##$MEAN= 0
##$ME_mod= 0
##$MI= 1.114404
##$NCOEF= 0
##$NC_proc= 0
##$NLEV= 6
##$NOISF1= 3.799351
##$NOISF2= 2.8
##$NSP= 1
##$NTH_PI= 0
##$NZP= 0
##$OFFSET= 15.70392
##$PC= 1
##$PHC0= -13508.29
##$PHC1= 5.600991
##$PH_mod= 1
##$PKNL= yes
##$PPARMOD= 0
##$PSCAL= 0
##$PSIGN= 0
##$REVERSE= no
##$SF= 200.130013532006
##$SI= 16384
##$SIGF1= 3
##$SIGF2= 2
##$SINO= 400
##$SIOLD= 16384
##$SREGLST= <1H.CDCl3>
##$SSB= 0
##$STSI= 0
##$STSR= 0
##$SW_p= 3612.71676300578
##$SYMM= 0
##$S_DEV= 0
##$TDeff= 0
##$TDoff= 0
##$TI= <>
##$TILT= no
##$TM1= 0
##$TM2= 0
##$TOPLEV= 0
##$USERP1= <user>
##$USERP2= <user>
##$USERP3= <user>
##$USERP4= <user>
##$USERP5= <user>
##$WDW= 1
##$XDIM= 8192
##$YMAX_p= 0
##$YMIN_p= 0
$$ End of Bruker specific parameters
$$ ---------------------------------
##NTUPLES= NMR FID
##VAR_NAME=  TIME,          FID/REAL,        FID/IMAG
##SYMBOL=    X,             R,               I
##VAR_TYPE=  INDEPENDENT,   DEPENDENT,       DEPENDENT
##VAR_FORM=  AFFN,          ASDF,            ASDF
##VAR_DIM=   8192,          8192,            8192
##UNITS=     SECONDS,       ARBITRARY UNITS, ARBITRARY UNITS
##FACTOR=    0.0002496,     1,               1
##FIRST=     0,             0,               0
##LAST=      2.0444736,     0,               0
##MIN=       0,             -351909,         0
##MAX=       2.0444736,     567560,          0
$$ Real data points
##PAGE= N=1
##DATA TABLE= (X++(R..R)), XYDATA
0@%%%%%%%lJ1j6J6j6K4l3M1n6P2q8J04j26J50j76K08k48K96l44M00m64N36o17
$$ 0 0 0 0 0 0 0 0 -3 8 -8 8 -8 16 -17 24 -32 40 -48 56 -70 80 -96 112 -136 160 -184 216 -248 288 -329
30c29P06q07R18j041J180j330J493j675J873k093K334k595K879l190L531l902
$$ -329 377 -430 488 -553 627 -703 790 -885 988 -1105 1229 -1366 1513 -1677 1854 -2048
46b048M309m755N241n773O360p006P720q516R403j0397J1525j2815J4306j6053
$$ -2048 2261 -2494 2747 -3026 3334 -3672 4048 -4468 4935 -5462 6063 -6752 7554 -8499
60h499J8127k0643K3775k7789L3144m0689N2188p2022J15461l71176J94304N01871
$$ -8499 9628 -11015 12760 -15029 18115 -22574 29614 -42408 73053 -298123 -103819 398052
72C98052n52869K65461R1457n48055K35324N48511m72123j16355K85841l17435
$$ 398052 -154817 110644 202101 -345954 -110630 437881 -34242 -150597 135244 -182191
82a82191J6245N39043l20076l14361L51529j15958j90123M77457q8082m51773
$$ -182191 -165946 373097 53021 -261340 90189 -25769 -215892 261565 173483 -278290
92b78290K78334J29938l01990K72610J23916m58859R5304L23399k45391L4231
$$ -278290 44 129982 -172008 100602 224518 -234341 -139037 184362 -61029 -26798
102b6798K29553l28054p1999L79218j17264j57133K11771j51046j64695L27658
$$ -26798 202755 -125299 -197298 181920 64656 -92477 119294 -31752 -196447 131211
112A31211P261k65782J37221J8604j89249K23242J14010k85496M2405J51071j61549
$$ 131211 138472 -127310 9911 28515 -160734 62508 176518 -108978 -66573 84498 -77051
123g7051P6288J65689k30085n9550K12124p9856n5007J53953j23521j21922J95595
$$ -77051 -763 164926 -65159 -124709 87415 7559 -47448 106505 -17016 -138938 56657
134E6657P080j24483J07595k2719j35918J41800O6362j52566M4108N6812j18148
$$ 56657 63737 -60746 46849 24130 -111788 30012 96374 -56192 -12084 44728 -73420
145g3420O4648J04916j29577k2742R9600o7621l581J06231q2375o4604J03631
$$ -73420 -8772 96144 -33433 -56175 43425 -24196 -27777 78454 -3921 -68525 35106
156C5106k0182n1596Q3202l3160q5405Q5110K7777p3859M4029J5365p8370M8075
$$ 35106 14924 -36672 46530 13370 -72035 13075 40852 -33007 11022 26387 -51983 -3908
168c908N8046p0610k63L9146n3967J5789O3879n3021k4445M9569k8174r592N5531
$$ -3908 54138 -16472 -16735 22411 -31556 -15767 48112 -4909 -29354 20215 -7959 -17551 37980
181C7980l5155m1908N1911R93k9172L8849j3057n0280M1019K3280l8329J9165
$$ 37980 2825 -39083 12828 13821 -15351 23498 10441 -39839 1180 24460 -13869 5296
193E296R319m3093K4633L4373l8144k927K2038k7374Q957L7605k9293j9632K7047
$$ 5296 14615 -28478 -3845 30528 -7616 -10543 11495 -15879 -6922 30683 1390 -18242 8805
206H805j2602o938L3348j6944k8275K7394L156j7085K2152m840l1235J9112J7629
$$ 8805 -3797 -10735 22613 5669 -22606 4788 7944 -9141 13011 8171 -23064 -3952 13677
219A3677j8116P773P026k4392O801K2100j4141m411R649j4455K538K0085j1907
$$ 13677 -4439 3334 10360 -14032 -7231 14869 728 -3683 5966 -8489 -5951 14134 2227
232B227r542J0223r310k149K0175n796j5327J0255J108q384J1726N12j4951O846
$$ 2227 -7315 2908 -6402 -8551 11624 5828 -9499 756 1864 -6520 5206 5718 -9233 -2387
246b387O478p269P348J216j4603N468R673q269K277O249j1063r22J1275n536m630
$$ -2387 4091 -3178 4170 5386 -9217 -3749 5924 -2345 -68 6181 -4882 -5804 5471 -65 -4695
261d695P899n009l631J1384l022q213P333j053o481Q433K105q721L029M160o304
$$ -4695 3204 -1805 -5436 5948 2926 -5287 2046 993 -5488 2945 5050 -3671 -642 3518 -2786
276b786J715N014o427l74O466m116j103N243m723k396O374j428l564M524J01m830
$$ -2786 -1071 3943 -2484 -2858 3608 -508 -1611 3632 -1091 -3487 2887 1459 -2105 2419 2520 -2310
292b310K555K739m564J17L744k324m06K704j903j382J200o98J43J377l79r24R30
$$ -2310 245 2984 -1580 -1463 2281 -43 -449 2255 352 -1030 170 -528 -385 992 613 -311 619
309F19K30k040M85K008j686m92K324l52j817L74R37j056p77J698P4j132J070n83
$$ 619 849 -1191 -706 1302 -384 -876 1448 1096 -721 -347 590 -466 -1243 455 529 -603 467 -116
327a16r06R78r59n11K015k13j344J152Q80k233j77K329j046r19K139o09j207Q96
$$ -116 -1022 -44 -1003 -1514 501 288 -1056 96 976 -1257 -1434 895 -151 -1070 1069 460 -747 149
345A49q20m30J023l71l9J178j10j342M90P97j501K1J769n22n68O17j46j05m26
$$ 149 -671 -1101 -78 -449 -488 690 580 -762 -272 525 -976 -955 814 292 -276 341 195 90 -336
364c36L6J030o10l42R38j65o19n2m6J42l8K4K94N76o48q55J651Nk019J925R46
$$ -336 -300 730 120 -222 716 551 -68 -120 -166 -24 -62 -38 256 832 184 -671 980 985 -1034 891 1837
385A837k631J078J439k763J04K066j377j20K101j552j285K430j161j742L095p92
$$ 1837 -794 284 1723 -1040 -936 1130 -247 -367 1734 182 -1103 1327 166 -1576 1519 727
401G27k664L455N9l652K385Q26l401K141K462l159J90K408k894l10L138k720j104
$$ 727 -1937 1518 1577 -2075 310 1136 -2265 -124 2338 -821 -631 1777 -1117 -1427 1711 -1009 -2113
418b113L581j872j117L562k303k494L632m39k160L123m37l145K772P24l323K097
$$ -2113 1468 -404 -1521 2041 -262 -2756 876 437 -1723 1400 963 -2182 590 1314 -2009 88
434H8Q31l902K847K747m532J257K647m472J242M310l922q62L889k920r87M699
$$ 88 919 -2983 -136 2611 -1921 -664 1983 -2489 -1247 3063 -859 -1721 2168 -752 -1739 2960
450B960k862l296M996j139l195N531j398n968N179J684n594M170K197o734K731
$$ 2960 98 -3198 1798 659 -2536 2995 1597 -4371 808 2492 -3102 1068 3265 -3469 -738
465g38M934n440J66M489n450r8O953m539l140O279l944l236P877k240o285O012
$$ -738 4196 -1244 -1078 3411 -2039 -2137 4816 277 -2863 3416 -528 -3764 4113 1873 -4412 1600
481A600M61n484N486J528p767L666M259o359K924M374q636J405P681o745j001
$$ 1600 2061 -3423 2063 3591 -4176 -510 3749 -2610 314 4688 -3948 -2543 5138 -1607 -2608
496b608P430o412l078R402l052o094O878j489o402Q141P67q934N905K845q488
$$ -2608 4822 -1590 -4668 4734 1682 -4412 2466 977 -5425 2716 3483 -5451 454 3299 -5189
511e189O097M977j0796K111Q056p637l51Q204p465l678R980l324n520Q177l262
$$ -5189 908 5885 -4911 -2800 5256 -2381 -2732 5472 -1993 -5671 4309 985 -4535 3642 380
526C80o929J0035N39r260O507J879q992O414N723j0262N42P309o400N84Q111p699
$$ 380 -6549 3486 4025 -5235 1272 3151 -5841 573 6296 -3966 -3424 3885 -2515 -1931 6180 -1519
542a519l493Q702l731k871Q313n107o612R223N19o903N647L35q233N877N404p511
$$ -1519 -5012 3690 -41 -2912 5401 294 -6318 2905 3424 -3479 2168 2503 -5730 147 5551 -1960
558a960J506L312p157L386O855p372q03N653n982M4Q475n607n194P208j670l879
$$ -1960 -454 2858 -4299 -913 5942 -1430 -2233 3420 -2562 -2518 5957 350 -4844 2364 694 -3185
574c185P960j951q507O393K081o208N820J376r467M313O172o869J269M871p838
$$ -3185 4775 2824 -5683 710 2791 -3417 2403 3779 -5688 -1375 4797 -2072 -803 4068 -3770
589c770M3R022m690l651O448m587l333Q941k276o969O404j71n906P017J490r197
$$ -3770 -3727 5295 605 -3046 3402 -1185 -4518 4423 2147 -4822 1582 1411 -4495 2522 4012 -5185
605e185L510N357o515J976N375p480o76P540m175k237N478m442k239P404k047
$$ -5185 -1675 3682 -2833 -857 4518 -2962 -3638 3902 -273 -2510 2968 -1474 -3713 3691 1644
620A644m765M666j514m347O547J029o765L315K153n231M331L267p428J044M793
$$ 1644 -3121 1545 31 -4316 2231 3260 -3505 -190 1963 -3268 1063 4330 -3098 -2054 2739
635B739m384J472M735o319j712O233k457j755N308m287m116P108k29m682M543
$$ 2739 -1645 -173 4562 -1757 -3469 2764 307 -1448 3860 -427 -4543 2565 2336 -2346 2197
650B197j479n524O579K333o583K773J775o190M246N541p378p52N709n116j93P493
$$ 2197 718 -4806 1773 4106 -2477 296 2071 -4119 127 5668 -1710 -2462 3247 -1869 -2062 5431
666E431n415m808O946j516l604O667j997o697N768J845n625M586J697p877L413
$$ 5431 16 -4792 2154 638 -2966 3701 1704 -4993 775 2620 -3005 1581 3278 -4599 -1186
681a186N761o556O57N245o745n91P795m193l451O026l229l701P251j060o149N187
$$ -1186 4575 -1981 -1324 3921 -2824 -3415 4380 187 -3264 2762 -467 -4168 3083 2023 -4126 1061
697A061P42n903N439K492p753K675M666o036J611N093o167j035O266l517k048
$$ 1061 1803 -4100 1339 3831 -3922 -1247 3419 -2617 -1006 4087 -2080 -3115 3151 -366 -2414
712b414N568l469l634O619r36n253N170K86o007M886K679o236K075L491m919J180
$$ -2414 3154 -315 -3949 2670 1734 -3519 1651 1937 -4070 816 3495 -2741 -666 2825 -2094 -914
728i14M509m693j032N038l344j928N430k625l821N250k70m143L956O63m609K685
$$ -914 3595 -1098 -2130 2908 -436 -2364 3066 441 -3380 1870 1600 -2543 1413 2076 -2533 152
744A52K316l900J120K540l712N21L568l239q23L491k491j339L813j486k419K900
$$ 152 2468 -1432 -312 2228 -1484 -963 2605 -634 -1457 2034 -457 -1796 2017 531 -1888 1012
760A012j24k259K105L87k433J417Q62k003J247Q23k384J211J390k292M98J676
$$ 1012 888 -1371 734 1121 -1312 105 967 -1036 211 1034 -1350 -139 1251 -1041 -543 1133
776A133j944qJ811j209o70J388p39n11J508r41q65J893q21j273K220o26j873J719
$$ 1133 -811 -819 992 -217 -887 501 -238 -749 759 -182 -1047 846 25 -1248 972 346 -1527 192
794A92M46j709R66P05j597P52J115j578M25J249j736K97J939j799n36J869j087
$$ 192 638 -1071 -105 600 -997 -245 870 -708 -283 966 -770 -473 1466 -333 -869 1000 -87
811h7r19J769l49j336J273K38j155R73K99j597R65P57j451P96Q16j572K72J215
$$ -87 -1006 763 414 -922 351 589 -566 407 706 -891 74 831 -620 176 992 -580 -308 907
829I07r99k50J099o32m76R18k70n94Q02m76n59J167l30q51J074j41r55R05J64
$$ 907 -92 -342 757 125 -351 567 297 -297 505 29 -530 637 307 -544 530 389 -566 339 503
848E03r69M90N26p87J50N28q24j7Q78q65L2R85r78k36J194p04m97R79l24p40Q61
$$ 503 -466 24 550 -237 -87 441 -383 -400 478 -387 -355 630 -348 -584 610 -94 -591 388 64 -676 185
869A85J10r70N38L97j007N48O78j020L54O65r78R1P53p23j81Q67m52l84P46j36
$$ 185 295 -675 -137 260 -747 -199 479 -541 -187 478 -500 -409 344 -379 -560 307 -145 -529 217 81
889H1o08O54K0n53N29R3o07M62K13o80L75K66n63K36M50l91r3N22k95k95M76j78
$$ 81 -527 127 147 -406 123 216 -391 71 284 -396 -21 245 -318 -82 368 -23 -116 406 111 -184 292 114
911A14k39M44k39k08M63l03j97M92q5m05M75O4n45K59K60m51J20L32m03KL81n21
$$ 114 -125 319 80 -128 335 32 -165 327 242 -163 312 376 -169 90 350 -101 19 351 -52 -50 331 -190
933a90K10L78n43Q7M98m62k45O37k05n88N04J47n67L06K56m84K49J77m94L71J28
$$ -190 20 398 -145 -58 440 -22 -267 370 165 -423 81 228 -339 -33 223 -261 -12 165 -329 42 170
954A70n06J66N58o26j34O04l56m18O68p2m78N15j7m19M84k52l71N84l1n50N43
$$ 170 -336 -170 388 -238 -372 232 -124 -542 126 54 -424 91 74 -345 139 -113 -484 100 69 -481 62
975F2K83p84Q7P92n64l19Q63n18l03P90m36l01P11m72m51J058j88q41P15L76j025
$$ 62 345 -439 -352 440 -124 -443 420 -98 -401 389 -47 -348 363 -109 -560 498 310 -531 184 560 -465
996d65M50P72j053M0Q23p21P6P43p85j88Q23n33k56J004n79q77J172J51j119Q86
$$ -465 -15 757 -296 -256 567 -154 -78 665 -120 -308 515 -18 -274 730 151 -726 446 597 -522 364
1016C64L23j295O90O95j034K90M07r80M27R00r08k32Q85o72m04J325m66j204J182
$$ 364 687 -608 82 777 -257 33 440 -540 -113 787 -121 -353 532 -140 -544 781 315 -889 293
1035B93q9q44R91k0j053O64L31p15N96K86j231M12J134j056j53R89j041l42J498
$$ 293 204 -640 351 331 -722 -58 273 -442 154 440 -791 -379 755 -301 -454 535 -506 -848 650
1054F50n59o10P66m60m31J141l00r48P89Jp69J113K61j515N90P80j009O00N55
$$ 650 91 -519 247 -213 -644 497 197 -751 38 39 -730 383 644 -871 -281 499 -510 90 645
1073F45j369K93J011q37K27O90j222m4J537q17o52J271r47o96J788k84j285J110
$$ 645 -724 -431 580 -257 -30 660 -562 -606 931 114 -538 733 -214 -910 878 594 -691 419
1091D19k97j009J698K21j871Q69O02j458J230J060k346K74J801j675J22J919k095
$$ 419 122 -887 811 1032 -839 30 632 -826 404 1464 -882 -608 1193 -482 -360 1559 -536
1108e36p25K551r71j195K048r88j854K509L28k338J635M28k567J906J444l006
$$ -536 -1261 1290 319 -876 1172 184 -1670 839 1167 -1171 464 892 -1675 231 1675 -1331
1124a331P99J919k599N44K608k566r07K849j519j197K952j338k167K970k03k532
$$ -1331 -532 1387 -1212 -668 1940 -626 -1533 1316 -203 -1400 1552 214 -1953 1017 814 -1718
1140a718K490J51k991K309J435l240J261J790l021Q66K770k994m72K956k061q28
$$ -1718 772 923 -2068 241 1676 -1564 -303 1487 -1534 -668 2102 -892 -1364 1592 -469 -1297
1156a297L290k101k082L457o99k371L093l95l367K906J295l221J574J406l340
$$ -1297 1993 -108 -2190 1267 568 -1803 1290 895 -2472 434 1729 -1492 82 1488 -1852
1171a852J402K775l159j67K727k822j21L761k456j971L328j221j908L433o19l331
$$ -1852 -450 2325 -834 -1001 1726 -1096 -1217 2544 88 -1883 1445 224 -1684 1749 1130 -2201
1187b201K554Q67k644K330Q47l857J708K462l018Q23K218l519q6L778k140j303
$$ -2201 353 1220 -1424 906 1753 -2104 -396 2066 -952 -129 2089 -1430 -1516 2262 122 -1181
1203a181K667j887j601L638n65k713K315k99k324L055O19l490J610J350k758J647
$$ -1181 1486 -401 -2002 1636 1071 -1642 673 374 -1950 1105 1724 -1766 -156 1194 -1564 83
1219H3J944l291L0K473j867p2K481k398j113K978j158j274K651j420k198K992
$$ 83 2027 -1264 -1234 1239 -628 -700 1781 -617 -1730 1248 90 -1184 1467 47 -2151 841
1235H41J11k383J915L25k612J877J513k584O70J472k509Q76K298k575l78K434
$$ 841 952 -1431 484 809 -1803 74 1587 -997 -327 1145 -1364 -488 1810 -765 -1143 1291
1251A291j876n34K712j484j783K544l05j782K142j83k321K018O77k313J518Q63
$$ 1291 -585 -1119 1593 109 -1674 870 565 -1217 925 742 -1579 439 1116 -1197 321 1184
1267A184k612J222J776k270K29J769j930j72K324j490j053K067r75j019K241q09
$$ 1184 -1428 -206 1570 -700 -471 1298 -632 -804 1520 30 -1023 1044 69 -950 1291 482
1283D82j719J955j65j585J770K00k171J275R54j860Q16J168k083M82J710j737
$$ 482 -1237 718 553 -1032 738 938 -1233 42 996 -864 -48 1120 -963 -481 1229 -508
1299e08N7J646j787k98K107j203j042J851p25j305J941j54j865J637K06j810J561
$$ -508 -451 1195 -592 -890 1217 14 -1028 823 98 -1207 734 580 -1285 352 558 -1252 309
1316C09O86k157J055J104k029O16J648j907k27J992j370p17K048j056j314K091
$$ 309 995 -1162 -107 997 -1032 -416 1232 -675 -902 1090 -280 -997 1051 -5 -1319 772
1332G72l81j609J791K4j874J509O27j867R51J084j746L71J447j540k03J681j215
$$ 772 391 -1218 573 597 -1277 232 859 -1008 -57 1027 -719 -348 1099 -441 -644 1037 -178
1349a78o36J720p98j055J591k81j275J313J73j379J051N39j380N53R34j348K83
$$ -178 -814 906 108 -947 644 363 -912 401 574 -805 246 785 -595 -42 892 -456 -173
1366a73J067j203j24J172p45n02J184m73q47J094k1r91Q27K09j001N69N58j030
$$ -173 894 -309 -433 739 -6 -508 676 203 -644 450 429 -562 265 474 -527 42 600 -430
1384d30K61P56q44P1P34o70l10Q80m32l96O36j22n98N39R6n76M88J30n64J84M81
$$ -430 -169 587 -257 -186 548 -122 -432 448 16 -380 256 134 -464 75 171 -405 83 213 -351 -167 314
1405C14n37k5M98l55k52L72J31m99L31Q9l11Q8K60k50M4J66j80J0K58k18j23K66
$$ 314 -223 -248 250 -105 -357 15 146 -353 -22 67 -244 -156 104 -146 -102 64 -116 -106 152 -66 -189 77
1427G7mk55J42K32l10L7K85j86j10J56l5j24J32K8r2P5P5k51J58J93k84M5J99
$$ 77 73 -182 -40 192 -118 -81 204 18 -92 64 29 -95 37 65 -27 48 123 -128 30 223 -61 -16 183
1450A83k03l5K04m3j18K2J11j56J05J7j32J16N0j75J50K9k02O4J22p3q7J72Kj52
$$ 183 -20 -55 149 106 -12 10 121 -35 70 87 -45 71 121 -54 96 125 -77 -13 109 36 -51 121 123 -29
1474b9M6M9n2j0l1mR0q1j04J70k8j79J36Q0r0j31J33Mk1L0p7l8J11r1P0O3j33
$$ -29 17 66 14 4 -27 -31 59 -22 -126 44 16 -163 -27 53 -37 -168 -35 -31 -52 -22 -99 -137 -26 -117 -47 16 -117
1501a17pJ20q3o8J51Mj09mJ39n0r9M6J4p2J02J1M0J4%r2L9P0p5j4J85j71l1J25
$$ -117 -124 -4 -87 -155 -4 0 -109 -113 26 -24 -123 -77 -63 -135 -33 -22 18 32 32 -60 -21 49 -26 -40 145 -26 -57 68
1529F8J8j21J07l6oK0K7m7nM0j03L7J23j13q4K29j40p0K58j85j13J79J5j51R1
$$ 68 86 -35 72 36 30 50 77 30 25 65 -38 -1 122 9 -75 154 14 -56 202 17 -96 83 98 -53 38
1554C8po9R9P3k09Q8J89k93Q9J56j73%J86k12m4J96r7k57M26j26k94K91P6m48
$$ 38 31 -38 61 134 -75 13 202 -91 -2 154 -19 -19 167 -45 -89 107 10 -247 179 53 -241 50 126 -322
1578c22L49J17m50L22P9l14J72K62m45K9M39m01r5N02l65k44N22j17l80M91m7
$$ -322 27 144 -306 16 95 -219 -47 215 -230 -201 238 -163 -258 244 -121 -365 157 40 -340 151 104
1599A04n04M99J18n47L22K70o15K73M78o07m0N85m84j30O48k81n25P04j83m05
$$ 104 -400 99 217 -330 -8 262 -353 -80 398 -209 -249 336 -148 -278 370 89 -436 268 85 -320
1619c20O92q1o85N05J40o19M58L34p68J74O80p18J23O11p32p3P72m05m31Q39m17
$$ -320 372 291 -394 111 251 -368 90 424 -344 -170 510 -208 -85 526 -206 -279 493 88 -343 496 79
1640G9n10Q38q1q17O93J40q25N88M89r28J89O05o58J2O97p01k84Q91m09m15Q89
$$ 79 -431 407 326 -491 202 342 -483 105 594 -334 -145 460 -198 -186 511 -190 -474 417 8 -407 482
1661D82m02p03Q75J12q77N54K87p89M05N53q70R8O25p15J31O76o64l12Q14k70
$$ 482 80 -623 252 364 -513 41 328 -461 -56 497 -373 -275 350 -365 -234 442 -222 -534 280 10
1681A0n05Q62k97p01P42J93o40L75J32p54N16M97n83p3N21o19NQ77m94m57N61
$$ 10 -495 367 70 -631 111 304 -336 39 171 -583 -67 430 -153 -226 295 -324 -319 558 64 -393 168
1702A68k10k24O37r9o20L18K17l01K73K17p42J32N84l67P6L92o22j91O94l7l76
$$ 168 -42 -266 371 272 -348 -30 187 -114 159 376 -366 -234 350 -17 59 451 -171 -362 332 295 -81
1723h1K48j54l41M81J72l97O1Kk18L82K60m33j24K01j14P2L23l20k01J75P1m5
$$ -81 167 13 -328 153 325 -72 -11 -9 -227 155 415 -18 -142 59 -55 17 340 20 -181 -6 65 20
1745B0N3n8k57J63J49l0Nk6j71O0J63j5r8k0J5J4N9j8j19l0k3J74L9j45L5j3k7
$$ 20 73 15 -242 -79 70 40 45 19 -152 -92 71 56 -42 -62 -47 -33 26 8 -111 -141 -164 10 49 -96 -61 -74 -101
1772a01J65n9k03Q3O6k2Q9M9j97k3J93k3l5O2j09q6K21J18k23k5Po9J91J24k50
$$ -101 64 5 -198 -115 -49 -71 18 67 -130 -153 40 17 -18 44 -65 -151 70 188 -35 -60 -53 -122 69 193 -57
1797e7rP4LP0R7k56j26J94R3RP8j33k48J83K25q0l9k3j53J12K27j26j18M4j55
$$ -57 -66 8 11 81 178 -78 -204 -10 83 92 170 37 -211 -28 197 117 78 55 -98 14 241 115 -3 41 -114
1822a14N0K75p4j96J9k6J34N0n5j57L3P7J6O8Q3l25jJ56Pl1P6j43j01J53J03j60
$$ -114 -64 211 137 -59 -40 -66 68 118 63 -94 -61 16 32 100 183 -142 -143 13 20 -11 65 -78 -179 -26 77 -83
1848h3Nkq9K36K9j45k7N8m5J0J66j93q2J40M2j04J70j05j43J67M3j20M3Jj63J43
$$ -83 -78 -80 -169 67 96 -49 -76 -18 -63 -53 113 -80 -162 -22 20 -84 86 -19 -162 5 48 -72 -29 -28 -191 -48
1874d8J68j52n1P0o1K1J74j01j06M1P8n2R3J9k65J84O0j24R2O0j72l0K60m2j13
$$ -48 120 -32 -83 -13 -74 -53 121 20 -86 -45 33 -19 74 93 -172 12 72 -52 40 100 -72 -102 158 116 3
1899CO8rn6J71q6l6m7M5k8J04K6j79K8Q0n4k2J23j29j00J54mj9N4q5j25J89o2
$$ 3 71 62 6 177 91 55 8 53 25 129 155 -24 4 84 30 8 131 2 -98 56 52 33 87 2 -123 66 4
1926DnL4kj53Q2O0k9j5k2l5J3J17o5j9M6o1r1J76q4n7O3O2r2J9J20j28r3J95j04
$$ 4 -1 33 31 -122 -40 20 -9 -24 -46 -81 -68 49 -16 -35 11 -50 -141 35 -49 -106 -43 19 -73 -54 66 -62 -155 40 -64
1955f4QN6l1k1jJ8o9O8K9j00L7K04j78l0K20j06r6J05r4j6L8N2p4O6Q4j85P5J01
$$ -64 -56 0 -31 -52 -53 -35 -104 -36 -7 -107 -70 134 -44 -74 146 40 -56 49 -45 -61 -23 29 -45 21 105 -80 -5 96
1983I6j54N6J28j30n3J85rj77P3J31j59Q0Q8j52L0J44k19jJ78j31m0J60n9j73
$$ 96 -58 -2 126 -4 -57 128 119 -58 15 146 -13 67 155 3 33 177 -42 -43 135 4 -36 124 65 -108
2007a08J28P7j54P1Q6j95J12N4j35M8M0r8l7J62q9n7J06p8kP3K1j70J32Q4j42
$$ -108 20 97 -57 14 100 -95 17 71 -64 -16 24 -74 -111 51 -38 -95 11 -67 -69 4 25 -145 -13 71 -71
2032g1J05pj49J21k2q8Q3K4q5M1R8j01n5R7lq6R7n1k3O5p2K9Q0j0j21O4Q5j43
$$ -71 34 27 -122 -1 -23 -111 -28 -4 -89 -48 50 -51 -106 -9 -12 -98 -1 -52 -75 -10 -82 -53 27 17 -104 -40 45 -98
2060i8M9J57j59PQ1o2K4L7q1L4J16j02%R2j18m1K09k6j25N6Qp6O5j5pO8L4j15
$$ -98 -49 108 -51 -44 37 -25 -1 36 -45 -11 105 3 3 95 -23 -64 145 119 -6 50 58 -18 47 32 25 93 127 12
2088A2N9M0m9m1R8j12j3L8o1J6J02r5o8J47j23L6P3m8k3N9j06l5J41j0j48K7J33
$$ 12 71 111 62 21 119 7 -6 32 -29 -13 89 -6 -74 73 -50 -14 59 11 -12 47 -59 -94 47 37 -111 -84 49
2115D9j14J1Q3j42P5P2p8J6J27j73j0J57q8j6k2M8j28J22P3j61R8L0q4j3Q1m7
$$ 49 -65 -54 29 -113 -38 34 -44 -28 99 -74 -84 73 -15 -31 -53 -5 -133 -11 62 -99 -1 29 -55 -68 13 -34
2141c4m4Q1k8k0J27j01qK1rm8Q8L6j24O8J6oJ4mk8nP4l8K2j7LM8n8n3Q4j2K6L8
$$ -34 -78 3 -25 -45 82 -19 -27 -6 -15 -63 25 61 -63 5 21 15 29 25 -3 -8 66 28 50 33 36 84 26 -27 57 45 71 109
2173A09o7m5J0L0lK6%k7k2j6K6O1k0j49L5J47p6j9J0j16L7J43Mj22Mk3mJ50m1
$$ 109 42 -3 7 37 34 60 60 33 11 -5 21 82 62 -87 -52 95 19 0 10 -106 -69 74 78 -44 -40 -63 -67 83 42
2202D2j14K2Qk5Q5J63k81q7K40q8p1K11j90j24L17j27j31K46j66j42K78L3k16
$$ 42 -72 -50 -42 -67 18 181 -100 -187 53 -35 -106 105 -85 -209 108 -19 -150 96 -70 -212 66 99 -117
2225a17K5J23k11J84J88k66m5K24k34O9K84k69r3J81m2l1J55r4k63J83K04k26
$$ -117 -92 31 -180 4 192 -74 -119 105 -129 -60 224 -45 -138 43 1 -30 125 31 -232 -49 155 -71
2247g1J22J15l00N9K80k05m4J54k64M3L74k02k08K87p5k27L47K9l73K63N8k58
$$ -71 51 166 -134 -75 205 0 -44 110 -154 -111 263 61 -147 140 65 -162 185 214 -159 104 162 -96
2269i6J68J17l25OL52k08k0K26l30j31M83j53k44K47n4k58K77J09l16J34J75l69
$$ -96 72 189 -136 -130 222 14 -6 220 -110 -241 242 89 -155 92 38 -220 57 166 -150 -16 159 -210
2291b10J70L16m75m9M28l16j2L63k88k19L62Ok11K19j8l63L18J26l33J64R6l59
$$ -210 -40 276 -199 -248 180 -136 -148 215 -73 -292 70 76 -135 84 66 -297 21 147 -186 -22 74 -285
2313b85K36L11l76l5K52j80o8L49k21k12K19L5j53L13j76k67K21K15k20J28L4
$$ -285 -49 262 -114 -149 103 -77 -145 204 -17 -229 -10 25 -128 185 9 -258 -37 178 -42 86 120
2334A20l44J80K58k25N5Q3k48rL47j50j83K14j62o7L12p5k50J52K8q6J72J4k78
$$ 120 -224 -44 214 -11 44 127 -121 -130 217 67 -116 98 -64 -131 181 106 -144 8 36 -50 122 136 -142
2357a42J20J66j50R0N6k72O0K24j61l4J42k36PK92j49j21J63q4j33K53M9k09J13
$$ -142 -22 144 -6 84 140 -132 -72 152 -9 -43 99 -137 -130 162 13 -108 55 -29 -162 91 140 -69 44
2380D4nk20J83J27k77J5J62j51J10J22k52j5K48j93K5J96k71l9K53N7k66J50p2
$$ 44 39 -181 2 129 -148 -133 29 -122 -12 110 -142 -157 91 -102 -77 119 -152 -191 62 119 -147 3 -69
2403f9j15K21J17k81J27O8j86R1J47k46mK27j99J36R3j57j20K44r2j4J23o2k16
$$ -69 -184 37 154 -127 0 68 -118 -27 120 -126 -130 97 -102 34 127 -30 -150 94 2 -12 111 49 -167
2426a67K31kj36R9Q6k73J61J83k47Q1J36k23M0J90j42m1J91j66o1K18q0j72J35
$$ -167 64 62 -74 25 111 -162 -1 182 -65 16 152 -71 -31 159 17 -24 167 1 -60 158 78 -94 41
2449D1Q1k61K04O3k70J46J43k30P9J06j51K7J37j19n1J60p3j24J78l8j50J54L0
$$ 41 122 -139 65 128 -142 4 147 -83 -4 102 -49 -22 115 -4 -55 105 32 -92 86 48 -102 52 82
2472H2k00J39L7j18Q9k8p3P7l5p0J2J34m5m9J36j07r4J84p4j33J81j9p7J09l7
$$ 82 -118 21 58 -60 29 1 -72 5 -30 -100 -88 46 1 -48 88 -19 -113 71 -3 -136 45 26 -51 58 21
2497B1p5O0j0j06P9R2j28K3P5k7k6O1j8r4N2O0j06R5j0l4qR0j30P4R3j72Q1Q1
$$ 21 -54 6 -4 -110 -31 61 -67 -44 31 4 -22 39 21 -73 -21 39 -67 28 18 -16 -24 66 -64 10 103 -69 12 93
2525I3p1l6R9l1k8m2R5j37J20Jj10P4K5m7rM7m2K1J9J2q8J03l7o2O6l6Om1K2m3
$$ 93 22 -14 85 54 26 -16 79 -58 62 63 -47 27 52 5 -4 43 1 22 41 53 -35 68 31 -31 35 -1 5 -36 -14 -57
2555e7P3Mj3J2J5n4k2JP6j46R5M5o1k1RK5K9j8oj2l3L7Mj6K1k8J6Qpjj4nj6J4
$$ -57 16 20 7 19 34 -20 -42 -41 35 -111 -16 29 -32 -53 -44 -19 10 -8 -14 -26 -59 -22 -18 -34 -13 -41 -25 -17 -24 -25 -39 -44 -60 -46
2589d6kNM8%l5L2k0kK1L3n3K4j7M0m6O5J3n7K9n7L7l2K3m0Q3p7Q0OJ7n4qj3J1
$$ -46 -48 -43 5 5 -30 2 -18 -20 1 34 -19 5 -12 28 -18 47 60 3 32 -25 12 -20 3 -37 46 -31 49 55 72 18 10 -3 8
2622HqL5Ok2k4J8K1M3l0n5N0qn8M7L9r6k9N6L9l9J2oJn6M8O5p8L2o4J6J14j06
$$ 8 0 35 41 19 -5 13 34 77 47 -8 42 34 -24 23 62 -34 -63 -7 32 -7 5 -1 0 -56 -8 57 -21 11 -53 -37 77 -29
2654b9m9M0l6LN5L7o8QN2p9K5J7J8pr%K3Lk0K2j9oj0L9m8j7Q3J5o0L4j1j0M0K4
$$ -29 -78 -38 -74 -71 -16 21 -47 -39 13 -66 -41 -24 -6 -13 -22 -22 1 4 -16 6 -13 -19 -29 10 -38 -55 28 43 -17 17 6 -4 36 60
2688F0n2m3R4m6m1Q1l1r0J40m3m5O5p5pJ14j3o8mN0j05P3N1j46Q7P5j21Q8On9
$$ 60 8 -35 59 13 -28 53 22 -68 72 29 -16 49 -26 -33 81 68 0 -4 46 -59 14 65 -81 6 81 -40 48 54 -5
2717eOJ9m7M6M8q5r1J39l0j5P9j8j27N2R4j33N3Q0r8K2Q3n8K1K9j34m6J35l5n5
$$ -5 1 20 -27 19 67 -18 -109 30 0 -15 64 46 -81 -29 65 -68 -15 65 -33 -11 72 14 35 64 -70 -116 19 -16 -71
2746g1R1rl3O6k0j71J35j9l3J8R9j57R0j2Ol0P8l3l7J11n3j23J14%n4M0N5r3R
$$ -71 20 11 -22 44 24 -147 -12 -31 -64 -46 53 -104 -14 -26 -20 -50 28 -5 -42 69 16 -107 7 7 -47 -7 48 -45 -36
2775c6K3k3O4k5K9l0M9J3rj6n0j7M4k0K6NJl1J2P3j01P4j9n3R4K2j44P8k1NL6
$$ -36 -13 -36 28 3 32 2 51 64 55 39 -11 -28 16 -4 22 27 28 -3 9 82 -19 55 36 -17 77 99 -45 33 12 17 53
2806E3l2Lo5O8m0%M1m3MP3o1k7O3q4mQ6jr4M1oNN2L1j26N8L2j10J16L2j39m2J06
$$ 53 21 24 -41 27 -13 -13 28 -15 -11 62 1 -26 37 -47 -51 35 34 -60 -19 -25 -20 32 63 -63 -5 27 -83 33 65 -74 -116 -10
2838a0Km3J34k07J2J54j8k1R1j28q8J40j3j00Q8N5j28N5J42j26p7M1n9Q0J54n0
$$ -10 -8 -51 83 -124 -112 42 24 3 94 -34 -122 18 5 -95 -7 48 -80 -25 117 -9 -86 -45 -104 -24 130 80
2864H0j47J06q6m3J96n5p8m4J15o5R2M5j91J0J68j19M8P6j77k2J44K3j27R5m6
$$ 80 -67 39 -47 -90 106 51 -27 -71 44 -21 71 116 -75 -65 103 -16 32 108 -69 -91 53 76 -51 44 -2
2889br4J31M1j80J30oj05J21N7q1r1J40p5l8J97j80m9J27L3j26J56j18q8Q2L9
$$ -2 -96 35 76 -104 26 20 -85 36 93 12 -79 61 -14 -52 145 -35 -84 43 76 -50 106 -12 -100 -18 21
2914B1n5L1O5j57Q9J29j51j2O5n6j8J02n6k6OK1r0J68p5j39J16Q5j57J13M9j85
$$ 21 -34 -3 62 -95 -6 123 -28 -40 25 -31 -49 53 -3 -29 -23 -2 -92 76 1 -138 -22 63 -94 19 68 -117
2940a17P4J03o3j7j2k8R5L6q4n5M9l5J5R4N5j74O7K4l0P4J5j17k6O7rMm3o8P5
$$ -117 -43 60 -3 -20 -32 -60 35 71 -13 -68 -19 -54 -39 55 110 -64 3 27 -3 71 86 -31 -57 10 1 5 -38 -106 -31
2969c1R1K4n3K7j23K9J43k3o2M6n3j10J83m9l1j6R2r7K5O7o8j05J53q9J2O3q8
$$ -31 60 84 31 58 -65 -36 107 84 22 68 15 -95 88 39 8 -8 84 -13 12 79 11 -94 59 -30 -18 45 -43
2996d3NN1O5j20Q5m2o5J03l0l2j4Q4j27O5K7l7K0K4m0k1Q9q0ON6K6j54J47m6m7
$$ -43 -38 13 78 -42 43 1 -64 39 9 -23 -37 47 -80 -15 12 -25 -5 19 -21 -42 47 -33 -27 29 55 -99 48 2 -45
3025d5P2nq7M1j4l6J18l1n5l1N3J5qO4n6q3O4L9q8P1L5o9O6nn9M5L9o5kR6j07
$$ -45 27 22 -65 -24 -38 -74 44 13 -42 -73 -20 -5 -13 51 -5 -88 -24 15 -73 -2 33 -36 30 25 -34 11 50 -15 -17 79 -28
3056b8MM5kj9K1N8r0M5J6k8JK0l5J8K1j6m6M4plM8q6oM0k2K4mK5m0NL1Pm4M0n8
$$ -28 -24 21 19 0 21 79 -11 34 50 22 23 43 8 26 47 31 -15 29 22 19 67 -19 -25 15 -7 17 13 38 -2 3 34 41 -3 37 -21
3091b1JL0LLK7j7Jj7Qqm9L5K3mJ5m9Rk2K5m5L2P6j01K6N4n4KK4Ql6K8J9n4J3m5
$$ -21 -20 10 13 16 43 26 27 10 18 10 -39 -4 19 15 30 -19 -10 -32 -7 -52 -20 56 -45 -19 35 -19 -17 7 15 -21 7 26 -28 -15 -60
3126f0M3L1j2k7M1j7K7o8N0k2J0K7m4M2o3Q8r2Q7l1%K4n7M6KNmojm2M0n1K4J4
$$ -60 -17 14 2 -25 16 -1 26 -42 8 -14 -4 23 -21 21 -42 46 -46 41 10 10 34 -23 23 25 30 26 20 19 -23 17 -34 -10 4
3159DM4o9O0Mk5L5n0j0j2O8j1j7j4Q3q4K7k5N3n7ML8k5J8M2n8J8n2K4k4L%L2O
$$ 4 48 -21 39 43 18 53 3 -7 -19 49 38 21 7 90 6 33 8 61 4 8 46 21 39 81 23 41 -11 13 -11 -8 -8 24 30
3192C0p6L4K0m8pO0j5l1j0J7Q9k9q4Q2n0J8j9qJ1J6J3m6K3l1J9Mn2J04ml6J2k7
$$ 30 -46 -12 8 -40 -47 13 -2 -33 -43 -26 63 34 -50 32 -18 0 -19 -27 -16 0 13 -33 -10 -41 -22 -18 -70 34 30 -6 6 -21
3224b1K3j0N6m7L7m4Qk9pM6o1P3J9J6n6L4j6k2Rj8K9K5m6L0J1j3k3L5L8m8k8K4
$$ -21 2 -8 48 1 38 -6 2 -27 -34 12 -49 24 43 59 3 37 21 -1 8 -10 19 44 -2 28 39 26 3 38 76 28 0 24
3256B4k9K7q3J16m3n5Q7o0kO2n9jK4p6M1JM3Jk5M1l2M2o6pM4k1l3L3L3l1N5q2
$$ 24 -5 22 -61 55 12 -43 44 -16 -18 44 -15 -16 8 -68 -27 -26 17 18 -7 34 2 44 -22 -29 15 -6 -39 -6 27 -4 51 -31
3288c1J2L5m5N7J8r1J3J7rJO4l4J3l4L3k7K2ro1J9O0j5m4j9N6J1K2n2pP2l6k8
$$ -31 -19 16 -29 28 46 -45 -32 -15 -24 -23 41 7 20 -14 19 -8 14 5 -56 -37 23 8 -36 -55 1 12 34 -18 -25 47 11 -17
3320a7K8k0jJ3Q3j10J2K9p0Q8K3o4L4L2p1K4K2k1m0P1l7j6L6K0p2PP2n4Q0r4j8
$$ -17 11 -9 -10 3 86 -24 -12 17 -53 35 58 -6 28 60 -11 13 35 14 -26 45 8 -8 28 48 -24 -17 55 1 81 -13 -31
3351c1M6R3j27J8P0p6L3O3j31M1M8q7N5M4k4o4L3o1KK3M6q5L0P6o0j3R7j50K1
$$ -31 15 108 -19 -1 69 -7 26 89 -42 -1 47 -40 15 59 35 -29 4 -57 -55 -32 14 -71 -41 35 -25 -38 59 -91 -70
3380g0J31o2l7O1n4m6Q6jl4O5l2q0O9O6q6K0j5klR3q9k2J16r0p3J57n1o1R3j8
$$ -70 61 -1 -38 23 -31 -77 9 8 -26 39 7 -73 -4 62 -24 -4 -19 -21 -24 69 -20 -42 74 -16 -89 68 17 -44 49 31
3410C1l8K3k4j8MOl9L8Kj5k2J10m2m6K7L6m9M3Kp5N9P1r5rL0m4N6O7p3M4K3j31
$$ 31 -7 16 -8 -26 -22 -16 -55 -17 -15 -30 -52 58 16 -30 -3 33 -16 27 29 -46 13 84 -11 -20 10 -34 22 89 16 60 83 -48
3442d8O0QM3k4ol9J2M0l1p5M7m9j9R1M0j05K2P6o3R8l0l6j11O8K0N9m1m6lQ7m
$$ -48 12 20 63 39 33 -6 6 46 15 -60 -13 -62 -81 10 50 -55 -33 43 -20 78 48 12 -99 -31 -11 48 7 -39 -42 45 41
3473D1l4j2p0NO8j5O8q2m5L4N0mj5P5r7K1L2J3q9N2k9L0Kml0k7J06m9J5L6m7m2
$$ 41 7 -5 -75 -70 -2 -17 51 -31 -76 -42 8 4 -11 64 -33 -12 20 33 -56 -4 -33 -3 -1 -5 -35 -62 44 -5 10 46 -1 -43
3505d3O1N2m8K2j7n8O0qo0O7l2l3P7Qn2JPj4k7J35j23n8J81n2q0P1l1j26J92l3
$$ -43 18 70 22 44 27 -31 29 21 -39 28 -4 -37 40 48 -4 -3 4 -10 -37 98 -25 -83 98 46 -34 37 6 -120 72 39
3535C9k8RM9p0m0J15j21L1J0j1k6J07p3l4Q1kl3pLr8L0O1K1j9ol7j7J56j50N7
$$ 39 11 20 69 -1 -41 74 -47 -16 -6 -17 -43 64 -9 -43 38 36 3 -4 -1 -99 -69 -8 13 -6 -12 -49 -66 90 -60 -3
3565cN9n7j00J41l3q4J02j6p4J08m7j03P5M7m7K7P1l4m9M1l7j3Q5k3m5l8O2k3
$$ -3 56 -1 -101 40 7 -77 25 9 -65 43 -4 -107 -32 15 -32 -5 66 32 -17 24 -13 -26 59 36 -9 -47 15 -8
3593hO5Jj01K5P4k5o0P8q9rK0P3j15P6J3n2L8J6k8m3J37k8J4m0j5oK4o8L2J5K2
$$ -8 57 58 -43 -18 56 31 -29 49 -40 -49 -29 44 -71 5 18 -34 4 20 -8 -51 86 58 72 32 17 11 35 -33 -1 14 36
3624C6m5L8k4n4J08q9L2nj1l0L2J9K0j5j7j5Mqj2L3Kp4O4ml7N3jl6nM8j8qK5l8
$$ 36 -9 29 5 -49 59 -30 2 -3 -14 -44 -12 7 27 12 -5 -20 -16 -24 -36 -3 -1 -75 -11 -15 -52 1 0 -36 -41 7 -11 -19 6 -32
3658c2K5k9j2J0O8l7K0k6K3j4j5qM2Kl2L3j6k0Pj7L2k8j9J3P9j03J52j11L4q8
$$ -32 -7 -36 -48 -38 30 -7 13 -13 10 -4 -19 -27 15 17 -15 18 2 -18 -11 -28 4 -24 -43 -30 49 -54 98 -13 21 -67
3688f7Q9Rl8j2l1L6M9m8k8K7KNN2m7j5J2Mj2jQK0J0L5j7j02N9L9l1O4j03O6nm7
$$ -67 22 31 -7 -19 -50 -14 35 -13 -41 -14 -12 -7 45 -2 -17 -5 -1 -13 -14 -6 14 24 59 42 -60 -1 38 7 71 -32 34 29 -18
3721a8Q8kr7K5Qk1N1k1N7j02K6k4M7k0J1n3L1l7K6K5K5j05O2ol9pl0Q0m6N9%l
$$ -18 70 68 -29 -4 4 -17 34 13 70 -32 -6 -30 17 -3 8 -45 -14 -51 -25 0 25 -80 -18 -24 -63 -70 -100 -20 -66 -7 -7 -10
3753a0J4m1L7L0n7MK1MqM8j9m9L8N1n3lm5O2l4k2Q4m9j6J9JKJ7n9Q9l2r5Q2L5
$$ -10 4 -37 0 30 -27 -23 -2 2 -6 42 23 -26 12 63 10 7 -38 24 -10 -32 52 3 -13 6 7 9 26 -33 56 24 -71 11 46
3786D6n5j0L1mj9K7L2k7j3k1K3K1Pm1rpN3o7O0J0m6pO2Pj9Jp4K8K2L0l8J7PKJ0
$$ 46 -9 -19 12 8 -11 16 48 21 8 -13 10 31 38 -3 -12 -19 34 -33 27 37 -9 -16 46 53 34 35 -39 -11 11 41 3 20 27 29 39
3821C9n0k8M9o8K5J6N4m1j8m5P1n3K0N0J1j9n5N1K0p2O3o8J6Q0kr1K4k6ON6N5
$$ 39 -11 -39 10 -58 -33 -17 37 -4 -22 -67 4 -49 -29 21 32 13 -42 9 29 -43 20 -48 -32 48 46 -45 -21 -47 -41 15 70
3852G0j23O4L9o1j2M6j9l6R1j0m5j1k8M9Kj2qQ7r8jP0p7mMQJ2K6L2o5N6k1k7M8
$$ 70 -53 11 50 -11 -23 23 4 -32 59 49 4 -7 -35 14 16 4 -4 83 -15 -16 54 -23 -27 -23 -15 -3 23 55 -10 46 25 -2 46
3885D6k0j04Q0O0j03mQ7q3OL1J8m6M4J7l6oK8mj7N5p5J3N6l6LL7Np6P3n2l2J8
$$ 46 26 -78 2 62 -41 -45 42 -41 -35 -4 14 -32 12 29 -7 -13 15 11 -6 49 -26 -13 43 7 10 47 52 -24 49 -3 -35 -17
3917a7N6m8Npk9N9j0n9K4O9o8j0Qn2M5M1l8J7O5o2LK2Rm1N7j9q1L6K4k8KN4n1
$$ -17 39 -9 -4 -11 -40 19 9 -50 -26 43 -25 -35 -27 -79 -34 7 -31 -14 51 -11 -8 14 23 -18 39 20 -61 -25 -1 -29 -27 27 -24
3950b4J4M9m2jk0K3qK1Kk6K6k6O4o4m1N7L3Pp7Q0o1k4M4l4QPK6l9j9M8j5l1M8
$$ -24 -10 39 -3 -4 -24 -1 -9 12 14 -12 14 -12 52 -12 -53 4 37 44 -33 47 -14 -38 6 -28 -20 -13 13 -26 -45 3 -12 -43 5
3983EOJ7Ll6l9N3nr0J01j8Mlj0n3M6P8n8KJ5r8Q5L1k7m9N6kpOJ2n3K5N6n9j7j2
$$ 5 11 28 31 -5 -44 9 4 -86 15 -3 1 -2 -12 -65 -19 59 1 3 18 -80 5 36 9 -40 16 14 7 13 25 -28 -3 53 -6 -23 -35
4018c5k0M9J3m0N5l4o2K3R2L0j16P4n8k2Q5Lo9O6o6J8j7N1l1P1Mn7j5M7m2j4J04
$$ -35 -55 -6 7 -33 22 -12 -74 -51 41 71 -45 29 -29 -51 34 37 -32 34 -32 -14 -31 20 -11 60 64 7 -8 39 -3 -17 87
4049H7j15M1J3o9o8J38M2j40J13Rj05O3N7j45K9M6P7p6L4j7k4N0q1N2K7l2j07
$$ 87 -28 13 26 -43 -111 27 69 -71 42 51 -54 9 66 -79 -50 -4 73 -3 31 14 -10 40 -41 11 38 6 -101
4076a01Q3O3o8Q0j04JN8J9m9o9J78j88Q8K4K3q7Q0k8pNkl7n1J26l9N1rl2j03Q6
$$ -101 -18 45 -23 57 -47 -46 12 31 -18 -87 91 -97 -9 15 38 -49 31 3 -4 1 -1 -38 -89 37 -2 49 40 8 -95 -9
4106il5J4P1j03N4J8Pll6O0j11O1Pr7J28k9k4lO6o5lN3m2L0K8k9l7K9L6j3o4L5
$$ -9 -44 -30 41 -62 -8 10 17 14 -22 38 -73 -12 -5 -102 26 -3 -27 -30 36 -29 -32 21 -21 9 37 8 -29 0 36 23 -41 -6
4138fO1r5qK4QN2n2jO7j14P1N3m5k4M0l6K9lK7p8J9j1j5N9o6L4oM0n0L8m5N1k8
$$ -6 55 -40 -48 -24 -16 36 -16 -17 50 -64 7 60 15 -9 31 -5 24 21 48 -30 -11 -22 -37 22 -44 -10 -16 24 -26 12 -33 18 -10
4171a0J8L5n7K0j5K4m1M9k2L6m1M3l3rM6n3K%M8j4p4O4Nn8P2r9K5J9KpL4Nk3q
$$ -10 8 43 -14 6 -9 15 -26 23 1 37 -4 39 6 -3 43 -10 -8 -8 40 26 -48 16 21 -37 35 -64 -39 -20 -18 -25 9 14 -9 -17
4205a7j6%L7lnMJ1L2m0m8L1K8J0k6J2j2J0j6O0r3O4k3lK0o2J6J5k0L1J6l6K5K1
$$ -17 -33 -33 4 1 -4 0 11 43 3 -45 -14 14 24 -2 10 -2 8 -8 52 -41 23 0 -3 17 -45 -29 -14 -34 -3 13 -23 2 23
4238B3j8L9m9J9L7l8k9L8k6l6J0J7l9N6J5m0J4J4pP5p6J7l9l4P8p1J09m5l3kj
$$ 23 5 44 -5 14 51 13 -16 22 -4 -40 -30 -13 -52 4 19 -21 -7 7 0 75 -1 16 -23 -57 21 -50 59 14 -19 -21 -22
4269b2J1N7l2j9j5K8k8J9J4p7k2P9qM2Qp9L5j1L2Orl1J9m0N6Pj6l2K7J7Jn7NM4
$$ -22 -11 46 14 -5 -20 8 -20 -1 13 -64 -86 -7 -15 27 35 -44 -9 -20 12 18 9 -22 -3 -43 13 20 4 -28 -1 16 17 -40 -35 9
4303IJ6L6q9N0l1k0j4J8M6jn1L2j9Q5m9K9o0M5mq6P9k2n3M0Qj4N1k9j8j6J19j13
$$ 9 25 61 -28 22 -9 -29 -43 -25 21 20 -31 1 -18 67 18 47 -13 32 28 -58 21 -1 -54 -14 -6 -20 31 2 -16 -32 87 -26
4335b6mN9o7N4m2N3k8pK1m1K5NpM4p1N5k0ROm1PK8k8OrJK8m0J4q2R7NPm3K1QJ
$$ -26 -30 29 -38 16 -26 27 -1 -8 13 -28 -3 2 -5 39 -32 23 3 12 18 -23 -16 12 -16 -10 -19 -18 10 -30 -16 -98 -1 4 11 -32 -11 -3 -2
4372bK4l8LNm7j4Q3m1O3Oj6m6K1J0Kl5jk4M9oj5Mn1L3J8j5j8L0J0J4J2j6j0K9
$$ -2 22 -16 -13 -8 -55 -69 14 -27 36 42 26 -20 1 11 13 -22 -23 -47 2 -4 -19 -15 -66 -33 -15 -30 -48 -18 -8 6 18 2 -8 21
4406B1l8LL2jM0n7JJ8k5K6l8M3m5%J7M0M3o7NL9J4k2j5k6k2l5P6Jjq0R4Jj9n4
$$ 21 -17 -14 18 17 57 0 1 19 -6 20 -18 25 -20 -20 -3 37 80 13 18 57 71 49 34 8 -14 -49 27 28 27 -53 41 42 23 -31
4440c1QRj3J08q3m2M7o1J6M9l4P0k5O4o7rj8K8n3O4jj5j7k8N1l7N2m8oL6ok8J8
$$ -31 -23 -14 -27 81 -2 -44 3 -58 -42 7 -27 43 18 82 15 6 -12 16 -37 27 26 11 -6 -34 17 -20 32 -16 -22 14 8 -20 -2
4473bQo1K1L1k5M4J0o4O2k9kk1l2Q9n4O2k1l2pj7N5lL3r2Q8n7k0Q7Kj09N4kJ3
$$ -2 6 -55 -34 -3 -28 16 26 -38 24 -5 -7 -28 -60 29 -25 37 16 -16 -23 -40 15 12 45 -47 41 -16 -36 51 53 -56 -2 -4 9
4506IOL1n2PN5k2kj8j3k7L9O3n7j3Lo3Q5qoPK2o2M3L2q4K4M7p7N4l5k6M0k6L3
$$ 9 15 46 -6 1 56 34 32 14 1 -26 13 76 19 6 9 -54 31 23 17 24 46 -16 27 59 -25 -1 46 -31 23 -12 -38 2 -24 9
4540IM0j09j5Q7k5k0N7k7Nm2M6l9J3J2M8m3J8Lp2N0N9o7pN1j1k0K5K3kk0j2l0
$$ 9 49 -60 -75 12 -13 -33 24 -3 2 -40 6 -33 -20 -8 40 -3 15 18 -54 -4 55 -12 -19 32 21 1 26 49 47 27 15 -15
4572a5N2o0N4r0L2N3l5m9N1K6k7o0Q8M3m4P1j10L6j1jJ2pl4K5NlJ2j9L8K6n4O1
$$ -15 37 -23 31 -59 -27 26 -9 -58 -7 19 -8 -68 20 63 19 90 -20 16 5 4 16 9 -25 0 5 2 14 -5 33 59 5 66
4604F6o3k8M3N1l6k4M9k4%j0j3j6k2k7P3ok1lJ6o7L1O0j4j2j5O6j06K9O5l7j5
$$ 66 3 -25 18 69 33 9 58 34 34 24 11 -5 -27 -54 19 13 -8 -11 5 -62 -31 29 15 3 -12 54 -52 -23 42 5 -10
4635a0l0k8K6L3j7PL4n1qQ1k3K8k7ll8l3N2pL1M3q1OJ6m3L9N8m0q1L4N0o7J5M4
$$ -10 -40 -68 -42 -9 -26 -19 15 -36 -44 37 14 42 15 12 -26 -59 -7 -14 17 60 -21 -15 1 -42 -3 55 15 -66 -32 18 -49 -34 10
4668A0k1L9Ol9j1P6J7o4J1k0j4Oj7L5k4K4l1K4m8K1%qL7L7m3M5j6o8L8MJ5o9M0
$$ 10 -11 28 34 -5 -16 60 77 13 24 4 -10 -4 -21 14 -10 14 -17 7 -41 -20 -20 -28 9 46 3 48 32 -36 2 6 21 -48 -8
4701hLl8L3N5n4K8lm2l1L2K9l4M7m6L0P2l9n9N2p9L1K6k5n1P2o6N7mj4Mm7N2R
$$ -8 -5 -43 -10 45 -9 19 16 -26 -57 -25 4 -30 17 -29 1 73 34 -25 27 -52 -21 5 -20 -71 1 -65 -8 -12 -26 -22 -69 -17 -8
4734hj3jj8L7M6r9Q2l8K9L4j5k8rL1J3l2j8N7p7l4J05j7p3Q9p2L2j9PJ1k9J0Q3
$$ -8 -21 -22 -40 -3 43 -56 26 -12 17 51 36 8 -1 30 43 11 -7 50 -27 -61 44 27 -46 43 -29 3 -16 -9 2 -27 -17 66
4766F6m3l9l3O7k7p2R3l8J4j3M5o3L1k1l5P6qk3R1n2oJ5Ok3j5KJ8j5j9P6m0mn3
$$ 66 23 -16 -49 18 -9 -81 12 -26 -12 -25 20 -43 -12 -33 -68 8 0 -23 68 16 10 25 31 8 -7 -5 13 -2 -21 55 15 11 -42
4799d2M1j2j2M3l5M7K8q8N1l9K2L2q5N1m9%Q3l6kl1k3P1J5n8j4K3M4J1o9O1k7
$$ -42 -1 -13 -25 18 -17 30 58 -30 21 -18 4 36 -49 2 -47 -47 36 0 -2 -33 -56 15 30 -28 -42 -19 25 36 -33 28 1
4830AKOM7%r3K0O9o4l6P9k1m7K0kOQp2P2K4L4n9M9m7M1q0O3j8N9r3M8NKk2O0k7
$$ 1 3 9 56 56 -37 -17 52 -12 -48 31 10 -37 -17 -19 -13 -5 -77 -5 19 53 -6 43 -4 37 -43 20 2 61 -32 16 21 23 1 61 34
4865C4k4Ok5L6Ol0K1m9L6Ol1O5k6Rl9Q7o5l6k2P9k1M8l1m7N3p6L8J4pn8M6okO
$$ 34 10 16 -9 27 33 3 24 -25 11 17 -14 51 25 34 -5 82 17 -19 -41 38 17 65 34 -13 40 -36 2 16 9 -49 -3 -9 -11 -5
4899eN8o4Kl8K8lOjk4K1N7k9J2j0k3jN0o3KOK8k4k4j7N5OQl5j0N4j1L5k9Jl7j3
$$ -5 53 -11 -9 -47 -19 -22 -16 -17 -41 -20 37 8 20 10 -13 -14 36 -27 -25 -19 9 -15 -39 -56 -1 5 13 -22 -32 22 11 46 17 18 -19 -32
4935c2J3J5N5q4QM3p9R3n6J9J9m0L5j5NJ1Lq4J19q8N1l8k5K1J4NNNN1qm4J5L2
$$ -32 -19 -4 51 -33 -25 18 -61 32 -24 -5 14 -26 9 -6 -1 10 13 -71 48 -40 11 -27 -52 -31 -17 -12 -7 -2 49 41 -3 12 44
4968D4n5J1J5m7J3nP4o3J6PO0q8M4kj2j5lK6M5j01jjmJ5o9R6k7L0n8N5p3J6R0
$$ 44 -11 0 15 -32 -19 -24 50 -13 3 10 70 -18 26 24 12 -3 -6 20 65 -36 -37 -38 -42 -27 -96 0 -27 3 -55 0 -73 -57 33
5001C3j00Q2o4N2m0L2J4l4N6Lm6p3L1Q0m2l7Q9nn7NL8k6kM7k2mMr2R1ML0o7O6
$$ 33 -67 15 -49 3 -37 -5 9 -25 31 34 -12 -85 -54 26 -16 -53 36 31 -26 -21 17 -9 -11 36 14 10 14 -78 13 17 47 -20 46
5034D6m0l1O0j8j8K0l9M6j3K4k6J0J4k1k8J5L4l4L8j7k6O8ol0l5J8J9kl9J3K9
$$ 46 6 -25 35 17 -1 19 -20 26 13 37 11 21 35 14 -14 1 35 1 39 22 -4 64 58 28 -7 11 30 28 -11 2 31
5065C1m8M6n2NL0KM6n4m8L8k5L1K8m1k1lL3j0M6q9N0O5l9n4PN8o0oM8m6K9qo5
$$ 31 -17 29 -23 -18 12 14 60 6 -42 -4 -29 2 30 -11 -32 -35 -2 -12 34 -55 -5 60 21 -33 -26 32 -28 -34 14 -32 -3 -11 -76
5098g6N2L8Qk9mn7M2Q9k6p6K7K5JJK5Op7R6n2k0j0L0J2l9M2OLk2n7N2l6O2m3J2
$$ -76 -24 14 22 -7 -11 -68 -26 63 37 -39 -12 13 14 15 40 46 -31 65 13 -7 -17 13 25 -14 28 34 37 15 -42 10 -26 36 -7 5
5132EkkL0J8j3j0l9POQJ6l0qm5R7m7L1J3q1O1n0P7o3L0Lj5L6ok5J3JM3m1L7l0
$$ 5 3 1 31 49 36 26 -13 -6 0 8 24 -6 -14 -59 38 -9 22 35 -46 15 -35 42 -21 9 12 -3 33 27 2 15 16 59 18 55 25
5167B5pjK7q2M4nk9O2q2K0M4l6j1K1K2l5l3J2Q5m1j6n3Q5n1k4K8L3kl2N6m4jr
$$ 25 18 17 44 -38 6 1 -28 34 -48 -28 16 -20 -31 -10 12 -23 -56 -44 41 0 -16 -69 16 -35 -59 -31 2 0 -32 24 -20 -21 -30
5200c0K1nO1l6MN0l1L5pp1j7M2j2j8K3K1ol5lL9k8MJ5kK3m7l0O3J0o8K7J2j0L0
$$ -30 -9 -14 47 11 15 65 34 69 62 -9 -26 16 4 -14 9 30 24 -11 -14 25 -3 1 16 14 37 -10 -40 23 33 -35 -8 4 -6 24
5234B4k5kk6J04p1J7l8J1PM6K1j53N5M0J9j2l4j5P5m5K6l0M6n8M0NJ0rl1Ml4M2
$$ 24 -1 -3 -29 75 4 21 -17 -6 1 47 68 -85 -30 10 29 17 -17 -32 43 -2 24 -6 40 -18 22 27 37 28 -3 1 -33 9
5266Io4O0Kp6P3L6l8Jk0k7K2QK1Ll7j8J0J2L7KK2km5j7k2J16j4m1l7mK4J1k0Q
$$ 9 -55 5 7 -69 4 40 2 3 -17 -44 -22 -14 7 10 -27 -45 -35 -23 14 16 38 36 -9 -26 -48 68 54 13 -24 -28 -4 7 -13 -5
5300eK6l2K0ORl6J9k5j7M0l1N5Nq9R6k9j7K2J6nj3J9n2J8M5mk4m1pLL3n0P9J1
$$ -5 21 -11 9 15 24 -12 7 -18 -35 5 -26 29 34 -55 41 12 -5 17 33 28 15 34 -18 0 45 41 17 -24 -31 -28 5 -45 34 45
5334D5p5K9q7R3k6NK4J1M7k9n6NKj1J1J7j2L9o1OoN2j9K6Km6QO7p3K6o5qO0j1
$$ 45 -30 -1 -88 5 -21 -16 8 19 66 37 -19 -14 -12 -23 -12 5 -7 32 -29 -23 -29 23 4 30 32 -14 -6 61 -12 14 -51 -59 1 -10
5368a0jJ2k1M3n4Ok0J9M5l7LJ7J0k3P5m3j2k0l5O2o0N7lj6O7n5k0J4k2nLM9l0
$$ -10 -11 1 -20 23 -31 -25 -45 -26 19 -18 -15 2 12 -11 64 21 9 -11 -46 16 -44 13 10 -6 61 6 -14 0 -22 -27 -24 25 -5
5401em8J01p1O3km8K9L5l5J1L2p1k9M6nrm0PL2k6J3oJ3J1l5K7O1m2k1JL2o0M1
$$ -5 -53 48 -23 40 38 -10 19 54 19 30 62 -9 -38 8 3 -6 -46 -39 -7 -33 -20 -26 -13 -2 -37 -10 51 9 -12 -11 21 -39 2
5434Bj8L6k3JN4j7lr8R2k4j5j1K4J9m2k1N0m9QO8q6L5L3lKj3QJK5l5oPj4l7N3
$$ 2 -16 20 -3 -2 52 35 32 -66 26 2 -13 -24 0 19 -23 -44 6 -43 -35 33 -53 -18 15 12 14 1 9 10 35 0 -6 1 -13 -50 3
5469Ck1L2q7P0j4K7j8lK5l2J5M0m9kl0R4l4l1oP2n5mN1j4k5JM7k9nm5M3J7o0K0
$$ 3 -18 14 -73 -3 -17 10 -8 -11 14 -18 -3 37 -12 -14 -44 50 16 -15 -21 51 -4 -8 43 29 4 5 52 23 18 -27 16 33 -27 -7
5503gk8N9m9L0J2o2O1ok9k5%Q2K1n8m3L2O7p0j4K5rj7L8km6K5LrK2m2L7k4J31
$$ -7 -35 24 -25 5 17 -45 16 10 -19 -44 -44 38 59 1 -42 -10 57 -13 -27 -2 -11 -28 10 8 -38 -13 -10 -19 3 -39 -2 -26 105
5536A05j85J8K5R7m8K2l4J5k8km2O1n1L1k7J9L4o6N0RkN9r3N6l8k4Jj8M6Lm4K8
$$ 105 -80 -62 -37 60 12 34 0 15 -13 -15 -57 4 -47 -16 -43 -24 10 -56 -6 3 1 60 -33 23 -15 -39 -38 -56 -10 -7 -51 -23
5568b3N9j5n8Q4o3k1O0k9k0n5Q9Nj5QJ4K7o3K2mk1M0L1m8l4J8nM7k7k2j1J9ko
$$ -23 36 21 -37 47 -16 -37 23 -6 -26 -81 8 13 -2 6 20 47 -16 6 2 -19 21 52 4 -30 -12 -17 30 3 -19 -30 -11 -13 -19
5601a9K4km2K7K2MjM2q1K7K7l4K1o1O6n0O6k5j4l8J8J7N4o0k2N3l5RJ4J2n8M4
$$ -19 5 3 -39 -12 10 14 13 55 -26 1 28 -6 15 -46 20 -30 36 11 -3 -41 -23 -6 48 -12 -34 19 -16 -7 7 19 -39 5
5633El7jL6OJ3Lkm6P%o4L9P0J4n0LN2j3l8k9J00l5k3Pj8rJ5k8oN3nl1J3J6j2o7
$$ 5 -32 -33 3 9 22 25 23 -23 -16 -16 -80 -41 29 43 -7 -4 48 35 -3 -32 68 33 10 17 -1 -10 5 -23 -29 24 19 -12 1 17 5 -62
5669f2R0L6j0o1J5%jJ8Nq8N6Kj6O9n2j7%K6J2j4m9OR0rJ0j00L4k7n8J60j23M3
$$ -62 28 64 54 -7 8 8 7 25 30 -58 -2 0 -16 53 1 -16 -16 10 22 8 -41 -35 55 46 56 -44 -10 -37 -95 65 -58 -15
5701a5K1K0l0l1Q2m0m1M4k0L1p0N1M0Kk6l4K5k6lK1l5K1M0l7J0N7q0J7QK0K9n7
$$ -15 6 26 -4 -35 47 7 -34 10 -10 21 -49 2 42 44 18 -16 9 -17 -20 1 -34 -13 27 -10 0 57 -23 -6 2 22 51 -6
5733fNpll0L3M6k3jk3k4L3Omj4l4O1J6j5jOn0M3J0j3l0J08p5k5Oo5P8K6ol7N7
$$ -6 -1 -8 -11 -41 -8 38 15 14 -9 -33 0 6 2 -12 -46 15 31 16 15 21 -29 14 24 11 -19 89 14 -11 -5 -70 8 34 28 -9 48
5768D8p1M4l2KN3m9M2J4Qkn2l6M2pK4j4j5J4Lk1k2P7m1k2O2j2l5k1k2J7L5Ml9
$$ 48 -23 21 -11 -9 44 -5 37 51 59 57 5 -31 11 4 28 14 -1 13 16 -5 -27 50 9 -13 49 37 2 -19 -41 -24 11 15 -24
5801b4L5ro7N7O9k0j0l2K1K7l2j8qJ3m6P0MQp9N1k6N5%o0J6K2mL2n6j1J9O1r8
$$ -24 11 2 -65 -8 61 41 31 -1 20 47 15 -3 -11 2 -44 26 30 38 -41 10 -16 39 39 -21 -5 17 13 45 -11 -22 -3 58 -40
5834d0L8J3m7K2l5L7RJ5m5O2K4p8m5Q2ll2J3K4j7J7l5J11q3jM4l5j5k0M6Mn3k
$$ -40 -2 11 -36 -14 -49 -12 -3 12 -33 29 53 -25 -70 12 9 -23 -10 14 -3 14 -21 90 7 6 50 15 0 -20 26 30 -23 -25
5866b5P2l0k2K0J5LO7j49P3k2k3J4M6l2K3o5L2L1J5l4j1%j2K5Ll5QK1J6n3Nj9
$$ -25 47 17 -5 15 30 33 100 -49 24 2 -21 -7 39 7 30 -35 -3 28 43 9 -2 -2 -14 11 14 -21 -13 8 24 -29 -24 -43
5898d3O6k3o5O2J2q1J11roOkk4K7Pp1P5%k8l6M3m5P6k8k1Mj6L7p5Q6n6O3k4p1
$$ -43 23 0 -65 -3 9 -72 39 30 24 30 28 4 31 38 -33 42 42 14 -22 21 -24 52 24 3 7 -9 28 -47 39 -17 46 22 -49
5931d9J8J6K9l6O2n1K1Qk4QkKl9J4N4n0Q2k0r8J02o2N8m1J6m9M7N0r1O4o1L6L0
$$ -49 -31 -15 14 -22 40 -11 10 18 -6 2 0 2 -37 -23 31 -19 63 43 -55 47 -15 43 2 18 -31 16 66 -25 39 -22 14 44
5963D4j9mJ0k8j2OJ2k6L3j4N7o9m6L7k4Q5k1qk5K2l7L2pl3M1l3Q8r4L5J5o0L8
$$ 44 25 21 31 3 -9 -3 9 -17 16 2 59 -10 -56 -19 -43 42 21 13 -12 10 -27 5 -2 -35 6 -27 61 -33 2 17 -43 -5
5995eo2N3N6m3mq1J03m9O5l2J3J3pJ4Pn0K0PJj3l5Q7q5L3po7Q4J0n7N7J0kp0K2
$$ -5 -67 -14 42 -1 -5 -86 17 -32 33 1 14 27 20 34 41 -9 11 18 19 6 -29 58 -27 6 -1 -68 16 26 -31 26 36 34 -36 -14
6029a4J7j8J7m2O1j7j9N6k8l9J6K7OLlnpQm9O7q9R5j0qjK6n7P1K2q8L1k2K9l9
$$ -14 3 -15 2 -40 21 4 -15 41 13 -26 -10 17 23 26 23 18 11 19 -30 37 -52 43 33 25 24 50 -7 64 86 -2 29 7 36 -3
6063cl3J8j8L0K3j13P6N6ok8ml8J1K0On4P4kj3m4j0L6O0l5K6j3Pk9J1K1q4O0K1
$$ -3 -36 -18 -36 -6 17 -96 -20 36 30 2 -2 -40 -29 -9 -3 -57 17 15 2 -42 -52 -16 44 9 35 22 29 0 11 32 -52 8 29
6096B9Rj4K0j1L1l0j7Qj2Nlo3R1p1O6m6L8n0ML8m2j8KK5kNml8N9n1MN6Qk3M3Q
$$ 29 38 24 44 33 64 34 17 25 13 18 15 -48 43 -28 38 -8 30 -20 -16 22 -20 -38 -36 -11 -13 -8 -12 -50 9 -42 -38 18 26 3 46 54
6132E4j12J9O2o3M7N4o9J8m0M0l9N4mn0m1P3L6n1oJ8n5O5n0M3J6Lq0L0L4L0k8
$$ 54 -58 -39 23 -40 7 61 -8 10 -30 10 -29 25 21 -29 -70 3 39 -12 -18 0 -55 10 -40 3 19 22 -58 -28 6 36 8
6163H%J3K4o2J9K5k5J7%j4K1k4K3j8k4N7j03lnJ8N1qJk1N0j1J5l4j7Q1K1m3J6
$$ 8 8 21 45 -17 2 27 2 19 19 5 26 2 25 7 -17 40 -63 -66 -71 -53 -2 -10 -9 -30 20 9 24 -10 -27 54 75 32 48
6196D8l9L4n2JkJ6PK3k8n0N5j1j0l0Q9o1M9P5q6qk5RK5l0Qo5M5K5m0M8K2m2N5
$$ 48 9 43 -9 -8 -10 6 13 36 8 -42 13 2 -8 -38 51 -10 39 114 28 20 -5 4 29 -1 7 -58 -13 12 -28 20 42 0 55
6229E5p8N3l5qnRJ3rL3n5J8J9n4j1l2J11J8n2K2K2p5R0k9K9n5j2PPJ7j0j0RLk8
$$ 55 -23 30 -5 -13 -18 -9 4 -5 28 -27 -9 10 -44 -55 -87 24 42 -10 12 34 -41 49 20 49 -6 -18 -11 -4 13 3 -7 2 5 -23
6263b3J2L4Ll7j3P0n5j0j8N2n6N3L0r5J2J02m2m3N6Pk8lj8m0R5j00P1l2qL0K9
$$ -23 -11 23 26 -11 -24 46 -9 -19 -37 15 -41 12 42 -53 -41 61 19 -24 32 39 11 8 -10 -50 45 -55 16 -16 -24 6 35
6294C5L0k3j5Ol7M6j5q3O4J1n0M6m5L9M4n9PrK9m0QL2Lj0m3N9K0l4Nm6L6P1m7
$$ 35 65 42 27 33 -4 42 27 -56 8 19 -31 15 -30 9 53 -6 1 -8 21 -19 -11 21 24 14 -29 30 50 16 21 -25 11 82 35
6327C5o7L7N1j22J02o4N1K8p6j2L5K4Mp0O6L2n8J7%P1j08O5n5K9q4N5O5l2%l3
$$ 35 -32 5 56 -66 36 -28 23 51 -25 -37 -2 22 26 -44 22 54 -4 13 13 84 -24 41 -14 15 -69 -14 51 19 19 -14
6357a4M8n1ORl3L0L4k3K3l6j0M6KLJ1l8j3jmL0l2O1j0o4Q0on4pN1l3J8l7N2l1
$$ -14 34 -17 -11 -2 -35 -5 29 6 29 -7 -17 29 31 34 45 7 -6 -7 -11 19 -13 48 38 -26 54 48 -6 -13 38 5 23 -14 38 7
6391GK4mj7N1k5k5J4pJ6m4O1l3n5J20p8Jj5L5j1k4J3j8j4O5nk6l4M0l1j8L9%J4
$$ 7 31 27 10 61 36 11 25 18 34 -10 51 18 -37 83 5 6 -9 26 15 -9 4 -14 -28 37 32 6 -28 12 -19 -37 2 2 16
6424A6k6N5p0N8oJmo1N7j7lN7k3k6l4J04r7J6J6j7qj9PlQ1m3L4n1rn9R4m4l7O9
$$ 16 -10 45 -25 33 27 28 24 -37 20 3 0 57 34 8 -26 78 -19 -3 13 -4 -12 -31 -24 -27 54 11 45 -6 -15 -74 20 -24 -61 8
6458HK5m6j0M8l5k8R3l6qqJ9L2mm5M5o4PlJ8l8qP8m8Kj5NNQJ2J2l8K7ok0lN6k1
$$ 8 33 -13 -23 25 -10 -38 55 19 11 3 22 54 50 5 50 -14 -7 -10 8 -30 -38 40 -8 -6 -21 -16 -11 -3 9 21 -17 10 4 -16 -19 37 16
6495A6j3j1L9q6N8J8p4Oj4K7J4K3J4j3%n8P4oMJ8n7K5K6m6rN0j1p9N6j9MK1J1
$$ 16 3 -8 31 -55 3 21 -53 -47 -61 -34 -20 3 17 4 4 -54 20 14 18 36 -21 4 30 -16 -25 25 14 -65 -9 -28 -24 -3 8
6528Hm8K4QN6m1k6Kp2J07lqK4l8J2qk1N3l7L4m3L9m6J7O1j0o6JK2n3O3Pkl2j1
$$ 8 -40 -16 -8 48 7 -19 -17 -89 18 15 7 31 -7 5 -3 -24 29 -8 26 -17 22 -24 -7 54 44 -22 -21 1 -52 11 18 16 -16 -27
6562b7J8O9m5Rj6PK2n0j0M1k0Lj8Q5o8l2J2L1k8L4NMlKMm0O6o9J7o0N5M1m2N6
$$ -27 -9 60 15 24 8 15 37 -13 -23 18 -2 1 -17 68 0 -32 -20 11 -17 17 22 26 23 25 29 -11 55 -14 3 -57 -2 39 -3 53
6596E3J2q7k9P0QPr2L5P4p3k2L9K6lkJ7j6k5j2O3k9M9J8j00K6L4n5K3j2M8o0l8
$$ 53 65 -22 -51 19 27 34 -58 -23 51 -22 -44 -5 21 18 16 33 17 -8 -20 43 14 63 81 -19 7 41 -14 9 -3 45 -15 -53
6628e3K4N4l1pK1L3q6L8j8K9K2Rjn1J4m8NL8KM7q2N0pJ2j2K1k8M6j5j1J7J4k1
$$ -53 -29 25 -6 -13 8 41 -45 -7 -25 4 26 35 34 -17 -3 -51 -46 -8 -6 41 -41 9 2 14 2 23 -5 41 26 15 32 46 25
6661B5K5k2m0L6j1nk6M8ql6jM1l4PQOko6P2Mp9O4opl1J00l8m2K5j7K5n2L2oL1
$$ 25 50 28 -12 24 13 8 -18 30 22 -14 -15 26 -8 -1 7 13 11 -55 17 21 -58 6 0 -7 -38 62 24 -18 7 -10 15 -37 -5 -11 20
6696B0m8j8j4M8M8q4M0j8l0N9p0Q5ljMj6L0l7M8k5K6m2j9O3m6K7l9M6l9M0n4L5
$$ 20 -28 -46 -60 -12 36 -48 -8 -26 -56 3 -67 18 15 14 18 2 32 -5 43 18 44 2 -17 46 0 27 -12 34 -5 35 -19 16
6728A6N3l9ro8M6j6k9K9NM3o2N6l4J5K5n8L3M7j6%k4j8JmnK5mJ1lJ6m1J0k0Q1
$$ 16 69 30 21 -47 -1 -17 -46 -17 -12 31 -31 25 -9 6 31 -27 6 53 37 37 13 -5 -4 -8 -13 12 8 19 16 32 -9 1 -19 62
6762F2n6n6rN8M2n8N2m8J8j9L0j27J53m5L1m4l3k2R0l1K1k4l3L1K0OJ5p6M1m2
$$ 62 6 -50 -59 -1 41 -17 35 -13 5 -14 16 -111 42 -3 28 -16 -49 -71 19 -12 9 -15 -48 -17 3 9 24 -52 -11 -53
6792e3Q7m1K0j1Rk0Rj0L8k2l5K7lK6j8k9PJ5j6MJ6Ml4O8k8J0Nmk7J5j9K4o9J7
$$ -53 34 -7 13 2 11 -9 0 -10 28 6 -29 -2 -5 21 3 -26 -19 -4 -20 -16 0 4 -30 38 10 20 25 21 -6 9 -10 14 -55 -38
6826c8%Q7o4mJ0J2n2K3L3oK5m6k5P3k5L7L3o7k7L6k4mJ3K8j5LM0m0l5N9j12J02
$$ -38 -38 49 -15 -19 -9 3 -49 -26 7 1 26 -20 -45 28 3 40 73 6 -21 15 -9 -13 0 28 13 16 56 16 -19 40 -72 30
6858C0Qp4N5Jo1L8l4L2k6M1n6K7L7Plq6J6J9J2j4L1L1j2j5J5kl0k2M5m6RM5n6
$$ 30 38 -36 19 20 -41 -3 -37 -5 -31 10 -46 -19 18 25 22 -64 -48 -29 -17 -31 0 31 19 4 19 17 -13 -35 10 -36 -27 18 -38
6891c8K6L4l7M2o6N0K3J3j8j4k2L6Ql2k1O0kk8Nq2L6Q2p6J4PJk0o5L6K1L8k2K0
$$ -38 -12 22 -15 27 -39 11 34 47 29 15 -7 29 37 5 -16 44 42 14 19 -63 -27 55 -21 -7 0 1 -19 -84 -48 -27 11 -11 9
6924ILk9QM3j0j6l6N3l3J5L6l2rj0N9n6j8M2m4L3Jk4qN1k9jP6r1O8j22N4L8Nj0
$$ 9 12 -17 -9 34 24 8 -28 25 -8 7 43 11 2 -8 51 -5 -23 19 -25 8 9 -15 -23 28 -1 -2 74 -17 51 -71 -17 21 26 16
6958A6J4mk0p2O2nML9p9O3o8rO4j9l9O6K8n0j5O4p2J6KJ7j7j4M2l5QK9L6o6Q4
$$ 16 30 26 6 -66 -4 -9 -5 34 -45 18 -50 -59 5 -14 -53 13 41 -9 -24 40 -32 -16 -14 3 -14 -28 14 -21 -13 16 52 -14 70
6991G0o1MOk4j5M3j1k5oL2mk2RrM1n0M7r7M2J8J5M3q8N1M5p7K9j4l9M2L6m8J1
$$ 70 9 13 19 -5 -20 23 12 -13 -19 13 9 -13 -4 -13 28 -22 25 -72 -30 -12 3 46 -42 9 54 -23 6 -8 -47 -5 31 -17 -6
7024fn2N0M3K0l7j3J1m2NJ9JL1m3K3M3l3kl6J0O3p4JpLO0J1n5J5L7p5j7J4P3k5
$$ -6 -58 -8 35 55 18 5 16 -26 -21 -2 -1 30 -13 10 53 20 18 -18 -8 55 -19 -18 -25 -22 38 49 -6 9 46 -29 -46 -32 41 16
7058A6J1n2M4n8K0O5q1JP2M5j13KmJ4J0m8J14k7m7K7k9K3j2mM9l1K1J0m3L9m3
$$ 16 27 -25 19 -39 -19 46 -35 -34 38 83 -30 -28 -32 -18 -8 -56 58 31 -16 11 -18 5 -7 -11 38 7 28 38 -5 34 -9
7089ioN4k2Jl7j0L6j7P0q3M3npM7n8K7M3p6P2m4J5m8RO3n0l4JN4j1n3J4M0k1L1
$$ -9 -15 39 17 18 -19 -29 7 -10 60 -23 20 15 8 55 -3 24 67 -9 63 19 34 -14 -5 58 8 -26 -25 29 18 -35 -21 19 -2 29
7123B9j3LNjl1K0J6J0l5k3n8N9m6J26n9n9L4J6J1K1K2o8L0j9NjK1l8l8M1K0J4
$$ 29 16 19 24 23 -8 12 28 38 3 -20 -78 -19 -65 61 2 -57 -23 -7 4 25 47 -21 9 -10 -5 -6 15 -23 -61 -20 0 14
7155A4j7J2m5K1O0o5LJ4K9p1O2j5K5l2K7m2N5J9m2K6nLKl8JOML9l3o0N9o3L9Q
$$ 14 -3 9 -36 -15 45 -20 -17 -3 26 -45 17 2 27 -5 22 -20 35 54 12 38 33 36 38 0 1 7 11 50 17 -43 16 -47 -8 0
7189@RL5q5M3l2%rK0L2M1Rr5j4R0p7M7K0o6nL4L9o1J3LNn2O4mj6p1M7PL6N6k8
$$ 0 9 44 -41 2 -30 -30 -39 -19 13 54 63 -32 -46 44 -33 14 34 -32 -37 -3 36 -25 -12 -9 -4 -56 8 4 -12 -83 -36 -29 7 63 35
7224C5On7%J5JK5r9K3K5L6RJ1Oq0O8Qj3lK7r0J9L4l4N2m0KOj7K2OJ0K6n7j7L1
$$ 35 41 -16 -16 -1 0 25 -74 -51 -26 10 19 30 36 -44 24 32 19 16 43 -47 -28 6 -28 24 -16 -14 -8 -25 -3 3 13 39 -18 -35 -4
7259do2J9j5P0J2K7k2j6L6j9j9l1J3K5Lo5M4K3J5m1M6rOk5L4n9P0j06L2LLn9P5
$$ -4 -66 -47 -62 8 20 47 25 9 45 26 7 -24 -11 14 17 -48 -4 19 34 -7 39 30 36 11 45 -14 56 -50 -18 -15 -12 -71 4
7292DL1j20Q5JM2n1rk3M8j4n6L2PJ8J2K0l0k6j1L6M8m9K5r0N8K5j5K0K2n7K7k7
$$ 4 35 -85 0 1 43 -8 -17 -40 8 -6 -62 -30 -23 -5 7 27 -3 -29 -40 -4 44 -5 20 -70 -12 13 -2 18 40 -17 10 -17
7324a7P8k8l1l5J0L4J8k3L7J7j29P8n2J01o9O6o5K6p9Q1L9k6m3L2K2o1N6m9K5
$$ -17 61 33 2 -33 -23 11 29 6 43 60 -69 9 -43 58 -11 55 -10 16 -63 18 57 31 -12 20 42 -19 37 -12 13
7353A3m3%L2L9m1j9jM1K3o0N7n9l6P6J7o7M8J7l5Lj9rk2O1kl3RJ3J1K8l3k1L4
$$ 13 -30 -30 2 41 0 -19 -20 21 44 -16 41 -18 -54 22 39 -28 20 37 2 5 -14 -23 -45 16 14 -19 -10 3 14 42 9 -12 22
7386B2j6L7M4q5PNqnj6K8m9N1j2J2k1oJ6K9l1o5O0L7m4l2L7P4q3jk1JQ2l2L6n7
$$ 22 6 43 87 2 9 14 6 1 -15 13 -36 15 3 15 -6 -12 4 33 2 -63 -3 34 -10 -42 -5 69 -14 -15 -36 -35 47 15 51 -6
7420fK8krL4q6m%O6nl4M1k6RlJ5m0OM5j9K4q1%O2L6j5o7K8K9J2J2p2K0N0q4R6
$$ -6 22 20 11 45 -41 -45 -45 21 16 -18 23 -3 6 3 18 -22 -16 29 10 34 -47 -47 15 51 36 -31 -3 26 38 50 -22 -2 48 -36 60
7455F0k8nl6M7m7K0NPJ4n0K1lkK0k4N5n2oJ3l6K4m4M0k2M4n7j4J0m3R2K5K1n3
$$ 60 32 27 -9 38 -9 11 16 23 37 -13 8 5 3 23 -1 54 2 -4 9 -27 -3 -47 -7 -29 15 -42 -56 -46 -89 3 28 49 -4
7488dLJ0l4K6k1K1ljl9N6lKk7L3k0k3jJ54j21m3N0n9Q0m0k1JL7K5l7K6Q9r5m2
$$ -4 -1 9 -25 1 -20 1 -2 -3 -42 14 11 13 -14 19 -1 -24 -25 129 8 -35 15 -44 36 -4 -25 -24 13 38 1 27 116 21 -21
7521b1N7om0j8rK8M5p3MK8l9QqJ03j01L2KK3ql5L0J5l8J9K0m8J5pO7m3J3m9K5
$$ -21 36 30 -10 -28 -37 -9 36 -37 -33 -5 -44 -36 -44 59 -42 -10 -8 15 7 -28 2 17 -21 -2 18 -30 -15 -22 45 2 15 -34 -9
7554im3O0n0J7O8p4oL5l7M8k2M1k2L8r1O3J2n9K5ll3LO5p9L3k9N0J8n1ol8O8k7
$$ -9 -52 8 -42 -25 43 -31 -37 -2 -39 9 -13 28 6 44 -47 16 28 -31 -6 -9 -42 -39 26 -53 -20 -49 1 19 -32 -38 -76 -8 -35
7587c5L4K8j01N5N4l4M5o9j1QPO3l6J1k4O4l9j9L5l9j6J0j0J5N9o2M1%m5MRj4
$$ -35 -1 27 -74 -19 35 1 46 -23 -34 -26 -19 44 8 19 -5 59 20 1 36 -3 -19 -9 -19 -4 55 -7 34 34 -11 -7 2 -12
7619a2k2O3m8M6Kl2l6M2j0J3m6P2mpj2j7J0K7qm0K4kl0O0%q0P0l9Q1r6O2m0o3
$$ -12 -34 29 -19 27 29 -3 -39 3 -7 6 -40 32 28 21 9 -8 2 29 21 -19 5 3 -27 33 33 -47 23 -16 65 -31 31 -9 -72
7652g2Q8k6k1J7k5lJ0n2P8Om8P3o6O0k5k6K9q6O7j7O1M8q0M7L0o6o0J18m8l0R
$$ -72 16 -10 -31 -14 -39 -42 -32 -84 -6 0 -48 25 -41 19 -6 -32 -3 -89 -22 -39 22 70 -10 37 67 1 -59 59 11 -19 -10
7683a0kMK6K2k4J5j3J2n9lO6j3LM2r7N9m4L4o3R2jn2J1rK9j01Q1m0M4K3m8pM7
$$ -10 -12 -8 18 40 16 31 18 30 -29 -32 34 21 24 66 -31 28 -16 18 -45 47 46 -6 5 -4 25 -76 5 -35 9 32 -16 -23 24
7716B4o5O5n1j2OL5M6o7K4J9k3k0PK8n9L2L2L1j6ml6J5J3l7L8k3l2L7lJ1k7M3
$$ 24 -41 24 -27 -39 -33 2 48 -19 5 24 1 -19 -12 16 -43 -11 21 52 36 32 -4 11 24 -13 25 2 -30 7 4 15 -12 31
7748C1l3Lj7j2j2K0L7j0m9j4N8l7N2k1J9n2L3j4J8J8ql9J2QL6J0k5M8o7J8K9o3
$$ 31 -2 1 -16 -28 -40 -20 17 7 -42 -56 2 -35 17 -4 15 -37 -4 -18 0 18 10 -29 -17 -9 27 37 12 60 -7 11 40 -23
7780b3M0M9p3K5k6l6O1m2P0m4m4O0pKO9j32O0M9p1J0K7j7L4j23Q4l2J7Q0q0L7
$$ -23 17 66 -7 18 -8 -44 17 -25 45 1 -43 17 10 12 81 -51 9 58 -13 -3 24 7 41 -82 2 -30 -13 67 -13 24
7810B4j7M4q2M4M7p4J0pL4mk0jn3J4L5O6o7M7j02K9Q0o6K6ON5m5k3J2n5M3m5P1
$$ 24 7 51 -31 13 60 -14 -4 -11 23 19 -1 -2 -55 -41 -6 60 -7 40 -62 -33 47 -19 7 13 68 23 0 12 -43 0 -45 26
7842B6K5k5k5rL5j6pnk0k8L8J0Np2Q9k9oJ4mJ1k3MJ8OmL%l1qN8m4%Ljl8M9k3L4
$$ 26 51 26 1 -8 27 11 4 -1 -21 -49 -11 -1 4 -68 21 -8 -14 0 -4 7 -16 -12 6 12 8 11 11 -20 -28 30 -14 -14 -11 -12 -50 -1 -24 10
7880A0k3J3NJ6L2l0mL8k3J2Jl1j0j1Q3p4n4L6mJ4j1pM3J1p0OJ8k3j0O4nl1L2k1
$$ 10 -13 0 5 21 53 23 19 57 34 46 47 16 6 -5 78 4 -50 -14 -18 -4 -15 -22 21 32 -38 -32 -14 -37 -47 17 12 -19 13 -8
7914hnN1j12L1L2L9k5K6M4k5p3O3rn4L5l8k4P1n4O8nJp0J7O7j8m2L4k6K6l1J3
$$ -8 -13 38 -74 -43 -11 28 3 29 73 48 -25 38 29 -25 10 -28 -52 19 -35 33 28 29 -41 -24 43 25 -17 17 -9 17 -14 -1
7946apn0O0OJ3k4m9L7L2r6Q7lrJ2Nj1J6J2p6M2J1M6l2M2l1j7%p1Q7m0j8oO1M4
$$ -1 -8 -58 2 8 21 -3 -52 -15 17 -79 8 5 -4 8 13 2 18 30 -46 -4 7 53 21 63 32 15 15 -56 31 -9 -27 -33 28 72
7980G2p1L8m2o6J6O9q6Q3%pl4M3l7M4l6NM3o4K6Rk%j6J7Jk8kM9j9o3O5J3pK3r
$$ 72 1 39 -3 -69 -53 16 -70 13 13 6 -28 15 -22 22 -14 -9 34 -30 -4 5 3 3 -13 4 5 -23 -25 24 5 -58 7 20 13 36 27
8015B7k3j0K6k2lj0J7L9l5pjj3J7J0qj3n6J2L5jJ9M4o3L1n6j7Q1mJ4j4j2M9m0
$$ 27 4 -6 20 -2 -5 -15 2 41 6 -1 -2 -15 2 12 4 -9 -65 -53 -18 -19 0 44 -19 12 -44 -61 20 16 30 16 4 53 13
8048A3j7n7K7P2l0RK5k7n3O9m4K3K7j9l7oM9q1O7jM2n5L9j0l3M9p1J9jL5PQp5
$$ 13 -4 -61 -34 38 8 17 42 15 -38 31 -13 10 37 18 -19 -25 24 -57 10 9 51 -4 35 25 -8 41 -30 -11 -12 23 30 38 -37
8081c7J1Q3j34P2J04j32k2P8k9M5k1Rk8l0R9o8pk0rN6kpj3O7r3J6L4K4kj0%m5
$$ -37 -26 57 -77 -5 99 -33 -55 23 -6 39 18 27 -1 -31 68 0 -7 -27 -36 20 18 11 -2 65 -28 -12 22 46 44 34 34 -11
8113a1kK3RK7k3l2oqKQQJ5l5N3k8RJ4ll1K9J2n7lm0N6mJ9j4N0j4o2L7J2k4J3j7
$$ -11 -13 10 19 46 23 -9 -15 -23 -21 -13 -5 10 -25 28 0 9 23 20 -11 18 30 -27 -30 -70 -14 -18 1 -13 37 23 -39 -2 10 -14 -1 -18
8149a8PN3k4m4K5j5J8k4O4l1k1P8m6L6nn4P6q6M5NKj1j9Jj7jM7n8mRM2j0o9R0
$$ -18 -11 42 18 -26 -1 -16 2 -22 42 11 -10 68 22 58 53 -1 75 -11 34 39 41 30 11 12 -5 -6 41 -17 -21 -12 30 20 -49 41
8183D1m3OnKPoN5n1
$$ 41 -2 4 -1 1 8 2 57 6
8191F
$$ Imaginary data points
##PAGE= N=2
##DATA TABLE= (X++(I..I)), XYDATA
0@%%%%%%%%%%%%%%%%mJ2j6J6j6J6j6K0k6K9l1L6m1M4n1N6o2O9p7Q4q9J01j11J21
$$ 0 0 0 0 0 0 0 0 0 0 0 0 0 0 0 0 0 -4 8 -8 8 -8 8 -8 12 -14 15 -16 20 -21 23 -28 28 -34 35 -42 42 -47 54 -57 64
40F4j33J45j57J71j91K11k29K49k73L00l31L66m03M49n03N66o44P37q52J000j194
$$ 64 -69 76 -81 90 -101 110 -119 130 -143 157 -174 192 -211 238 -265 301 -343 394 -458 542 -652
61f52J454j818K348l163M508o972J2262k7383J37052M49924n81381j05031L26003
$$ -652 802 -1016 1332 -1831 2677 -4295 7967 -19416 117636 567560 -13821 -118852 207151
74B07151m53904P5944O01935l97238l61270M14576j13397j43798M78498j88690
$$ 207151 -246753 -170809 431126 33888 -327382 87194 -26203 -170001 308497 119807
84A19807m71716L69541J11246k91869L31768N1627n14565J99641L16632l18117
$$ 119807 -351909 17632 128878 -162991 168777 220404 -294161 -94520 222112 -96005
94i6005Q1083K28993m04475j1866M31203j86432j54379K60005k03063j62868L91261
$$ -96005 -14922 214071 -190404 -202270 228933 42501 -111878 148127 -54936 -217804 173457
105A73457k7911k94248J80766j449k06794K66268R2619l26929P2873J55406j78734
$$ 173457 145546 -148702 32064 30615 -176179 90089 182708 -144221 -71348 84058 -94676
116i4676J16248J66627k81872l9095K38936j13235l8446J79586j71715j23435
$$ -94676 21572 188199 -93673 -132768 106168 -7067 -45513 134073 -37642 -161077
126a61077K43070j3043j44826J29716m0090j50611J78689P1085j75459N6605N3664
$$ -161077 81993 68950 -75876 53840 13750 -136861 41828 112913 -62546 -5941 47723
137D7723j35719R1970J10815j63034j1484J13766r0493O179J22636j08206o8992
$$ 47723 -87996 3974 114789 -48245 -59729 54037 -36456 -30277 92359 -15847 -84839
148h4839J26547k5194n4795R6876m4849r4283J02938K3406q5375N7877Q986r2968
$$ -84839 41708 16514 -38281 58595 13746 -80537 22401 45807 -39568 18309 27295 -65673
160f5673O6139O1781q7669R832M8220o7901J9088P5052o6264l1470O0429l0519
$$ -65673 466 62247 -25422 -15590 32630 -35271 -16183 58869 -7395 -38865 21564 -8955
172h955j2113O5608l8842m8653N7106k584l2147M7079j4225n3603M8388K3052
$$ -8955 -21068 44540 5698 -42955 14151 11567 -20580 26499 12274 -41329 7059 30111
184C0111m5099K0782Q252m9453L0305M0611m3788j898K6004l5126Q878M2858l4836
$$ 30111 -14988 5794 14046 -35407 -5102 35509 -8279 -10177 15827 -19299 -10421 32437 -2399
197b399j9843L3484j3691o847L5909k1763l1853L1075L714j8438K5727n763l4254
$$ -2399 -22242 11242 -2449 -9296 26613 4850 -27003 4072 7786 -10652 15075 9312 -24942
210b4942K4486J6861k4784J0559O396k9455J3807K7001k0416n196J3398j7992
$$ -24942 -456 16405 -8379 2180 8576 -20879 -7072 19929 -487 -5683 7715 -10277
222a0277J78K5987j1539j4246J3469n993m184J9184q545j6751J2396K93o471J6531
$$ -10277 -10099 15888 4349 -9897 3572 -2421 -6605 12579 4034 -12717 -321 -28 -6499 10032
236A0032k077j9806Q635Q662j0206O145N054j4725L807J2163q176N34M726j2440
$$ 10032 7955 -11851 -3216 5446 -4760 1385 6439 -8286 -4479 7684 -492 42 4768 -7672
250g672K472J3648p283l863P823p590m121J2206k518q603P473k22o244R216J62
$$ -7672 -5200 8448 1165 -2698 5125 -2465 -6586 5620 3102 -5501 1972 1750 -4494 4722 4884
265D884j0911N660L841p433N500M638r259N63O789n147j297O121m421k883P113
$$ 4884 -6027 -367 3474 -3959 1541 6179 -3080 -2517 4272 -875 -2172 3949 -472 -3355 3758
280C758k042m150N162k224m361O096L46n329L210J730m932J362M074l764j290
$$ 3758 1716 -2434 2728 504 -3857 2239 2585 -2744 466 2196 -2736 -1374 2700 -1064 -2354
295b354M542j395k257K804j102k135J851J12m59J068m32j209N55P47j486Q8K299
$$ -2354 2188 793 -1464 1340 238 -1897 -46 66 -393 675 243 -966 -411 336 -1150 -1062 1237
312A237j139j427K118j84k213M22J441n36q91J551M85j614N68J57j202J046M6
$$ 1237 98 -1329 789 605 -1608 -1186 255 -281 -1172 379 864 -750 -182 -25 -1227 -181 -135
329a35p48J737L1j853O59R92j714n47K640k33j715J760O8j948R17O1o49J335Q6
$$ -135 -883 854 885 -968 -309 683 -1031 -1578 1062 829 -886 874 942 -1006 -89 -28 -677 658 744
348G44o03Q38j60j441J79J182q36l55J853k97j326N67n2m42j13O6R87k01o78Q54
$$ 744 141 979 819 -622 -443 739 -97 -452 1401 1104 -222 345 293 -149 -262 -196 791 590 -88 766
368G66n0r21%J94J26J91q1J00J94m42q44J115N73k003J026J702k466J07K156k217
$$ 766 716 -205 -205 -11 115 306 225 325 519 77 -767 348 921 -1082 -56 1646 -820 -713 1443 -774
388g74p37K528q90j232J966p76j858K288K22k322K358N63l168K193J496m081J120
$$ -774 -1511 1017 127 -1105 861 85 -1773 515 737 -1585 773 1336 -1832 361 1857 -2224 -1104
405a104K457l240P78L346l042j078L106j663j523L409j361k387L579m73k700L031
$$ -1104 1353 -1887 -1109 2237 -805 -1883 1223 -440 -1963 1446 85 -2302 1277 804 -1896 1135
421A135n33l295L330J088l082J920P96l380J748K159l275P25K431l395J003L719
$$ 1135 602 -2693 637 1725 -1357 563 1359 -2021 -273 1886 -1389 -664 1767 -1628 -625 3094
437C094m043r25M103k997o76M918k857k793M216j190k891M106j022m424M323J365
$$ 3094 -949 -1874 2229 -768 -1444 3474 617 -2176 2040 850 -2041 2065 1043 -3381 942 2307
453B307m543L572J176o327L595M329n946J485M137o061J42O234m379k672N540
$$ 2307 -2236 1336 2512 -3815 -220 4109 -1837 -352 3785 -2276 -2134 4100 -279 -2951 2589
468B589k973k547O847k432n714N859l57n377O594N92p851M577L617o449K864L808
$$ 2589 -384 -2931 3916 1484 -4230 1629 1272 -4105 2489 3081 -4770 -193 3424 -3025 -161 3647
484C647p324J295O725n364q41N974o425j867Q873m526m790P716l041n560Q722
$$ 3647 -3677 -2382 4343 -1021 -1862 4112 -2313 -4180 4693 167 -4623 3093 52 -5508 3214
499C214jq425N444K622p277N318M035r477K813O522q095J689P366r211j493J0385
$$ 3214 3213 -5212 232 2854 -4423 895 4930 -4547 -1734 4788 -3307 -1618 5748 -3463 -4956 5429
515E429n197m581Q700l916o591R677K61q702O468J333q388P428M162j0763L250
$$ 5429 232 -4349 4351 435 -6156 3521 3782 -4920 1548 2881 -5507 1921 6083 -4680 -1430
530a430O091q408K509Q037r093k810R602l863l719P994m777o304R172Jo357O669
$$ -1430 4661 -3747 -1238 6799 -2294 -5104 4498 635 -3084 4910 133 -6171 3001 3002 -3355 3314
546C314j199q220P852L739q855K812L937p618L048P474p492k126O037m848P9Q015
$$ 3314 2115 -6105 1747 5486 -3369 -557 3380 -4238 -1190 6284 -1208 -3334 2703 -2145 -2066 5949
562E949o078m345P146k903l178P991l172p499P081K079o057N332R40r169M565
$$ 5949 -129 -4474 2672 -231 -3409 4582 1410 -6089 992 3071 -2986 2346 3286 -5883 -1318
577a318N837p001K115M195q486J626Q544o222k676O435n057k420R405k545p046
$$ -1318 4519 -2482 -367 3828 -4658 -3032 5512 -710 -3386 3049 -2008 -4428 4977 2432 -4614
592d614O110n74n593P562O48q834M876L738o804M014M011q901J190P936n429j710
$$ -4614 1496 922 -4671 2891 3539 -5295 -419 3319 -3485 529 4540 -4361 -3171 4765 -664 -2374
608b374O552n262l453Q375k012n417N431j175m297O575J90o707L607J816m982
$$ -2374 4178 -1084 -4537 3838 1826 -3591 1840 665 -3632 2943 3133 -3574 33 1849 -3133
623c133M445K998p315J207M978m703J175M638o465j236O835k977j776N029m431
$$ -3133 1312 4310 -3005 -1798 3180 -1523 -348 4290 -2175 -3411 3424 447 -1329 3700 -731
638g31l566O981m86m501M388j432n156O246K166o545K577J833n577M452M327p315
$$ -731 -4297 2684 2198 -2303 2085 653 -4503 1743 3909 -2636 -59 1774 -3803 649 4976 -2339
654b339K20M661m968J364O494o455l542P108k311l298O960k938o702O747J806
$$ -2339 -2119 2542 -2426 -1062 5432 -1023 -4565 2543 232 -3066 3894 956 -5746 1001 2807
669B807n764M602O95p295M266M830o233J391M003o839R10P461n463k837O589m144
$$ 2807 -2957 1645 2340 -4955 -689 4141 -2092 -701 3302 -3537 -2627 4834 -629 -3466 3123 -1021
685a021l137Q071k002o211N636M6n222N736J481p318L396L820o121K564M584p206
$$ -1021 -4158 3913 1911 -4300 1336 1382 -3840 1896 3377 -3941 -545 3275 -2846 -282 4302 -2904
701b904Q3O896m713j669O081m351l345O806j358m571N096p37n059N549J503o581
$$ -2904 -2821 4075 -638 -2307 3774 -577 -3922 2884 1526 -3045 2051 1314 -3745 1804 3307 -3274
717c274L366L059o113K592M749o108m24N364l912j258N220l270l148N387j176
$$ -3274 92 3151 -2962 -370 4379 -1729 -2153 3211 -701 -1959 3261 -9 -3157 2230 1054
732A054l827M756k88n174M395J945n280K380K605m718J101L792l596p21L558k712
$$ 1054 -2773 1983 1695 -3479 916 2861 -2419 -39 2566 -2152 -1051 2741 -855 -1576 1982 -730
748g30j094M062k137k497L769r38k759L506j00l371K488J159k762J272J412k495
$$ -730 -1824 2238 101 -2396 1373 435 -2324 1182 1082 -2289 199 1358 -1404 -132 1280 -1215
764a215O06J777j957J52J645k033J82K050j913m68K258j331q20K016o05j322J403
$$ -1215 -609 1168 -789 -637 1008 -1025 -843 1207 -706 -1174 1084 -247 -1067 949 344 -978 425
781D25n1j147J226k30j280J598N9j759J671L92k259J328J346j982L93J204j413
$$ 425 374 -773 453 223 -1057 541 600 -1159 512 904 -1355 -27 1319 -663 -270 934 -479
798d79M0J436j106m25J559j170n14K127j193j436K015l30j486J584K07j687R02
$$ -479 -439 997 -109 -534 1025 -145 -659 1468 275 -1161 854 524 -962 622 829 -858 44
815D4Q00j297M45R02j442L58J345j392M2J299j505k29J498q07q13J157k29q61
$$ 44 844 -453 -8 894 -548 -190 1155 -237 -195 1104 -401 -630 868 61 -752 405 176 -685
833f85R34J31q74N98J38p40P84J55j128P12L24j100O27O12j024J11Q37p00j18
$$ -685 249 380 -494 104 242 -498 286 441 -687 25 349 -751 -124 488 -536 -425 412 -288 -406
852d06P63o35k95R28m73m23R78n81o50J205l18q66R06J87r58O59M31j007K23P83
$$ -406 357 -278 -573 355 -118 -541 437 -144 -794 411 93 -773 133 320 -638 21 452 -555 -332 451
872D51q66J57Q50q76j51J030p30l03R86m50n18Q59j34p11O28Q9o81M41L51o87
$$ 451 -415 -258 592 -284 -435 595 -135 -438 548 98 -420 439 305 -406 222 311 -370 71 422 -265
892b65L51L80o56K43M53o42J78M74n66m7N38l15k87M41j13l35M11Q0l76L01j0
$$ -265 86 466 -190 53 506 -136 42 516 -50 -97 441 126 -161 280 167 -168 243 323 -53 248 238
913B38l95K99m1l50M48K2m93K86K45n26R8M32l58j05M25l34k14M94l69j19M95
$$ 238 -157 142 101 -249 199 221 -272 14 259 -267 -169 263 -95 -200 225 -109 -323 171 -198 -317 178
934A78l83j86N84k78m48O62L4o93L59M60o09J5M62n10N6M13m45J43M29n38J01
$$ 178 -205 -391 193 -85 -533 129 163 -530 -171 289 -320 -305 157 -353 -297 116 -329 -186 243 -295 -194
955a94N11m55l30O59j02o00O65J83o77L11L00n45L50J34o02O07K41o91L13L90
$$ -194 317 -138 -468 191 89 -511 154 337 -340 -29 271 -274 76 210 -392 215 456 -235 78 468
975D68o94j40Q94l98n47P92j33n81P35j00n44O39r1o59Q46L9r46M11O20r06J19
$$ 468 -226 -366 528 130 -417 375 242 -339 396 296 -248 391 300 -359 487 526 -420 -9 611 -295 -176
996a76R27q09m41J135n16m43Q41m89n33R20k16o32Q13j24r80Q81N40j176L66P41
$$ -176 751 -58 -499 636 120 -323 518 29 -504 416 200 -432 381 257 -723 158 698 -478 -112 629
1016F29j139J36J040r74j98P63o52O7R38p05n87R45k80o88J136j2j410Q98N82
$$ 629 -510 -374 666 -308 -506 257 -395 -328 610 -95 -682 263 -17 -705 431 419 -991 -93 489
1035D89j037N72L53j095M12Q09p95J52N63r24J2J253p64p43J161n27p02J435j27
$$ 489 -548 24 377 -718 -306 503 -292 -140 423 -501 -489 764 0 -743 418 -109 -811 624 497
1054D97j161P87N1o61Q95O1j073O07M92q57N83N99j442J86J294r31o9R23j132
$$ 497 -664 123 174 -487 408 469 -604 3 495 -362 221 820 -622 -436 858 -73 -142 781 -351
1073c51j61J316n65m86Q10p66l92J535m56j148J030j29j131J566K20j788Q92O05
$$ -351 -512 804 239 -247 563 -203 -595 940 484 -664 366 237 -894 672 892 -896 -4 601
1091F01j275J042P03j920L12J326j238L24J332j883n06K308r84j040J974j159
$$ 601 -674 368 1071 -849 -537 789 -449 -125 1207 -676 -1182 1126 142 -898 1076 -83
1107h3j584K582n2k113J647J25k148J948J130k652P67J427k284P71K289k677l87
$$ -83 -1667 915 863 -1250 397 522 -1626 322 1452 -1200 -433 994 -1290 -519 1770 -907 -1294
1124a294K659j799q26K878j646j910K992m07k223K471j44k794K423J097l017J502
$$ -1294 1365 -434 -1260 1618 -28 -1938 1054 647 -1576 895 751 -2043 380 1477 -1540 -38
1140c8J512l141J341K415l183j4K814k357n53L259k171j722L301q73k192L020
$$ -38 1474 -1667 -326 2089 -1094 -1108 1706 -651 -1204 2055 -116 -1838 1463 590 -1602 1418
1156A418o71k908L023P45l263K061J065l460J875K492l414J92K605k731M3L328
$$ 1418 747 -2161 862 1607 -1656 405 1470 -1990 -115 2377 -1037 -845 1760 -971 -928 2400
1172B400k532j635L230j433j579L580j266l164L108N04k853K569O74l779J793
$$ 2400 -132 -1767 1463 30 -1549 2031 765 -2399 709 1213 -1640 929 1603 -2176 -383
1187c83K346k904P25K021l470L80L554k580r22K919k433j262M012j180k757K589
$$ -383 1963 -941 -216 1805 -1665 -1285 2269 -311 -1233 1686 -747 -2009 2003 823 -1934 655
1203F55k63k349L009N19l513J651J338k559J803J679l591N66K608k345J22K555
$$ 655 392 -1957 1052 1571 -1942 -291 1047 -1512 291 1970 -1621 -1055 1553 -792 -670 1885
1219A885k735j053L228j042j475K430j280k015L030m1k313K175m8k721K511J246
$$ 1885 -850 -1903 1325 283 -1192 1238 -42 -2057 973 932 -1381 794 746 -1975 536 1782
1235A782k969R18J497k523R02K336k476m75K329j797l18K640j955j420K819r10
$$ 1782 -1187 -269 1228 -1295 -393 1943 -533 -1008 1321 -476 -794 1846 -109 -1529 1290 380
1251C80j695K601n40k403K190P29k361J408R66k647J181J785k410L97J762k291
$$ 380 -1315 1286 746 -1657 533 1262 -1099 309 1275 -1372 -191 1594 -816 -419 1343 -948
1267i48J99K436k015p56K227j229j084K418p79j829K027m4j739J768J54k200J572
$$ -948 -749 1687 -328 -1084 1143 -86 -1170 1248 469 -1360 667 623 -1116 652 806 -1394 178
1284A78P71k001J145R50k211O98J705j761j04J636j576m08K144j298r34J880r27
$$ 178 949 -1052 93 1043 -1168 -470 1235 -526 -630 1006 -570 -978 1166 -132 -1066 814 -113
1301a13j105K103m78j651J695O6j759J525O14k026Q69J123j823P11J446k017J34
$$ -113 -1218 885 407 -1244 451 517 -1242 283 897 -1129 -260 863 -960 -249 1197 -820 -686
1318f86J875j597l70K010j381r97K111o17j471J848j32j868J663N50j984J156
$$ -686 1189 -408 -778 1232 -149 -1146 965 348 -1123 725 593 -1275 388 938 -1046 110
1334A10R21j913Q13J293j759Q0J605j437m40J838j111r37J860o67j228J685j29
$$ 110 1031 -882 -69 1224 -535 -455 1150 -287 -727 1111 0 -937 923 256 -972 713 584
1351E84j530J350L60j564R25P87j572M67J110j331M2J219j065l57J379p56p57
$$ 584 -946 404 764 -800 125 912 -660 -193 917 -414 -372 847 -218 -575 804 48 -709
1368g09J299m11r70J082K4j087R08L61j056M82O35j058K89P73q98q4Q90o55l45
$$ -709 590 179 -791 291 315 -772 136 497 -559 -77 558 -500 -211 562 -336 -420 470 -185 -530
1387e30R16l70o44P90Oo77N84J76p31L53L28n00J25N01o56O4O08m41k29N17j62
$$ -530 386 16 -628 162 168 -509 75 251 -480 -127 201 -299 -174 327 -329 -265 343 -98 -327 190 28
1408B8l78M24P2k94N8K64k84L9K88k24r9K90j74m2K71j36k36K65J29l31M8K64
$$ 28 -350 74 146 -148 -90 174 -110 -71 217 -7 -106 184 10 -32 239 103 -133 132 261 -70 -22 242
1430B42k32j58L92j23k29K29Pj29R9J8j15R7O4k15N8K21k25j17K75j32j03J65
$$ 242 10 -148 244 121 -108 121 128 -1 98 116 1 98 162 -53 5 226 1 -116 159 27 -76 89
1452H9P1k58J12J22k26L2J68j66LJ26j83M4J76k68M0J90j59n2J13j7p0J1J07p4
$$ 89 160 -98 14 136 -90 -58 110 -56 -53 73 -110 -66 110 -158 -118 72 -87 -139 -26 -43 -113 -102 5 -69
1476f9mM9j28J66p3j22J62j0j33Q1J46j34k8Q8K4o5l1N8k0J6n3m2J50m2r3J75
$$ -69 -73 -24 -152 14 -59 -181 -19 -29 -162 -81 65 -69 -97 -9 15 -50 -81 -23 -43 -27 -80 -122 28 -14 -107 68
1502F8k5j50P7P7k6l9J12K1j69J38ko4N0j6k2O1o7K1K9j8l4m7J28j7j33J68O0
$$ 68 43 -107 -30 47 21 -18 94 115 -54 84 82 18 68 52 30 91 24 45 74 56 22 -25 103 86 -47 121 181
1529A81j20m3P6o9j4Q2j3p1N5l0n8J36j02r9J57l3j77K14n2j52Q8O9j14Q2Qj22
$$ 181 61 18 94 25 11 93 80 9 64 34 -24 112 10 -89 68 35 -142 72 20 -132 -44 25 -89 -7 1 -121
1555a21L2J75j83l1J90k71j7K79j15j51L31j21j51K15p6k53L09L1l84L21J48l84
$$ -121 -89 86 -97 -128 62 -209 -226 53 -62 -213 118 -3 -154 61 -15 -268 41 72 -312 9 157 -227
1577b27J75K68l52N5L08l57j9L74l42j11N10k64l34N45j68m16N42M0n19L87J77
$$ -227 -52 216 -136 -81 227 -130 -149 225 -117 -228 282 18 -316 229 61 -355 187 227 -292 95 272
1598B72n95L07M11o28J15M82n15J4N44m13k78O02j85l76O75k06o42N92J68o36
$$ 272 -323 -16 395 -233 -118 364 -151 -137 407 -6 -284 318 133 -243 432 226 -416 176 344 -292
1618b92M96J74p02L29N05o47J34N76p89n1P71m72l29O84m05m41Q56j52p00O67
$$ -292 204 378 -324 5 510 -137 -3 573 -216 -267 504 32 -297 387 -18 -459 397 245 -455 212
1638B12l9o72O51L25r90M23N13q27J30P97p78j94Q37m31l51Q36m74m97Q08k10
$$ 212 173 -499 152 477 -513 -90 423 -404 -274 523 -255 -449 388 -43 -394 442 -32 -529 279 69
1658F9n71O62P0q30O81L81r41K79O18q09J57P43o86k81Q04l97l40P81l22o60Q76
$$ 69 -502 160 230 -600 81 462 -479 -200 418 -391 -234 509 -177 -458 346 -51 -391 390 68 -592 284
1679B84mp24O53M5q03N81M75p66R5N21o66J55P23n92l05O23k69k48P16k25p39
$$ 284 280 -444 209 254 -549 32 507 -259 -164 357 -309 -154 569 -23 -328 295 26 -222 494 269 -470
1700d70O22J76n64N29L5p49L28M73l34j7L07n60m3O86k46k82M13m26k71O76lm43
$$ -470 152 328 -236 293 328 -421 -93 380 46 29 336 -224 -267 419 173 -109 304 -122 -393 283 280 -163
1722a63Q7J10l10L74K88n03r0K05j44J82K11l62k08L38o8o9K34k00k53K44K93
$$ -163 -76 34 -276 98 386 -117 -207 -2 -146 36 247 -115 -323 15 -53 -122 112 -88 -341 -97 196
1743A96j59rm5k16J43J60p6k2n1o6J31J33p5j44LP0KR2q5j00N1lJ19j8o4j20J71
$$ 196 37 28 -17 -233 -90 70 -6 -28 -79 -145 -14 119 44 -100 -97 -27 -25 67 -18 -118 -67 -70 49 31 -33 -153 18
1770A8l9P5M8k21N2L7L5Q2m9q3j0K06lj36Q3k9j95K66J53k93k5J46j19J09P1j85
$$ 18 -21 54 102 -119 -67 -30 5 87 38 -45 -55 151 148 12 95 66 -129 137 290 -3 -28 118 -1 108 179 -6
1796fp6J03L2J02J6j55k15K70J64k09K1r3j33J55K56j64q8m4m0R9K52j88j89P7
$$ -6 -82 21 53 155 171 16 -199 71 235 26 47 -46 -179 -24 232 68 -20 -64 -104 -5 247 59 -130 -53
1820e3o4P3J56p3j86j3R5N0O0l5k33P4J46o7P7nj29o7K74%j07l1p2j8J45K8j45
$$ -53 -117 -44 112 39 -147 -160 -65 -15 45 10 -223 -149 -3 -70 7 2 -127 -194 80 80 -27 -58 -130 -148 -3 25 -120
1847a20j9J30r2J35L8j71l9J80o5j7J19q8j19J66J4m8P6m3j33J55K1j19jQ0p2
$$ -120 -139 -9 -101 34 72 -99 -138 42 -23 -40 79 -9 -128 38 52 4 80 37 -96 59 80 -39 -40 40 -32
1872c2L9K21j86j10J51j5o0R6L3k43J43P4o2K3J9k23J71R8j29J0M6q0K4J42N3
$$ -32 7 228 42 -68 83 68 8 104 137 -106 37 111 49 72 91 -132 39 137 8 18 64 -16 8 150 203
1897B03k36J6K1j04J66M5j87ML9m8J10Q5k07m7J33j0qP5r5q8R0P3n1j2k6l7Q4
$$ 203 -33 -17 4 -100 66 111 -76 -72 -33 -81 29 114 -93 -140 -7 -17 -25 50 -45 -133 -43 30 -21 -33 -59 -96 -12
1924a2pm3l2O9p0J7J37j10p8J33m8p9J67p1j12J48pl2J17p1j62J41R7j54j7J43
$$ -12 -19 -62 -94 -25 -95 -78 59 -51 -129 4 -44 -123 44 -27 -139 9 2 -30 87 16 -146 -5 92 -62 -79 64
1950F4j05p1J55j9q0O1M1n2M2L1j52J61K8j74N4Q6n5k9J13r6n1J20Rj58J04O8
$$ 64 -41 -112 43 24 -56 5 46 -6 36 67 -85 76 104 -70 -16 70 15 -14 99 3 -48 72 81 -77 27 95
1976I5j03J4J07j01l7J58j09j49K40m4j41J35M0k21Q8J34j78K8R4n2n2J47o3n0
$$ 95 -8 6 113 12 -25 133 24 -125 115 71 -70 65 105 -116 -28 106 -72 -44 50 -2 -54 93 30 -20
2000b0R8o7p7J23m3j24R5P8k18M0J96j84j7J59j26qJ30j10o4J98j17q3J44rq5
$$ -20 78 11 -66 57 14 -110 -15 63 -155 -115 81 -103 -120 39 -87 -95 35 -75 -139 59 -58 -141 3 -6 -91
2025i1M9P9j60J14N8j21J9M3q5J15J9j23P2P6p5K1M4m3p7J88q9k9K4l1p6J60p7
$$ -91 -42 37 -123 -9 49 -72 -53 -10 -95 20 39 -84 -12 64 -11 10 54 11 -66 122 33 4 28 -3 -79 81 4
2052DQK4k2q2J09R4j15l7J14n9k6J03j01n0P6j0p7J04k0n6J03k3o5N6l6l2m5J47
$$ 4 12 36 14 -68 41 135 20 -17 97 38 12 115 14 -36 40 30 -47 57 37 -19 84 61 -4 52 16 -16 -61 86
2080H6p9l4L4p5P3N1q2L0P5j66M4R6q9ML0l3l7L3rl9J00m0o5R5q9o7K06k5j08
$$ 86 7 -27 7 -68 5 56 -26 4 79 -87 -43 53 -36 -32 -2 -35 -72 -39 -48 -87 13 -27 -92 3 -86 -153 53 28 -80
2109h0N2K2j08K3P8Lk5L7p8k3J21Pq3M7l5q1J62L6j44R3K3q3L7O6m5m8P3k5k7
$$ -80 -28 -6 -114 -91 -13 -10 -35 2 -76 -99 22 29 -54 -7 -42 -123 39 75 -69 24 47 -36 1 67 22 -26 47 22 -5
2138eL4M3j28J33r6J6Q1M3j23k3Q4r7L7P2p0J7M0n3k5O1rJ5ko7L3OJ8j1K8Ml5
$$ -5 29 72 -56 77 -19 -3 78 121 -2 -25 59 -38 -1 71 1 18 58 5 -20 41 32 47 45 -22 11 17 35 24 52 56 21
2169B1j5k0Q0r6N2l7M6n4P7n9m8pJ01o5K1j5o6M4J10l2q9L4j9k6Q4Lj36J01J7
$$ 21 6 -14 66 -30 22 -15 31 -23 54 -5 -53 -60 41 -24 -3 -18 -84 -40 70 38 -51 -17 -36 -62 22 25 -111 -10 7
2198Gj37J28k8r4P4O5j07O0J02k11K5J54k3q5J36j58p5K44l8j50J54j6j72K68
$$ 7 -130 -2 -30 -124 -50 15 -92 -32 70 -141 -116 38 15 -70 66 -92 -167 77 39 -111 43 27 -145 123
2222A23O1k28j6J08j48J02K46k85j15K74n8j23K60j81j97K71K5j74J66Ml08J71
$$ 123 184 -44 -60 48 -100 2 248 -37 -152 122 64 -59 201 20 -177 94 119 -55 111 115 -193 -22
2244b2K82l37L4J19k43R3K66j00k56K18j08r1L57n9l68J93J53l07K97J33n14J53
$$ -22 260 -77 -43 76 -167 -74 192 92 -164 54 -54 -145 212 153 -215 -22 131 -176 121 254 -260 -107
2266a07K70k29RL11m28l3M17k06j66K76j35k79M84o4l64J91J06l06K76K12m41
$$ -107 163 -66 -57 254 -174 -207 210 4 -162 114 -21 -300 184 120 -244 -53 53 -253 23 235 -206
2287b06L8L15l31J11K63l43j31M34j54k05L82j61l58M71R2l36J18N2k69K30K38
$$ -206 -168 147 -184 -73 190 -153 -284 150 -4 -209 173 12 -346 125 217 -119 -1 51 -218 12 250
2308B50l78L1K45l18R5L53k96j74L74r0k01K60q7k91K94P2k04J22Q9m02K58K39
$$ 250 -128 -97 148 -170 -75 278 -18 -192 182 92 -109 151 64 -227 67 139 -65 57 146 -256 2 241
2330B41k69jJ89k68P4K93k66j02J73j16p0L32j46k71K08K8j13K26Ql60J70R4j10
$$ 241 -28 -29 160 -108 -34 259 -7 -109 64 -52 -122 210 64 -207 1 29 -84 142 150 -210 -40 54 -56
2353e6Q6J42l24R2K07k14QJ68k40J7K96j73j13J69r0j26L03j01k02J91l2j82K04
$$ -56 30 172 -152 -60 147 -67 -59 109 -131 -114 182 9 -104 65 -25 -151 152 51 -151 40 8 -174 30
2376C0M1k47R9Q0r5M5J71l28rL52k02j1J72j61n8K02n3j63J50m5k00K68J04k72
$$ 30 71 -176 -77 3 -92 -47 124 -204 -213 139 -63 -74 98 -63 -121 81 28 -135 15 -30 -230 38 142 -130
2400a30J05R0j99J54J15k42L2J54j08M0J60k09p4K16k7j14J92j12j75K18M8j68
$$ -130 -25 65 -134 20 135 -107 -75 79 -29 11 171 -38 -112 104 77 -37 155 43 -132 86 134 -34
2422c4J23mk36J13K23k02K8O9j58P3J98k01q1J95j83M3J76j59q8K02r9j47K42
$$ -34 89 85 -151 -38 185 -17 11 80 -78 -5 193 -8 -89 106 -77 -34 142 -17 -105 97 -2 -149 93
2445I3k3k32J73O1j33N8J20k02j3K48k27P8M6j48j8J78p0j12J49m9j54K33kk00
$$ 93 70 -162 11 72 -61 -3 117 -85 -98 150 -77 1 47 -101 -119 59 -11 -123 26 -23 -177 56 54 -146
2469a46J02R9j05M0N5j27P3P2p5k2J24k18M9J81m9j56J82q9j04J05R5j53J34k8
$$ -146 -44 55 -50 -10 45 -82 -9 63 -12 -34 90 -128 -79 102 53 -103 79 -10 -114 -9 86 -67 67 39
2493C9m3M6l0j4L2O0p8K1J13j09j14J71r9MJ0M2m5J8J01j20O6K4j00J8N6j16O4
$$ 39 -4 42 12 -2 30 90 12 33 146 37 -77 94 -5 -1 9 51 6 24 125 5 71 95 -5 13 69 -47 17
2520A7N5j06o5J34k2j04J41Nj29M4N9rj1K5r6N9Kk5J9K0kl8lK6k7J0j3K0j4Q3
$$ 17 72 -34 -99 35 13 -91 50 55 -74 -30 29 20 9 34 -62 -3 -1 -26 -7 13 11 -27 -30 -4 -31 -21 -34 -14 -28 55
2550E5q0m0P5l0J3Lnl1M9N0m7m8O6j02P3mKm1L9l3KKJ1O7m1l2OPM0km6L9Kk7J1
$$ 55 -25 -65 10 -20 -7 -4 -9 -40 9 59 12 -36 30 -72 1 -3 -1 -42 -3 -36 -34 -32 -21 46 5 -27 -21 -14 26 24 -22 17 19 -8 3
2585CK1J7o6K3L6l8K9R%l5oL3M6nj1j4j8K8j5o6qP0MK0l6Pm4P9l9k3JJ3o1R2m9
$$ 3 24 41 -25 -2 34 -4 25 34 34 -1 -7 26 72 67 56 42 24 52 37 -29 -37 33 37 57 21 28 -16 63 24 1 2 15 -46 46 -3
2620cl0JL7l8L0j4j9K5j0K7m4K4j2j3m5M0N6q2N2N7q0M9qJl7N9j5k3L3m1P9n1
$$ -3 -33 -32 5 -33 -3 -17 -36 -11 -21 6 -38 -14 -26 -39 -84 -44 12 -70 -18 39 -41 8 0 1 -36 23 8 -15 18 -23 56 5
2652Eo7k8N1l1M5pl0M5kL9n6lM0q4J07j8m8N5O7j45P8J1l8m4R4k6l5L0J7jJ4j6
$$ 5 -62 -90 -39 -70 -25 -32 -62 -17 -19 20 -36 -39 1 -83 24 6 -42 13 80 -65 13 24 -14 -58 36 10 -25 5 22 21 35 19
2684A9o8J18K1p4O4rl6p6J10lp5Q6l3m2K3N8j22Q2O2j60J18l5o4J7O9j04K1J09
$$ 19 -49 69 90 16 80 71 35 -41 69 66 -9 77 44 2 25 83 -39 43 105 -55 63 28 -36 -19 50 -54 -33 76
2712G6j22k1J45q4n3P2n3j0Q5q6o1Q8k4QL2L8p2J7P1p5l9K04j93j6J12k4j35J15
$$ 76 -46 -67 78 -6 -59 13 -40 -50 35 -51 -112 -24 -48 -40 -8 30 -42 -25 46 -29 -68 136 -57 -73 39 15 -120 -5
2740eL3j05J20K3j52Q5Q2j11NJ12j86P5J12k1m5j6l2m9J03K5j01J01n5k6Q4k6
$$ -5 28 -77 43 66 -86 -1 81 -30 -25 87 -99 -24 88 67 22 6 -26 -75 28 53 -48 53 -2 -28 56 30
2766C0o9oK7K0K4N9k3m1n3P9N8k2o6o7J86q5n5Q9q1m9J10ql5M1l4m9P3k5l8J9
$$ 30 -39 -45 -18 2 26 85 62 21 -32 47 105 83 17 -50 136 51 -4 85 4 -45 65 57 22 63 29 -20 53 28 -10 9
2796IL3p5O4N7q2n4J33j69R1K7q9m6J21j1n2P6q1n9R3K7m1O1p2p0J08L5p0%J5
$$ 9 42 -33 31 88 6 -48 85 -84 7 34 -55 -101 20 9 -43 33 -48 -107 -14 13 -28 33 -39 -109 -1 34 -36 -36 -21
2825b1L6j1M0r7o8J37n8RJ54j65l4J66j9j23O6j3p5J02O3j28NJ6o0P1J38j91Q2
$$ -21 15 4 44 -53 -121 16 -42 -33 121 -44 -78 88 69 -54 12 -1 -76 26 89 -39 -34 -18 -78 -7 131 -60 22
2852B2mn4J7J24j05j13J71q3N0J16n5k07Q0Q3l6P3J9j98Q5J31o5j1R9j82l3J73
$$ 22 18 -36 -19 105 0 -113 58 -25 25 141 86 -121 -41 42 6 79 98 -100 -15 116 51 40 139 -43 -76 97
2878I7k6m5O2j11p1J61N0j80R8op8K8J06j48j5R9j53J03J01j24qP8k8p6J60j01
$$ 97 71 26 88 -23 -94 67 117 -63 35 29 -49 -21 85 -63 -78 21 -132 -29 72 -52 -60 18 -10 -86 74 -27
2904b7j12J72Qj00ML7q0M7J09q6J8M3o2l9J55j79l8J10N5n2P1o8j17J47m9l0P6
$$ -27 -139 33 41 -59 -55 -18 -98 -51 58 -28 -10 33 -29 -68 87 -92 -130 -20 35 -17 54 -14 -131 16 -33 -63 13
2931A3k3r6J55M5j33k2O6n4LJ43j02J3Rm6L8L5l5j33J31k8pO0Jj45Q1Q8p2rP8
$$ 13 -10 -106 49 94 -39 -61 5 -49 -46 97 -5 8 17 -29 9 44 9 -124 7 -21 -28 32 33 -112 -31 57 -15 -24 54
2960E4p8J5P6n2j5O6n6J7L0n6k5O0n4j3J39m6j65P9N0r4R1L9q6J0O0o8KJ07j28
$$ 54 -24 -9 67 15 0 66 10 27 57 1 -24 36 -18 -31 108 62 -103 -24 26 -68 23 62 -24 -14 46 -22 -20 87 -41
2989d1k8R1n5j6L3Pk3K2ll4M5m9n9J07M0o8j3N9k6l1Q3r1j5J24m6j01J25l7m9
$$ -41 -69 22 -33 -49 -16 -9 -32 -10 -13 -47 -2 -51 -110 -3 37 -31 -44 15 -11 -42 41 -50 -65 59 13 -88 37 0 -49
3018d9Q2J4q8JP3n6OQ7j33LQ8j2%Rk4k1%M7%oL2j29R7L9k5M9l9j18MJ43m9Lm7
$$ -49 33 47 -41 -40 33 -23 -17 70 -63 -60 28 16 16 25 1 -20 -20 27 27 21 53 -76 21 60 35 84 45 -73 -69 74 25 28 -19
3051a9K6%K1J8pj3L0k9nLo7P6O6j17O1rl4N3k7m1M0M7p0l3KN6p4J9K0j0k5O6p8
$$ -19 7 7 28 46 39 26 56 27 22 25 -42 34 100 -17 44 35 1 54 27 -14 26 73 3 -30 -28 28 -46 -27 -7 -17 -42 24 -54
3084e4K0R5o1p4P5m6KN6m3k4P0l8K4k4j0M8No2N8k9j8L3jJ4pp0P9oM6p8J1k0J5
$$ -54 -34 61 0 -74 1 -45 -43 13 -30 -54 16 -22 2 -22 -32 16 21 -41 17 -12 -30 3 2 16 9 -61 18 12 58 -20 -9 -29 -14
3117a4L7J5o0Q0o1n0O1K8j5J4l1j2qO1rn5L7No4L5O2j8j6M8l4m6K4lJm9M5oMK0
$$ -14 23 38 -22 58 -3 -53 8 36 21 35 4 -8 -16 45 36 -19 18 23 -41 -6 56 38 22 70 36 -10 14 11 12 -37 8 2 6 26
3151B6K8J3Or0j7N0k0O2m6M7m3K1l4L8l8r6J06J2l3J5l9K4o2J3N6m3M0j1K2j8
$$ 26 54 67 73 -17 -34 16 -4 58 12 59 16 37 3 41 3 -93 13 25 -8 7 -32 -8 -70 -57 -1 -44 -4 -15 7 -11
3181a1Ok2J4J0JJ8pr3N7M9l4rQ5l6p8M4L5l2j4L9Mp6N2J8j5L6k4K6n1N1m9l3O0
$$ -11 -5 -27 -13 -3 -2 16 9 -84 -27 22 -12 -21 64 28 -50 -6 29 -3 -17 22 26 -50 2 20 5 41 17 43 -8 43 -6 -39 21
3214B1o4LL1l7K1M4l6L5L3n4l0P3Mj9j2pj3K1K0j0Nk7N7r9kR1o0RM7ro6Q1o0J3
$$ 21 -43 -40 -9 -46 -25 19 -17 18 51 -3 -33 40 44 25 13 6 -7 14 34 24 29 2 59 -40 -42 49 -11 -2 45 36 -30 51 -9 4
3248Dj0J9K3j4Pj6M8q1N5J6Rn8j6%oM9l9mqQq3J12J8m7pM4q5N3oRm6K6k3L8K1
$$ 4 -6 13 36 22 29 13 61 -20 35 51 60 2 -14 -14 -20 29 -10 -14 -22 -14 -97 15 33 -14 -21 23 -62 -9 -15 -6 -52 -26 -49 -11 10
3283A0k1%M4l6j8L1n5%P4q6L7kK8l0L8kj9NK3mJ2Kp0P4qm5RM8J1n6K3M6j42J20
$$ 10 -11 -11 33 -3 -21 10 -45 -45 29 -57 -20 -22 6 -24 14 12 -7 -2 21 17 29 31 -39 35 27 -18 -9 39 50 -6 17 63 -79 41
3317D1p0K5k0J3j7O4N8j46M1k6K6OO5o2j3P2k4m2O3q8L8M3l2l4K0k5l0O6L8p0
$$ 41 -29 -4 -24 -11 -28 36 94 -52 -11 -37 -11 -5 60 -2 -15 57 33 -9 54 -34 4 47 15 -19 1 -24 -54 12 50 -20
3347b0J0L1j05O9P6o7j00J41j10O8N6n0j00J84q4n4O8Oj24J02nn8M1P2n9m2J47
$$ -20 -10 21 -84 -15 61 -6 -106 35 -75 -7 49 -1 -101 83 -1 -55 13 19 -105 -3 -8 -66 -25 47 -12 -54 93
3374I3r6%O1o0o8M4Q3j03J3L9r7R0Q0r3J4Rk5MR4n8m6J19q8RP9r6o1L5qpM1N3
$$ 93 -3 -3 58 -2 -70 -26 57 -46 -33 6 -91 -1 79 -14 0 9 -16 -12 82 24 -22 97 9 18 97 1 -60 -25 -33 -40 1 54
3406E4j42M5O6n7j1R7r1M3O3p6j4PK9q7J49n9m0M8O6j02L0L3q0j1J20q8Q4j6o7
$$ 54 -88 -43 23 -34 -45 52 -39 4 67 -9 -23 -16 13 -74 75 16 -24 24 90 -12 18 51 -29 -40 80 -8 76 60 -7
3435gmP4j6j6n5l6NJ33p4%n1N3k4K4L9j34L3L2K5N0j9j11O1Jj6L1kp6J2M6KL1
$$ -7 -11 63 47 31 -24 -60 -55 78 4 4 -47 6 -18 6 45 -89 -56 -24 1 51 32 -79 -18 -17 -33 -2 -4 -80 -68 -22 -20 11
3467A1nl3mO3M6o3j2n9KN3J7k6N8jn5O3k3NK0j0J3l3Q0j42M7P0j19O6M9l3o1O0
$$ 11 6 -27 -31 32 78 15 3 -56 -54 -1 16 -10 48 47 -8 55 32 37 57 47 60 27 107 -35 12 82 -37 29 78 45 -16 44
3499D4l5j7M0l0k9N8qn2N1rk3J9P6j45M8M4l2KK2n6k4M6P1n4M5r3m4J34l6m1P6
$$ 44 9 -8 32 2 -27 31 23 -29 22 13 -10 9 85 -60 -12 32 0 2 24 -32 -56 -10 61 7 52 -41 -85 49 13 -28 48
3530D8Oj31O1J18j20j9P4j19P7L8m0q1J22k1q4J32p5q9J10N2j30J03J6j04J1N0
$$ 48 54 -77 -16 102 -18 -37 37 -82 -5 33 -7 -88 34 13 -71 61 -14 -103 7 59 -71 32 48 -56 -45 5
3556En0k7J76j47j2J08l2j4K9j4j02J54j5j45J50l2o5L7Q2o1k6P7j6j07Q6l4n9
$$ 5 -45 -72 104 -43 -55 53 21 7 36 22 -80 74 59 -86 64 32 -33 4 86 25 -1 76 60 -47 39 5 -54
3583e4J04J0n6J4ql5N7K5n7Kmj7l6J03o8J4J2k0L3rJ7p0P4n8oj1J05n6LoLo0N8
$$ -54 50 60 4 18 10 -25 32 57 0 2 -2 -19 -55 48 -20 -6 6 -14 19 10 27 -43 31 -27 -33 -44 61 5 8 2 5 -55 3
3616Cm3J9K9M1p5Q9r0k1R9o5M4q3P7o2N0o7L1K2oo9PL3N0l8QnM4l9K4j8lK4J2
$$ 3 -40 -21 8 49 -26 63 -27 -48 51 -14 30 -53 24 -38 12 -55 -24 -2 -8 -77 -70 -37 13 -25 -17 -22 22 -17 7 -11 -14 10 22
3649B2rn9N0k7R4r1M3k8M8n7j9N5K3j1k3JRj8j9M6j5L2j1j5j0J4qK6Jj5K0l8Q
$$ 22 13 -46 4 -23 71 -20 23 -5 43 -14 -33 22 45 34 11 12 21 3 -16 30 15 47 36 21 11 25 17 43 44 29 49 11 19
3682A9j2Oj2nM0l3%M4m5OJ9o6P4n2J2%Kk5L1n0N8L3j12Q8k0J5J3j7j5n1Q4r3K0
$$ 19 7 13 1 -4 36 3 3 47 2 8 27 -39 35 -17 -5 -5 -3 -28 3 -47 11 44 -68 20 0 15 28 11 -4 -55 29 -64 -44
3715d4J1lN0k5l6L3J1J6J3p6J15n0J3l6K3o7J8Qk2O7J5%r5M5KJM9j2m6J8k3kN4
$$ -44 -33 -36 14 -11 -47 -14 -3 13 26 -50 65 15 28 -8 15 -52 -34 -26 -48 19 34 34 -61 -16 -14 -13 36 24 -22 -4 -27 -29 25
3748B5J6l8k2K0rK1k7K2n2N2M5n2K0o3O6mlOl3K4K5Om3J1l2K3oJ8l2K1L6m9QJ4
$$ 25 41 3 -19 1 -8 13 -14 8 -44 8 53 1 21 -42 24 20 17 23 -10 14 39 45 2 13 -19 4 -2 16 -16 5 41 -8 0 14
3782A4k4l4P0l6j0j4M0j8j1J1M7p4O0J7m9L0j5n5N0M4j12J12l3l6Qk2J3J9k4M8
$$ 14 -10 -44 26 -10 -20 -34 6 -12 -23 -12 35 -39 21 38 -11 19 4 -51 -1 43 -69 43 10 -26 -18 -40 -27 -8 -32 16
3812A6K0p1M3l6mL1M0m3j8M3j6olJ6k6jjk8L3K8l1oJ4ko0R9k4J8l3oN2k7kpJj1
$$ 16 36 -35 8 -28 -32 -1 39 -4 -22 21 5 -1 -4 12 -14 -15 -16 -44 -11 17 -14 -20 -6 -8 -68 31 7 25 -8 -14 38 11 9 2 3 -8
3848hJ0%L3p6O7LL5m3Kj2mk5P0K5r7J9M0n2O0pj6j9mJ9L3L6p8rjJ1K2o5L4k0M5
$$ -8 2 2 35 -41 26 29 64 21 23 11 7 -18 52 77 -20 -1 39 -13 47 40 24 5 1 20 53 89 11 2 1 12 34 -31 3 -17 28
3883B8m8J9j6j9K9K9n0j1J3J3Q3k9Pj00M7k9O0l8P3l3k4l8N3M9r0rN7m7K6K3j3
$$ 28 -20 -1 -17 -36 -7 22 -28 -39 -26 -13 70 41 48 -52 -5 -34 26 -12 61 28 4 -34 19 68 -22 -31 26 -21 5 28 15
3914A5m1M2m1K4l7l3O7N2q4K7m1L6j0rP9m7p7J33q1O1n0N4n5K6K3n1P1m2l0K1
$$ 15 -26 16 -25 -1 -38 -71 -4 48 -36 -9 -50 -14 -24 -33 46 -1 -78 55 -26 35 -15 39 -16 10 33 -18 53 11 -19 2
3944BM3o2O5j8oJ5j3mJL3m5n7M1jK1k6kJ0Q4n8l1L1l0M4m9M8n6l3M0k8M0jj9m0
$$ 2 45 -17 48 30 24 39 26 22 23 56 11 -46 -5 -6 15 -11 -13 -3 81 23 -8 23 -7 37 -12 36 -20 -53 -13 -41 -1 -2 -21 -61
3978f1O1L9n5K0L1p0P8m8K4k4N5m2j5O2l3n6O8k5J2P1o8m4N0m3M3O6j31k0P5J8
$$ -61 0 39 -16 4 35 -35 43 -5 19 -5 50 8 -7 55 22 -34 34 9 21 92 24 -20 30 -13 30 96 -35 -55 20 38
4008C8q5O1Jk6k8P5o7P3j04M8K9K7m0m6J6KmL5j8k2PR0j03J02K2j05L4N3j08P4
$$ 38 -47 14 15 -11 -39 36 -31 42 -62 -14 15 42 2 -44 -28 -26 -30 5 -13 -35 -28 62 -41 61 83 -22 12 65 -43 31
4038C1J3n1OR4m8j5O2p5m3L2P9j09R4l1m2J7RKm8O0j04L6J27j82O2P9l2j2qk4
$$ 31 44 -7 -1 93 45 30 92 17 -26 6 85 -24 70 39 -3 14 23 25 -23 37 -67 -31 96 -86 -24 55 23 11 3 -21
4068b1k2O4k0J2jO8j27P9rp0M5L8m7jM8q4kL9J7l7Q8o3m2L4k5J6K3J6m4N8k3J8
$$ -21 -43 21 1 13 12 80 -47 32 23 -47 -2 36 -11 -12 36 -48 -50 -11 6 -31 57 -6 -48 -14 -39 -23 0 16 -28 30 7 25
4100B5r7J14rl3O4o7r3Q7K6J3j5kq3Q7K3k9kk4M2m8P6l4j5J5n0M6N3p4l9J00o8
$$ 25 -72 42 33 0 64 -3 -96 -9 17 30 15 13 -70 17 40 11 9 -15 27 -21 55 21 6 21 -29 17 70 -4 -43 57 -11
4131a1J0pn2O9rO4m7KnK2j6lN5l3Qj0Oj01O5Rl0N4m8J6L3j02L1N7j5k9K7o7k0
$$ -11 -1 -8 -60 9 0 64 17 19 14 36 20 17 72 39 47 37 43 -58 7 16 -14 40 -8 8 41 -61 -30 27 12 -17 10 -57 -77
4164g7O1RJ3L2r0Q7m9K2j6qL6L2J1j05N0m6Q3p2QJ9k3M4j4J8l0o9J22j38R7L2
$$ -77 -16 -7 6 38 -52 35 -14 8 -8 -16 20 52 63 -42 8 -38 45 -27 -19 0 -23 21 7 25 -5 -74 48 -90 7 39
4194C9m0Q1j23J9M7p4R2ql8O5o1J6j8J5Ro2N1k9K2K5j8k2L0k3l2R3l4J0j6k9L0
$$ 39 -1 80 -43 -24 23 -51 41 33 -5 60 -1 15 -3 12 21 -41 10 -19 3 28 10 -12 18 -5 -37 56 22 32 16 -13 17
4225A7lRm5L7p0J18m1J2j1o0J0J8L1m1J6j9Ll2K9Np2OM5L9K4n6L3l3K2K9n1%J7
$$ 17 14 23 -22 15 -55 63 22 34 23 -37 -27 -9 22 -19 -3 -22 -19 -51 -22 -17 -89 -83 -38 1 25 -31 2 -31 -9 20 -31 -31 -14
4258a4M6L6l3k2Rj3l5M8k6j9j4M1Kj2M8j3o5M2k0J7M1m7M8l1l2l0M4N9l4L7r3
$$ -14 32 68 35 13 22 9 -26 22 -4 -23 -37 4 6 -6 42 29 -36 6 -14 3 44 -3 45 14 -18 -48 -4 55 21 58 -35
4289c5PNQM4k3l1O0n6OM3n9O1q0Q0k9j3L3k6j0N3m7J7L1K3o4L0Rp0J2N5p0N1j9
$$ -35 -28 -23 -15 29 6 -25 35 -21 -15 28 -31 30 -50 30 1 -12 21 -5 -15 38 -9 8 39 62 -2 28 37 -33 -21 34 -36 15 -4
4322dJ09r6mJ6J6j5Lm9K3J9j3nk6j8M4JO1n2Rp0O6J6o4O1j0O%j2kom3M9l9NM8
$$ -4 105 9 5 21 37 22 25 -24 -1 18 5 0 -26 -44 0 1 62 10 19 -51 15 31 -33 28 18 24 24 12 10 4 -39 10 -29 -24 24
4357B4l9OM0m4oN5k4m5K2nPL9n4M1M2ll7o3N9K8m0o9L1K8lK1J8j7J9n0J0L0k1
$$ 24 -15 -9 31 -13 -19 36 12 -33 -11 -16 -9 30 -24 17 59 56 19 -44 15 43 3 -66 -35 -7 -10 11 29 12 31 -19 -9 21 0
4390@%m0M8J8m5KN2n4M2j1l8K7oK4Rn9O4l4j5M1o1O3L2r4N5M3m6Pj6M8Kn9j4l0
$$ 0 0 -40 8 26 -19 -17 35 -19 23 12 -26 1 -5 19 28 -31 33 -1 -16 25 -36 27 59 -35 20 63 17 24 8 56 58 -1 -15 -45
4424d5M2LJ3m2N5o6Q4k9j1k4%l0O3on1N2l6lJ6l0O9p0J5k7NR2r0P6Ln1rJ5k8Q
$$ -45 -3 0 13 -29 26 -40 44 15 4 -20 -20 -50 13 7 -44 8 -28 -31 -15 -45 24 -46 -31 -58 -53 39 -51 25 28 -23 -32 -17 -45 -37
4458c7MN1k1kQ1ml8m7K3mJ1k2K0rpn3O2K4n4K7pJ1L0Oj00N7l0o6L9Q3o5K2L3J0
$$ -37 -33 18 -3 -5 76 72 34 -13 10 6 17 -5 15 6 -1 -54 8 32 -22 5 -2 9 39 45 -55 2 -28 -94 -55 28 -37 -15 18 28
4492B8M2o6L8p1M9K5m3Nk4k0K7PkL4J1m6okj3K4l4N9j5QL4j9l1J5mj3l0K3j4l
$$ 28 70 4 42 -29 20 45 2 7 -17 -37 -10 -3 -5 29 40 -6 -12 -14 -27 -3 -37 22 7 15 49 30 -1 14 10 -3 -33 -10 -24 -27
4526b7j4M2j9Lo7J07m2j8J8l6l6Q6l%L5q3K5L4j3QJ6K2k6J0Mm2kj0K1N3j1nj0
$$ -27 -41 1 -18 -15 -82 25 -17 -35 -17 -53 -89 -3 -6 -6 29 -54 -29 5 -8 0 16 38 12 22 26 -16 -18 -28 -7 46 35 30 20
4559B0j8%mqOM0k9lj1NrK3k1J5j9M8j09O8R6l9k7J5n2j6Q8k1m5N1p0kP5n6j7j
$$ 20 2 2 -2 -10 -4 36 7 4 -7 -2 -11 12 -9 6 -13 35 -74 -6 90 51 24 39 -13 -29 59 38 -7 44 -26 -28 47 -9 -26 -27
4593b7J0PK0mJ3r0Q5J8j6OJ5n8J0N0Kl7Rm5K2L8j5l4K0jk2N6l6p3L1P1n2O0m1
$$ -27 -17 -10 10 6 19 -71 14 32 16 22 37 -21 -11 39 41 4 13 -32 -10 28 13 -21 -1 -2 -24 32 -4 -77 -46 25 -27 33 -8
4626hqlmJ6J1p5J00j07Q6l3N5rK4l9L0j9j3K4ln8L4P0p9M1k5j2J2R6p4M5k1l9
$$ -8 -16 -19 -23 -7 4 -71 29 -78 8 -25 30 21 45 6 36 17 4 28 25 -33 1 71 -8 33 8 -4 8 104 30 75 54 15
4658A5m5O1j5QNM5j06P1n7NJ3N6n0KLQnlMM0k9k7l2R9l8j6%lj3m3R6n3l4N0No
$$ 15 -30 31 16 24 29 74 -32 39 -18 -13 0 56 6 8 11 19 14 11 15 55 26 -1 -33 66 28 12 12 9 -4 -47 49 -4 -38 12 17 11
4694A1Qm8Q9j35P9j8P1o5K6k6L0p7N5l5Ol2J06q9L1M3p8j8N1RrJ5lK1j1p2L8p
$$ 11 19 -29 60 -75 4 -14 57 -8 18 -8 22 -55 0 -35 -29 -61 45 -44 -13 30 -48 -66 -15 -6 -15 0 -3 18 7 -65 -27 -34
4726c4l5Q3m1K6j5P9p0M7np4P7Po6N9o6M8l3J8L3l2pj4PM5k6j6oJ7mR%J1o9N5
$$ -34 -69 14 -27 -1 -16 63 -7 40 35 -39 38 45 -21 38 -28 20 -13 5 38 6 -1 -15 -8 37 11 -5 -11 6 2 11 11 22 -47 8
4760HRLJ2q9M1k5M0j0K5j6k7pL0J6l9L0M8q3J5k2j6L9O2m3l7L8n8N1m1M8J7m2
$$ 8 17 20 32 -57 -16 -41 -1 -11 14 -2 -29 -36 -6 10 -29 1 49 -34 -19 -41 -57 -18 44 1 -36 2 -56 -5 -46 2 19 -23
4792b3LJ6J7k0jNm6M8j2J6m9O0L2j08P9m4OJ2kL5l3j9L7o5K5O0p4O3o0J2M5lr
$$ -23 -20 -4 13 -7 -8 -3 -49 -1 -13 3 -46 14 46 -62 17 -27 -21 -9 -11 24 -9 -28 9 -56 -31 29 -45 18 -42 -30 15 12 3
4825CJ7l9J5O1rpk0J8l4l4K2l1N4k4L3K1n3QK8L6k2m5K0j2l6J6K7k5J7k8j7J0
$$ 3 20 -19 -4 57 48 41 21 39 5 -29 -7 -38 16 -8 25 46 -7 1 29 65 43 -2 18 6 -30 -14 13 -12 5 -23 -40 -30
4857c0J8M1n6J1j0N1qm2L3o2M9K0k0L9k4k7K1Pk8J3pk2NL1j2m2J4k4O7J0J1l4
$$ -30 -12 29 -27 -16 -26 25 17 -25 8 -54 -5 15 -5 34 10 -17 4 11 -17 -4 -11 -33 -28 3 -9 -51 -37 -61 6 16 27 -7
4889gkm0O5k8JRK9l1n7O0J0j7K8n1K4k9qJ9O0p0qK0P2n4j4J8LKo7Q5KJ6k7J6j3
$$ -7 -9 -49 16 -12 -11 -2 27 -4 -61 -1 9 -8 20 -31 -7 -36 -44 -25 35 -35 -43 -23 49 -5 -19 -1 2 4 -63 22 24 40 13 29 16
4924A6j8K4krn9R0l5okL5j3lL9km4K8n8L8l7jk0M9mJ6Lk6J7k4k8O8p5K2LK5k2
$$ 16 -2 22 20 11 -48 42 7 1 -1 34 21 18 57 55 11 39 -19 19 -18 -19 -39 10 6 22 25 -1 16 -8 -36 32 -43 -21 -18 7 -15
4959a5K3rj7Q4r2P1o8k1L3j0P3r1O1On2K1O8mpp4M9L7j44Q6kP2r1J6Ll3K0K4K5
$$ -15 8 -1 -18 66 -26 45 -23 -44 -11 -21 52 -39 22 28 -24 -3 65 61 54 -20 29 66 -78 8 6 78 -13 3 6 -27 -7 17 42
4992D2rl6k2M7n4lQ6p0KJ0k3K4J4k4k8L5N6r1Q3k2k4L2oNo%K6k3L6Ln7L8m1J3
$$ 42 33 -3 -25 22 -32 -35 51 -19 -17 -7 -30 -6 8 -16 -44 -9 47 -44 39 17 -7 25 19 24 18 18 44 21 57 60 3 41 0 13
5026A3j8n3M7N0J4o4K4j6n3Q8rl6K2j0K6J3l9l0nJ8M3l2j6K5m6N3J3Qj5j4o0L6
$$ 13 -5 -58 -11 39 53 -11 13 -3 -56 32 23 -13 9 -1 25 38 -1 -31 -36 -18 25 -7 -23 2 -44 9 22 30 15 1 -59 -23
5058b3Pk5k4M6L1o4J06p0O4p8K8N2k5mN7p8L0l1N8m7Nk0L9l3K5j1n0J9lj1Pl9
$$ -23 -16 -41 -65 -19 12 -52 54 -16 48 -30 -2 50 25 21 78 0 30 -1 57 10 15 -5 34 1 26 15 -35 -16 -19 -30 -23 -62
5090f2O3q0R1k4k6J2k5O0L5k8j05Q6oK8ppo7P9l4L9j6J5J7o0P6j3q5Q5l2m0L9
$$ -62 1 -79 12 -12 -38 -26 -51 9 44 16 -89 -3 -9 19 12 5 -62 17 -17 22 6 21 38 -22 54 41 -44 41 9 -31 8
5121Hl3J5N9j8m6K8K7p9O1K8m9O8o6J0j4lJ2l8LJ3J4K0l0o7rN2K7j9K1m5L3N2
$$ 8 -25 -10 49 31 -15 13 40 -39 22 50 1 69 3 13 -1 -4 8 -30 -27 -14 0 20 -10 -77 -86 -34 -7 -26 -5 -50 -17 35
5153C5k4Qm0P4o0Rn2O9k4MlM5On4j0L0p6J18m9j9l6LpO8l0k2O4j3jJ0rj5l2L0
$$ 35 11 19 -21 53 -7 2 -50 19 -5 -1 -4 41 47 -7 -17 13 -63 55 6 -13 -49 -46 -53 15 -15 -37 27 14 13 23 14 -1 -33 -3
5187coL3J0rlj0pj9M7m0k1M5O2p6m4N8j1J3K5n8M7m0QJ4L4l6qKK7nk5J5n1K2R
$$ -3 -9 24 34 25 22 12 5 -14 33 -7 -28 17 79 3 -41 17 6 19 44 -14 33 -7 1 15 49 13 5 7 34 29 4 19 -32 -10 -1
5222aKP4p6ll8O1j1J3o2K0QQk2J5K0j3k6M2j6nj3M1Lm4M9j6J5J5l6j8j9O0l8Q
$$ -1 1 75 -1 -4 -42 19 8 21 -41 -21 -13 -5 -27 -12 8 -5 -31 11 -5 -10 -23 18 21 -23 26 10 25 40 4 -14 -33 27 -11 -3
5256cl3N0q8P8L4p1M1rO7k9k5m9L9k3k0Om8N9L8K9m2m1j7R1l5Pl2j0P4j1l0O0
$$ -3 -36 14 -74 4 38 -33 8 -1 66 37 12 -37 2 -21 -41 -35 -83 -24 14 43 1 -40 -57 34 -1 6 -26 -36 38 27 -3 57
5288E7l2J8j3k1m2L4l8M9J1l0LN7o4L4j5m1MJ18p2L4n7O2p6j7M3rl4J3Kj8P1m3
$$ 57 25 43 30 9 -33 1 -37 12 23 -7 -4 53 -11 23 8 -33 -29 89 17 51 -6 56 -20 -37 6 -3 -37 -24 -22 -40 31 -12
5320a2k3L3k2j1k0L1k9k5N0O4k1j2m5MK9j8K9m2j5P1j6%L4j9nmM9j2o6M1l1K7
$$ -12 -35 -2 -24 -35 -55 -24 -53 -78 -28 36 15 3 -42 -38 -9 -27 2 -40 -55 16 0 0 34 15 10 6 55 43 -23 18 -13 14
5352A4j8k8O9p4O0l3%M1k2k1N4k6M7j18Q7ol3l0N9p1mK3KL1J0J9J1m4j8O1p6M5
$$ 14 -4 -32 37 -37 23 -10 -10 31 9 -12 42 16 63 -55 32 26 -7 -37 22 -49 -53 -30 -28 3 13 32 43 -1 -19 42 -34 11
5384A1O1o8J1j5%QJ1m1L8j9j3j2K3M8k9l4K9k1l1RJ5M2k3L8oj8nOr5J07r%J1o0
$$ 11 72 4 15 0 0 8 19 -22 16 -3 -16 -28 -5 43 14 -20 9 -12 -43 -34 -19 23 0 38 32 14 9 15 -80 27 18 18 29 -31
5418c1J0K5K6k0o3J4J4P1m2K4rk9nL4j2k4qM5m0M8o5P4j4m4K1Nl4Q6k5n3K4nL3
$$ -31 -21 4 30 10 -53 -39 -25 46 4 28 19 -10 -15 19 7 -17 -25 20 -20 28 -37 37 23 -21 0 5 -29 57 32 -21 3 -2 31
5451C1ml0Mk1K8pj8j0j2M9J0jJ9m2j1MN8q6J9K2j6ok4lM9N3p8LJ06q3l8j3M8J9
$$ 31 27 -3 1 -20 8 1 -17 -27 -39 10 20 19 38 -4 -15 -11 47 -39 -20 2 -14 -20 -44 -47 2 55 -23 -20 86 3 -35 -48 0 19
5485A9L2k4J0n6P3k7%n1L3l0Q6m6m5L6j9L5j7l7l3M8M1n4OJ0J3J1j2m3N7m5M8
$$ 19 51 27 37 -19 54 27 27 -24 9 -21 65 19 -26 10 -9 26 9 -28 -61 -13 28 -26 -20 -10 3 14 2 -41 16 -29 19
5516A9p3oK3Q0j5m5K4j1l0j9R6o6K1jj2Q4n5q0J61r5J9M9m3l2J6Jl6O2oL9o0J7
$$ 19 -54 -60 -37 43 28 -17 7 -4 -34 -53 43 -23 -2 -3 -15 69 14 -66 95 0 19 68 25 -7 9 10 -26 36 30 69 9 26
5548B6k1k2K5m9N6q3N7J1J8j03P9j5L3on3O7%k5J6Oqj8j9M7K2k9N7m2qJ3l0K0
$$ 26 5 -17 8 -41 15 -68 -11 0 18 -85 -6 -21 12 6 -47 20 20 -5 11 17 9 -9 -28 19 41 12 69 27 19 32 2 22
5580B2j3K1k0l0oM2K2l3m2L2qL0o5M4K2mJqk%j5k2k0j1J4L9K8k0k5nNK8mq2J14
$$ 22 9 30 10 -20 -26 16 38 5 -37 -5 -13 17 -48 -4 18 14 15 7 5 5 -10 -32 -52 -63 -49 -10 18 -2 -27 -32 -27 1 -3 -85 29
5615B9Pm5L0l3l3m4R4K6q4J3M4mnN0j2m7L9k4N4m2K6k4pnJ5Mo3K0k4lN6k7P8n9
$$ 29 36 -9 21 -12 -45 -89 5 31 -53 -40 4 0 -5 45 33 -14 25 1 55 13 39 15 8 3 18 22 -41 -21 -45 -48 8 -19 59 0
5649@J7n9L2jP3o6J8Nk9Ql8J5kK1jl2M0mM1qm9M7Nl4L1K4L4l4o1K7nQ5j00P7q4
$$ 0 17 -42 -10 -11 62 -4 14 19 -10 -2 -40 -25 -27 -6 -7 -39 1 -3 38 30 -19 28 33 -1 30 54 88 54 -7 20 15 100 0 77 -7
5684gL2J7o2M4Mr6P0L6o3O7k0l7n6O0l1K1j3O8j33R5l6K6%L4m9L6Lj7l2R3k7j08
$$ -7 25 42 -20 24 28 -68 2 38 -25 42 22 -15 -71 -11 -42 -21 -34 34 -99 -4 -40 -14 -14 20 -29 7 10 -7 -39 54 27 -81
5716h1K8K9M6K2m0n1J08p2N0n4P8k7l7j5K0nL1k7Mj5N4Jn3oQjJl8km6N0OJ8%J5
$$ -81 -53 -24 22 44 4 -47 61 -11 39 -15 63 36 -1 -16 4 -1 30 3 7 -8 46 47 -6 -12 -4 -5 -4 -42 -44 -90 -40 -34 -16 -16 -1
5751aK2mjM5p4j2K6l8P3n7P2p8O2ml7k1K0M8q7R5l5j1m0M2l8L9k4N8j4m6Mj5j
$$ -1 21 17 16 61 -13 -25 1 -37 36 -21 51 -27 35 31 -6 -27 -7 41 -46 49 14 3 -37 5 -33 6 -18 40 26 -20 -16 -31 -32
5784c2l6P7j7Nm3J7K6j0KMN1o8l4N8M8l4n9J8oJ7O0k0jn8N4QqLl4N6rJ8m5N8o7
$$ -32 -68 9 -8 -3 -46 -29 -3 -13 -11 -7 44 -24 -58 0 48 14 -45 -27 -33 -16 44 24 23 -35 19 27 19 22 -12 44 35 53 8 66 -1
5819aNL1Mn2J2O1m3M9o3oMMnl5QM2Qn2poK7j7k5M8j6j7L7k1L7N7j09R0mo3j6K6
$$ -1 4 35 39 -13 -1 60 17 66 3 -3 1 5 0 -35 -27 15 23 -29 -36 -42 -15 -32 -57 -9 -25 -42 -5 -26 11 68 -41 49 45 -18 -34 -8
5855hK0K8m3P6r0Q6l3j5o5J10l5m4P7mj9n2K6rlmOK8k4k3J6j8K2l7M6l8mJ4nP0
$$ -8 12 40 -3 73 -17 69 36 21 -44 66 31 -13 64 60 41 -11 15 6 3 -1 5 33 9 -14 2 -16 6 -31 15 -23 -27 -13 -18 52
5889E2q0lO6k3o1P5rl0J3J4J8k6n0lM1Pl9O8J1l2J2m7L0K3mL2k1Rj1j2k1j8N6
$$ 52 -28 -31 35 12 -49 26 17 -13 0 14 32 6 -44 -47 -6 1 -38 30 41 9 21 -26 4 27 23 55 34 43 32 20 -1 -19 37
$$ [...]
8191d3
##END NTUPLES=NMR FID
##END=
