##TITLE=1H_AEBC1103
 CDcl3,8 sc, 
 12.03.2021
##JCAMPDX= 6.0         $$ Bruker NMR JCAMP-DX V2.0
##DATA TYPE= NMR FID
##DATA CLASS= NTUPLES
##ORIGIN= UXNMR, Bruker Analytische Messtechnik GmbH
##OWNER= root
$$ XWIN-NMR		Version 3.5
$$ Fri Mar 12 10:18:55 2021 Russian Standard Time (UT+4h)  she@DPX200
##.OBSERVE FREQUENCY= 200.131506
##.OBSERVE NUCLEUS= ^1H
##.DELAY= (6, 6)
##.ACQUISITION MODE= SIMULTANEOUS
##.ACQUISITION SCHEME= undefined
##.AVERAGES= 8
##.DIGITISER RES= 18
##SPECTROMETER/DATA SYSTEM= spect
##.PULSE SEQUENCE= zg30
##.SOLVENT NAME= D2O
##.SHIFT REFERENCE= (INTERNAL, D2O, 0, 15.7039)
##AUDIT TRAIL= $$ (NUMBER, WHEN, WHO, WHERE, WHAT)
$$ ##TITLE= Audit trail, XWIN-NMR		Version 3.5
$$ ##JCAMPDX= 5.01
$$ ##ORIGIN= Bruker BioSpin GmbH
$$ ##OWNER= she
$$ F:/spectra/data/she/nmr/H-F/1/audita.txt
$$ ##AUDIT TRAIL=  $$ (NUMBER, WHEN, WHO, WHERE, WHAT)
(   1,<2021-03-12 10:17:41.34 +0400>,<she>,<DPX200>,
      <created by zg, POWCHK disabled, PULCHK disabled
       configuration hash MD5:
       00 E9 B6 7A A2 85 ED C7 34 08 36 98 17 FE 4E 26
       data hash MD5: 16K
       0E 03 71 27 72 B4 F3 36 38 41 DF 88 6C 13 63 FA>)
$$ ##END=
$$ 
$$ hash MD5
$$ 74 7F 46 71 82 5C 29 C2 BB 8D 27 17 14 DA 50 AE
##$RELAX= 
##$RELAX= 
##$RELAX= 
##$RELAX= 
##$RELAX= 
##$RELAX= 
$$ Bruker specific parameters
$$ --------------------------
##$DU= <F:/spectra>
##$EXPNO= 1
##$NAME= <H-F>
##$PROCNO= 1
##$TYPE= <nmr>
##$USER= <she>
##$AMP= (0..31)
100 100 100 100 100 100 100 100 100 100 100 100 100 100 100 100 100 100 
100 100 100 100 100 100 100 100 100 100 100 100 100 100 
##$AQSEQ= 0
##$AQ_mod= 1
##$AUNM= <au_zg>
##$AUTOPOS= <>
##$BF1= 200.13
##$BF2= 200.13
##$BF3= 200.13
##$BF4= 200.13
##$BF5= 200.13
##$BF6= 200.13
##$BF7= 200.13
##$BF8= 200.13
##$BYTORDA= 1
##$CFDGTYP= 0
##$CFRGTYP= 5
##$CHEMSTR= <none>
##$CNST= (0..31)
1 1 145 1 1 1 1 1 1 1 1 1 1 1 1 1 1 1 1 1 1 1 1 1 1 1 1 1 1 1 1 1 
##$CPDPRG= <>
##$CPDPRG1= <>
##$CPDPRG2= <>
##$CPDPRG3= <>
##$CPDPRG4= <mlev>
##$CPDPRG5= <mlev>
##$CPDPRG6= <mlev>
##$CPDPRG7= <mlev>
##$CPDPRG8= <mlev>
##$CPDPRGB= <>
##$CPDPRGT= <>
##$D= (0..31)
0 1.2 0 0 0 0 0 0 0 0.06 0 0.03 0 0 0 0 0.0002 0 0 0 0 0 0 0 0 0 0 0 0 
0 0 0 
##$DATE= 1615529860
##$DBL= (0..7)
120 120 120 120 120 120 120 120 
##$DBP= (0..7)
150 150 150 150 150 150 150 150 
##$DBP07= 0
##$DBPNAM0= <>
##$DBPNAM1= <>
##$DBPNAM2= <>
##$DBPNAM3= <>
##$DBPNAM4= <>
##$DBPNAM5= <>
##$DBPNAM6= <>
##$DBPNAM7= <>
##$DBPOAL= (0..7)
0.5 0.5 0.5 0.5 0.5 0.5 0.5 0.5 
##$DBPOFFS= (0..7)
0 0 0 0 0 0 0 0 
##$DE= 6
##$DECBNUC= <off>
##$DECIM= 32
##$DECNUC= <off>
##$DECSTAT= 4
##$DIGMOD= 1
##$DIGTYP= 9
##$DL= (0..7)
0 120 120 120 120 120 120 120 
##$DP= (0..7)
150 150 150 150 150 150 150 150 
##$DP07= 0
##$DPNAME0= <>
##$DPNAME1= <>
##$DPNAME2= <>
##$DPNAME3= <>
##$DPNAME4= <>
##$DPNAME5= <>
##$DPNAME6= <>
##$DPNAME7= <>
##$DPOAL= (0..7)
0.5 0.5 0.5 0.5 0.5 0.5 0.5 0.5 
##$DPOFFS= (0..7)
0 0 0 0 0 0 0 0 
##$DQDMODE= 0
##$DR= 18
##$DS= 0
##$DSLIST= <SSSSSSSSSSSSSSS>
$$ [...]
##$SUBNAM2= <"">
##$SUBNAM3= <"">
##$SUBNAM4= <"">
##$SUBNAM5= <"">
##$SUBNAM6= <"">
##$SUBNAM7= <"">
##$SUBNAM8= <"">
##$SUBNAM9= <"">
##$SW= 16.9725357007746
##$SWIBOX= (0..15)
0 0 2 0 0 0 0 0 0 0 0 0 0 0 0 0 
##$SW_h= 3396.73913043478
##$TD= 16384
##$TD0= 1
##$TE= 0
##$TE2= 300
##$TE3= 300
##$TEG= 300
##$TL= (0..7)
0 120 120 120 120 120 120 120 
##$TP= (0..7)
150 150 150 150 150 150 150 150 
##$TP07= 0
##$TPNAME0= <>
##$TPNAME1= <>
##$TPNAME2= <>
##$TPNAME3= <>
##$TPNAME4= <>
##$TPNAME5= <>
##$TPNAME6= <>
##$TPNAME7= <>
##$TPOAL= (0..7)
0.5 0.5 0.5 0.5 0.5 0.5 0.5 0.5 
##$TPOFFS= (0..7)
0 0 0 0 0 0 0 0 
##$TUNHIN= 0
##$TUNHOUT= 0
##$TUNXOUT= 0
##$USERA1= <user>
##$USERA2= <user>
##$USERA3= <user>
##$USERA4= <user>
##$USERA5= <user>
##$V9= 5
##$VALIST= <valist>
##$VCLIST= <CCCCCCCCCCCCCCC>
##$VD= 0
##$VDLIST= <DDDDDDDDDDDDDDD>
##$VPLIST= <PPPPPPPPPPPPPPP>
##$VTLIST= <TTTTTTTTTTTTTTT>
##$WBST= 1024
##$WBSW= 4
##$XGAIN= (0..3)
0 0 0 0 
##$XL= 0
##$YL= 0
##$YMAX_a= 199089
##$YMIN_a= -206928
##$ZGOPTNS= <>
##$ZL1= 120
##$ZL2= 120
##$ZL3= 120
##$ZL4= 120
##$ABSF1= 10
##$ABSF2= 0
##$ABSG= 5
##$ABSL= 3
##$ALPHA= 0
##$AQORDER= 0
##$ASSFAC= 0
##$ASSFACI= 0
##$ASSFACX= 0
##$ASSWID= 0
##$AUNMP= <proc_1d>
##$AZFE= 0.1
##$AZFW= 0.1
##$BCFW= 1
##$BC_mod= 2
##$BYTORDP= 1
##$COROFFS= 0
##$CY= 11.3945322036743
##$DATMOD= 1
##$DC= 2
##$DFILT= <>
##$DTYPP= 0
##$F1P= 15.9154993809931
##$F2P= -4.1035820241983
##$FCOR= 0.5
##$FTSIZE= 0
##$FT_mod= 4
##$GAMMA= 1
##$GB= 0.15
##$INTBC= 1
##$INTSCL= 1
##$ISEN= 128
##$LB= 0.24
##$LEV0= 0
##$LPBIN= 0
##$MAXI= 10000
##$MC2= 0
##$MEAN= 0
##$ME_mod= 0
##$MI= 1.114404
##$NCOEF= 0
##$NC_proc= 0
##$NLEV= 6
##$NOISF1= 3.799351
##$NOISF2= 2.8
##$NSP= 1
##$NTH_PI= 0
##$NZP= 0
##$OFFSET= 15.70392
##$PC= 1
##$PHC0= -11115.87
##$PHC1= 11.40094
##$PH_mod= 1
##$PKNL= yes
##$PPARMOD= 0
##$PSCAL= 0
##$PSIGN= 0
##$REVERSE= no
##$SF= 200.130013532006
##$SI= 16384
##$SIGF1= 3
##$SIGF2= 2
##$SINO= 400
##$SIOLD= 16384
##$SREGLST= <1H.CDCl3>
##$SSB= 0
##$STSI= 0
##$STSR= 0
##$SW_p= 3612.71676300578
##$SYMM= 0
##$S_DEV= 0
##$TDeff= 0
##$TDoff= 0
##$TI= <>
##$TILT= no
##$TM1= 0
##$TM2= 0
##$TOPLEV= 0
##$USERP1= <user>
##$USERP2= <user>
##$USERP3= <user>
##$USERP4= <user>
##$USERP5= <user>
##$WDW= 1
##$XDIM= 8192
##$YMAX_p= 0
##$YMIN_p= 0
$$ End of Bruker specific parameters
$$ ---------------------------------
##NTUPLES= NMR FID
##VAR_NAME=  TIME,          FID/REAL,        FID/IMAG
##SYMBOL=    X,             R,               I
##VAR_TYPE=  INDEPENDENT,   DEPENDENT,       DEPENDENT
##VAR_FORM=  AFFN,          ASDF,            ASDF
##VAR_DIM=   8192,          8192,            8192
##UNITS=     SECONDS,       ARBITRARY UNITS, ARBITRARY UNITS
##FACTOR=    0.0002944,     1,               1
##FIRST=     0,             0,               0
##LAST=      2.4114304,     0,               0
##MIN=       0,             -206928,         0
##MAX=       2.4114304,     199089,          0
$$ Real data points
##PAGE= N=1
##DATA TABLE= (X++(R..R)), XYDATA
$$ plain form
0 0 0 0 0 0 0 0 0 0 0 0 0 0 -8 8 -8 8 -16 16 -18 24 -32 32 -40 48 -56 64 -74 88 -99 113 -129 147 -167 188
34 188 -212 239 -268 299 -334 372 -412 458 -506 559 -618 681 -751 828 -912 1003 -1106 1218
52 1218 -1342 1483 -1642 1818 -2025 2263 -2540 2871 -3273 3772 -4413 5263 -6448 8209 -11083
67 -11083 16532 -30264 130245 196879 -112391 85575 -123324 -79796 193401 -103583 -48073
78 -48073 78276 -86942 153902 17584 -168163 80401 -22694 17558 100692 -166855 15
89 15 102446 -20146 85239 -74888 -109761 101724 -4685 16385 3696 -95651 89978
100 89978 47951 -46304 15 -100646 30765 105371 -49028 12821 -32711 -27821 106762
111 106762 -60734 -52682 24668 -38227 107958 9635 -117030 44176 -23888 21038 85255
$$ packed form
0@%%%%%%%%%%%%qJ6j6J6k4L2l4M2n6O4p2Q8j04J20j38J62j87K12k42K76l14L55
34A88m00M51n07N67o33P06p84Q70r64J065j177J299j432J579j740J915k109K324
52A218k560K825l125L460l843M288m803N411o144P045q185R676j1711J4657j9292
67a1083K7615m6796J60509O6634l09270J97966k08899M3528K73197k96984N5510
78d8073J26349j65218K40844j36318j85747K48564j03095M0252Q3134k67547J66870
89A5J02431j22592J05385j60127l4873K11485j06409K1070j2689r9347J85629
100H9978m2027r4255M6319j00661J31411P4606j54399O1849m5532M890J34583
111A06762j67496Q052P7350o2895J46185r8323j26665J61206o8064M4926O4217
$$ plain form
122 85255 -128592 -2188 66071 -48925 82670 -43300 -85648 107558 -30215 -17664 35759
133 35759 -102949 68977 72253 -79271 36419 -48777 -34012 111012 -49803 -25478 39385
144 39385 -49831 62515 15140 -83899 36973 -3071 8254 54802 -68568 -5016 39728
155 39728 -19364 34893 -23541 -40277 49531 1691 -1057 1991 -37591 32942 19567 -15164
167 -15164 1886 -33632 19287 34936 -21813 6187 -16452 -9550 41892 -22869 -12753 13341
179 13341 -18551 36461 -2546 -39254 22159 -12860 8349 29133 -46861 7158 22147 -26173
191 -26173 29714 -16828 -31818 42052 -13545 -6512 16647 -35978 18456 19805 -29110 15017
203 15017 -12015 -12106 34974 -20854 -8051 15972 -19867 17456 7023 -27248 12783 2379 -5365
$$ packed form
122H5255k13847J26404O8259j14996J31595j25970m2348J93206j37773J2551N3423
133C5759j38708J71926L276j51524J15690q5196J4765J45024j60815K4325O4863
144C9385q9216J12346m7375r9039J20872m0044J1325M6548j23370O3552M4744
155C9728n9092N4257n8434j6736Q9808m7840k748L048l9582P0533j3375l4731
167a5164J7050l5518N2919J5649n6749K8000k2639O902N1442o4761J0116K6094
179A3341l1892N5012l9007l6708O1413l5019K1209K0784p5994N4019J4989m8320
191b6173N5887m6542j4990P3870n5597P033K3159n2625N4434J349m8915M4127
203A5017k7032r1M7080n5828J2803K4023l5839L7323j0433l4271M0031j0404p744
$$ plain form
216 -5365 15915 -14462 -4286 12168 -5530 6089 -3443 -6921 11024 643 -1237 1423 -6545
229 -6545 4853 5977 -2279 263 -2738 4632 2388 -1673 3418 -5472 3513 7581 -6782 1975 2123
244 2123 -5491 9114 -849 -6159 7474 -5196 1923 5247 -8890 4773 2378 -6733 7257 -3731
258 -3731 -6764 9700 -5571 -1988 6574 -8484 1190 3609 -6836 2542 618 -5018 4021 -2962
272 -2962 -3358 3632 -4659 968 2146 -5277 1599 957 -4897 2734 682 -4540 3786 -906 -3294 2565
288 2565 -686 -1615 1926 -180 -1289 1501 -921 846 292 -290 2180 -740 209 1887 -866 151
304 151 3286 -960 168 3202 -1444 381 2240 -41 101 2334 111 -589 1569 151 465 607
320 607 1302 160 -148 893 -223 -343 1130 847 -1489 1300 -208 -1554 1159 -514 -669 -93 -259
$$ packed form
216e365K1280l0377J0176J6454j7698J1619r532l478J7945j0381j880K660p968
229f545J1398J124q256K542l001P370k244m061N091q890Q985M068j4363Q757J48
244B123p614J4605r963n310J3633j2670P119L324j4137J3663k395r111J3990j0988
258c731l033J6464j5271L583Q562j5058R674K419j0445R378j924n636R039o983
272b962l96O990q291N627J178p423O876o42n854P631k052n222Q326m692k388N859
288B565l251r29L541k106j109K790k422J767n54n82K470k920R49J678k753J017
304A51L135m246J128L034m646J825J859k281J42K233k223p00K158j418L14J42
320F07O95j142l08J041j116j20J473k83k336K789j508j346K713j673j55N76j66
$$ plain form
337 -259 -685 -324 -639 52 -1503 -310 1240 -3346 814 -280 -2930 2087 -1090 -2759 1767 -1590
353 -1590 -1280 1852 -4033 1075 903 -3014 2927 -2868 -1591 4070 -3039 -392 2618 -4949 2949 2401
369 2401 -4940 3485 -1238 -407 4614 -3286 60 1878 -1648 4234 -589 -3669 4711 -1186 1135
384 1135 3048 -4897 2575 2824 -186 1803 -3381 775 3953 -1249 2779 -2466 -2941 8038 -2386
399 -2386 -1145 2369 -5992 6042 2825 -6176 2843 -3385 820 8160 -8414 -182 3103 -5661 9888
414 9888 -4048 -9743 9125 -3456 438 5747 -13617 2981 7336 -7367 5997 -6819 -6153
427 -6153 12848 -5690 -2021 1792 -10184 10127 4195 -11641 4421 -4830 343 11972 -10595
440 -10595 -3257 3637 -2434 9028 -3854 -8746 5914 276 5022 911 -11977 5613 4274 361
$$ packed form
337b59m26L61l15O91j555J193J550m586M160j094k650N017l177j669M526l357
353a590L10L132n885N108j72l917N941n795J277N661p109K647L010p567P898n48
369B401p341Q425m723Q31N021p900L346J818l526N882m823l080Q380n897K321
384A135J913p945P472K49l010J989n184M156L178n202M028n245m75J0979j0424
399b386J241L514q361J2034l217r001R019o228M205P340j6574Q232L285q764J5549
414I888j3936n695J8868j2581L894N309j9364J6598M355j4703J3364j2816O66
427f153J9001j8538L669L813j1976K0311n932j5836J6062r251N173J1629k2567
440a0595P338O894o071J1462j2882m892J4660n638M746m111j2888J7590j339l913
$$ plain form
454 361 4417 -11197 1009 9614 -2115 2745 -6878 -4012 13767 -1856 -1775 21 -9903 14104
468 14104 5127 -10958 4692 -6733 4216 14421 -13803 -1859 4690 -4878 15309 -6657 -14489
481 -14489 12780 -3453 5117 6012 -20786 6787 9720 -6886 8327 -12098 -6861 18832 -6521
494 -6521 -1804 -663 -12989 15823 4048 -12338 2846 -8378 4929 13360 -14003 -2954 1306
507 1306 -1887 13245 -8433 -9990 5963 -694 8808 -2170 -14864 6463 3243 2988 4578 -16146
521 -16146 2816 10206 -3180 5575 -10822 -4614 16407 -3593 -504 -1859 -11497 16943 4101
534 4101 -11008 6019 -10227 6153 16344 -16242 669 3213 -5215 17568 -7472 -13111 12530
547 12530 -4384 7519 5471 -20427 9051 6410 -4835 10457 -13687 -4310 16890 -7072 1351
$$ packed form
454C61M056j5614J2206Q605j1729M860r623K866J7779j5623Q1J796r924K4007
468A4104q977j6085J5650j1425J0949J0205k8224J1944O549r568K0187k1966p832
481a4489K7269j6233Q570Q95k6798K7573K933j6606J5213k0425N237K5693k5353
494f521M717J141j2326K8812j1775j6386J5184j1224J3307Q431k7363J1049M260
507A306l193J5132k1678j557J5953o657R502j0978j2694K1327l220k55J590k0724
521a6146J8962P390j3386Q755j6397O208K1021k0000L089j355r638K8440j2842
534D101j5109J7027j6246J6380J0191l2586J6911K544q428K2783k5040n639K5641
547A2530j6914J1903k048k5898K9478k641j1245J5292k4144R377K1200k3962Q423
$$ plain form
560 1351 -1169 -12183 15377 1849 -8842 3408 -9486 6604 10117 -11977 311 -1553 -1456
573 -1456 12458 -8696 -6345 4846 -3789 9426 -2510 -12112 6842 -939 2912 3738 -13916 3865
587 3865 5671 -4324 6941 -10177 -3632 13173 -6531 2096 -760 -10755 13633 957 -8164 6719
601 6719 -9233 4509 11372 -13041 3694 1000 -5457 13937 -6828 -7090 9793 -5794 5912
614 5912 4589 -13918 7980 2864 -3936 8883 -9574 -1001 10501 -5803 3083 -326 -7455 10039
628 10039 -352 -4164 3955 -6626 4996 4774 -7243 2859 -2330 -574 7331 -6084 -1571 2668
642 2668 -3813 5858 -2276 -5676 5191 -3240 2214 1963 -8085 3959 776 -3261 5041 -6193
656 -6193 -1326 6494 -5709 2492 -170 -6483 7422 -1858 -3737 4575 -5878 2131 4888 -7282
$$ packed form
560A351k520j1014K7560j3528j0691J2250j2894J6090L513k2094J2288j864R7
573a456J3914k1154K351J1191q635J3215j1936r602J8954p781L851Q26j7654J7781
587C865J806r995J1265j7118O545J6805j9704Q627k856r995K4388j2676r121J4883
601F719j5952J3742O863k4413J6735k694o457J9394k0765k62J6883j5587J1706
614E912j323j8507K1898n116o800J2819j8457Q573J1502j6304Q886l409p129J7494
628A0039j0391l812Q119j0581J1622k22j2017J0102n189J756P905j3415M513M239
642B668o481R671q134l400J0867q431N454k51j0048J2044l183m037Q302j1234
656f193M867P820j2203Q201k662o313J3905r280j879Q312j0453Q009K757j2170
$$ plain form
670 -7282 3344 116 -3733 7164 -4130 -2431 4980 -4187 2882 2069 -6030 4329 571 -2480
684 -2480 4673 -3629 -253 4335 -2983 2085 293 -2383 3643 -554 -884 2207 -2128 1875 1622 -2228
700 -2228 1949 -857 -53 2175 -1844 549 556 -779 1830 -822 -709 1549 -1614 1154 291 -2534 2056
717 2056 -886 -923 1910 -2157 36 1148 -2167 1029 -186 -1975 1811 -1435 -770 1164 -2317 924
733 924 463 -2119 1115 -483 -1583 1658 -1313 -752 1420 -1401 220 445 -1229 606 156 -670 525
750 525 -471 -348 667 -539 276 246 -227 581 199 -48 182 596 60 286 381 129 377 449 266 297 545
771 545 -70 540 286 -156 655 -228 277 413 -61 121 455 -83 298 278 -408 593 -102 -230 182 -74
791 -74 -309 266 -224 -469 276 -566 49 -192 -475 379 -602 -346 -41 -672 -506 292 -755 -282 78 -894
$$ packed form
670g282J0626l228l849J0897j1294J699P411r167P069q13q099J0359l758l051
684b480P153q302L376M588p318N068j792k676O026m197l30L091m335M003k53l850
700b228M177k806Q04K228m019K393Pj335K609k652J13K258l163K768q63k825M590
717B056k942l7K833m067K193J112l315L196j215j789L786l246O65J934l481L241
733I24m61k582L234j598j100L241k971N61K172k821J621K25j674J835m50q26J195
750E25r96J23J015j206Q15l0m73Q08l82k47K30M14n36K26R5k52K48P2j83L1K48
771E45o15O10k54m42Q11q83N05J36m74J82L34n38L81k0o86J001o95j28M12k56
791g4k35N75m90k45P45q42O15k41k83Q54r81K56L05o31J66P98j047M73L60r72
$$ plain form
811 -894 58 -138 -327 -7 -378 25 -95 -441 296 -265 -587 663 -732 -122 711 -845 404 308 -439
830 -439 623 52 -48 767 -532 621 609 -1075 1285 -226 -371 1646 -859 187 1384 -800 764
847 764 493 -1006 1649 -348 170 1397 -1529 1231 765 -1235 1561 -396 -947 2365 -1246 -228
863 -228 1453 -2085 1454 -35 -1709 1804 -1341 -29 1750 -2483 862 612 -2472 2602 -1475 -1680
879 -1680 2658 -2483 392 1146 -3099 1991 -203 -2219 2535 -2630 -387 2554 -3507 1609 424
894 424 -3285 3452 -1413 -1955 3058 -2859 741 2190 -4069 2690 -200 -2229 4167 -2948 -300 3448
910 3448 -3453 2450 821 -3744 4071 -773 -1437 3510 -3574 1669 2600 -3667 3551 -824 -1723 4731
926 4731 -3132 -134 3171 -4053 3342 814 -3995 4194 -2004 -387 3671 -4465 1887 1835 -3681 4172
$$ packed form
811h94R52j96j89L20l71M03j20l46P37n61l22J250j395O10Q33j556J249r6p47
830d39J062n71j00Q15j299J153j2j684K360j511j45K017k505J046J197k184J564
847G64k71j499K655j997N18J227k926K760m66k000K796j957n51L312l611J018
863b28J681l538L539j489j674L513l145J312J779m233L345k50l084N074m077k05
879a680M338n141K875P54m245N090k194k016M754n165K243K941o061N116j185
894D24l709O737m865n42N013n917L600J449o259O759k890k029O396p115K648L748
910C448o901N903j629m565P815m844o64M947p084N243R31o267P218m375q99O454
926D731p863K998L305p224P395k528m809Q189o198J617M058q136O352n2n516P853
$$ plain form
942 4172 -1975 -2749 5230 -3873 526 2590 -5475 3906 675 -4109 4063 -3235 -766 4314 -5215
957 -5215 1730 1161 -4448 5545 -2343 -3418 4836 -4357 1051 3132 -6108 3274 584 -3744 4873
972 4873 -3920 -908 4763 -4642 2555 625 -4759 5502 -1455 -2729 4725 -4440 1557 3798 -5415
987 -5415 3262 -191 -2478 5645 -3618 -670 3700 -4134 3703 801 -4720 5027 -1349 -1254 4556 -5197
1003 -5197 1496 3268 -3945 3865 -1572 -2923 5517 -3223 -34 3082 -5289 4008 1103 -4654 4531
1018 4531 -2754 -832 4811 -4943 947 2102 -4222 4555 -1630 -3515 4835 -3675 512 2801 -5850
1033 -5850 3134 1013 -3982 4056 -3066 -1837 4725 -3980 1046 1162 -4196 4283 -1169 -2642 3537
1048 3537 -3305 1038 3307 -4912 2199 604 -2778 4261 -2498 -1385 3359 -2898 2152 637 -3354
$$ packed form
942D172o147p74P979r103M399K064q065R381l231m784Q172p298K469N080r529
957e215O945n69n609R993p888j075Q254r193N408K081r240R382k690m328Q617
972D873q793L012N671r405P197j930n384J0261o957j274P454r165N997K241r213
987e415Q677l453k287Q123r263K948M370p834P837k902n521R747o376R5N810r753
1003e197O693J772p213P810n437j351Q440q740L189L116q371R297k905n757R185
1018D531p285J922N643r754N890J155o324Q777o185j885Q350q510M187K289q651
1033e850Q984k121m995Q038p122J229O562q705N026J16n358Q479n452j473O179
1048C537o842M343K269q219P111j595l382P039o759J113M744o257N050j515l991
$$ plain form
1063 -3354 3671 -827 -1320 3377 -3724 1149 3059 -3502 2704 -231 -2234 4051 -1790 -668 2458
1078 2458 -2864 2569 1066 -3217 3353 -1360 -711 3874 -3181 430 2176 -2843 2306 -243 -2669
1093 -2669 3067 -1473 -343 1795 -3129 1663 794 -2418 2314 -1654 -1317 2888 -2281 -173 1345
1108 1345 -2492 1687 -121 -2061 1446 -1230 130 1368 -2184 810 244 -1707 1867 -1171 -968
1123 -968 1919 -1435 447 479 -1795 1367 -102 -776 1073 -1462 422 1327 -1449 1287 -48 -1095
1139 -1095 1821 -834 -520 1214 -902 965 708 -1192 1073 -282 -110 1514 -1257 497 1279 -1125
1155 -1125 995 117 -956 1513 -185 -338 836 -971 471 366 -801 864 -357 -98 749 -981
1171 -981 18 544 -859 568 171 -838 505 -267 -96 316 -553 142 -38 -586 128 -571 -284 313 -614
$$ packed form
1063c354P025m498m93M697p101M873J910o561O206k935k003O285n841J122L126
1078B458n322N433j503m283O570m713O49M585p055L611J746n019N149k549k426
1093b669N736m540J130K138m924M792q69l212M732l968L37M205n169K108J518
1108A345l837M179j808j940L507k676J360J238l552K994n66j951L574l038K03
1123i68K887l354J882L2k274L162j469o74J849k535J884R05k776K736j335j047
1139a095K916k655L14J734k116J867k57j900K265j355J72J624k771J754P82k404
1155a125K120q78j073K469j698j53J174j807J442j05j167J665j221K59Q47j730
1171i81R99N26j403J427l97j009J343p72J71M12q69O95j80n48P14o99K87N97r27
$$ plain form
1190 -614 166 53 -972 236 2 -341 64 -306 -251 93 -179 264 -144 4 783 -529 39 473 -590
1209 -590 253 300 -277 218 97 -167 127 31 75 245 53 455 -111 -90 398 -85 151 405 -249 104 382
1230 382 -109 149 264 132 212 51 173 -96 71 87 43 -15 191 51 17 172 -75 48 102 78 -96 25
1252 25 -42 -262 -81 171 -450 -186 78 -265 -206 -100 -287 -243 -148 -97 -314 -157 -69 -255 -182 40 -155 -398 26
1275 26 12 -72 166 -146 -165 135 29 -216 15 127 -268 103 110 44 -63 271 130 -9 141 179 -13 216 254
1298 254 46 266 106 118 248 -34 139 76 326 -12 33 70 192 -106 102 246 -165 382 142 -89 45
1319 45 -78 72 79 102 -52 -272 -88 95 -257 -50 147 -336 66 -62 -422 -110 -100 -96 -7 -77 -133 -235 -253 34
1343 34 -219 -185 107 -412 16 37 -534 128 152 -168 155 -316 -149 156 -166 144 -39 -78 449 125 -101 247
$$ packed form
1190f14P80j13j025J208k34l43M05l70N5L44k72M43m08J48P79j312N68M34j063
1209e90Q43M7n77M95j21k64K94r6M4J70j92M02n66K1M88m83K36K54o54L53K78
1230C82m91K58J15j32Q0j61J22k69J67J6m4n8K06j40l4J55k47J23N4k4j74J21
1252B5o7k20J81K52o21K64K64l43N9J06j87M4R5N1k17J57Q8j86P3K22j95k43M24
1275B6j4q4K38l12j9L00j06k45K31J12l95L71Po6j07L34j41j39J50L8j92K29L8
1298B54k08K20j60J2J30k82J73o3K50l38M5L7J22k98K08J44m11N47k40k31J34
1319D5j23J50PK3j54k20J84J83l52K07J97m83M02j28l60L12J0MQ9p0n6j02j8K87
1343C4k53L4K92n19M28K1n71O62K4l20L23m71J67L05l22L10j83l9N27l24k26L48
$$ plain form
1365 247 -36 148 448 -346 -44 98 110 390 -47 55 50 52 289 -79 -265 379 93 110 473 -438 120 314
1387 314 13 98 -322 109 259 -43 -35 -154 -277 621 44 -174 38 -178 27 354 -225 -183 -230 -126 214 -219
1409 -219 -368 14 -226 260 -173 -768 207 -160 -112 203 -640 -137 373 -197 -223 -342 -284 501 -179 -267 -120
1430 -120 -586 472 383 -471 -173 -190 -53 635 -238 -342 258 20 644 -304 -358 220 -109 397 415 -786 210
1451 210 557 142 307 -387 -148 504 42 168 -131 -143 836 287 -205 23 -540 338 546 -508 101 -158
1471 -158 83 593 -262 -366 130 -21 516 51 -701 133 4 268 252 -919 133 451 -140 180 -575 -481
1491 -481 610 -135 64 -233 -774 497 236 -637 127 -450 -74 606 -455 -216 63 -238 693 -91 -562
1510 -562 106 -138 595 408 -641 162 448 -12 585 -328 -239 701 8 194 28 -601 638 344 36 127
$$ packed form
1365B47k83J84L00p94L02J42J2K80m37J02nKK37l68j86O44k86J7L63r11N58J94
1387C14l01Q5m20M31J50l02Qj19j23Q98n77k18K12k16K05L27n79M2m7J04L40m33
1409b19j49L82k40M86m33n95R75l67M8L15q43N03N10n70k6j19N8P85o80q8J47
1430a20m66J058q9q54K98j7J37O88q73j04O00k38O24r48n4N78l29N06J8j201R96
1451B10L47m15J65o94K39O52m62J26k99j2R79n49m92K28n63Q78K08j054O09k59
1471a58K41N10q55j04M96j51N37m65p52Q34j29K64j6j171J052L18n91L20p55R4
1491d81J091p45J99k97n41J271k61q73P64n77L76O80j061K39K79l01R31p84m71
1510e62O68k44P33j87j049Q03K86m60N97r13Q9R40o93J86j66o29J239k94l08R1
$$ plain form
1530 127 -496 480 474 -393 -59 -36 -36 995 9 -294 377 -238 461 296 -645 199 -32 74 586 -796 27
1551 27 297 -229 444 -336 -644 606 -44 -18 177 -608 205 215 -459 -18 -428 -252 558 -457 -181 51
1571 51 -413 473 -72 -682 256 -156 -18 519 -646 88 180 -149 399 -283 -302 440 -121 103 238 -645 264
1592 264 265 -271 144 -190 46 617 -121 102 119 -168 626 -20 -163 426 -124 453 396 -362 125 167 -31 337
1614 337 -213 -228 335 -228 259 89 -476 374 136 -130 302 -373 4 320 -330 31 -46 -233 364 -82 -103
1635 -103 36 -287 288 125 -319 70 44 -163 331 -166 -37 250 -292 -1 -37 -255 143 -92 -60 201 -277
1656 -277 -22 216 -168 55 -99 -78 330 -72 -11 -2 -115 188 -8 -158 -46 52 173 208 -254 121 140 -59
1678 -59 367 -50 28 214 -19 42 39 -15 151 46 50 214 -52 89 196 -10 -27 -44 18 -60 2 -308 60 -171
$$ packed form
1530A27o23R76oq67L34K3%J031r86l03O71o15O99j65r41Q44k31J06N12j382Q23
1551B7K70n26O73p80l08J250o50K6J95p85Q13J0o74M41m10J76Q10j015K76K32
1571E1m64Q86n45o10R38m12J38N37j165P34R2l29N48o82j9P42n61K24J35q83R09
1592B64Jn36M15l34K36N71p38K23J7k87P94o46j43N89n50N77n7p58M87M2j98L68
1614C37n50j5N63n63M87j70n65Q50k38k66M32o75L77L16o50L61p7j87N97m46k1
1635a03J39l23N75j63m44L89k6k07M94m97J29K87n42K91l6k18L98k35L2K61m78
1656b77K55K38l84K23j54K1M08m02O1Rj13L03j96j50J12R8J21L5m62L75J9j99
1678e9M26m17P8J86k33O1ln4J66j05MJ64k66J41J07k06j7j7O2p8O2l10L68k31
$$ plain form
1702 -171 -101 0 -41 9 5 20 41 -25 -65 98 -240 -68 88 -124 74 -50 35 -49 -6 -105 11 -47 -119 39 -231
1727 -231 46 -28 -88 18 -42 -57 -43 31 23 -276 90 -55 28 -56 -54 134 -30 -39 164 108 84 -26 50 50 -26 86 -56
1754 -56 96 50 -12 117 -26 144 90 59 221 122 0 -1 159 206 168 -36 156 -32 -69 22 -29 -28 31 6 -83 90
1780 90 -145 133 19 -153 16 -52 -72 -39 -187 72 98 -120 -49 -133 -19 -27 -206 -88 -40 -196 84 -105 -161 128
1804 128 -180 -18 99 -188 33 61 -60 211 -108 -200 344 -174 216 61 -388 387 -90 26 346 -266 94
1825 94 176 -135 235 -203 11 648 -207 -116 226 -333 343 187 -477 377 51 -66 354 -275 -14 254 -258
1846 -258 369 16 -287 570 -161 51 407 -624 346 245 -361 437 -370 -344 719 -341 -35 39 -658 587
1866 587 -54 -524 265 -350 43 562 -766 10 56 -393 624 -454 -441 452 -341 359 208 -898 517
$$ packed form
1702a71P0J01m1N0mJ5K1o6m0J63l38J72J56k12J98j24Q5q4M3r9J16n8p2J58k70
1727b31K77p4o0J06o0j5J4P4qk99L66j45Q3q4KJ88j64rK03n6k4j10P6%p6J12j42
1754e6J52m6o2J29j43J70n4l1J62r9j22jJ60M7l8k04J92j88l7R1n1JN9k5q9J73
1780I0k35K78j14j72J69o8k0L3j48K59K6k18P1q4J14qj79J18M8j56K80j89n6K89
1804A28l08J62J17k87K21K8j21K71l19r2N44n18L90j55m49P75m77J16L20o12L60
1825I4Q2l11L70m38K14O37q55R1L42n59O76j56o64Q54l26j17M20o29K61K68n12
1846b58O27l53l03Q57p31K12L56j031R70j01o06P98q07K6J063j060L06P4o97J245
1866E87o41m70P89o15L93N19j328P76M6m49J017j078J3Q93p93P00j51j106J415
$$ plain form
1885 517 172 -173 562 -774 118 587 -403 507 -82 -633 825 -204 -334 522 -618 396 594 -869
1903 -869 256 -183 -295 1050 -512 -163 774 -405 667 85 -891 716 -16 -136 706 -983 395
1920 395 687 -494 652 -560 -532 1160 -316 -178 224 -937 869 411 -802 526 -524 132 1188
1937 1188 -986 -108 342 -552 1075 -355 -876 663 -456 231 358 -1346 374 440 -284 600 -1014
1954 -1014 -254 1123 -592 234 -168 -1004 1094 63 -599 442 -875 543 781 -1037 229 -130 -313
1971 -313 1380 -640 -396 811 -622 878 4 -1171 796 -16 -143 720 -1173 191 852 -604 670
1988 670 -430 -655 1075 -228 -300 392 -857 724 477 -1025 471 -494 122 1182 -1097 -110 263
2005 263 -470 838 -146 -971 701 -187 196 499 -1271 304 385 -358 590 -679 -344 1026 -254 56
$$ packed form
1885E17l45l45P35j336Q92M69r90R10n89n51J458j029j30Q56j140J014J98j463
1903h69J125m39j12J345j562L49R37j179J072n82r76J607p32j20Q42j689J378
1920C95K92j181J146j212K8J692j476J38M02j161J806m58j213J328j050O56J056
1937A188k174Q78M50q94J627j430n21J539j119O87J27j704J720O6p24Q84j614
1954a014P60J377j715Q26m02q36K098j031o62J041j317J418K38j818J266l59j83
1971c13J693k020K44J207j433J500q74j175J967q12j27Q63j893J364O61j456J274
1988F70j100k25J730j303p2O92j249J581k47j502J496r65O16J060k279R87L73
2005B63p33J308r84q25J672q88L83L03j770J575Q1p43R48j269L35J370j280L10
$$ plain form
2023 56 -50 -708 748 78 -658 311 -529 326 744 -812 103 -47 -306 845 -374 -437 523 -278 484
2042 484 88 -827 601 -20 -124 470 -808 150 734 -411 317 -166 -469 834 -19 7 45 -438 425
2061 425 293 -405 226 -312 -57 673 -523 -62 385 -371 463 24 -507 324 -73 56 240 -615 146 234
2081 234 -318 305 -320 -279 385 18 -205 181 -278 360 65 -161 151 -217 220 305 -315 94 6 -103 397
2102 397 -228 -267 281 -201 82 30 -425 8 74 -114 202 -208 -32 76 89 159 -28 25 247 -39 -160 52
2124 52 -269 260 177 -56 61 -10 16 333 -45 -39 36 -92 149 41 -17 184 -12 93 49 -160 33 26 -44 85
2148 85 26 -40 153 -206 22 -142 -51 84 -79 -106 85 -90 43 12 -50 93 -36 -97 12 9 81 100 73 -71
2172 -71 -21 -200 148 69 -19 -12 -224 42 -98 20 54 -49 -2 -114 -51 -66 257 -42 42 -36 -240 6 -99 -44
$$ packed form
2023E6j06o58J456o70p36R69q40Q55M18j556R15j50k59J151j219o3R60q01P62
2042D84l96r15J428o21j04N94j278R58N84j145P28m83l03J303q53K6L8m83Q63
2061D25j32o98O31n38K55P30j196M61M47p56Q34m39n31Q31l97J29J84q55P61Q8
2081B34n52O23o25M1O64l67k23L86m59O38k95k26L12l68M37Q5o20M09q8j09N00
2102C97o25l9N48m82K83n2m55M33O6j88L16m10J76J08J3P0j87N3K22k86j21K12
2124E2l21N29q3k33J17p1K6L17l78OP5j28K41j08n8K01j96J05m4k09J93pp0J29
2148H5n9o6J93l59K28j64R1J35j63k7J91j75J33l1o2J43j29o1J09lP2J9k7j44
2172g1N0j79L48p9q8Pk12K66j40J18L4j03M7j12O3j5L23k99Q4p8k04K46j05N5
$$ plain form
2196 -44 -91 -13 -44 -89 166 -87 -39 -92 155 -44 66 95 -146 82 40 -90 96 122 -79 70 -17 -71 -107 5
2220 5 -5 -72 -49 33 -196 79 19 -49 90 129 -101 -78 106 -83 -107 -186 -62 -111 -105 19 -131 -72 106 78 -79 148
2246 148 4 175 30 -13 112 49 57 11 70 9 -17 59 61 -82 10 103 -55 -19 94 -35 -36 -26 69 -6 -47 6 98
2273 98 34 159 -32 44 159 103 83 79 -98 -91 190 6 10 14 -5 172 41 43 -18 78 149 -44 -172 97 113 38 82
2300 82 -94 35 -10 152 -56 -117 -111 66 14 64 -143 -142 -31 -65 -40 130 -64 57 -19 30 -208 -134 102 51 -31
2325 -31 20 -105 -188 227 101 -134 -147 -5 138 -17 -164 -116 -102 102 138 -196 2 45 66 335 -137 -208 184
2348 184 98 215 -93 -99 229 140 176 -9 -354 76 269 62 73 -117 -147 405 -31 -60 18 -34 51 104 -380 62
2372 62 -397 248 209 -439 -77 20 -110 228 -160 -164 131 6 93 -26 -416 82 139 190 193 -444 48 376 -143
$$ packed form
2196d4m7P8l1m5K55k53M8n3K47j99J10K9k41K28m2j30J86K6k01J49q7n4l6J12
2220Ej0o7K3Q2k29K75o0o8J39L9k30K3J84j89k4p9J24m9OJ24j50N9J78k8j57K27
2246A48j44J71j45m3J25o3Qm6N9o1k6P6Kj43R2R3j58L6J13j29jJ0R5p5m1N3R2
2273I8o4J25j91P6J15n6k0mj77PK81j84MMj9J77j31Ko1R6P1j93j28K69J6p5M4
2300H2j76J29m5J62k08o1OJ77n2N0k07JJ11l4K5J70j94J21p6M9k38P4K36n1q2
2325c1N1j25q3M15j26k35j3J42J43j55j47M8J4K04L6l34J98M3K1K69m72p1L92
2348A84q6J17l08oL28q9L6j85l45M30J93k07J1j90l0N52m36k9P8n2Q5N3m84M42
2372F2m59O45l9o48L62R7j30L38l88mK95j25Q7j19l90M98N7N1Lo37M92L28n19
$$ plain form
2395 -143 73 3 -348 504 98 -272 125 -202 318 328 -238 83 -57 -86 368 -319 -149 217 -62 329 19
2416 19 -543 310 157 -2 250 -591 76 213 -74 364 -295 -121 700 -347 -139 75 -440 537 338 -329
2436 -329 228 -278 188 551 -495 -19 185 -181 623 -525 -464 576 -54 148 173 -724 247 297 -125 249
2456 249 -581 7 463 -245 122 26 -480 704 28 -423 373 -543 192 434 -388 107 -109 -128 591 -330
2476 -330 -196 380 -186 410 15 -481 448 25 25 326 -681 21 390 -386 190 -249 -231 649 -243 -53 178
2497 178 -554 387 242 -476 249 -191 -199 499 -510 -105 255 -238 706 -315 -374 460 -281 184 188 -569 321
2518 321 229 -324 400 -366 -124 596 -295 137 -56 -453 428 -126 -295 392 -339 253 448 -564 97 118
2538 118 -207 372 -249 -200 50 -274 276 4 -364 375 -73 -93 543 -424 -94 319 -358 344 -41 -202 327
$$ packed form
2395a43K16p0l51Q52m06l70L97l27N20J0n66L21j40k9M54o87J70L66k79L91l10
2416A9n62Q53j53j59K52q41O67J37k87M38o59J74Q21j047K08K14n15R77j99o67
2436c29N57n06M66L63j046M76K04l66Q04j148O1J040o30K02K5q97R71N0m22L74
2456B49q30N88M56p08L67r6n06J184o76m51P96r16P35K42q22M95k16j9P19r21
2476c30J34N76n66N96l95m96R29m23%L01j007P02L69p76N76m39J8Q80q92J90K31
2497A78p32R41j45p18P25m40qO98j009M05L60m93R44j021n9Q34p41M65Mp57Q90
2518C21r2n53P24p66K42P20q91M32j93l97Q81n54j69O87p31N92J95j012O61K1
2538A18l25N79o21M9K50l24N50k72l68P39m48k0O36r67L30M13o77P02l85j61N29
$$ plain form
2559 327 -156 -128 159 -219 206 -68 -319 244 -62 -42 214 -313 -89 214 -128 189 -39 -198 333 -138 51
2580 51 284 -184 291 -70 -20 347 -148 -207 489 -263 138 53 -480 184 49 -214 266 -15 157 272 -253
2601 -253 137 106 -342 424 -315 -168 118 -141 -34 -67 -130 96 58 20 92 -59 -60 88 -58 130 15 -255 176
2624 176 -96 -55 223 -87 -90 51 -116 119 -58 -13 124 -128 230 60 -86 162 64 -224 55 96 -132 2
2646 2 -103 188 16 -1 -5 -108 57 -32 -94 128 156 -281 97 -53 53 21 -18 -102 80 79 -188 -120 -36 0 7 77
2672 77 108 -47 -46 -114 -180 -16 197 -149 92 45 38 64 -231 152 39 19 -41 40 -24 -17 -19 -121 62 -111 1 -11
2698 -11 -8 -53 -104 -63 -28 -64 12 88 134 82 -150 -82 -12 -73 -50 81 -158 5 108 -121 -4 172 139 170 -56 76
2724 76 153 -12 79 28 64 82 3 99 129 -91 76 165 90 36 -2 51 93 -98 100 -116 -47 78 -78 -110 43 -60
$$ packed form
2559C27m83K8K87l78M25k74k51N63l06K0K56n27K24L03l42L17k28j59N31m71J89
2580E1K33m68M75l61N0L67m95n9O96p52M01q5n33O64j35k63M80k81J72J15n25
2601b53L90l1m48P66p39J47K86k59J07l3o3K26l8l8P2j51jJ48j46J88j15k70M31
2624A76k72M1K78l10lJ41j67K35j77M5J37k52L58j70j46K48r8k88K79M1k28J34
2646Bj05K91j72j7mj03J65q9o2K22K8m37L78j50J06l2l9q4J82jk67O8Q4L6PP0
2672G7L1j55Jo8o6J64K13l46K41m7pK6k95L83j13k0o0Q1o4Pkj02J83j73J12j2
2698a1Lm5n1M1L5l6P6P6M6n2k32O8P0o1K3J31k39J63J03k29J17J76l3L1k26J32
2724G6P7j65R1n1L6J8p9R6L0k20J67Q9p5n4l8N3M2j91J98k16O9J25j56l2J53j03
$$ plain form
2750 -60 -77 -20 -194 121 -107 -95 169 -10 6 104 -206 21 -47 -261 99 -182 -20 82 -273 284 -34 -140
2772 -140 50 -220 -15 154 -228 19 -62 -264 374 -90 -127 314 -189 -164 221 -78 196 -128 -137 222 4 -118
2794 -118 253 -214 207 137 -291 195 -150 -35 305 51 85 -46 -339 306 85 -197 314 -102 3 318 -227
2815 -227 -23 59 -305 358 -113 -115 235 -257 75 112 -122 166 135 -292 218 -181 165 415 -354 251 168 -206
2837 -206 383 -260 -204 248 -145 199 101 -514 313 -36 -123 376 -401 -51 98 -447 262 -59 -415 418 -248
2858 -248 -79 301 -442 380 240 -452 274 -319 -170 502 -312 52 168 -458 423 -29 -383 361 -248 6
2878 6 400 -589 120 406 -424 247 -180 -255 556 -259 30 105 -377 423 -25 -376 328 -329 13 464 -399
2899 -399 169 173 -360 528 -217 -388 447 -413 345 259 -466 364 3 -190 435 -439 -76 369 -538 363 -36
$$ packed form
2750f0j7N7j74L15k28J2K64j79J6R8l10K27o8k14L60k81J62J02l55N57l18j06
2772a40J90k70K05J69l82K47q1k02O38m64l7M41n03K5L85k99K74l24rL59k18j22
2794a18L71m67M21p0m28M86l45J15L40k54L4j31k93O45k21k82N11m16J05L15n45
2815b27K04Q2l64O63m71kL50m92L32L7k34K88l1m27N10l99L46K50p69O05q3l74
2837b06N89o43N6M52l93L44r8o15Q27l49q7M99p77L50J49n45P09l21l56Q33o66
2858b48J69L80p43Q22j40o92P26n93J49O72q14L64J16o26Q81m52l54P44o09K54
2878FL94r89P09K86q30O71m27p5Q11q15K89P5m82Q00m48l51P04o57L42M51q63
2899c99N68Mn33Q88p45j71Q35q60P58q6p25Q30l61j93O25q74L63M45r07R01l99
$$ plain form
2920 -36 -324 605 -54 -135 322 -428 389 360 -378 150 -186 -284 610 -208 -9 326 -341 371 176 -479 252
2941 252 -226 -117 361 -439 9 219 -291 262 -219 -354 485 -158 21 228 -341 397 254 -255 394 -258
2961 -258 -10 468 -319 44 165 -267 493 -37 -239 204 -297 167 279 -284 222 83 -161 273 -328 -74
2981 -74 195 -209 156 3 -400 352 63 -175 212 -251 84 209 -296 59 -38 -201 478 -249 -112 177 -231
3002 -231 298 113 -350 270 -38 -73 210 -245 102 119 -227 346 -70 -225 260 -36 -89 188 -175 146 283
3023 283 -226 117 -83 -33 301 -131 10 50 -157 310 13 -109 143 70 22 303 -358 86 -17 -52 181 132
3045 132 -59 163 -57 11 54 -109 95 -90 -30 98 -135 -14 251 -72 46 -151 -77 145 -17 -273 -42
3066 -42 -112 98 21 -140 1 -61 -48 85 70 18 63 -120 173 -152 -39 102 1 94 -61 -89 45 -134 25
$$ packed form
2920c6k88R29o59q1M57p50Q17k9p38N28l36r8Q94q18J99L35o67P12j95o55P31
2941B52m78J09M78q00M48K10n10N53m81j35Q39o43J79K07n69P38j43n09O49o52
2961b58K48M78p87L63J21m32P60n30k02M43n01M64J12n63N06j39k44M34o01K54
2981g4K69m04L65j53m03P52k89k38L87m63L35J25n05L55r7j63O79p27J37K89m08
3002b31N29j85m63O20l08l5K83m55L47J7l46N73m16j55M85k96n3K77l63L21J37
3023B83n09L43k00N0L34m32J41M0k07M67k97j22K52p3m8K81o61M44j03l5K33m9
3045A32j91K22k20O8M3j63K04j85O0J28k33J21K65l23J18j97P4K22j62k56K31
3066d2p0K10p7j61J41o2J3J33j5n2M5j83K93l25J13J41j01R3j55k8J34j79J59
$$ plain form
3089 25 -19 -7 -151 226 67 32 8 -6 26 59 99 -38 95 91 -12 -90 115 -97 -92 118 -25 -42 -41 -66 -138 -14
3115 -14 -140 -53 128 -29 -5 -99 -4 95 -37 -127 50 -102 -49 28 -146 43 45 -93 -32 43 45 0 -90 19 42 -111
3141 -111 5 -32 -38 -51 -3 50 -46 85 11 23 194 -129 67 42 -23 -26 15 -122 -27 10 -14 -54 106 -21 -66 122
3167 122 -34 -62 29 33 36 22 82 -16 7 44 -43 52 0 58 -40 -88 -4 -8 30 51 143 34 105 -61 -46 25 -38 -85 42
3196 42 174 41 52 17 -122 -3 103 -69 -6 -16 -24 195 25 -129 -43 -43 81 -64 88 -79 14 -9 66 15 -133
3221 -133 -124 -137 -193 148 55 -141 -4 52 -178 39 0 -126 -76 84 -102 -68 -24 -35 104 65 132 9 -57 -46 67
3246 67 135 22 1 9 4 -67 9 159 43 -6 -32 -86 -118 -42 -36 -99 61 10 -90 -22 -63 -52 -53 34 25 60 -32 -93 -265 48
3276 48 -49 -36 -19 73 1 8 -10 -145 -35 126 3 -230 21 65 32 174 -124 -42 190 101 -24 24 -178 25 104
$$ packed form
3089B5m4J2j44L77j59l5k4j4L2L3M0j37J33mj03p8K05k12NK10j43j7Jk5p2J24
3115a4j26Q7J81j57K4r4R5R9j32r0J77j52N3P7j74J89Kj38O1P5Km5r0J09K3j53
3141a11J16l7oj3M8N3r6J31p4J2J71l23J96k5o5lM1j37R5L7k4m0J60j27m5J88
3167A22j56k8R1MLj4O0r8K3L7q7R5n2N8r8m8Q4mL8K1R2j09P1j66J5P1o3m7J27
3196D2J32j33J1l5j39J19J06j72O3j0qK19j70j54Q6%J24j45J52j67R3k3P5n1j48
3221a33Rj3n6L41r3j96J37N6k30K17l9j26N0J60j86L4M4j1J39l9O7j23o6J1J13
3246F7O8j13k1Qnp1P6J50j16m9k6n4l2P6Oo3J60n1j00O8m1J1jQ7rL5r2o1j72L13
3276D8r7J3J7R2p2Pj8j35J10J61j23k33K51M4l3J42k98Q2K32q9j25M8k02K03P9
$$ plain form
3301 104 -127 29 -300 186 90 -24 -67 -155 -38 30 -51 -121 159 -184 79 79 -211 78 -118 -23 266 -143 3
3324 3 1 67 27 80 -220 259 -20 -27 26 -181 182 23 -42 55 -37 -29 319 -147 -20 237 -234 159 -32 -201 22
3349 22 -55 151 32 -205 78 -75 -237 267 -314 -177 123 -90 32 12 -219 82 152 -42 148 -379 -23
3370 -23 290 -281 97 -256 -120 493 -189 -235 83 -102 419 140 -301 95 -9 104 196 -310 80 194 -178
3391 -178 178 -53 -286 431 27 -77 235 -261 50 -29 -65 113 -87 165 252 -202 65 246 -214 331 -29
3412 -29 -410 370 -128 99 175 -264 84 -2 -15 201 -266 -295 313 -220 5 84 -396 420 237 -210 143 -288
3434 -288 -62 336 -129 8 -48 -226 462 -207 -43 247 -165 289 190 -435 144 -95 -58 234 -224 -158 305
3455 305 -93 289 -233 -179 319 -125 77 121 -337 265 245 -238 108 -153 -83 391 -157 -113 0 -71 62 -29
$$ packed form
3301A04k31J56l29M86r6j14m3q8J17O8q1p0K80l43K63%k90K89j96R5K89m09J46
3324CkO6m0N3l00M79k79pN3k07L63j59o5R7r2QL48m66J27K57m71L93j91j69K23
3349B2p7K06j19k37K83j53j62N04n81J37L00k13J22k0k31L01P0j94J90n27L56
3370b3L13n71L78l53J36O13o82m6L18j85N21k79m41L96j04J13R2n06L90J14l72
3391a78L56k31k33P17m04j04L12m96L11p9l6J78k00K52Q7m54K67J81m60N45l60
3412b9l81P80m98K27P6m39L48q6j3K16m67k9O08n33K25P9m80Q16j83m47L53m31
3434b88K26L98m65J37n6j78O88o69J64K90m12M54r9o25N79k39L7K92m58O6M63
3455C05l98L82n22N4M98m44K02M4m58O02k0m83L46k61P0M74n48M4J13p1J33r1
$$ plain form
3477 -29 -137 139 -120 68 314 -250 -1 277 -130 142 -128 -175 235 -84 -41 -77 -100 232 -44 47 286 -196
3499 -196 -244 192 -208 -69 17 -355 203 -51 -251 19 -24 38 135 -252 129 62 -177 294 -117 -112 246 20 46
3522 46 22 -433 331 -39 262 28 -221 28 262 -165 -69 16 -148 160 -102 57 203 -123 180 92 -56 -14
3544 -14 102 101 65 -141 7 67 95 221 -53 -19 86 62 59 14 -149 92 92 69 80 -30 80 195 -14 1 111
3569 111 -43 16 122 -373 43 -50 -15 -6 -56 24 -35 -123 -21 -52 5 -158 -91 -3 7 -54 79 -64 -90 37 58 -157
3595 -157 3 -13 -52 89 26 113 -108 -25 228 50 38 44 -105 31 74 -4 43 -24 -95 64 -30 64 -74 2 234
3620 234 -36 48 168 29 10 32 -195 1 26 -126 -131 -99 -27 -127 26 26 40 17 113 -1 24 110 -93 -7 -8 135
3646 135 -61 113 -70 -98 -170 87 43 -112 -21 52 -211 -38 6 22 79 -17 -30 -90 -80 -96 102 133 42 -31 84
$$ packed form
3477b9j08K76k59J88K46n64K49K78m07K72k70m7M10l19M3l6k3L32k76R1K39m82
3499a96m8M36m00J39Q6l72N58k54k00K70m3O2R7l87L81o7k39M71m11NL58k26K6
3522D6k4m55P64l70L01k34k49K49K34m27R6Q5j64L08k62J59J46l26L03q8j48M2
3544a4J16jl6k06J48O0K8J26k74L4J05k4lm5j63K41%k3J1j10J10J15k09J5J10
3569A11j54N9J06m95M16r3L5Rn0Q0n9q8J02l1N7j63O7Q8J0o1J33j43k6J27K1k15
3595a57J60j6l9J41o3Q7k21Q3K53j78j2Oj49J36M3p8M7o7p1J59r4R4j38P6K32
3620B34k70Q4J20j39j9K2k27J96K5j52nL2P2j00J53%J4k3R6j14K5Q6k03Q6jJ43
3646A35j96J74j83k8p2K57m4j55R1P3k63J73M4J6N7r6j3o0J0j6J98L1r1p3J15
$$ plain form
3671 84 -50 -200 112 25 16 44 -134 54 112 -97 -110 4 20 165 162 -110 -22 -138 210 44 -77 105 10 -102
3695 -102 -59 14 -89 -7 -78 65 -228 -24 131 -58 111 40 -127 79 -11 -111 104 163 -239 64 -69 -26 39
3718 39 39 31 158 63 167 -76 22 123 -166 -18 69 -126 -38 23 33 33 -74 -90 -85 -93 129 -25 -206 124 -57 83
3744 83 -2 -90 -165 193 -257 -16 -177 -137 3 -80 17 -9 -41 85 -28 -8 209 -138 32 256 74 55 13 -72
3768 -72 29 -79 106 -48 -239 100 -108 -186 196 -59 -282 83 -122 -109 245 -11 -39 140 -256 19 -68 -200
3790 -200 99 -252 85 201 -153 79 -28 -169 189 -1 -103 10 -154 176 271 -154 -40 -73 -68 80 -214
3811 -214 243 93 -140 217 -70 -270 248 -145 25 82 -231 93 74 -6 165 -197 -186 178 -59 25 63 -191
3833 -191 139 131 -317 80 -71 80 162 -102 70 231 -22 321 -221 -145 306 -102 160 130 -55 126 74 -121
$$ packed form
3671H4j34j50L12q7rK8j78J88N8k09j3J14J6J45lk72Q8j16L48j66j21J82r5j12
3695a02M3P3j03Q2p1J43k93K04J55j89J69p1j67K06r0j00K15N9m02L03j33M3O5
3718C9%qJ27r5J04k43R8J01k89J48Q7j95Q8O1J0%j07j6NqK22j54j81L30j81J40
3744H3q5q8p5L58m50K41j61M0J40q3R7k6l2J26j13K0K17l47J70K24j82j9m2q5
3768g2J01j08J85j54j91L39k08p8L82k55k23L65k05J3L54k56k8J79l96K75q7j32
3790b00K99l51L37J16l54K32j07j41L58j90j02J13j64L30R5m25J14l3NJ48k94
3811b14M57j50k33L57k87k00N18l93J70N7l13L24j9q0J71l62J1L64k37Q4L8k54
3833a91L30qm48L97j51J51Q2k64J72J61k53L43n42P6M51m08K62l0j85J81n2j95
$$ plain form
3855 -121 187 -125 -125 177 -132 156 -33 -92 340 -61 -65 40 -48 260 102 -214 82 -21 48 231 -320 -198
3877 -198 41 -95 81 -60 -171 17 92 -165 231 -373 111 224 -185 246 -206 -282 248 65 -153 -27 -120
3898 -120 171 33 -150 36 -104 188 123 -151 8 72 -86 197 -77 -195 185 170 155 -12 -120 213 129 -10
3920 -10 134 -40 -131 209 147 -80 26 -69 68 45 -62 188 -172 56 4 -137 -56 47 -60 116 -10 -93 177
3943 177 -112 -92 -40 -201 122 29 6 40 -131 -110 52 -220 14 -44 -192 178 -4 -154 -31 -79 16 87 -65
3966 -65 -4 -96 -80 23 8 7 -109 -39 149 -17 -113 15 106 26 110 -181 39 -162 -48 37 -46 99 117 -10 -194
3991 -194 97 95 165 97 -103 22 7 69 154 -102 -3 -3 50 155 -66 -93 -65 -32 37 -42 36 30 68 -53 75 -93 -116
4018 -116 9 -61 -62 -126 -27 -59 -41 41 -44 -17 -76 47 23 -115 -4 102 -185 -24 -97 -32 126 -28 59 -4 -33 58
$$ packed form
3855a21L08l12%L02l09K88j89n9M32m01mJ05q8L08j58l16K96j03O9J83n51J22
3877a98K39j36J76j41j11J88P5k57L96o04M84J13m09M31m52p6N30j83k18J26r3
3898a20K91j38j83J86j40K92o5k74J59O4j58K83k74j18L80j5j5j67j08L33q4j39
3920a0J44j74r1L40o2k27J06r5J37k3j07K50l60K28n2j41Q1J03j07J76j26q3K70
3943A77k89K0N2j61L23r3k3L4j71K1J62k72K34n8j48L70j82j50J23m8R5P1j52
3966f5O1r2J6J03j5jj16P0J88j66r6J28R1q0Q4k91K20k01J14Q5q3J45J8j27j84
3991a94K91kP0o8k00J25j5O2Q5k56R9%N3J05k21k7K8L3O9p9P8oL8j21J28j68k3
4018a16J25p0jo4R9l2J8Q2q5K7n9J23k4j38J11J06k87J61p3O5J58j54Q7o3k9R1
$$ plain form
4044 58 -116 68 39 75 64 153 -107 107 42 70 92 -4 -65 76 63 -66 -124 -90 -52 26 117 -91 -60 96 173 1
4070 1 -39 0 -10 36 -6 111 3 64 -57 -103 57 -37 -90 -139 -33 -30 -48 2 -114 43 -60 -47 -10 -105 -29 -40 -69
4097 -69 42 18 15 -7 190 31 -69 7 -45 6 -45 -33 45 97 154 -40 26 78 -283 18 134 4 -22 173 65
4122 65 -131 24 61 -179 -24 -77 -33 -9 -132 -47 173 169 23 52 36 -18 -48 -71 -112 76 -73 -122 74 94 -7
4147 -7 121 -75 111 73 -14 149 -50 -134 42 6 -26 -141 -23 51 178 -62 20 9 -34 175 -1 -51 -64 -59 8
4172 8 14 93 -36 68 149 -15 102 115 -109 131 45 10 90 -92 73 -37 32 41 5 117 -40 4 -18 2 -15 -28
4198 -28 72 -183 -97 173 50 -71 -173 -46 -97 90 -114 67 -129 -21 6 56 16 -112 10 83 76 -46 25
4221 25 -39 127 -141 -91 -16 -76 38 -58 -130 23 18 -174 124 -46 -50 0 119 29 -109 32 -28 13 -28 -59 -166 58
$$ packed form
4044E8j74J84k9L6j1Q9k60K14o5K8K2r6o1J41j3j29n8L4L8P8R1k08L1J56P7j72
4070Am0L9j0M6m2J17j08O1j21m6J60r4n3m9J06Lj8N0j16J57j03J3L7r5P6j1k9
4097f9J11k4lk2J97j59j00P6n2N1n1J2P8N2N7j94O6N2l61L01J16j30k6J95j08
4122F5j96J55L7k40J55n3M4K4j23Q5K20mj46K9j6n4l0k3m1J88j49m9J96K0j01
4147gJ28j96J86l8q7J63j99q4J76l6l2j15J18P4J27k40Q2j1m3K09j76n0j3NO7
4172HOP9j29J04Q1j64J17J3k24K40q6l5Q0j82J65j10O9Rl6J12j57M4k2K0j7j3
4198b8J00k55Q6K70j23j21j02J27n1J87k04J81j96J08K7N0m0j28J22P3pj22P1
4221B5o4J66k68N0P5o0J14r6p2J53nj92K98j70mN0J19r0j38J41o0M1m1l1j07K24
$$ plain form
4247 58 -13 -32 169 64 88 37 30 73 42 -56 -111 49 -101 127 -12 -14 98 -213 -138 -10 -38 -61 90 -182 35
4272 35 35 -23 -42 -131 25 187 -164 80 -52 -80 28 -38 19 46 -66 38 -111 -257 144 79 -25 78 50 29
4296 29 129 -202 40 24 -166 145 -7 -49 68 -111 4 51 -258 -66 -90 -112 68 -97 79 -74 37 61
4318 61 35 -8 95 -190 25 -21 -47 -32 -33 -158 30 34 -89 74 30 -183 -62 -103 21 -90 -163 51 -220 -25
4342 -25 59 -294 16 -8 46 179 27 -114 -25 -48 72 279 -260 181 -150 -64 209 -115 14 30 -89 177 -154
4365 -154 13 8 -56 20 -161 -84 -2 67 -26 85 -69 60 86 -138 77 135 -129 85 -58 -120 -2 54 123 114 -113
4390 -113 10 2 40 -14 -92 -148 -29 -170 -46 48 -80 9 28 39 57 -258 -17 124 -72 147 -80 -145 154 -55
4414 -55 -40 18 -16 -46 -3 -40 -53 139 65 199 -175 41 42 -112 189 -73 -1 25 7 -66 -69 -69 45 -111 -203 -103 -54
$$ packed form
4247E8p1j9K01j05K4n1pM3l1r8n5J60j50K28j39kJ12l11P5J28k8k3J51k72K17
4272C5%n8j9q9J56J62l51K44j32k8J08o6N7K7j12J04j49j46M01o5j04J03k8k1
4296B9J00l31K42j6j90L11j52m2J17j79J15M7l09J92k4k2J80j65J76j53J11K4
4318F1k6m3J03k85K15m6k6J5jj25J88Mj23J63m4k13J21m1J24j11p3K14k71J95
4342b5Q4l53L10k4N4J33j52j41Q9k3J20K07n39M41l31Q6K73l24J29J6j19K66l31
4365a54J67no4P6j81P7Q2O9r3J11j54J29K6k24K15N8k64K14j43o2J18N6O9rk27
4390a13J23qL8n4p8n6J19j41J24R4j28Q9J9J1J8l15K41J41j96K19k27o5K99k09
4414e5J5N8l4l0M3l7j3J92p4J34l74K16Jj54L01k62P2K6j8p3l%J14j56r2J00M9
$$ plain form
4441 -54 3 94 15 -27 62 -15 81 17 -74 90 9 -29 -12 -37 156 66 1 157 12 100 10 -13 71 155 -41 41 -7 78
4469 78 57 -253 5 -28 92 2 2 16 -31 87 -42 54 17 -35 58 -43 -23 145 61 -99 -1 112 34 -79 -114 -109
4495 -109 -19 101 -58 -63 78 84 68 58 -54 37 -201 -83 107 -157 -42 -14 -26 113 44 -101 0 -96 -59 -33 -41
4520 -41 -10 75 115 -20 -126 26 -52 2 77 97 -74 -84 -80 -112 96 32 -145 92 182 -52 -60 -11 18 -36 -109 -60 -69 -73
4548 -73 62 56 -42 188 70 -10 8 16 -33 0 -23 31 -9 99 -72 -104 -123 -103 -109 -140 88 -15 62 -39 12 78 102 41
4576 41 11 -57 -9 -8 3 -84 73 -97 -90 -52 69 -27 116 67 -11 80 -10 5 113 81 -83 -45 22 -55 117 85 -117
4603 -117 -42 210 64 -55 73 -213 8 -49 61 9 -115 -140 159 42 -36 -18 -19 -183 2 -85 68 -4 -114
4626 -114 63 -54 -64 83 -83 -79 55 -137 122 10 -51 -63 53 -165 66 19 22 -1 -43 -23 51 50 -88 -17 65
$$ packed form
4441e4N7R1p9m2Q9p7R6o4r1J64q1l8J7k5J93r0o5J56j45Q8r0k3Q4Q4j96Q2m8Q5
4469G8k1l10K58l3J20r0%J4m7J18j29R6l7n2R3j01K0J68q4j60R8J13p8j13l5N
4495a09R0J20j59nJ41Oj6j0j12R1k38J18J90k64J15K8j2J39o9j45J01r6L7K6q
4520d1L1Q5M0j35j06J52p8N4P5K0j71j0Ml2K08o4j77K37R0k34qM9K9n4p3M9rm
4548g3J35or8K30j18q0J8Qm9L3k3N4m0J08j71l2j9K0ol1K28j03P7j01N1O6K4o1
4576D1l0o8M8JJ1q7J57j70PL8J21r6J43m9p8R1r0J5J08l2j64L8O7p7J72l2k02
4603a17P5K52j46j19J28k86K21n7J10n2j24k5K99j17p8J8jj64J85q7J53p2j10
4626a14J77j17j0J47j66MJ34j92K59j12o1j2J16k18K31m7Lk3m2K0P4jj38P1Q2
$$ plain form
4651 65 19 30 1 -62 100 42 17 5 3 48 -45 -34 52 38 184 8 35 -50 -40 98 -34 -109 -122 39 109 -52 -73
4678 -73 -99 -36 -3 86 5 -21 18 -155 84 -5 -37 -18 -65 -37 -118 164 95 162 23 118 -57 -103 -94 7 19 43 -75
4705 -75 118 -33 47 -29 -9 -248 -99 18 -47 58 81 -48 -41 158 -76 142 157 89 34 25 99 34 -60 -23 -118 -11
4731 -11 73 3 30 -9 1 142 49 170 -17 -74 74 -46 71 54 -80 -71 -29 -44 -26 -129 12 -95 -72 -22 51 1
4757 1 107 -33 -80 -2 -185 -51 -61 35 -63 -22 89 132 62 -81 -32 -134 -38 -62 -95 -37 -8 64 80 5 52 -50 -9
4784 -9 94 -39 138 -62 -6 -7 139 47 -107 -6 -78 9 2 -79 50 -79 149 -70 82 54 -24 -70 21 88 -185
4809 -185 -97 -4 90 50 -68 -115 -27 53 96 28 -70 112 75 8 -3 -2 -66 146 -25 18 -50 -107 68 -14 29 125 110 2
4837 2 158 -108 97 -60 -9 87 -128 10 59 159 -22 105 66 -25 25 64 -38 106 -13 -61 -12 -252 -64 -68
$$ packed form
4651F5m6J1k9o3J62n8k5j2kM5r3J1Q6j4J46j76K7q5J0J38j32p5j3J61P0j61k1
4678g3k6O3L3Q9q1k6L9j73K39q9l2J9m7K8q1K82o9O7j39R5j75m6RJ01J2K4j18
4705g5J93j51Q0p6K0k39J49J17o5J05K3j29PJ99k34K18J5o8n5rP4o5r4L7r5J07
4731a1Q4p0K7l9J0J41r3J21j87n7J48j20J17j7j34RM2j5J8j03J41j07K3N0P3n0
4757AJ06j40m7P8j83J34j0R6r8M1J11M3p0j43M9j02R6k4l3N8K9P2J6p5M7j02M1
4784iJ03j33J77k00N6jJ46r2j54J01p2Q7pq1J29j29K28k19J52k8p8m6R1O7k73
4809a85Q8R3R4m0j18m7Q8Q0M3o8r8J82l7o7j1Jo4K12j71M3o8n7J75q2M3R6j5j08
4837BJ56k66K05j57N1R6k15J38M9J00j81J27l9r1N0L9j02J44j19m8M9k40J88m
$$ plain form
4861 -68 -64 100 -82 81 -116 -14 102 -54 19 -81 155 29 -135 27 35 112 72 -61 -80 43 60 -24 28 27 52
4886 52 -15 36 -16 -89 108 -79 -32 -129 -168 24 64 -59 43 60 -96 73 31 -102 -185 -207 88 -199 -40 28 58
4911 58 86 -73 -6 -169 20 168 -48 17 -28 -56 86 -68 -22 -27 -32 -49 89 87 138 192 -51 91 -50 -105 97 36
4937 36 82 -83 -156 -40 48 -54 33 4 77 4 -2 -82 67 71 -104 145 -37 10 147 72 62 70 -28 143 82 54 -17
4964 -17 160 -55 109 104 2 -25 -116 -155 29 -38 40 92 39 15 -90 -147 -118 60 66 -13 63 21 -63 -108 53 158 22
4991 22 9 -51 -10 42 16 22 72 -30 46 -34 -157 191 -62 47 77 -107 50 39 170 -151 -90 -62 -63 27 -130 51
5017 51 155 -37 141 -4 9 -14 116 -55 20 -241 -77 -84 -136 -149 5 -53 16 -39 85 -128 -16 34 35 -58 45
5042 45 -9 -202 117 27 50 -75 -143 -41 81 -94 115 130 31 -56 109 -3 14 4 160 62 -119 -96 94 -154
$$ packed form
4861f8MJ64j82J63j97J02J16j56P3j00K36j26j64J62QP7m0j33j9J23J7q4N2jK5
4886E2o7N1n2p3J97j87M7r7l9J92M0j23J02J7j56J69m2j33q3k2K95k87J59O8L0
4911E8K8j59O7j63J89J48k16O5m5k8J42j54M6nnj7J38kN1N4k43J42j41n5K02o1
4937C6M6j65p3J16Q8j02Q7k9P3p3oq0J49Mj75K49j82M7J37p5j0Qr8J71o1k8p1
4964a7J77k15J64nj02k7r1l9J84o7P8N2n3k4j05n7K9J78Op9P6m2q4m5J61J05j36
4991B2j3o0M1N2k6ON0j02P6q0j23L48k53J09L0j84J57j1J31l21O1K8jR0j57J81
5017E1J04j92J78j45J3k3J30j71P5k61J64pn2j3J54n8O9n5J24k13J12N0Jr3J03
5042D5n4j93L19r0K3j25o8J02J22j75K09J5r9q7J65j12J7j0J56r8j81K3J90k48
$$ plain form
5066 -154 147 -100 59 -106 0 54 -5 30 107 74 188 -26 1 60 -188 -26 -110 -39 51 -61 -72 151 -26 -99
5090 -99 -15 207 33 -7 85 46 -72 -71 -33 72 138 117 72 9 100 52 35 3 44 -58 73 88 -71 4 80 -4 84
5117 84 -68 -10 6 -192 88 32 49 47 -56 119 29 14 11 106 8 43 14 7 154 165 144 33 -192 67 -58 -112 -110
5144 -110 -76 -96 -13 3 -99 -25 -53 -25 -160 46 -58 37 75 27 -40 -57 -25 -7 -7 25 120 198 -7 25 -112 -98 45
5171 45 12 -111 16 2 -52 120 -71 -78 -82 -27 118 90 21 81 50 4 -89 -132 102 -35 -57 -17 78 -102 93 -30
5197 -30 35 -112 -84 105 154 -69 -37 130 -128 9 -8 -44 94 -24 -6 -225 -100 -143 87 -83 -52 87 -91
5220 -91 153 -97 13 -21 -56 93 -38 40 -64 104 80 -90 5 -23 15 -83 108 -111 37 96 -123 20 -64 -115
5244 -115 64 72 109 -23 72 -20 -87 76 167 18 -30 90 -48 -123 -23 14 45 74 55 94 -4 -134 -52 -77 14 67
$$ packed form
5066a54L01k47J59j65J06N4n9L5P7l3J14k14K7N9k48J62q4P1R0j12j1K23j77p3
5090i9Q4K22j74m0R2l9j18JL8J05O6k1m5o3R1m8j7l2M1j02J31J5j59P5P6q4Q8
5117H4j52N8J6j98K80n6J7kj03J75r0j5lR5r8L5k9pJ47J1k1j11k25K59j25n4K
5144a10L4k0Q3J6j02P4k8K8j35K06j04R5L8m8o7j7L2J8%L2R5P8k05L2j37J4J43
5171D5l3j23J27j4n4J72j91pmN5J45k8o9O0l1m6r3m3K34j37k2M0R5j80J95j23
5197c0O5j47K8J89M9k23L2J67k58J37j7l6J38j18J8k19J25m3K30j70L1J39j78
5220i1K44k50J10l4l5J49j31P8j04J68k4j70R5k8L8r8J91k19J48N9k19J43q4n1
5244a15J79QL7j32R5r2o7J63R1j49m8J20j38p5J00L7L1K9j9L9r8j30Q2k5R1N3
$$ plain form
5270 67 -111 132 -140 75 -27 66 81 4 -123 174 131 112 -130 -68 122 57 -87 -76 -119 -78 -17 -125 23 -17
5294 -17 -88 46 63 -109 -68 -119 -45 -70 -83 -78 -45 -15 -37 -60 -109 7 -25 38 -113 -154 98 139 14 80 -97 82 125
5321 125 -64 -4 64 -6 22 -93 40 11 19 40 -102 -91 99 -95 -37 53 -178 -204 80 -8 -36 -76 -81 -75 -45 7 132
5348 132 45 58 54 -75 17 -37 36 164 54 -18 112 -7 35 16 -65 19 -201 59 -3 88 -72 -81 -123 58 109 -102
5374 -102 25 -1 -124 114 -41 -10 -38 75 -58 -20 11 -123 -43 -194 12 96 -67 -93 -28 0 -92 -110 -33 19 7
5399 7 -12 22 146 21 -127 49 37 -7 80 -56 40 13 7 -57 102 -47 191 105 -21 -38 -4 116 6 -22 -16 -28
5425 -28 191 -1 59 -26 -152 111 -52 39 -31 112 -137 164 -12 23 -79 -46 -4 43 119 14 69 67 -53 67
5449 67 -136 4 -35 -80 109 -45 -4 -64 0 35 89 -165 36 95 30 -113 -64 75 -69 -145 88 153 -4 -29 -97
$$ packed form
5270F7j78K43k72K15j02R3J5p7j27K97m3j9k42O2J90o5j44J1m3M1O1j08J48m0
5294a7p1J34J7j72M1n1P4k5j3NL3L0k2k3m9J16l2O3j51m1K52M1j25O6j77J79M3
5321A25j89O0O8p0K8j15J33k9QK1j42J1J90j94N8R0k31k6K84q8k8m0nOL0N2J25
5348A32q7J3mj29R2n4P3J28j10p2J30j19M2j9q1Q4k20K60o2R1j60rm2J81N1k11
5374a02J27k6j23K38j55L1k8J13j33L8L1j34Q0j51K06Q4j63k6O5K8r2j8P7N2j2
5399Gj9L4J24j25j48J76j2m4Q7j36R6k7oo4J59j49K38q6j26j7L4J20j10k8Oj2
5425b8K19j92O0q5j26K63j63R1p0J43k49L01j76L5j02L3M2M7P6j05N5kj20J20
5449F7k03J40l9m5J89j54M1o0O4L5N4k54K01N9o5j43M9J39j44p6K33O5j57k5o8
$$ plain form
5474 -97 2 -14 57 16 29 -30 79 -103 82 -95 2 122 59 -46 73 11 4 -57 -25 8 56 16 91 183 -59 77
5500 77 171 27 0 102 -3 -21 82 45 1 4 3 73 -28 -54 59 -73 104 81 60 -96 32 18 -112 96 88 56
5526 56 -66 2 7 69 -17 -4 -102 -83 -50 35 71 89 22 8 -39 -117 -70 50 -59 -12 -80 -105 -52 17 -192 -24 120 32
5554 32 -13 -102 -16 -27 -83 -71 -27 35 -75 -18 56 4 33 -3 193 16 -79 -52 -191 -47 -30 42 10 12 -129 141 235
5581 235 -192 -93 19 -57 -60 -68 157 63 69 -45 -36 9 68 3 57 72 0 -65 -146 -64 -102 125 -56 107 -76 68 12
5608 12 -96 -107 -26 -1 -68 52 -112 44 -17 -47 69 -3 285 6 3 37 53 -119 -10 -73 -95 21 3 19 142
5633 142 -1 135 -124 10 -23 -45 81 32 -87 -52 65 202 29 -159 50 52 46 -64 -16 58 -9 -96 -45 -78 -128
5658 -128 -74 31 -32 78 -82 -132 9 -59 -112 83 85 100 238 44 -6 52 -20 61 -30 17 -68 98 61 9 60 40
$$ packed form
5474i7R9j6P1m1J3n9J09j82J85j77R7J20o3j05J19o2po1L2L3M8m0P5R2k42J36
5500G7R4j44k7J02j05j8J03l7m4LjP0j01k6J13j32J77k3k1j56J28j4j30K08ql2
5526E6j22O8NO2q6J3r8J9L3Q5L6J8o7j4m7p8M7J20j09M7o8k5N3O9k09J68J44q8
5554C2m5q9Q6j1n6J2M4O2j10N7P4n2K9l6J96j77r5K7j39J44J7P2l2Kj41K70R4
5581B35m27R9J12p6lqK25r4Oj14RM5N9o5N4J5p2o5q1Q2l8K27j81J63j83J44n6
5608A2j08j1Q1K5o7J20j64J56o1l0J16p2K88k79lL4J6j72J09o3k2J16j8J6J23
5633A42j43J36k59J34l3k2J26m9j19L5J17J37j73j88K09Koj10M8P4o7q7N1l3n0
5658a28N4J05o3J10j60n0J41o8n3J95KJ5J38j94n0N8p2Q1r1M7q5J66l7n2N1k0
$$ plain form
5684 40 -8 69 103 13 52 146 -167 191 -137 37 9 -59 -62 17 -7 55 -46 37 -94 -189 -39 73 -140 45 -10 -75
5710 -75 77 5 12 -41 113 -64 29 -40 168 15 -26 9 -177 81 11 77 -46 206 -58 1 129 -62 185 95
5734 95 27 65 -162 -72 117 -89 7 58 -129 -91 -163 -165 -11 -34 16 6 46 -157 -121 -8 55 -85 -28 53 -150 8
5760 8 47 86 116 36 59 10 42 123 -82 12 -130 -226 -16 -37 -81 -7 -198 -142 8 -32 -19 70 -208 -34 32 -119 -65
5787 -65 113 100 139 14 -53 4 31 51 21 -175 -17 85 2 -23 107 -15 107 131 147 -159 45 34 -2 2 65 -129
5813 -129 14 44 -1 -163 -154 52 -43 -208 -125 131 -21 55 -110 -95 -135 86 -53 71 86 144 92 -24 -135 63
5837 63 -64 2 -47 -35 -98 -34 -59 114 161 -55 -5 79 54 -230 -55 48 -80 126 -17 -1 -76 20 10 225 -129
5862 -129 -26 153 -188 -132 -231 -69 -37 -87 -114 118 -82 38 124 -103 -33 -44 21 25 55 160 33 -78 50 2
$$ packed form
5684D0m8P7L4r0L9R4l13L58l28J74k8o8lP9k4O2j01Q3j31r5J50J12k13J85n5o5
5710g5J52p2Pn3J54j77R3o9K08j53m1L5j86K58p0O6j23K52k64N9J28j91K47r0
5734I5o8L8k27R0J89k06R6N1j87L8p2kJ54k3N0j0M0k03L6J13O3j40N7Q1k03J58
5760HL9L9L0q0K3m9L2Q1k05R4j42r6K10k1m4P4j91N6J50m0J3Q9k78J74O6j51N4
5787f5J78j3L9j25o7N7K7K0l0j96J58J02q3k5J30j22J22K4J6l06K04j1l6MO3j94
5813a29J43L0m5j62RK06r5j65Q3K56j52P6j65J5m0K21j39J24J5N8n2j16j11J98
5837F3j27O6m9J2o3O4k5J73M7k16N0Q4k5k84J75J03j28K06j43J6p5R6j0K15l54
5862a29J03J79l41N6r9J62L2n0k7K32k00J20Q6k27P0j1O5ML0J05j27j11J28m8
$$ plain form
5886 2 -11 17 -6 7 135 -58 124 52 69 0 -39 -44 136 -151 -8 5 -32 9 -144 -127 -68 85 58 1 -63 -80 63
5913 63 -30 19 36 -89 -124 -129 80 9 -62 -147 29 -158 0 159 216 71 -33 -151 10 202 -10 -16 16 64 56 39
5939 39 -11 137 -34 90 61 71 -26 17 55 -13 -156 -26 -42 -7 -7 -12 -2 -19 15 236 153 -87 150 -23 39 3 14
5966 14 107 153 83 17 -12 -98 59 -38 9 17 -111 -42 85 57 18 89 58 55 -72 -117 96 63 12 17 -15 31 -60 32 11
5995 11 -173 3 58 -86 126 117 -127 -94 -229 -87 149 87 21 13 57 -177 159 43 93 70 131 -63 -69 58 93
6020 93 44 -18 68 -28 61 -104 85 23 110 10 9 -42 32 10 74 214 49 102 146 -34 -10 -67 -6 16 -29 -210 -127
6047 -127 40 -184 92 171 -14 -46 -5 -65 -2 8 129 66 -84 5 -41 63 -82 -6 -215 -15 35 39 67 16 11 82
6073 82 40 -155 -74 48 -63 72 95 22 -93 -52 -33 36 -118 22 68 113 156 38 161 -50 19 93 -7 -129
$$ packed form
5886Bj3K8k3J3J28j93J82p2J7o9l9nJ80k87J43J3l7M1j53J7N9J53k7n7o4j7J43
5913F3r3M9J7j25l5nK09p1p1q5J76j87J58J59N7j45j04j18J61J92k12oL2M8qj7
5939C9n0J48j71J24k9J0r7M3L8o8j43J30j6L5%nJ0j7L4K21q3k40K37j73O2l6J1
5966A4R3M6p0o6k9q6J57r7M7Qj28O9J27k8l9P1l1lj27m5K13l3n1Nl2M6r1R2k1
5995A1j84J76N5j44K12rk44L3j35J42K36o2o6qM4k34L36j16N0k3O1j94oJ27L5
6020I3m9o2Q6r6Q9j65J89o2Q7j00jn1P4k2O4J40j65N3M4j80K4n7O1K2m5j81Q3
6047a27J67k24K76P9j85l2M1o0O3J0J21o3j50Q9m6J04j45P6k09K00N0MK8n1nP1
6073H2m2j95Q1J22j11J35K3p3j15M1J9O9j54J40M6M5M3j18J23k11O9P4j00j22
$$ plain form
6097 -129 -94 89 8 -80 173 106 -17 80 44 -25 -65 9 85 136 60 -53 30 -57 13 -112 -19 -60 68 33 117 133 52
6124 52 -49 125 46 -32 -195 11 -44 150 32 -41 60 15 -144 -125 -168 87 -81 -9 11 -93 38 52 8 -174
6148 -174 47 -106 -153 -55 50 -118 62 45 9 -122 -32 29 132 33 -44 68 -86 60 -8 62 41 107 39 78 136
6173 136 -30 -34 14 26 -75 77 -36 -15 93 -19 130 -113 -147 -58 -9 42 -2 133 42 -50 99 18 4 44 57
6198 57 152 -74 213 143 1 12 -37 36 -13 -113 136 -50 52 174 22 72 -22 -113 123 -47 81 -102 -1
6221 -1 -95 -256 175 228 -207 -69 76 33 66 -37 18 -74 -128 -8 60 -4 94 -130 -17 136 48 32 28 -82 15 101
6247 101 -4 64 -20 -7 -84 -45 117 58 -52 31 33 -202 92 -101 85 18 31 -16 -45 49 -33 10 -35 86 104 -21
6273 -21 78 -34 75 161 143 94 -61 -82 40 -87 32 -142 85 -105 90 38 51 -142 -89 -34 -126 64 95 -80
$$ packed form
6097a29L5J83q1q8K53o7j23R7l6o9m0P4P6N1p6j13Q3q7P0j25R3m1J28l5Q4J6q1
6124E2j01J74p9p8j63K06n5J94j18p3J01m5j59J9m3K55j68P2K0j04J31J4m4j82
6148a74K21j53m7R8J05j68J80j7l6j31R0O1J03r9p7J12j54J46o8P0k1O6o8L9N8
6173A36j66mM8J2j01J52j13K1J08j12J49k43l4Q9M9N1m4J35r1r2J49q1j4M0J3
6198E7R5k26K87p0j42J1m9P3m9j00K49j86J02J22j52N0r4r1K36j70J28j83J01
6221ar4j61M31N3m35J38J45m3L3j03N5r2n4J20O8o4R8k24J13J53q8j6mj10R7Q6
6247A01j05O8q4J3p7L9J62n9j10Q3Kk35K94j93J86o7J3m7k9R4q2M3m5J21J8j25
6273b1R9j12J09Q6j8m9j55k1J22j27J19j74K27j90J95n2J3j93N3N5r2J90L1j75
$$ plain form
6297 -80 -6 -176 -30 23 77 77 -20 -106 -76 -35 -175 119 62 29 -13 -175 -74 16 150 0 -29 42 -100 -106 14 100
6323 100 50 -47 -137 -58 40 -114 -4 1 -56 110 201 -143 34 -135 212 92 30 -57 -130 -111 69 -81 -35 25 66
6348 66 36 85 59 -14 -68 -73 144 -47 14 238 -55 -37 43 -43 -10 38 -192 152 -59 81 1 -60 -51 -38 23 80 -46
6375 -46 -144 50 20 56 91 20 -54 -199 -16 25 -49 -22 43 -97 -126 81 11 128 11 20 22 -96 -65 110 -4 -160
6401 -160 -79 -37 5 -69 -18 15 -169 52 80 32 118 -162 216 -89 -9 -122 88 -61 -8 -13 7 20 37 48 -132 -29
6427 -29 -53 21 -9 -179 -47 20 -71 135 -42 6 -102 -83 -163 64 36 -76 -53 -53 44 -67 -24 -31 71 -93 70 -44
6453 -44 56 29 -11 -83 -118 -11 -87 -159 44 -90 30 6 107 41 -61 66 -39 -32 -104 -60 3 211 19 -52 11
6478 11 9 28 4 -49 -89 166 4 -29 -17 -44 -129 5 -142 -35 5 4 87 105 -106 -155 -42 -144 -155 -4 69 138 -50
$$ packed form
6297h0P4j70J46N3N4%r7q6L0M1j40K94n7l3m2j62J01R0J34j50k9P1j42oJ20Q6
6323A00n0r7r0P9R8j54J10Nn7J66R1l44J77j69L47j20o2q7p3J9J80j50M6O0M1
6348F6l0M9k6p3n4nK17j91O1K24k93J8Q0q6L3M8k30L44k11J40q0o1RJ3O1N7j26
6375d6r8J94l0L6L5p1p4j45J83M1p4K7O5j40k9K07p0J17j17RKj18L1J75j14j56
6401a60Q1M2M2p4N1L3j84K21K8m8Q6k80L78l05Q0j13K10j49N3nK0J3J7J1j80J03
6427b9k4P4l0j70J32O7r1K06j77M8j08J9q0K27k8j12K3%R7j11M3pJ02j64J63j14
6453d4J00k7m0p2l5J07p6p2K03j34J20k4J01o6j02J27j05Pp2M4O3K08j92p1O3
6478A1kJ9k4n3m0K55j62l3J2k7q5J34j47J07M0jQ3J8k11m9J13j02j1J51P3O9j88
$$ plain form
6505 -50 -148 -84 -124 -129 46 -98 -4 -73 65 -22 152 -25 77 37 59 29 15 -10 -60 91 -78 83 81 146 -26 -109
6531 -109 88 -18 -34 112 -96 -8 -103 229 28 30 -104 13 11 156 169 135 144 -165 33 -172 -55 -48 -11 25 45
6556 45 39 -55 69 46 63 25 -69 126 7 -42 215 167 -59 -30 173 94 -22 150 82 -84 -114 -47 -19 22 -54 -126
6582 -126 43 -80 -5 -68 -19 47 -2 -23 262 -107 -52 -16 -10 187 -252 -5 79 -125 121 -106 -78 -29 -107 -39 20
6607 20 174 73 -14 98 -23 -35 -44 -51 54 -90 22 -109 77 -36 -100 -123 -128 -9 59 -121 -42 -12 28 -41 -22 54
6633 54 23 164 17 -228 -152 -106 -102 7 -38 -7 -74 14 -13 21 117 -110 -8 52 117 3 147 -86 -108 -44 92 61
6659 61 -150 -101 146 -67 38 -38 -177 -64 -208 -50 -18 -46 -81 -12 -92 69 88 8 -115 -22 88 1 -93 -19 27
6684 27 72 -22 -38 -49 -35 -145 103 171 29 97 -137 57 78 -76 -38 14 102 -124 -1 -53 98 15 -7 -80 37
$$ packed form
6505e0r8O4m0nJ75j44R4o9J38q7J74j77J02m0K2l0j4k5n0J51j69J61kO5j72q3
6531a09J97j06j6J46k08Q8r5L32k01Kj34J17kJ45J3l4Rl09J98k05J17PL7L6K0
6556D5or4J24k3J7l8r4J95j19m9K57m8k26K9K03p9j16J72o8j66l0O7K8M1p6p2
6582a26J69j23P5o3M9O6m9k1K85l69N5L6OJ97m39K47Q4k04K46k27K8M9p8O8N9
6607B0J54j01q7J12j21j2rpJ05j44J12j31J86j13o4k3nJ19O8j80P9L0M0o9J9P6
6633E4l1J41j47k45P6M6MJ09m5L1o7Q8k7L4R6k27J02O0O5j14J44k33k2O4J36l1
6659F1k11M9K47k13J05p6j39J13j44J58L2k8l5O9q0J61J9q0j23R3J10q7r4P4M6
6684B7M5r4j6j1J4j10K48O8j42O8k34J94K1j54L8N2Q8k26J23n2J51q3k2p3J17
$$ plain form
6709 37 -105 43 -36 -120 6 -98 73 -45 -150 44 -59 -48 133 37 -85 -108 36 -15 -17 -101 128 51 -24 -104
6733 -104 -31 -86 13 -2 -115 -102 -183 -55 -102 84 29 -75 29 -95 -160 14 85 56 3 -11 -27 121 37 -11 64 -42
6759 -42 -27 49 18 6 -77 108 -176 56 -41 -63 96 92 139 29 -11 38 18 -3 43 -127 -7 66 30 -73 48 -30
6785 -30 103 167 -149 -97 65 -46 44 102 -76 -5 -104 11 41 46 112 49 -96 -36 -74 29 26 37 -80 132 91 95 75
6812 75 -58 -74 -89 -44 -65 -125 33 7 -196 -108 -156 -103 36 37 -112 -49 -15 -53 12 92 -67 -4 -55 58 61 -51 -161
6839 -161 144 -62 6 44 66 149 -12 82 168 15 -79 108 -104 217 -87 76 -125 67 68 71 -6 73 66 16 -39 -176
6865 -176 -77 184 31 -73 39 37 -57 51 101 -16 -30 -70 38 -79 126 108 -18 -51 -13 36 -56 62 -54 -168
6889 -168 47 -172 16 -10 -24 92 -17 -135 -106 -20 -58 20 -111 129 -77 -72 -16 -147 109 -71 -82 -18 45 -55
$$ packed form
6709C7j42J48p9q4J26j04J71j18j05J94j03J1J81r6j22k3J44n1kq4K29p7p5q0
6733a04P3n5R9j5j13J3q1J28m7J86n5j04J04j24o5J74P1k9n3j4j6J48q4m8P5j06
6759d2J5P6l1j2q3J85k84K32r7k2J59mM7j10m0M9k0k1M6j70J20P3l6j03J21p8
6785c0J33O4l16N2J62j11R0N8j78P1r9J15L0NO6o3j45O0l8J03lJ1j17K12m1Mk0
6812G5j33j6j5M5k1o0J58k6k03Q8m8N3J39Jj49O3L4l8O5Q0j59O3n1J13Lj12j10
6839a61L05k06O8L8K2Q3j61R4Q6j53r4J87k12L21l04J63k01J92JLp7P9pn0n5j37
6865a76R9K61j53j04J12kr4J08N0j17j4m0J08j17K05j8j26l3L8M9r2J18j16j14
6889a68K15k19J88k6j4J16j09j18K9Q6l8P8j31K40k06NN6j31K56j80j1O4O3j00
$$ plain form
6913 -55 -86 93 24 -16 -85 -105 89 -143 -137 53 16 42 44 184 5 60 161 -41 39 112 -3 -10 30 6 -44 21 9
6940 9 4 63 -18 151 46 22 -160 -74 -31 6 -78 -46 42 35 27 53 169 -58 -40 59 -26 -83 289 74 -87 1 -151 92
6968 92 -16 140 -3 -68 25 8 -9 87 24 -69 -38 42 18 -5 74 55 -3 16 -2 57 8 132 -57 38 -77 -131 27
6995 27 -66 39 102 -2 -41 -60 -131 3 6 71 114 75 92 -94 -28 28 -67 53 117 -27 74 148 -18 -130 -20 -77
7021 -77 98 -45 -24 -59 75 2 56 53 46 104 -29 -60 -114 -69 -78 10 -53 117 34 -91 89 -162 122 76 79 49 -32 108
7049 108 -10 20 87 45 44 18 67 36 -28 130 -64 -67 -70 -45 220 60 -91 -38 24 112 -20 69 85 -31 88 -4 63
7076 63 -91 -23 -221 0 131 21 75 -63 81 -91 -35 -23 89 -77 25 -70 185 -60 106 100 34 65 45 -167
7100 -167 -114 -52 -81 14 -120 -65 43 -44 122 -42 -95 -11 14 -138 -16 168 -73 68 28 80 51 -4 -26 49 -122
$$ packed form
6913e5l1J79o9m0o9k0J94k32OJ90l7K6KJ40j79N5J01k02Q0P3j15pM0k4n0O5j2
6940InN9q1J69j05k4j82Q6M3L7q4L2Q8pqK6J16k27J8R9q5n7L72k15j61Q8j52K43
6968I2j08J56j43o5R3j7j7R6o3r3L1Q0k4k3P9j9n8J9j8N9m9J24j89R5j15n4J58
6995B7r3J05O3j04l9j9p1J34LO5M3l9J7j86O6N6r5J20O4j44J01P4j66j12J10n7
7021g7J75j43K1l5J34p3N4lpN8j33l1n4M5rQ8o3J70q3j25J80k51K84m6Ll0q1J40
7049A08j18L0O7m2jk6M9l1o4J58j94llK5K65j60j51N3O2Q8j32Q9J6j16J19r2O7
7076F3j54O8j98K21J31j10N4j38J44j72N6J2J12j66J02r5K55k45J66oo6L1k0k12
7100a67N3O2k9R5j34N5J08q7J66j64n3Q4K5j52J22J84k41J41m0N2k9n5k2P5j71
$$ plain form
7125 -122 48 59 57 -27 -51 61 -3 -88 -54 -100 -163 30 32 92 -62 -148 128 -40 -59 19 -26 6 -33 103 -60 23 -174
7152 -174 38 -156 -91 -111 -4 -123 122 -71 -42 -44 21 -68 55 82 48 -92 171 28 80 33 83 -135 -15 62
7176 62 -57 -52 -88 -66 -79 158 13 -56 24 -118 28 -90 82 -68 -138 -135 -48 89 -48 101 36 57 -19 24 70 18
7202 18 54 -16 -19 109 70 -67 -104 194 56 -285 -28 46 -39 37 20 12 184 -7 -12 -21 -108 89 -62 -85 52 -120
7228 -120 -104 63 -79 -70 -70 1 -48 -49 2 -143 -52 -89 16 201 102 41 -2 96 108 133 -153 -14 9 -49 -156 5 53
7255 53 -50 -61 -65 41 90 -10 -62 35 -53 100 -45 -63 138 -12 34 -62 -47 -30 -32 47 103 71 140 -115 -30 129 -160
7282 -160 -84 -13 24 -101 3 201 3 -20 -18 -24 115 -29 -89 -60 173 39 -60 -85 6 -126 -14 -128 5 20 27
7307 27 93 -56 211 -35 7 -78 -108 -31 -29 180 -23 2 -12 89 95 55 249 16 -20 74 7 -145 -106 -40 154 89
$$ packed form
7125a22J70J1kq4k4J12o4q5L4m6o3J93KO0j54q6K76j68j9P8m5L2l9J36j63Q3j97
7152a74K12j94O5k0J07j19K45j93K9kO5q9J23K7l4j40K63j43N2m7N0k18J20P7
7176F2j19Nl6K2j3K37j45o9Q0j42J46j18J72j50p0LQ7J37j37J49o5K1p6M3M6n2
7202A8L6p0lJ28l9j37l7K98j38l41K57P4q5P6j7qJ72j91nrq7J97j51k3J37j72
7228a20J6J67j42R%P1m9jN1j45R1l7J05J85r9o1m3R8J2K5k86J39K3n8j07J61M8
7255E3j03j1mJ06M9j00n2R7q8J53j45j8K01j50M6r6J5J7kP9N6l2O9k55Q5J59k89
7282a60P6P1L7j25J04J98j98k3KoJ39j44o0K9K33j34r9k5R1j32J12j14J33J5P
7307B7O6j49K67k46M2q5l0P7KK09k03K5j4J01Om0J94k33l6R4o7j52L9O6J94o5
$$ plain form
7333 89 4 46 71 11 -80 -89 -6 -153 -127 58 -109 -15 -69 83 62 134 -23 36 -48 -60 -102 24 44 -10 2 -93 57
7360 57 47 100 37 -56 -36 32 32 -173 -5 40 98 -64 41 14 13 -38 -146 -34 47 -56 -119 114 -76 -53 -122 21
7386 21 -91 -88 53 23 30 -68 -2 -27 13 14 -42 113 158 36 -5 -28 -2 -7 -197 51 -61 51 87 -80 -101 -44 45 0
7414 0 -200 70 9 142 13 -71 -41 -5 -31 65 45 52 39 -41 -80 57 -22 7 -86 -90 -155 -68 -38 35 -108 8 -141 60
7442 60 -26 28 27 47 32 -20 -40 46 56 158 94 -44 -115 5 -81 -11 -20 -82 -99 -58 -20 105 88 65 109 -91 -7 -18 -47
7471 -47 1 20 20 -50 -68 33 -7 7 -84 -18 -25 -49 -43 41 112 -125 -34 80 -94 -104 22 -62 -147 -47 -7 57 -7 26 -37
7500 -37 -5 118 -9 65 18 26 -127 110 122 -39 -225 -137 -90 22 64 -20 -4 -48 12 77 104 -72 -50 -167 35 85
7526 85 -156 -92 27 -194 62 130 49 -59 -79 -44 37 -69 -39 63 -15 17 -60 -55 53 -94 2 63 46 -126 -61 -23
$$ packed form
7333H9q5M2K5o0r1rQ3j47K6J85j67R4n4J52k1P2j57N9q4j2m2J26K0n4J2r5J50
7360E7j0N3o3r3K0O8%k05J68M5N8j62J05k7jn1j08J12Q1j03o3K33j90K3o9J43
7386B1j12LJ41l0Pr8O6k5M0Jn6J55M5j22m1k3K6nj90K48j12J12L6j67k1N7Q9m5
7414@k00K70o1J33j29q4L0L6k6R6k0Pj3q0l9J37p9K9r3mo5Q7L0P3j43J16j49K01
7442F0q6N4jK0j5n2k0Q6J0J02o4j38p1J20q6P0ro2j7M1L8J25j7k3M4k00Q4j1k9
7471d7M8J9%p0j8J01m0J4r1O6pk4OQ4P1k37R1J14j74j0J26q4q5J00M0O4o4L3o3
7500c7L2J23j27P4m7Qj53K37J2j61j86Q8M7J12M2q4J6m4O0O5K7j76K2j17K02N0
7526H5k41O4J19k21K56O8q1j08k0L5Q1j06L0J02p8L2p7NJ08j47R6O1j7j72O5L8
$$ plain form
7552 -23 20 67 -96 -33 -80 -52 129 -113 145 -30 112 -60 -2 79 62 1 36 102 -56 162 -91 -55 -57 -76 30
7577 30 5 -25 1 -128 205 5 18 30 -146 -99 2 -91 61 20 -118 118 3 -90 -23 -86 -155 -49 -8 -33 -4
7602 -4 -144 39 23 72 -62 10 -3 -11 111 -10 48 -5 -18 102 -127 190 -6 -19 28 100 10 -212 16 -20 -39 69
7628 69 53 40 86 -97 9 12 23 220 37 99 17 42 123 -156 63 -151 -97 -2 -28 20 43 -146 -81 18 -127 -147
7654 -147 -124 0 -60 -10 -6 -173 47 -54 -168 152 138 -246 18 37 108 -14 -18 1 -11 -106 -13 29 -28 21 -48 -145
7680 -145 42 -16 7 -122 -44 62 -3 187 -9 89 9 -11 74 59 -62 1 -46 -115 51 -49 54 -48 137 12
7704 12 -101 32 -37 17 25 122 -133 -13 8 -120 54 -203 -49 69 -85 47 68 62 -91 120 -65 -21 -63 -2
7728 -2 -127 23 137 2 -46 -54 -120 -196 -18 -83 48 156 27 -23 -32 -3 22 -58 -60 -61 17 -50 47 -32 30 -28 120 -68
$$ packed form
7552b3M3M7j63O3m7K8J81k42K58j75J42j72N8Q1j7o1L5O6j58K18k53L6kj9J06
7577C0k5l0K6j29L33k00J3J2j76M7J01r3J52m1j38K36j15r3O7o3o9J06M1k5K9
7602dj40J83j6M9j34P2j3qJ22j21N8n3j3J20k29L17j96j3M7P2r0k22K28l6j9J08
7628F9j6j3M6j83J06LJ1J97j83O2q2K5Q1k79K19k14N4R5k6M8K3j89O5R9j45k0
7654a47K3J24o0N0Mj67K20j01j14L20j4l84K64J9P1j22mJ9j2r5R3M2n7M9o9r7
7680a45J87n8K3j29P8J06o5J90j96R8q0k0Q5j5j21O3m7o9J66j00J03j02J85j25
7704A2j13J33o9N4QR7k55J20K1j28J74k57J54J18j54J32K1oj53K11j85M4m2O1
7728bj25J50J14j35m8qo6p6J78o5J31J08j29n0rK9K5q0kjP8o7R7p9O2n8J48j88
$$ plain form
7756 -68 7 33 74 -156 -76 -1 -12 74 110 123 -7 -121 -109 -60 -101 37 -13 -107 -101 74 25 -94 -91 -110 -3 -25 -60 -6
7784 -6 4 -68 -40 179 9 -122 25 -35 -83 -39 25 56 59 71 19 61 36 -54 38 61 119 186 -113 -107 -107 16 -180 -12
7812 -12 -72 -107 23 55 90 -196 -70 14 16 1 -21 -104 38 -30 74 -43 -43 126 -160 41 -21 -26 -24 -91 53 -93 -6
7839 -6 -19 30 9 -29 37 26 88 55 -37 -31 148 20 -158 -21 60 49 89 -149 -146 7 55 87 -82 -73 144 -148 13
7866 13 -53 82 -23 25 -78 3 173 72 67 80 33 -57 -14 -41 -133 -22 79 -27 38 82 17 28 -63 0 19 -113
7892 -113 46 -130 176 91 61 -29 -86 -132 -48 103 1 107 -4 -105 -157 55 -237 61 -7 95 14 71 179
7915 179 18 -123 -71 -7 25 56 48 -28 -49 -62 138 2 118 -13 -37 139 28 56 -60 12 -52 81 -153 -22
7939 -22 75 2 60 69 4 28 117 19 -25 -91 -30 53 -2 -24 49 -45 -154 -13 -3 22 90 73 46 -27 -51 -39 7 145 -58
$$ packed form
7756f8P5K6M1k30Q0P5j1Q6L6J3j30j14J2M9m1J38n0r4OJ75m9j19Lj9J07k2l5N4
7784fJ0p2K8K19j70j31J47o0m8M4O4L1LJ2n2M2k5r0R2K3N8O7k99O%J23j96J68
7812a2o0l5J30L2L5k86J26Q4Kj5k2q3J42o8J04j17%J69k86K01o2nKo7J44j46Q7
7839fj3M9k1l8O6j1O2l3r2OJ79j28j78J37Q1j1M0k38LJ53M8L2j69RK17k92J61
7866A3o6J35j05M8j03Q1J70j01nJ3m7r0M3k7r2J11J01j06O5M4o5J1r1O3J9j32
7892a13J59j76L06q5l0r0n7m6Q4J51j02J06j11j01n2K12k92K98o8J02q1N7J08
7915A79j61j41N2O4L2L1qp6k1j3K00j36J16j31k4J76j11K8j16P2o4J33k34J31
7939b2R7p3N8Ro5K4Q9r8m4o6O1Q3n5k2P3r4j09J41J0K5O8j7k7p3k4J2M6J38k03
$$ plain form
7968 -58 13 105 -37 -183 61 64 -37 -22 5 -9 -119 115 61 28 123 107 -88 43 67 32 -43 9 -18 29 -19 39 -62
7995 -62 -1 51 -59 201 140 53 -5 111 -236 -2 3 87 -112 -222 53 11 37 -61 44 135 -54 -35 21 -7 -34 55
8021 55 1 -39 -20 22 -65 1 89 50 -24 -42 -123 39 31 55 58 35 -72 23 -147 77 109 -60 -13 -38 285 1 -130
8048 -130 -55 38 -54 3 -72 -14 -13 -32 -77 53 -106 22 32 51 71 -33 116 -65 44 4 -89 -185 25 12 84 -145
8074 -145 42 -81 66 -49 -27 70 -3 -78 59 -72 -75 42 15 104 65 -137 22 -49 86 107 14 -99 57 -317
8098 -317 24 -63 10 -99 29 139 -121 100 42 80 15 57 48 -90 2 81 -51 -3 126 -36 28 163 -67 -124
8122 -124 9 26 -60 -74 71 84 39 -24 -45 -36 55 -6 -144 86 -85 33 15 70 80 30 -95 -16 104 7 -9 -35
8148 -35 -109 -12 -55 -107 -21 -75 -82 -3 -84 113 2 -77 107 -59 -14 33 113 28 46 37 -39 -81 -36 -30 127 57 -22 -15 14 25
$$ packed form
7968e8P1R2j42j46K44Lj01J5K7j4j10K34n4l3R5j6j95J31K4l5p5N2k7M7m8N8j01
7995f2O1N2j10K60o1q7n8J16l47K34NQ4j99j10K75m2K6r8J05R1j89J9N6k8k7Q9
8021E5n4m0J9M2q7O6Q8l9p4j8q1J62qK4Lk3j07R5j70K24L2j69M7k5L23k84j31
8048a30P5R3r2N7p5N8Jj9m5J30j59J28J0J9K0j04J49j81J09m0r3r6K10j3P2k29
8074a45J87j23J47j15K2R7p3p5J37j31lJ17k7Q9l9k02J59p1J35K1r3j13J56l74
8098c17L41q7P3j09J28J10k60K21n8L8o5M2rj38R2P9j32M8J29j62O4J35k30n7
8122a24J33J7q6j4J45J3m5o3k1RR1o1j38K30j71J18j8N5J0n0j25P9J20r7j6k6
8148c5p4R7m3n2Q6n4pP9q1J97j11p9J84j66M5M7Q0q5J8rp6m2M5OJ57p0p9PK9J1
$$ plain form
8178 25 -63 35 -138 41 16 -6 193 26 18 105 104 -163 -73
$$ packed form
8178B5q8R8j73J79k5k2J99j67qQ7jk67R0
8191g3
$$ Imaginary data points
##PAGE= N=2
##DATA TABLE= (X++(I..I)), XYDATA
$$ plain form
0 0 0 0 0 0 0 0 0 0 0 0 0 8 -8 8 -8 14 -16 17 -24 30 -32 40 -48 56 -70 80 -94 107 -123 144 -165 187 -214
33 -214 242 -274 310 -348 391 -434 489 -545 603 -671 744 -824 909 -1003 1107 -1221 1346
50 1346 -1481 1632 -1796 1982 -2187 2418 -2679 2976 -3317 3718 -4193 4764 -5469 6367 -7549
65 -7549 9191 -11638 15735 -24396 84939 -132276 -66694 9352 -140192 199089 -22688
76 -22688 -130192 131127 -33424 36389 77445 -206928 49251 76265 -53133 90869 -105030
87 -105030 -60239 165464 -34090 -3566 -23325 -125118 108025 52547 -55535 25062 -75605
98 -75605 47067 82363 -92325 -16126 -32901 4686 126489 -51535 -46760 18844 -42483 80477
110 80477 -20625 -98025 64630 -1395 45044 39768 -138023 25002 51164 -29759 76659
$$ packed form
0@%%%%%%%%%%%Qj6J6j6K2l0L3m1N4o2P2q8J04j26J50j74K01k30K67l09L52m01
33b14M56n16N84o58P39q25R23j034J148j274J415j568J733j912K110k328K567
50A346k827L113l428L778m169M605n097N655o293P035p911Q957j0233J1836j3916
65g549J6740k0829K7373m0131J09335k17215O5582P6046j49544L39281k21777
76b2688j07504K61319j64551O9813M1056k84373K56179K7014j29398J44002j95899
87a05030M4791K25703j99554L0524j9759j01793K33143n5478j08082Q0597j00667
98g5605J22672L5296j74688P6199j6775L7587J21803j78024M775O5604o1327J22960
110H0477j01102p7400J62655o6025M6439n276j77791J63025K6162q0923J06418
$$ plain form
121 76659 -83841 -52639 123037 -41430 13489 13711 -108977 93964 29511 -77889 55382
132 55382 -53993 14490 109548 -95039 -11526 24057 -53197 100590 -10123 -79847 63718
143 63718 -22538 12505 45783 -90697 18618 46128 -25556 43983 -44189 -35065 67087 -17862
155 -17862 -222 2014 -47825 46616 22029 -31095 7573 -26618 15528 33702 -32812 -3218
167 -3218 -11104 4975 41449 -28311 -15685 5248 -15148 35603 -7511 -34265 24929 -9694
179 -9694 11108 13061 -47526 17567 13583 -14254 27992 -33394 -14458 43324 -24045 5565 8395
192 8395 -41408 36402 9210 -29650 24087 -19329 -473 34121 -31241 20 12840 -18941
204 -18941 30949 -4861 -26186 24579 -10042 1741 19133 -26168 6255 17493 -12982 10641
$$ packed form
121G6659j60500L1202J75676j64467N4919K22j22688K02941o4453j07400J33271
132E5382j09375O8483R5058k04587Q3513L5583p7254J53787j10713o9724J43565
143F3718q6256L5043L3278j36480J09315K7510p1684O9539q8172R124J02152q4949
155a7862J7640K236m9839R4441k4587n3124L8668l4191M2146J8174o6514K9594
167c218p886J6079L6474o9760J2626K0933k0396N0751m3114k6754N9194l4623
179i694K0802J953o0587O5093l984k7837M2246o1386J8936N7782o7369K9610K830
192H395m9803P7810k7192l8860N3737m3416J8856L4594o5362L1261J2820l1781
204a8941M9890l5810k1325N0765l4621J1783J7392m5301L2423J1238l0475K3623
$$ plain form
216 10641 -4945 -11473 18557 -1962 -1919 2514 -8913 9296 4609 -6080 2722 -3238 1538 7257
230 7257 -5114 -1827 156 2244 4084 -5316 600 -2772 -1219 8449 -5749 -3294 5167 -6189
244 -6189 2459 2514 -10372 5732 136 -4500 6423 -8299 -1371 6197 -7832 2892 2246 -9625
258 -9625 7302 -368 -8279 7861 -4644 -2959 7074 -6205 -1044 4008 -4997 2751 1843 -4944
272 -4944 4338 -1494 -1891 4683 -3553 603 4179 -3480 899 3347 -4302 2659 3242 -3366 3072 1389
288 1389 -1899 2193 1481 -940 2061 970 -91 1440 -826 1897 409 -379 2252 -42 -941 2025
304 2025 -238 -1832 3124 -749 -1593 1999 -711 -1307 904 206 -1590 1032 -328 -1296 -228 -304 -336
321 -336 -1163 270 -672 -1451 -537 76 -1877 -424 735 -2538 408 -404 -1657 -61 -416 -676 -364 -532
$$ packed form
216A0641j5586o528L0030k0519M3M433j1427J8209m687j0689Q802n960M776N719
230G257j2371L287J983K088J840r400N916l372J553R668j4198K455Q461j1356
244f189Q648N5j2886J6104n596m636J0923j4722O928P568j4029J0724o46j1871
258i625J6927p670p911J6140j2505J685J0033j3279N161N052r005P748r08o787
272d944R282n832l97O574q236M156L576p659M379K448p649O961N83o608O438j683
288A389l288M092p12k421L001j091j061J531k266K723j488p88K631k294q99K966
304B025k263j594M956l873q44L592k710n96K211o98j796K622j360r68J068p6l2
321c36q27J433r42p79R14O13j953J453J159l273K946q12j253J596l55k60L12j68
$$ plain form
339 -532 -528 -684 -1022 1714 -1998 -478 2015 -2832 1144 919 -2890 1886 1270 -1845 2497 -1626 -685
356 -685 3631 -2708 2132 841 -2681 4719 -555 -2518 4294 -2116 683 5271 -4745 1536 2765
371 2765 -2491 4598 -1411 -1949 3840 -1246 1545 1079 -4644 3796 1694 -2612 3255 -4123 -78 4604
387 4604 -2272 374 -1569 -1228 4203 -2021 -978 -98 -4274 5918 57 -6395 3202 -4033 1400
402 1400 5095 -8188 124 1470 -2959 6734 -5792 -5843 7665 -4996 3485 1527 -12683 8111
416 8111 2997 -6201 6414 -8436 -2335 12859 -7566 -336 1653 -8466 12523 -118 -9112
429 -9112 5975 -5748 4601 9507 -12950 1452 4658 -3691 11034 -6271 -8055 9941 -1034
442 -1034 3907 198 -10484 7102 4806 -819 2401 -9930 3030 10025 -4381 1863 -5898 -2289
$$ packed form
339e32Mj56l38K736l712J520K493m847L976k25l809M776o16l115M342m123R41
356f85M316o339M840j291l522P400n274j963O812o410K799M588j0016O281J229
371B765n256P089o009n38N789n086K791m66n723Q440k102m306N867p378M045M682
387D604o876K646j943L41N431o224J043Q80m176J0192n861o452R597p235N433
402A400L695j3283Q312J346m429R693j2526n1J3508j2661Q481j958j4210K0794
416H111n114r198J2615j4850O101J5194k0425P230J989j0119K0989j2641q994
429i112J5087j1723J0349M906k2457J4402L206q349J4725j7305j784J7996j0975
442a034M941l709j0682J7586k296n625L220j2331J2960O995j4406O244p761L609
$$ plain form
456 -2289 12812 -3019 -3141 -1474 -4927 12193 1121 -9622 3060 -5704 7107 9308 -15790
469 -15790 1187 2289 -2412 12924 -10966 -9698 11904 -4198 5838 330 -18981 12095 5090
482 5090 -6268 7449 -16115 -397 17810 -10230 198 -2118 -11004 18593 -832 -12764 5634
495 5634 -8657 9170 10594 -17444 1108 2205 -497 13885 -11345 -8800 10167 -1740 7869
508 7869 -2883 -13844 9975 4023 1397 1372 -14111 5895 10583 -3643 3039 -10337 -1256 16445
522 16445 -4878 -1029 -2574 -7048 16721 155 -9751 3561 -7396 10286 10316 -17201 3135
535 3135 768 -1901 16961 -13719 -8698 12692 -5962 8680 -160 -19039 12858 3635 -4676
548 -4676 7949 -17625 1889 15581 -10698 3802 -4951 -10311 18430 -2895 -9588 5223 -9959
$$ packed form
456b289J5101j5831j22J667l453J7120j1072j0743J2682q764J2811K201k5098
469a5790J6977J102m701J5336k3890J268K1602j6102J0036n508j9311L1076p005
482E090j1358J3717k3564J5718J8207k8040J0428k316q886K9597j9425j1932J8398
495E634j4291J7827J424k8038J8552J097k702J4382k5230K545J8967j1907R609
508G869j0752j0961K3819n952k626k5j5483K0006M688j4226O682j3376R081J7701
522A6445k1323L849j545m474K3769j6566r906J3312j0957J7682L0k7517K0336
535C135k367k669J8862l0680N021K1390j8654J4642q840j8879L1897r223q311
548d676J2625k5574J9514J3692k6279J4500q753n360K8741k1325o693J4811j5182
$$ plain form
561 -9959 9236 8055 -15797 2714 -1386 301 12164 -11893 -4966 6366 -3040 8970 -3951
574 -3951 -11576 9314 -86 2164 2062 -13295 6458 6187 -3198 4554 -10041 -243 12537 -5966
588 -5966 2142 -2165 -7476 14752 -2397 -6185 5707 -8478 8506 7582 -13213 5161 -506 -2573
602 -2573 13722 -10559 -4038 9580 -7137 8607 35 -12836 11210 75 -2901 7751 -12327
615 -12327 2139 9992 -8593 4954 -3362 -6802 12421 -4088 -4358 4093 -7521 6208 3855
628 3855 -9657 3576 -2299 -306 7265 -8207 -629 2672 -3437 5911 -3718 -5486 5550 -2550
642 -2550 1582 1474 -7780 4670 835 -2421 4039 -6764 1099 5428 -5297 3117 -1405 -4524 8402
657 8402 -3203 -2376 4299 -6204 5093 3064 -7038 4897 -1407 -1702 7306 -5585 -537 5060
$$ packed form
561i959J9195j181k3852J8511m100J687J1863k4057O927J1332r406J2010j2921
574c951p625K0890r400K250j02j5357J9753k71r385P752j4595R798J2780j8503
588e966Q108m307n311K2228j7149l788J1892j4185J6984r24k0795J8374n667k067
602b573J6295k4281O521J3618j6717J5744q572j2871K4046j1135k976J0652k0078
615a2327J4466P853j8585J3547q316l440J9223j6509k70Q451j1614J3729k353
628C855j3512J3233n875J993P571j5472P578L301o109R348r629j768J1036q100
642b550M132j08r254J2450l835l256O460j0803P863M329j0725Q414m522l119J2926
657H402j1605Q27O675j0503J1297k029j0102J1935o304k95R008j2891N048N597
$$ plain form
671 5060 -4805 5209 365 -5768 6552 -1446 -1020 4601 -5405 1725 4315 -4438 3039 -291 -3128
686 -3128 5328 -2124 -1049 2353 -3032 2313 1009 -3022 1889 -987 -523 2322 -2838 227 710 -1749
702 -1749 1855 -1475 -1077 1278 -1417 671 -210 -1996 1173 -910 -783 1131 -2640 857 691 -2291
718 -2291 1685 -1309 -1374 2141 -1699 -330 1304 -1954 1217 366 -1743 1872 -1143 -186 1774 -1802
734 -1802 421 1086 -1499 1591 435 -1402 1965 -386 -435 1600 -788 542 752 -286 474 518 -290
751 -290 863 127 -192 1066 -188 397 330 91 153 448 199 -160 512 -126 10 337 27 -158 322 -148
771 -148 -296 213 -610 125 -59 -360 160 -371 -304 86 -517 -487 235 -752 -129 -48 -719 16 -338 -501 -3
792 -3 -90 -506 89 -286 -281 120 -536 251 -134 -526 188 -148 -371 479 -28 -249 684 -222 -5 520 -200 323
$$ packed form
671E060r865J0014m844o133J2320p998M26N621j0006P130K590q753P477l330k837
686c128Q456p452J075L402n385N345j304m031M911k876M64K845n160L065M83k459
702a749L604l330L98K355k695K088q81j786L169k083J27J914l771L497j66k982
718b291L976k994o5L515l840J369J634l258L171q51k109L615l015R57J960l576
734a802K223O65k585L090j156j837L367k351m9K035k388J330K10j038P60M4q08
751b90J153p36l19J258j254N85o7k39O2K95k49l59O72o38J36L27l10j85M80m70
771a48j48N09q23P35j84l01N20n31O7L90o03L0P22r87O23Q1o71P35l54j63M98
792cq7m16N95l75NM01o56P87l85l92P14l36k23Q50n07k21R33r06K17N25p20N23
$$ plain form
814 323 280 262 290 10 425 459 -366 783 62 -436 1295 -342 -148 892 -231 611 421 -230 716 217
834 217 108 971 -875 692 575 -1156 1429 -269 -833 1413 -690 -434 986 -1327 576 554 -1318
851 -1318 1251 -1182 -431 1211 -1919 479 287 -1862 1566 -391 -1904 1801 -1703 -90 1315 -2634
867 -2634 973 62 -1408 1904 -1889 -654 2134 -2406 1087 708 -2896 2775 -690 -1502 2674 -2325
883 -2325 645 1853 -2708 1960 97 -1873 3698 -2054 -749 3113 -3201 2187 1465 -3441 3347
898 3347 -399 -1363 3746 -2771 522 2706 -3180 3120 -287 -2659 4572 -2064 -534 3158 -3943
913 -3943 2131 1895 -3744 3236 -1453 -1287 4064 -3764 727 1934 -3602 3823 -693 -3212 4105 -2901
929 -2901 -201 3132 -5080 2354 912 -3625 3733 -2997 -1397 3860 -3998 1274 1098 -4839 4386
$$ packed form
814C23m3j8K8k80M15L4q25J149p21m98J731j637J94J040j123Q42j90o51R46m99
834B17j09Q63j846J567j17j731K585j698n64K246k103K56J420k313J903k2j872
851a318K569k433P51J642l130K398j92k149L428j957j513L705l504J613J405l949
867b634L607r11j470L312l793J235K788m540L493l79l604N671l465q12M176m999
883b325K970J208m561M668j863j970N571n752J305L862o314N388p22m906O788
898C347l746r64N109o517L293K184n886O300l407k372P231o636J530L692p101
913c943O074k36n639O980m689J66N351p828M491J207n536P425m516k519P317p006
929b901K700L333q212P434j442m537P358o730J600N257p858N272j76n937R225
$$ plain form
944 4386 -1025 -3331 4454 -4385 378 3691 -5511 2436 527 -3572 5084 -2976 -1991 4408 -4513
959 -4513 2679 1937 -5703 5101 -998 -2586 5181 -4490 219 4662 -4715 3178 274 -4054 5995
974 5995 -2514 -1057 4139 -4882 3383 2444 -5286 4267 -987 -2066 5704 -4360 -82 3583 -4294
989 -4294 4051 -354 -3857 5119 -2354 -274 3468 -5649 2815 2207 -4360 4461 -2666 -2222 5203 -4193
1005 -4193 421 1913 -4703 4338 -585 -4066 4361 -3827 237 4141 -5999 2313 963 -3998 4769
1020 4769 -2764 -2626 4648 -3962 1363 1901 -5327 4243 -269 -3007 4429 -4313 196 4404 -4734
1035 -4734 2181 898 -3833 5044 -1636 -2359 3826 -3388 2153 2147 -4467 3373 -518 -1614 4621 -3666
1051 -3666 -238 3762 -3351 2693 451 -3450 4232 -1185 -635 2659 -3706 1991 1871 -3138 3156
$$ packed form
944D386n411k306P785q839M763L313r202P947j909m099Q656q060R85O399q921
959d513P192p42p640J0804o099j588P767r671M709M443r377P893k904m328J0049
974E995q509J457N196r021Q265r39p730R553n254j079P770j0064M278L665p877
989d294Q345m405l503Q976p473K080L742r117Q464o08o567Q821p127M44P425r396
1005d193M614J492o616R041m923l481Q427q188M064L904j0140Q312j350m961Q767
1020D769p533J38P274q610N325N38p228R570m512k738P436q742M509M208r138
1035d734O915j283m731Q877o680p23O185p214N541oo614P840l891j096O235q287
1051c666L428M000p113O044k242l901P682n417N50L294o365N697j20n009O294
$$ plain form
1066 3156 -1294 -1692 4325 -3181 -65 2317 -3305 2890 270 -3095 2634 -1841 -175 2788 -3812
1081 -3812 1360 1177 -3005 3164 -1911 -2094 3572 -2364 120 1660 -3547 2041 521 -2368 2205
1096 2205 -2216 -444 2432 -3108 1027 490 -2400 2674 -908 -1942 2325 -1837 413 1542 -2512
1111 -2512 1346 160 -1148 1890 -1458 -194 1817 -1571 1051 419 -1647 2359 -188 -785 1656
1126 1656 -1435 570 1006 -1248 1064 86 -458 1955 -1080 74 1141 -1366 1417 155 -1392 1504
1142 1504 -429 -228 1109 -1240 436 574 -1025 1109 -675 -698 1387 -1239 117 696 -1409 755
1158 755 95 -1356 761 -532 -520 915 -1031 -114 150 -653 762 -610 -725 709 -850 -144 409
1175 409 -976 245 269 -718 345 -400 -44 264 -347 321 -208 -551 451 -326 -296 613 -488 338 514
$$ packed form
1066C156m450l98O017p506L116K382n622O195k620l365N729m475J666K963o600
1081c812N172j83m182O169n075j83N666n936K484J540n207N588j520k889M573
1096B205m421J772K876n540M135n37k890N074l582j034M267m162K250J129m054
1111b512L858j186j308L038l348J264K011l388K622o32k066M006k547n97K441
1126A656l091K005M36k254K312r78n44K413l035J154J067k507K783j262j547K896
1142A504j933K01J337k349J676J38j599K134j784k3K085k626J356N79k105K164
1158G55o60j451K117j293J2J435j946R17K64q03J415j372j15J434j559P06N53
1175D09j385J221K4r87J063p45L56L08o11O68n29l43J002p77L0R09j101Q26J76
$$ plain form
1194 514 -483 180 304 190 417 30 197 236 -164 515 -22 -51 703 -27 148 524 -294 109 407 -60 140
1215 140 215 -72 112 51 406 101 -230 319 -103 -228 342 -136 -242 209 -264 -197 228 -120 -40 -74 -125 -92
1237 -92 -117 -16 -298 -204 35 -58 -165 -38 -240 -329 -6 -166 -13 -4 108 -423 -252 54 -145 -130 85 142 -201
1260 -201 58 -144 -81 10 38 -69 55 141 -30 -42 94 4 -182 309 8 -211 318 133 -4 341 377 105
1282 105 241 246 -81 166 236 195 32 327 193 -151 207 204 -86 115 274 -156 25 232 -163 13 87 -127
1304 -127 -145 10 74 -28 -75 215 -136 -75 47 -401 -137 -101 -172 -97 -121 55 -117 -165 -203 -211 -218 21 -318 -257 169
1329 169 -316 19 200 -249 -171 128 -254 70 -37 -116 130 25 136 -303 -190 299 -114 121 272 -65 -120
1350 -120 306 -27 129 176 42 311 43 68 68 -9 357 65 -41 306 55 240 349 -166 -84 262 13 247
$$ packed form
1194E14r97O63J24j14K27l87J67L9m00O79n37k9P54p30J75L76q18M03K98m67K00
1215A40P5k87J84o1L55l05l31N49m22j25N70m78j06M51m73O7M25l48Q0l4n1L3
1237i2k5J01k82R4K39r3j07J27k02q9L23j60J53RJ12n31J71L06j99J5K15N7l43
1260b01K59k02O3R1K8j07J24Q6j71j2J36r0j86M91l01k19N29j85j37L45L6k72
1282A05J36Nl27K47P0m1j63K95j34l44L58lk90K01J59m30J81K07l95J76P4k14
1304a27j8J55O4j02m7K90l51O1J22m48K64L6p1P5k4J76j72m8l8qpK39l39O1M26
1329A69m85L35J81m49P8K99l82L24j07p9K46j05J11m39J13M89m13K35J51l37n5
1350a20M26l33J56M7j34K69k68K5%p7L66k92j06L47k51J85J09n15Q2L46k49K34
$$ plain form
1372 247 -37 17 20 144 243 114 -496 98 183 -242 161 -428 -152 475 -235 -160 -193 -205 249 -126 -311 -105 -333
1395 -333 140 291 -655 -20 33 14 234 -349 -407 86 -96 37 -165 -470 384 17 30 201 -659 226 376
1416 376 -253 137 -176 -38 560 75 25 22 -345 448 308 -197 196 -355 453 576 -398 -112 315 -5 446
1437 446 -123 -400 199 101 459 56 -520 350 169 122 194 -577 -77 811 -128 24 -194 -300 732 -51 -177
1458 -177 -77 -533 337 208 -544 -65 -261 12 614 -542 -332 281 -335 408 -339 -660 117 -115 206 -98
1478 -98 -880 91 342 -237 184 -756 -295 735 -23 -26 -117 -558 557 327 -516 243 -297 415 662 -673
1498 -673 -121 114 -71 725 -239 -681 480 -88 559 421 -714 157 435 194 509 -608 21 695 -41
1517 -41 277 -58 -551 844 172 -178 157 -476 565 379 -492 -121 -259 163 753 -708 -336 66 -514
$$ packed form
1372B47k84N4LJ24R9j29o10N94Q5m25M03n89K76O27p10P5l3j2M54l75j85K06k28
1395c33M73J51r46O35N3j9K20n83n8M93j82J33k02l05Q54l67J3J71q60Q85J50
1416C76o29L90l13J38N98m85n0ll67P93j40n05L93n51Q08J23r74K86M27l20M51
1437D46n69k77N99r8L58m03n76Q70j81m7P2p71N00Q88r39J52k18j06J032p83j26
1458a77J00m56Q70j29p52M79j96K73O02j156K10O13o16P43p47l21P77k32L21l04
1478i8p82R71K51n79M21r40M61J030p58lr1m41J115k30q43P59n40P12K47j335
1498f73N52K35j85P96r64m42J161n68O47j38j135Q71K78k41L15j117O29O74p36
1517d1L18l35m93J395o72l50L35o33J041j86q71L71j38M22N90j461L72M02n80
$$ plain form
1536 -514 577 -13 -851 235 15 12 178 -850 -106 424 -216 429 -534 -549 645 -301 48 -15 -713 397
1556 397 283 -528 118 -488 -35 511 -386 -169 19 -227 611 -186 -474 334 -204 255 257 -661 210 350 -209
1577 -209 407 -202 -118 549 -80 230 -40 -347 514 144 -281 231 -165 242 595 -416 118 37 -55 602 -132
1598 -132 -113 241 -100 367 240 -463 342 -233 -69 240 -352 -9 209 -226 138 -172 -452 403 0 -202
1618 -202 195 -397 136 297 -597 135 -176 -264 343 -269 -275 115 -310 134 9 -295 169 -28 9 115 -283
1639 -283 -44 321 -167 303 -62 -283 364 -105 29 221 -266 139 45 -45 311 -88 159 359 -145 294 156
1660 156 -33 222 77 -43 223 107 87 180 -64 196 210 23 176 -63 -148 164 -122 -11 -70 -100 170 68
1682 68 -8 -84 -94 -28 134 -270 35 -119 -46 74 -58 3 156 -201 -205 113 -245 143 -179 -105 20 -14 -112 16
$$ packed form
1536e14J091n90q38J086k20lJ66j028P44N30o40O45r63j5J194r46L49o3o98J110
1556C97j14q11O46o06M53N46q97K17J88k46Q38p97k88Q08n38M59Kr18Q71J40n59
1577b09O16o09Q4O67o29L10k70l07Q61l70m25N12l96M07L53j011N34q1r2O57p34
1598a32J9L54l41M67j27p03Q05n75J64L09n92L43K18m35L64l10k80Q55m03k02
1618b02L97n92N33J61q94P32l11q8O07o12oL90m25M44j25l04M64j97L7J06l98
1639b83K39L65m88M70l65k21O47m69J34J92m87M05r4r0L56l99K47K00n04M39j38
1660A56j89K55j45j20K66j16k0R3k44K60J4j87J53k39q5L12k86J11n9l0K70j02
1682F8p6p6j0O6J62m04L05j54P3J20j32O1J53l57mL18l58L88l22P4J25l4r8J28
$$ plain form
1706 16 -162 79 -46 -118 40 23 -173 7 -131 100 102 -77 -36 188 -48 64 125 -32 78 122 -82 -88 89
1729 89 -41 86 -33 59 65 15 37 -23 -31 29 -27 117 107 5 10 40 33 231 161 19 -22 79 -12 -28 120 -83 -79 84
1757 84 -83 -47 115 -86 -7 92 3 -145 -97 -84 73 -147 -297 -54 -28 105 -34 -29 -70 -52 -86 -8 -81 -165 31
1782 31 -27 -51 -59 -193 182 -121 72 99 -160 98 1 -78 285 -6 -125 225 -122 115 13 -195 56 18 -147
1805 -147 229 -145 73 314 -50 216 151 36 372 -171 112 296 -249 248 127 -178 220 50 -14 458 -233
1826 -233 -81 279 -195 322 32 -161 167 -204 87 426 -547 197 49 -242 325 -324 -253 242 -219 0
1846 0 148 -694 348 152 -306 368 -532 -130 366 -489 14 13 -468 714 -145 -539 392 -455 163 451 -709
1867 -709 324 28 -340 487 -438 -73 632 -371 281 28 -814 689 28 -232 468 -833 129 503 -555
$$ packed form
1706A6j78K41j25p2J58j7j96J80j38K31Kj79M1K24k36J12O1j57J10M4k04oJ77
1729H9j30J27j19R2On0K2o0qO0n6J44j0j02NL0pJ98p0j42m1J01r1j6J48k03MJ63
1757H4j67L6J62k01P9R9q9j48M8J3J57k20j50K43K6J33j39Nm1J8l4P8p3q4J96
1782C1n8k4qj34L75l03J93K7k59K58r7p9L63k91j19L50l47K37j02k08K51l8j65
1805a47L76l74K18K41l64K66o5j15L36n43K83J84n45M97j21l05L98j70o4M72o91
1826b33J52L60m74N17k90j93L28l71K91L39r73P44j48k91N67o49P1M95m61K19
1846@J48q42J042j96m58O74r00M02M96q55N03jm81J182q59l94R31q47O18K88j160
1867g09J033k96l68Q27r25L65P05j003O52k53q42J503o61k60P00j301R62L74j058
$$ plain form
1886 -555 242 -143 -454 969 -467 -308 205 -614 616 219 -672 461 -234 26 889 -700 -60 525
1904 525 -545 810 -323 -799 853 -459 -86 319 -1097 576 311 -696 362 -800 -301 1120
1920 1120 -591 -77 -15 -917 973 90 -935 581 -570 281 820 -1145 222 236 -310 1011 -703
1937 -703 -773 702 -545 345 249 -1215 780 217 -374 725 -893 11 1082 -729 307 -295 -693 1155
1955 1155 -164 -514 529 -803 757 601 -987 479 -273 -38 1260 -950 -279 783 -450 831
1971 831 -43 -1050 802 -179 77 510 -1211 450 774 -559 537 -717 -601 1394 -580 -198 332
1988 332 -963 1021 168 -997 463 -442 259 986 -1156 54 218 -450 928 -567 -729 772 -339
2005 -339 334 307 -1337 528 331 -396 429 -826 -111 1052 -420 141 -145 -635 1118 -269 -499 448
$$ packed form
1886e55P97l85l11J423j436J59N13q19J230l97q91J133o95K60Q63j589O40N85
1904E25j070J355j133m76J652j312L73M05j416J673k65j007J058j162M99J421
1920A120j711N14O2r02J890q83j025J516j151Q51N39j965J367J4n46J321j714
1937g03p0J475j247Q90r6j464J995n63n91J099j618R04J071j811J036o02l98J848
1955A155j319l50J043j332J560j56j588J466p52K35J298k210O71J062j233J281
1971H31q74j007J852r81K56M33j721J661L24j333J096j254J16J995j974L82N30
1988C32j295J984q53j165J460r05P01P27k142J210J64o68J378j495j62J501j111
2005c39O73k7j644J865j97p27Q25j255P15J163j472N61k86m90J753j387k30R47
$$ plain form
2023 448 -536 433 715 -915 239 0 -127 1075 -693 -356 523 -439 686 81 -675 621 219 -36
2041 -36 303 -728 205 643 -364 454 -391 -367 674 -310 -157 92 -523 736 152 -550 253 -263 185
2060 185 441 -583 8 174 -382 566 -297 -673 447 -219 197 217 -585 296 91 -150 208 -352 -113 553
2080 553 -265 70 -243 -402 597 -10 -484 92 -225 105 382 -437 14 19 46 380 -343 -113 148 -161 217
2101 217 -76 -338 162 -59 -15 235 -283 175 325 -156 168 -77 71 295 38 -1 128 -209 222 71 -225
2122 -225 147 -95 -40 220 -58 -18 157 108 152 -72 -6 169 -108 -72 77 -96 98 141 -191 65 65 4 60 -52
2146 -52 -76 -94 -37 43 -58 96 -23 -138 189 146 22 -103 174 -27 -24 -88 -154 -27 18 83 60 -10 166 -31 119
2171 119 -28 54 -83 254 -175 82 101 -48 178 125 -108 -90 62 -54 125 -146 22 41 134 221 55 118 -67
$$ packed form
2023D48r84R69K82j630J154k39j27J202j768L37Q79r62J125o05p56J296m02k55
2041c6L39j031R33M38j007Q18q45K4J041r84J53K49o15J259n84p02Q03n16M48
2060A85K56j024N91J66n56R48q63l76J120o66M16K0q02Q81k05k41L58n60K39O66
2080E53q18L35l13j59R99o07m74N76l17L30K77q19M51NK7L34p23K30K61l09L78
2101B17k93k62N00k21M4K50n18M58J50m81L24k45J48K24k57l9J29l37M31j51k96
2122b25L72k42N5K60k78M0J75m9M4k24O6J75k77L6J49j73J94M3l32K56%o1N6j12
2146e2k4j8N7Q0j01J54j19j15L27m3j24j25K77k01Lo4o6J27M5O5k3p0J76j97J50
2171A19j47Q2j37L37m29K57J9j49K26n3k33J8J52j16J79k71J68J9R3Q7j66O3j85
$$ plain form
2194 -67 -63 -110 20 126 37 219 -32 63 -158 123 -37 129 42 -100 -31 -47 -222 -127 24 -9 21 105 -80 -138 -87
2219 -87 100 -77 -16 -55 -185 -99 62 -14 -24 47 -50 107 -44 -234 -14 -124 -19 3 16 227 56 -89 97
2242 97 -119 -5 6 -184 132 2 6 -59 115 164 151 25 77 -11 -127 145 156 -84 93 -66 -65 -118 -59 175 -7
2267 -7 61 58 -47 193 82 74 -17 -66 -108 22 108 -34 100 7 4 -15 -12 -21 99 -33 4 -97 -65 -99 -101 49 100 -55
2295 -55 93 194 -95 -29 18 -134 70 71 6 -136 -66 19 -36 177 14 -45 -102 58 -76 -132 -111 -1 142 143 -52
2320 -52 -81 4 171 -159 -104 98 -34 122 45 -276 -30 93 99 -10 -177 15 -212 139 123 -198 61 25 -100
2343 -100 102 22 -326 295 245 33 -214 -122 -25 49 -28 -25 -143 102 278 -167 -76 -108 -146 250 40 -212 -147 180
2367 180 199 -91 -301 6 -145 54 292 -369 -254 203 -176 210 -21 -386 350 223 173 110 -310 119 309
$$ packed form
2194f7Mm7J30J06q9J82k51R5k21K81j60J66q7j42O9j6j75R5J51l3L0Q4j85n8N1
2219h7J87j77O1l9j30Q6J61p6j0P1r7J57j51j90K20j10J05K2J3K11j71j45J86
2242I7k16J14J1j90L16j30Mo5J74M9j3j26N2q8j16K72J1k40J77j59Jn3N9K34j82
2267gO8lj05K40j11qr1m9m2J30Q6j42J34r3lj9LrJ20j32L7j01L2l4kJ50N1j55
2295e5J48J01k89O6M7j52K04Jo5j42P0Q5n5K13j63n9n7J60j34n6K1J10J43Jj95
2320e2k9Q5J67l30N5K02j32J56p7l21K46J23Oj09j67J92k27L51j6l21K59l6j25
2343a00K02q0l48O21n0k12k47R2R7P4p7Lj18K45J76m45R1l2l8L96k10k52O5L27
2367A80J9k90k10L07j51J99K38o61J15M57l79L86k31l65P36j27n0o3m20M29J90
$$ plain form
2388 309 -171 148 -107 -112 541 -178 -486 186 -404 435 231 -481 194 -48 179 335 -428 -123 326 93 536
2409 536 -258 -416 563 -120 140 217 -601 290 364 -74 133 -309 30 257 -120 -1 -52 -438 733 -30 -446
2430 -446 281 -132 146 484 -445 -21 39 -224 397 -375 -324 252 -129 286 -34 -623 458 212 -286 293
2450 293 -450 -123 592 -421 45 -308 -223 554 -139 -261 230 -500 528 213 -693 316 -242 -36 618
2469 618 -369 -98 222 -148 416 -192 -536 440 -6 175 226 -574 351 534 -396 271 -300 -94 724 -346
2489 -346 -124 29 -432 661 99 -496 280 -495 242 502 -534 105 163 -160 540 -190 -218 450 -313 310
2509 310 68 -592 393 -140 -220 264 -505 20 659 -254 141 -31 -526 597 -78 -52 221 -218 337 230
2529 230 -553 384 -92 -295 644 -492 -124 245 -283 316 11 -257 395 -17 -130 244 -393 170 256 -294
$$ packed form
2388C09m80L19k55nO53p19l08O72n90Q39k04p12O75k42K27J56p63L05M49k33M43
2409E36p94j58R79o83K60P7q18Q91P4m38K07m42L39K27l77J19n1l86J171p63m16
2430d46P27m13K78L38r29M24O0k63O21p72N1N76l81M15l20n89J081k46m98N79
2450B93p43L27P15j013M66l53Q5P77o93j22M91p30J028l15r06J009n58K06O54
2469F18r87K71L20l70N64o08l44R76m46J81N1q00R25J83r30O67n71K06Q18j070
2489c46K22J53m61J093n62n95P76p75P37K60j036O39N8l23P00p30k8O68p63O23
2509C10k42o60R85n33q0M84p69N25O39r13L95j72m95J123o75K6K73m39N55j07
2529B30p83R37m76k03R39j136L68L69n28N99l05k68O52m12j13L74o37N63Q6n50
$$ plain form
2549 -294 283 -202 -267 487 -191 -139 24 -363 163 137 -278 305 -78 2 424 -436 130 -75 -202 382 -303
2570 -303 -277 167 -276 -89 156 -369 407 19 -258 233 -299 160 354 -275 -39 -120 -376 306 50 -208 239
2591 239 -209 81 118 -255 64 -125 -119 31 -195 61 218 -354 172 -31 -173 201 -172 -64 62 -200 7
2612 7 92 -190 169 -91 -108 84 -245 92 22 -86 57 141 -173 -8 5 -64 120 -193 -54 108 -258 212 -52
2635 -52 39 135 -131 142 83 -75 -146 -133 -121 17 -37 -62 54 -15 119 -110 -67 37 17 10 33 -3 6 16 -283 -51
2661 -51 146 -15 62 100 20 -20 -37 -69 -138 32 103 -49 52 24 -191 -130 40 -4 24 220 -16 -158 20 -88
2685 -88 17 -9 -70 92 46 100 93 -76 144 -56 -251 107 -70 -153 -14 -23 -19 -136 75 -145 28 145 -110 -40
2709 -40 89 91 -66 -26 -14 -31 15 -192 76 -8 -86 5 -113 3 73 -137 32 -42 -15 201 -61 -9 24 -81 69
$$ packed form
2549b94N77m85o5P54o78N2J63l87N26k6m15N83l83Q0M22q60N66k05j27N84o85
2570c03K6M44m43J87K45n25P76l88k77M91n32M59J94o29K36q1k56O82k56k58M47
2591B39m48K90L7l73L19j89OJ50k26K56J57n72N26k03j42L74l73J08J26k62K07
2612GQ5k82L59k60j7J92l29L37p0j08J43Q4l14J65J3o9J84l13J39J62l66M70k64
2635e2R1R6k66K73n9j58p1J3J2J38n4k5J16o9J34k29M3J04k0pK3l6RJ0k99K32
2661e1J97j61P7L8q0m0j7l2o9J70P1j52J01k8k15O1J70m4K8J96k36j42J78j08
2685h8J05k6o1J62m6N4pj69K20k00j95L58j77q3J39rMj17K11k20J73J17k55P0
2709d0J29Kj57M0J2j7M6k07K68q4p8R1j18J16P0k10J69p4K7K16k62N2L3j05J50
$$ plain form
2734 69 -66 -67 -16 55 -136 137 -79 34 37 -60 64 -88 -116 52 -77 -11 111 57 116 32 -6 236 -104 -60 -14
2759 -14 -145 189 59 -128 62 0 -175 254 -207 -47 46 -27 139 9 -123 -32 -47 -65 332 -451 109 25 -174
2782 -174 111 -78 -170 294 -71 -159 92 -142 99 24 -171 331 -375 113 337 -371 227 5 -182 241 -24
2803 -24 -258 323 -101 28 127 -330 192 -44 -209 308 -463 -121 378 -179 223 293 -342 318 -92 -425 140
2824 140 -291 99 129 -341 127 -111 -252 485 -311 -172 377 -405 206 102 -385 253 -232 73 402 -426
2844 -426 -86 361 -355 270 -64 -162 507 -303 130 253 -416 275 133 -203 396 -153 -110 483 -640 164
2864 164 196 -347 403 -197 -365 433 -281 87 379 -548 218 145 -213 310 -322 -142 352 -354 231 141 -430
2885 -430 325 4 -296 392 -301 84 266 -369 249 -30 -298 536 -391 -80 356 -324 275 102 -597 367
$$ packed form
2734F9j35jN1P1j91K73k16J13Lr7J24j52k8J68j29O6J22n4N9q4l8K42l40M4M6
2759a4j31L34j30j87J90o2j75M29m61J60R3p3J66j30j32R1j5j8L97p83N60q4j99
2782a74K85j89r2M64l65q8K51k34K41p5j95N02p06M88K24p08N98k22j87M23k65
2803b4k34N81m24J29R9m57N22k36j65N17p71L42M99n57M02P0o35O60m10l33N65
2824A40m31L90L0m70M68k38j41P37p96J39N49p82O11j04m87O38m85L05L29q28
2844d26L40M47p16O25l34r8O69q10M33J23o69O91j42l36N99n49M3N93j123Q04
2864A64L2n43P50o00j68P98p14L68K92r27P66p3l58N23o32J80M94p06N85r0n71
2885d30P55l21l00O88o93L85J82o35O18k79k68Q34r27L11M36o80N99j73o99R64
$$ plain form
2905 367 4 -185 348 -452 34 329 -363 316 -219 -376 631 -188 83 139 -433 348 179 -376 173 -145
2925 -145 -16 403 -138 -88 221 -378 457 -156 -374 353 -122 52 379 -467 185 142 -438 470 -364 -257 494
2946 494 -369 158 243 -508 308 149 -180 158 -390 139 347 -388 90 162 -57 366 -135 -237 207 -121 281
2967 281 169 -449 266 -70 -197 402 -306 -2 366 -310 196 -111 -351 488 -40 -136 196 -613 284 157
2987 157 -310 139 -45 -192 379 -344 -33 168 -194 315 138 -229 264 -24 77 270 -394 194 253 -152
3007 -152 95 -171 33 341 7 -45 -34 -257 231 128 -166 103 -141 26 187 -224 -8 -36 -213 273 -156
3028 -156 -106 -47 -76 232 17 -341 61 107 47 99 -183 15 -11 -196 93 -58 24 298 66 -61 199 -206 147
3051 147 -31 -210 74 -23 -153 217 98 -74 19 29 196 -57 -216 191 -73 -15 4 -88 -18 104 110 170 130 -1
$$ packed form
2905C67l63j89N33q00M86K95o92O79n35j57J007q19K71N6n72P81j69n55N49l18
2925a45J29M19n41N0L09n99Q35o13k18P27m75J74L27q46O52m3n80R08q34J07P51
2946D94q63N27Q5p51Q16j59l29L38n48N29K08p35M78P2k19M23n01j02M44l28M02
2967B81j12o18P15l36j27N99p08L04L68o76N06l07k40Q39n28r6L32q09Q97j27
2987A57m67M49j84j47N71p23L11K01l62N09j77l67M93k88J01J93o64N88N9m05
3007a52K47k66K04L08l34n2J1k23M88j03k94K69k44J67J61m11K16k8j77M86m29
3028a56N0N9k9L08k15l58M02M6o0N2k82J98k6j85K89j51Q2K74k32j27K60m05L53
3051A47j78j79K84r7j30L70j19j72R3J0J67k53j59M07k64N8J9r2P0J22OO0m0j31
$$ plain form
3075 -1 94 48 60 -147 -84 49 6 -97 44 -129 -97 -17 -27 159 87 -115 -18 168 -76 53 -34 59 -157 -58 69
3100 69 -186 23 -124 -36 -56 66 -36 -100 67 -62 -36 -56 7 -10 -79 -65 90 44 41 138 54 -66 -91 54 -111
3125 -111 3 -144 87 175 -52 26 105 51 -20 -90 112 105 -85 10 -106 1 36 -40 -76 -47 -30 172 -37 62 -148
3150 -148 -45 74 45 32 -37 36 3 -21 41 70 90 113 66 163 -49 -24 9 59 -4 103 -67 84 -46 72 -43
3175 -43 -38 -30 -32 -63 -48 67 -122 76 -51 -100 -115 60 -39 38 9 74 -3 -210 -115 -51 -97 8 -47 -27 -90 -37 89 8
3203 8 -119 44 -114 -127 126 6 48 -2 53 -172 8 128 -11 41 168 12 -171 97 -7 95 226 -73
3225 -73 -29 60 112 -62 77 46 49 115 68 146 25 2 26 183 -7 -29 -71 -117 80 -55 44 54 -134 97 49 -169
3251 -169 -56 100 114 -29 19 -54 25 137 29 -99 8 -56 57 -9 78 82 -78 111 157 -189 59 -59 -57 18
$$ packed form
3075aR5m6J2k07O3J33m3j03J41j73L2Q0j0J86p2k02R7J86k44J29q7R3k16R9J27
3100F9k55K09j47Q8k0J22j02o4J67j29K6k0O3j7o9J4J55m6lR7q4j20k5J45j65
3125a11J14j47K31Q8k27P8P9n4p1p0K02pj90R5j16J07L5p6l6K9J7K02k09R9k10
3150a48J03J19k9j3o9P3l3k4O2K9K0K3m7R7k12K5L3N0o3J07j70J51j30J18j15
3175d3NQkl1J5J15j89J98j27m9j5J75r9P7k9O5p7k07R5O4m6J05n5K0o3N3J26q1
3203Hj27J63j58j3K53j20M2n0N5k25J80J20j39N2J27j56j83K68j04J02J31k99
3225g3M4Q9N2j74J39l1LO6m7P8j21k3K4J57j90k2m2m6J97j35R9J0j88K31m8k18
3251a69J13J56J4j43M8p3P9J12j08j28J07o4J13o6Q7Mj60J89M6l46K48j18KP5
$$ plain form
3275 18 85 -69 -88 80 44 14 -143 84 36 -82 109 -184 182 175 -115 182 -36 48 104 115 63 -64 -110 58
3299 58 -6 -121 161 -77 -135 151 -8 30 159 37 193 -24 -128 -38 72 -71 99 -296 24 -46 120 159
3321 159 -162 -86 178 -21 -46 31 -242 37 140 -89 75 -202 39 98 -278 11 -25 54 155 -129 -141 48
3343 48 -91 279 173 -229 84 97 110 88 -42 91 27 -84 78 -97 -265 262 -5 -12 25 -297 159 215 -166
3366 -166 25 -75 -70 144 -133 -28 58 -258 181 74 -523 212 -45 14 330 -254 -69 211 -196 197 -185
3387 -185 -330 210 -73 29 -86 -312 397 209 -284 -54 -124 -3 329 -72 -39 77 -261 314 -53 -168 101
3408 101 -138 199 203 -402 115 67 48 296 -331 -222 259 -141 140 -125 -465 232 145 -114 234 -244 190 394
3430 394 -319 -12 -54 -264 371 -100 -170 242 -138 254 117 -198 164 -199 -88 174 -368 -5 240 -208 181
$$ packed form
3275A8O7j54j9J68l6l0j57K27m8j18J91k93L66pk90K97k18Q4N6J1n2j27m6J68
3299E8o4j15K82k38n8K86j59L8J29j22J56k17j04R0J10j43J70l95L20p0J66L9
3321A59l21P6K64j99k5P7k73K79J03k29J64k77K41N9l76K89l6P9J01k84j2J89
3343D8j39L70j06m02L13J3J3k2j30J33o4j11J62j75j68N27k67pL7l22M56N6l81
3366a66J91j00NK14k77J05Q6l16M39j07n97P35k57N9L16n84J85K80m07L93l82
3387a85j45N40k83J02j15k26P09j88m93K30p0J21L32m01L3J16l38N75l67j15K69
3408A01k39L37Mo05N17m8j9K48o27J09M81m00K81k65l40O97q7k59L48m78M34K04
3430C94p13L07m2k10O35m71p0M12l80L92j37l15L62l63J11K62n42L63K45m48L89
$$ plain form
3451 181 -3 -193 336 -17 80 94 -375 216 45 -247 195 -152 -124 252 -214 -59 171 -146 298 22 -307
3472 -307 58 -228 39 127 -234 111 165 -166 305 -291 -185 131 -71 69 -47 -308 226 -11 126 44 -232
3493 -232 28 145 -234 300 145 -174 273 -149 -43 108 -155 -16 354 -222 194 -118 -29 183 -360 -91
3513 -91 119 -148 -69 17 -324 218 6 -100 100 -104 -96 138 -39 3 -14 7 261 -115 36 91 -262 15 22 -116
3537 -116 31 -9 13 -35 -118 -45 -37 117 69 -242 21 234 -123 82 168 -181 21 142 -121 224 4 -137 -26
3560 -26 28 70 -6 70 22 33 -121 84 -109 14 79 -161 2 67 -58 -11 86 -74 2 22 110 -115 29 -55 -15
3585 -15 29 -39 -150 32 59 -28 -23 117 -15 -125 93 -112 39 -19 10 -9 -117 178 -52 104 18 -55 107 175
3609 175 -10 -97 11 36 -60 75 97 38 -9 170 -124 -77 15 34 24 86 66 -148 190 -74 186 184 -55 -20 -50
$$ packed form
3451A81j84j90N29l53R7J4m69N91j71k92M42l47K8L76m66J55K30l17M44k76l29
3472c07L65k86K67Q8l61L45N4l31M71n96J06L16k02J40j16k61N34k37J37q2k76
3493b32K60J17l79N34j55l19M47m22J06J51k63J39L70n76M16l12Q9K12n43K69
3513i1K10k67P9Q6l41N42k12j06K00k04QK34j77M2j7K1K54l76J51N5l53K77Pj38
3537a16J47m0K2m8q3P3QJ54m8l11K63K13l57K05Q6l49K02J21k63L45k20j41J11
3560b6N4M2p6P6m8J1j54K05j93J23O5k40J63O5j25M7R7j60P6K0Q8k25J44q4M0
3585a5M4o8j11J82K7q7NJ40j32j10K18k05J51n8K9j9j08K95k30J56q6p3J62O8
3609A75j85q7J08K5r6J35K2n9m7J79k94M7R2J9j0O2k0k14L38k64K60kk39L5l0
$$ plain form
3634 -50 133 37 124 -8 25 -3 91 22 -79 17 -72 -42 54 8 98 -51 -116 -5 -125 -24 44 -136 99 63 150 58
3660 58 -1 15 -37 -6 33 -33 -125 30 -60 62 148 -60 -125 147 -229 100 167 -16 -110 122 85 140 -21 134 -36
3685 -36 16 139 8 45 70 -89 -85 106 -98 -119 -7 -178 95 -89 -40 138 -54 41 -30 143 127 -201 73 89
3709 89 -3 14 191 -155 -76 191 -101 -41 -190 45 83 -154 149 -144 -98 99 -105 18 267 -194 92 -11
3731 -11 -70 17 -18 -46 78 -74 5 -6 -221 204 -179 -74 4 -21 -151 104 -8 -42 -67 -140 144 99 -34 -67 -212
3756 -212 -58 163 -276 59 -62 -111 108 -23 -41 101 -87 146 73 48 102 -236 86 146 -43 17 168 -146
3778 -146 66 30 -169 225 -108 -128 233 -174 59 109 -234 102 -95 -159 271 47 -34 149 -44 29 94 -133
3800 -133 62 -81 -63 266 -117 -30 12 -67 147 -224 -53 48 -105 46 84 -261 -11 77 -120 185 -84 -4
$$ packed form
3634e0J83r6Q7j32L3k8R4o9j01R6q9L0R6m6R0j49o5J11j20J01O8j80K35l6Q7r2
3660E8n9J6n2L1L9o6r2J55r0J22Q6k08o5K72l76L29O7j83r4K32l7N5j61J55j70
3685c6N2J23j31L7K5j59MJ91k04k1J12j71K73j84M9J78j92R5p1J73j6l28K74J6
3709H9r2J7J77l46P9K67k92O0j49K35L8k37L03k93M6J97k04J23K49m61K86j03
3731a1n9Q7l5k8J24j52P9j1k15M25l83J05P8k5j30K55j12l4k5p3K84m5j33l3j45
3756b12J54K21m39L35j21m9K19j31j8J42j88K33p3k5N4l38L22O0j89O0J51l14
3778a46K12l6j99L94l33k0L61m07K33N0l43L36j97o4M30k24q1J83j93P3O5k27
3800a33J95j43J8L29l83Q7M2p9K14l71J71J01j53J51L8l45K50Q8j97L05k69Q0
$$ plain form
3822 -4 358 -217 130 -104 -13 58 -90 -196 73 -233 183 234 -340 -3 5 -81 195 -35 -147 6 -124 -7 12
$$ packed form
3822dL62n75L47k34R1P1j48j06K69l06M16N1n74L37Qq6K76k30j12J53j30J17J9
$$ [...]
8191F7
##END NTUPLES=NMR FID
##END=
