##TITLE=1H_AEBC0202
 CDCl3,72 sc, 
 3.03.2021
##JCAMPDX= 6.0         $$ Bruker NMR JCAMP-DX V2.0
##DATA TYPE= NMR FID
##DATA CLASS= NTUPLES
##ORIGIN= UXNMR, Bruker Analytische Messtechnik GmbH
##OWNER= root
$$ XWIN-NMR		Version 3.5
$$ Wed Mar  3 09:43:20 2021 Russian Standard Time (UT+4h)  she@DPX200
##.OBSERVE FREQUENCY= 200.1315066352
##.OBSERVE NUCLEUS= ^1H
##.DELAY= (6, 6)
##.ACQUISITION MODE= SIMULTANEOUS
##.ACQUISITION SCHEME= undefined
##.AVERAGES= 8
##.DIGITISER RES= 18
##SPECTROMETER/DATA SYSTEM= spect
##.PULSE SEQUENCE= zg30
##.SOLVENT NAME= CDCl3
##.SHIFT REFERENCE= (INTERNAL, CDCl3, 0, 15.7039)
##AUDIT TRAIL= $$ (NUMBER, WHEN, WHO, WHERE, WHAT)
$$ ##TITLE= Audit trail, XWIN-NMR		Version 3.5
$$ ##JCAMPDX= 5.01
$$ ##ORIGIN= Bruker BioSpin GmbH
$$ ##OWNER= she
$$ F:/spectra/data/she/nmr/H-F/1/audita.txt
$$ ##AUDIT TRAIL=  $$ (NUMBER, WHEN, WHO, WHERE, WHAT)
(   1,<2021-03-03 09:42:02.92 +0400>,<she>,<DPX200>,
      <created by zg, POWCHK disabled, PULCHK disabled
       configuration hash MD5:
       00 E9 B6 7A A2 85 ED C7 34 08 36 98 17 FE 4E 26
       data hash MD5: 16K
       9A CA A3 9D 13 CC E1 E7 40 D7 8F D2 21 46 C0 9E>)
$$ ##END=
$$ 
$$ hash MD5
$$ C8 94 CD 70 D8 A0 D9 1C 82 D3 EC 78 57 11 DC C7
##$RELAX= 
##$RELAX= 
##$RELAX= 
##$RELAX= 
##$RELAX= 
##$RELAX= 
$$ Bruker specific parameters
$$ --------------------------
##$DU= <F:/spectra>
##$EXPNO= 1
##$NAME= <H-F>
##$PROCNO= 1
##$TYPE= <nmr>
##$USER= <she>
##$AMP= (0..31)
100 100 100 100 100 100 100 100 100 100 100 100 100 100 100 100 100 100 
100 100 100 100 100 100 100 100 100 100 100 100 100 100 
##$AQSEQ= 0
##$AQ_mod= 1
##$AUNM= <au_zg>
##$AUTOPOS= <>
##$BF1= 200.13
##$BF2= 200.13
##$BF3= 200.13
##$BF4= 200.13
##$BF5= 200.13
##$BF6= 200.13
##$BF7= 200.13
##$BF8= 200.13
##$BYTORDA= 1
##$CFDGTYP= 0
##$CFRGTYP= 5
##$CHEMSTR= <none>
##$CNST= (0..31)
1 1 145 1 1 1 1 1 1 1 1 1 1 1 1 1 1 1 1 1 1 1 1 1 1 1 1 1 1 1 1 1 
##$CPDPRG= <>
##$CPDPRG1= <>
##$CPDPRG2= <>
##$CPDPRG3= <>
##$CPDPRG4= <mlev>
##$CPDPRG5= <mlev>
##$CPDPRG6= <mlev>
##$CPDPRG7= <mlev>
##$CPDPRG8= <mlev>
##$CPDPRGB= <>
##$CPDPRGT= <>
##$D= (0..31)
0 1.2 0 0 0 0 0 0 0 0.06 0 0.03 0 0 0 0 0.0002 0 0 0 0 0 0 0 0 0 0 0 0 
0 0 0 
##$DATE= 1614750122
##$DBL= (0..7)
120 120 120 120 120 120 120 120 
##$DBP= (0..7)
150 150 150 150 150 150 150 150 
##$DBP07= 0
##$DBPNAM0= <>
##$DBPNAM1= <>
##$DBPNAM2= <>
##$DBPNAM3= <>
##$DBPNAM4= <>
##$DBPNAM5= <>
##$DBPNAM6= <>
##$DBPNAM7= <>
##$DBPOAL= (0..7)
0.5 0.5 0.5 0.5 0.5 0.5 0.5 0.5 
##$DBPOFFS= (0..7)
0 0 0 0 0 0 0 0 
##$DE= 6
##$DECBNUC= <off>
##$DECIM= 32
##$DECNUC= <off>
##$DECSTAT= 4
##$DIGMOD= 1
##$DIGTYP= 9
##$DL= (0..7)
0 120 120 120 120 120 120 120 
##$DP= (0..7)
150 150 150 150 150 150 150 150 
##$DP07= 0
##$DPNAME0= <>
##$DPNAME1= <>
##$DPNAME2= <>
##$DPNAME3= <>
##$DPNAME4= <>
##$DPNAME5= <>
##$DPNAME6= <>
##$DPNAME7= <>
##$DPOAL= (0..7)
0.5 0.5 0.5 0.5 0.5 0.5 0.5 0.5 
##$DPOFFS= (0..7)
0 0 0 0 0 0 0 0 
##$DQDMODE= 0
##$DR= 18
##$DS= 0
##$DSLIST= <SSSSSSSSSSSSSSS>
$$ [...]
##$SUBNAM2= <"">
##$SUBNAM3= <"">
##$SUBNAM4= <"">
##$SUBNAM5= <"">
##$SUBNAM6= <"">
##$SUBNAM7= <"">
##$SUBNAM8= <"">
##$SUBNAM9= <"">
##$SW= 16.9725356469052
##$SWIBOX= (0..15)
0 0 2 0 0 0 0 0 0 0 0 0 0 0 0 0 
##$SW_h= 3396.73913043478
##$TD= 16384
##$TD0= 1
##$TE= 0
##$TE2= 300
##$TE3= 300
##$TEG= 300
##$TL= (0..7)
0 120 120 120 120 120 120 120 
##$TP= (0..7)
150 150 150 150 150 150 150 150 
##$TP07= 0
##$TPNAME0= <>
##$TPNAME1= <>
##$TPNAME2= <>
##$TPNAME3= <>
##$TPNAME4= <>
##$TPNAME5= <>
##$TPNAME6= <>
##$TPNAME7= <>
##$TPOAL= (0..7)
0.5 0.5 0.5 0.5 0.5 0.5 0.5 0.5 
##$TPOFFS= (0..7)
0 0 0 0 0 0 0 0 
##$TUNHIN= 0
##$TUNHOUT= 0
##$TUNXOUT= 0
##$USERA1= <user>
##$USERA2= <user>
##$USERA3= <user>
##$USERA4= <user>
##$USERA5= <user>
##$V9= 5
##$VALIST= <valist>
##$VCLIST= <CCCCCCCCCCCCCCC>
##$VD= 0
##$VDLIST= <DDDDDDDDDDDDDDD>
##$VPLIST= <PPPPPPPPPPPPPPP>
##$VTLIST= <TTTTTTTTTTTTTTT>
##$WBST= 1024
##$WBSW= 4
##$XGAIN= (0..3)
0 0 0 0 
##$XL= 0
##$YL= 0
##$YMAX_a= 118120
##$YMIN_a= -106693
##$ZGOPTNS= <>
##$ZL1= 120
##$ZL2= 120
##$ZL3= 120
##$ZL4= 120
##$ABSF1= 10
##$ABSF2= 0
##$ABSG= 5
##$ABSL= 3
##$ALPHA= 0
##$AQORDER= 0
##$ASSFAC= 0
##$ASSFACI= 0
##$ASSFACX= 0
##$ASSWID= 0
##$AUNMP= <proc_1d>
##$AZFE= 0.1
##$AZFW= 0.1
##$BCFW= 1
##$BC_mod= 2
##$BYTORDP= 1
##$COROFFS= 0
##$CY= 11.3945322036743
##$DATMOD= 1
##$DC= 2
##$DFILT= <>
##$DTYPP= 0
##$F1P= 15.9154993809931
##$F2P= -4.1035820241983
##$FCOR= 0.5
##$FTSIZE= 0
##$FT_mod= 4
##$GAMMA= 1
##$GB= 0.15
##$INTBC= 1
##$INTSCL= 1
##$ISEN= 128
##$LB= 0.24
##$LEV0= 0
##$LPBIN= 0
##$MAXI= 10000
##$MC2= 0
##$MEAN= 0
##$ME_mod= 0
##$MI= 1.114404
##$NCOEF= 0
##$NC_proc= 0
##$NLEV= 6
##$NOISF1= 3.799351
##$NOISF2= 2.8
##$NSP= 1
##$NTH_PI= 0
##$NZP= 0
##$OFFSET= 15.70392
##$PC= 1
##$PHC0= -10756.63
##$PHC1= 10.60094
##$PH_mod= 1
##$PKNL= yes
##$PPARMOD= 0
##$PSCAL= 0
##$PSIGN= 0
##$REVERSE= no
##$SF= 200.130013532006
##$SI= 16384
##$SIGF1= 3
##$SIGF2= 2
##$SINO= 400
##$SIOLD= 16384
##$SREGLST= <1H.CDCl3>
##$SSB= 0
##$STSI= 0
##$STSR= 0
##$SW_p= 3612.71676300578
##$SYMM= 0
##$S_DEV= 0
##$TDeff= 0
##$TDoff= 0
##$TI= <>
##$TILT= no
##$TM1= 0
##$TM2= 0
##$TOPLEV= 0
##$USERP1= <user>
##$USERP2= <user>
##$USERP3= <user>
##$USERP4= <user>
##$USERP5= <user>
##$WDW= 1
##$XDIM= 8192
##$YMAX_p= 0
##$YMIN_p= 0
$$ End of Bruker specific parameters
$$ ---------------------------------
##NTUPLES= NMR FID
##VAR_NAME=  TIME,          FID/REAL,        FID/IMAG
##SYMBOL=    X,             R,               I
##VAR_TYPE=  INDEPENDENT,   DEPENDENT,       DEPENDENT
##VAR_FORM=  AFFN,          ASDF,            ASDF
##VAR_DIM=   8192,          8192,            8192
##UNITS=     SECONDS,       ARBITRARY UNITS, ARBITRARY UNITS
##FACTOR=    0.0002944,     1,               1
##FIRST=     0,             0,               0
##LAST=      2.4114304,     0,               0
##MIN=       0,             -106693,         0
##MAX=       2.4114304,     118120,          0
$$ Real data points
##PAGE= N=1
##DATA TABLE= (X++(R..R)), XYDATA
$$ plain form
0 0 0 0 0 0 0 0 0 0 0 0 0 0 0 8 -8 8 -8 8 -16 16 -16 24 -24 32 -32 40 -48 56 -64 72 -80 94 -104 120 -134
35 -134 150 -169 189 -211 235 -261 289 -321 353 -392 433 -476 524 -577 637 -701 772 -851 940
54 940 -1039 1153 -1281 1430 -1605 1814 -2065 2379 -2778 3308 -4043 5135 -6910 10261 -18685
69 -18685 81344 116822 -66305 41064 -70862 -35328 115817 -39084 -21077 35535 -49282
80 -49282 83190 11758 -80045 48319 -15626 15435 62564 -85981 5164 54174 -18201 45338
92 45338 -36959 -57195 66650 3818 10531 1277 -65791 43069 27186 -24694 12837 -54456
104 -54456 7598 68362 -31489 -2557 -16838 -38446 59207 -13214 -32364 19809 -27834 37686
116 37686 12425 -70049 14689 -2607 -442 52706 -60008 -21840 39489 -29198 31937 -9982
$$ packed form
0@%%%%%%%%%%%%%Qj6J6j6J6k4L2l2M0m8N6o4P2q8J04j20J36j52J74j98K24k54
35a34K84l19L58m00M46m96N50o10O74p45Q25r09J000j101J214j338J473j623J791
54I40j979K192k434K711l035L419l879M444n157O086p351R178j2045J7171k8946
69a8685J00029L5478j83127J07369j11926L5534J51145j54901J8007N6612q4817
80d9282J32472p1432r1803J28364o3945L1061M7129j48545R1145M9010p2375O3539
92D5338q2297k0236J23845o2832O713r254o7068J08860j5883n1880L7531o7293
104e4456O2054O0764r9851K8932j4281k1608R7653p2421j9150N2173m7643O5520
116C7686k5261q2474Q4738j7296K165N3148j12714L8168O1329o8687O1135m1919
$$ plain form
128 -9982 -57475 47900 2465 -14244 22922 -53031 12904 44602 -37195 16257 -12532 -26586
140 -26586 56574 -12827 -22605 22008 -23685 23053 22490 -38323 14266 5596 1431 33010 -30968
153 -30968 -9633 23852 -6281 23465 -1471 -27120 23325 6080 -2093 9285 -20099 13256
165 13256 17778 -7122 5681 -17767 1320 24327 -9594 1381 -1356 -14281 22394 -1675
177 -1675 -17259 8532 -10152 10081 9080 -22552 3292 -2054 -3461 16993 -19727 -10394 14707
190 14707 -15325 7918 2294 -26170 13961 1919 -12459 8027 -14976 -3698 14955 -11368
202 -11368 -345 -1926 -12401 15157 -4056 -9798 8948 -9099 3279 10128 -13556 494 7121
215 7121 -4593 8609 -451 -5924 6109 846 4135 1098 -2542 6223 3023 879 4575 -2584
$$ packed form
128i982m7493J05375m5435j6709L7166p5953O5935L1698q1797N3452k8789j4054
140b6586Q3160o9401r778M4613m5693M6738n63o0813N2589q670m165L1579o3978
153c0968K1335L3485l0133K9746k4936k5649N0445j7245q173J1378k9384L3355
165A3256M522k4900J2803k3448J9087K3007l3921J0975k737j2925L6675k4069
177a675j5584K5791j8684K0233j001l1632K5844n346j407K0454l6720R333K5101
190A4707l0032K3243n624k8464M0131j2042j4378K0486k3003J1278J8653k6323
202a1368J1023j581j0475K7558j9213n742J8746j8047J2378O849k3684J4050O627
215G121j1714J3202r060n473J2033n263L289l037l640Q765l200k144L696p159
$$ plain form
229 -2584 1737 8227 115 2116 1253 1572 4326 1004 3907 113 301 5885 -322 -1339 4304 -2098
245 -2098 1680 5209 -4762 1530 400 -2148 3012 -2407 -1403 1623 -3687 -393 646 -6803 1953
260 1953 -470 -5595 2287 -3800 -4893 1369 -2853 -3870 517 -3860 -2481 -496 -4310 -358 -2417
275 -2417 -1759 30 -3177 -1672 180 -3048 -752 2275 -3709 3 1488 -2653 511 1390 -878 350
291 350 2693 -545 459 1952 1395 975 1371 3278 -87 1581 2773 1069 1079 3599 1838 -27 3967
308 3967 1110 315 3185 2622 -122 1981 2895 -1036 1610 1552 313 649 1852 10 -772 1678 -361
325 -361 -768 215 717 -1898 -388 141 -2617 -375 -360 -2063 -1548 -584 -2354 -1904 -647 -2000 -1850 -2058
343 -2058 -337 -3128 -1939 -468 -3157 -750 -33 -2762 -1725 296 -2862 -284 -89 -2128 666 -933
$$ packed form
229b584M321O490q112K001q63L19K754l322K903l794J88N584o207j017N643o402
245b098L778L529r971O292j130k548N160n419J004L026n310L294J039p449Q756
260A953k423n125P882o087j093O262m222j017M387m377J379J985l814L952k059
275b417O58J789l207J505J852l228K296L027n984L712J485m141L164Q79k268J228
291C50K343l238J004J493n57m20L96J907l365J668J192j704J0K520j761j865L994
308C967k857p95K870n63k744K103R14l931K646n8j239L36J203j842p82K450k039
325c61m07R83N02k615J510N29k758K242J5j703N15R64j770M50J257j353J50k08
343b058J721k791J189J471k689K407P17k729J037K021l158K578J95k039K794j599
$$ plain form
359 -933 202 -343 -1257 1125 784 -819 1947 -208 -936 4171 -402 138 2446 -22 1871 2091 588
376 588 1193 1789 1937 3069 -420 1803 2563 411 3964 716 -395 2755 1762 1080 679 -2 1163
393 1163 1460 1181 1578 -3006 1389 2336 -2102 1540 -1779 -2591 2846 -402 -2669 -230 -2911 1125
409 1125 575 -4540 65 -3329 -683 3042 -5739 -2700 899 -3822 1357 -368 -7693 1858 -195
424 -195 -2423 1281 -5810 -1458 2715 -1473 -107 -2792 -3262 4721 -235 -2437 1331 -4103 3156 4261
440 4261 -3920 -441 686 971 4116 -39 -2551 1322 2357 4813 -374 -2161 2756 1562 4643
455 4643 1355 -3515 2065 3822 2970 1836 -2915 381 4795 1005 2942 -3054 -2057 6987 326 -685
471 -685 -8 -4188 4163 4769 -4675 -577 -2155 -575 6579 -4589 -3810 510 -2072 4278 -1251 -7904
$$ packed form
359i33J135n45r14K382l41j603K766k155p28N107m573N40K308k468J893K20j503
376E88O05N96J48J132l489K223P60k152L553l248j111L150r93o82m01o81J165
393A163K97k79L97m584M395R47m438L642l319q12N437l248k267K439k681M036
409A125n50n115M605l394K646L725q781L039L599m721N179j725p325R551k053
424a95k228L704p091M352M173m188J366k685m70P983m956k202L768n434P259J105
440D261q181L479J127K85L145m155k512L873J035K456n187j787M917j194L081
455D643l288m870N580J757q52j134m751L296M414l790J937n996R97R044o661j011
471f85O77m180Q351O06r444M098j578J580P154j1168P79M320k582O350n529o653
$$ plain form
487 -7904 851 779 -399 2118 -7983 -2916 3558 -1319 405 -4697 -5050 3569 708 -2193 -2637 -4590
503 -4590 2461 3486 -3199 -2188 -3551 1761 4195 -1564 -2327 -2770 2091 4550 -1260 -1924 -518 133
519 133 6913 256 -5175 2824 616 4350 3905 -5716 973 3843 1858 4940 -3446 -2797 7361 307
535 307 2758 1112 -6815 6641 4860 -2534 1758 -3805 174 8148 -2544 -1665 75 -2643 6779
550 6779 -935 -5106 1505 -2602 2894 2910 -7020 -1278 1486 -950 2969 -4728 -4494 2565 -632 1141
566 1141 -3690 -5118 1949 -99 -360 -1260 -6423 1872 2629 -3271 681 -5173 -1164 5523 -3572 -690
582 -690 -877 -3541 5806 -97 -4595 2828 -2975 2771 5335 -6881 2328 1592 -1935 7101 -2648 -2946
598 -2946 6401 -1307 2732 3140 -5989 5398 2892 -1749 5100 -3830 563 6663 -2462 1807 1141
$$ packed form
487g904Q755p2j178K517j0101N067O474m877J724n102l53Q619k861k901m44j953
503d590P051J025o685J011j363N312K434n759p63m43M861K459n810o64J406O51
519A33O780o657n431P999k208L734m45r621O689K870j985L082q386O49J0158p054
535C07K451j646p927J3456j781p394M292n563L979P974j0692Q79J740k718R422
550F779p714m171O611m107N496J6r930N742K764k436L919p697K34P059l197J773
566A141m831j428P067k048k61r00n163Q295P57n900L952n854M009O687r095K882
582f90j87k664R347n903m498P423n803N746K564j2216R209p36l527R036r749k98
598b946R347p708M039M08r129J1387k506m641O849q930M393O100r125M269o66
$$ plain form
613 1141 -3195 6230 699 -2475 3499 -3093 2726 3258 -4418 1496 -183 -714 3681 -2976 -1955 1787
629 1787 -2221 2554 -1468 -4270 2799 -2462 189 1252 -5535 1168 745 -3579 2024 -3692 -2873 3355
645 3355 -4296 275 -458 -5417 3936 -1314 -3568 2707 -3869 -228 3642 -5457 1070 1153 -3764 4577
661 4577 -2059 -2622 3915 -2479 1182 2484 -3703 2577 1694 -2016 3948 -1792 -105 4511 -1896 2147
677 2147 1597 -1728 3641 1241 -794 3121 -757 955 2899 -1232 1874 479 153 2353 -805 621
693 621 1195 -962 1844 237 -1503 1774 -1109 -116 1447 -2293 1207 -26 -1622 1120 -1512 -1332
709 -1332 970 -2276 -312 70 -3067 1009 -1148 -2227 1177 -2328 -1240 967 -2384 -694 126 -2405
725 -2405 205 -444 -1983 581 -1536 -84 58 -1278 306 -88 -834 915 -138 -830 1461 -266
$$ packed form
613A141m336R425n531l174N974o592N819N32p676N914j679n31M395o657J021L742
629A787m008M775m022k802P069n261K651J063o787O703m23m324N603n716Q19O228
645C355p651M571p33m959R353n250k254O275o576L641L870r099O527Q3m917Q341
661D577o636n63O537o394L661J302o187O280q83l710N964n740J687M616o407M043
677B147n50l325N369k400k035L915l878J712J944m131L106j395l26K200l158J426
693F21N74k157K806j607j740L277k883R93J563l740L500j233j596K742k632J80
709a332K302l246J964L82l137M076k157j079L404l505J088K207l351J690Q20k531
725b405K610o49j539K564k117J452J42j336J584l94p46J749j053o92K291j727
$$ plain form
741 -266 149 1076 -51 431 958 777 357 906 729 758 1046 1019 706 920 1253 597 895 803 1141 888 436
762 436 1016 469 553 935 442 26 852 37 -5 862 -529 385 167 -543 -40 -150 -669 -350 -33 -795 -528
783 -528 -777 -420 -713 -1191 -389 -982 -915 -707 -675 -1251 -514 -884 -1332 -531 -1043 -579 -916 -508 -826 -700 -455
804 -455 -395 -342 -505 172 -714 54 202 -391 282 99 290 -54 377 361 522 97 1146 411 324 1536 68
825 68 856 1378 402 974 1138 397 1033 835 584 1361 -114 1236 725 -72 1791 -171 -10 1369 -414
844 -414 -86 1449 -859 578 631 -1257 924 -942 -179 575 -1425 473 -493 -1645 898 -862 -1882
861 -1882 1333 -2062 -921 981 -2680 118 -374 -1886 751 -1663 -1115 596 -2411 592 202 -3237
877 -3237 1982 -1164 -1704 2365 -2247 -558 1657 -2403 1180 557 -2082 2702 -851 -413 2551 -2804
$$ packed form
741b66M15R27j127M82N27j81m20N49j77K9K88k7l13K14L33o56K98r2L38k53m52
762D36N80n47Q4L82m93m16Q26q15m2Q67j391R14k18p10N03j10n19L19L17p62K67
783e28k49L57k93m78Q02n93O7K08L2n76P37l70m48Q01n12M64l37M08l18J26K45
804d55O0N3j63O77q86P68J48n93O73j83J91l44M31j6J61m25J049p35q7J212j468
825F8P88N22r76N72J64p41O36j98k51P77j475J350n11p97J863j962J61J379j783
844d14L28J535k308J437N3j888K181j866P63P54k000J898r66j152K543j760j020
861a882L215l395J141J902l661K798m92j512K637k414N48J711l007L003l90l439
877c237N219l146n40M069m612J689K215m060L583o23k639M784l553M38K964n355
$$ plain form
893 -2804 2055 1605 -2325 2994 -28 -1396 3907 -1057 -162 2834 -1956 2866 1159 -1763 3616 -1028
909 -1028 300 3490 -2621 1680 2255 -2716 3473 -131 -2262 4008 -2176 301 2305 -3589 2574
924 2574 426 -2639 3225 -2695 -968 3770 -4525 903 1146 -4322 3522 -1447 -3050 2860 -3499
939 -3499 -185 2137 -5057 1712 -410 -4115 4409 -3651 -2381 3842 -4683 1273 1690 -5450 2997
954 2997 -239 -2892 3905 -3713 -280 3459 -4425 2965 19 -3943 5444 -1710 -1858 4523 -4167
969 -4167 1803 3888 -4367 3700 -93 -1639 5272 -2938 440 3128 -3546 4296 1076 -4086 5365
984 5365 -1265 -705 5406 -4392 1562 3022 -3420 3911 -1152 -2491 5049 -2609 277 2756 -5491
999 -5491 3777 1142 -4705 4637 -2871 -1855 4657 -4629 72 1996 -4718 3758 -1219 -4399 3898
$$ packed form
893b804M859m50l930N319l022j368N303m964Q95K996m790M822j707k922N379m644
909a028J328L190o111M301N75m971O189l604k131O270o184K477K004n894O163
924B574k148l065N864n920J727M738q295N428K43n468P844m969j603N910o359
939c499L314K322p194O769k122l705Q524q060J270O223q525N956M17p140Q447
954B997l236k653O797p618L433L739p884P390k946l962R387p154j48O381q690
969d167N970K085q255Q067l793j546O911q210L378K688o674P842l220n162R451
984E365o630N60O111r798N954J460o442P331n063j339P540p658K886K479q247
999e491R268k635n847R342p508J016O512r286M701J924o714Q476m977l180Q297
$$ plain form
1014 3898 -3985 281 3184 -6308 1976 732 -4534 4189 -2805 -3527 4715 -3747 295 1551 -5339
1029 -5339 3594 5 -2723 3624 -4095 -408 4371 -4543 1812 1229 -4001 5027 -1012 -2328 3698
1044 3698 -2708 2237 2799 -3583 2973 139 -1554 5181 -3027 -363 4371 -3193 2871 1237 -3436
1059 -3436 4160 66 -588 3484 -3543 1203 2993 -3292 3379 -1033 -2549 5122 -2455 -832 2752
1074 2752 -3635 2175 1784 -4060 2120 -1312 -1205 3456 -3486 269 1311 -3493 2542 -903 -4059
1089 -4059 3021 -1650 -1442 2383 -4498 312 1528 -2628 1374 -2024 -1449 2404 -2233 -112 760 -3189
1105 -3189 2623 417 -2851 2076 -1941 2 3046 -2085 278 821 -1000 2038 -408 -868 2344
1120 2344 -1393 1716 1406 -2590 2515 877 -555 2410 -780 -253 2185 -825 1061 767 -883 2451
$$ packed form
1014C898p883M266K903r492Q284j244n266Q723o994p22Q242q462M042J256o890
1029e339Q933l589k728O347p719L687M779q914O355n83n230R028o039j316O026
1044C698o406M945N62o382O556k834j693O735q208K664M734p564O064j634m673
1059c436P596m094o54M072p027M746J790o285O671m412j516P671p577J623L584
1074B752o387N810l91n844O180l432J07M661o942L755J042m804O035l445l156
1089d059P080m671K08L825o881M810J216m156M002l398N75L853m637K121Q72l949
1105c189N812k206l268M927m017J943L044n131K363N43j821L038k446m60L212
1120B344l737L109l10l996N105j638j432K965l190N27K438l010J886k94j650L334
$$ plain form
1136 2451 -271 -365 1531 -1499 1475 1626 -1704 1173 199 -1283 1884 -763 -761 1153 -1099 958 -211
1153 -211 -1519 698 -552 -433 784 -1822 -620 767 -1649 348 -226 -1454 482 -554 -1020 -399
1169 -399 -995 25 -133 -1041 -16 -1058 -650 780 -959 -114 360 -859 161 -52 -455 -208 279 343
1187 343 22 -618 805 -364 -120 1238 -350 323 1234 -200 175 981 369 713 597 356 418 125 891
1206 891 462 -29 1129 255 121 746 231 -118 883 277 -86 839 319 -78 -157 550 -283 -37 431 -406
1226 -406 -562 111 21 -568 531 -420 -738 -270 -322 -664 -329 240 -763 -366 -299 -871 -687 -106 -369 -698
1246 -698 28 -642 -693 -57 -170 -613 -304 285 -654 -367 -3 -129 -365 427 36 -401 679 -64 -115 301
1266 301 502 -15 456 694 -121 227 424 522 376 850 278 10 619 506 248 314 767 35 137 534 165
$$ packed form
1136B451k722r4J896l030K974J51l330K877r74j482L167k647KJ914k252K057j169
1153b11j308K217j250J19J217k606J202J387k416J997n74j228J936j036m66O21
1169c99n96J020j58r08J025j042M08J430j739Q45M74j219J020k13m03K47M87O4
1187C43l21o40J423j169K44J358j588O73R11j434L75Q06o12L44j16k41O2k93P66
1206H91m29m91J158q74j34O25n15l49J001o06l63R25n20l97p9P07q33K46M68q37
1226d06j56O73r0n89J099r51l18M68n2l42L35N69j003L97O7n72J84N81k63l29
1246f98P26o70n1O36j13m43L09N89r39K87L64j26k36P92l91m37J080p43n1M16
1266C01K01n17M71K38q15L48J97R8j46M74n72k68O09j13k58O6M53p32J02L97l69
$$ plain form
1287 165 358 552 470 -248 387 74 -211 114 317 76 -23 240 -254 -377 38 -341 -265 36 -205 -703 -22
1308 -22 -138 -561 -396 -82 -365 -577 -108 -567 -447 -2 -392 -424 -187 -432 -522 -22 -171 -69 -240 -196 -481
1329 -481 -296 152 -356 -174 380 206 -354 345 -261 -409 652 424 6 315 509 215 62 556 185 245
1349 245 966 391 -335 467 534 293 826 317 -64 483 968 203 53 419 354 297 468 -177 -456 648 525
1370 525 -179 -187 -107 -216 254 265 -661 -430 249 -118 -246 -436 -598 -405 354 -307 -677 -727 -256 -214 -221 -400 -824
1393 -824 -251 108 -300 -1214 -421 -168 5 354 -947 -779 121 511 169 -465 -349 260 399 104 -243 -735
1413 -735 753 925 49 152 -446 406 1168 722 -173 -29 348 1036 398 -224 252 -234 1219 1018 -834
1432 -834 -130 641 554 860 -282 -755 615 725 413 -493 -900 725 461 461 -64 -1338 215 1331 -359
$$ packed form
1287A65J93J94q2p18O35l13k85L25K03k41r9K63m94j23M15l79P6L01k41m98O81
1308b2j16m23J65L14k83k12M69m59J20M45l90l2K37k45r0N00j49J02j71M4k85
1329d81J85M48n08J82N54j74n60O99o06j48J061k28m18L09J94k94j53M94l71O0
1349B45P21n75p26Q02O7k41N33n09l81N47M85p65j50L66o5n7J71o45k79J104j23
1370E25p04qQ0j09M70J1r26K31O79l67j28j90j62J93P59o61l70n0M71M2pj79m24
1393h24N73L59m08r14P93K53J73L49j301J68R00L90l42o34J16O09J39k95l47m92
1413g35J488J72q76J03n98Q52P62m46q95J44L77O88o38o22M76m86J453k01j852
1432h34P04P71q7L06j142m73J370J10l12r06m07J625k64%n25j274J553J116j690
$$ plain form
1451 -359 -460 -627 -473 1152 -37 -1100 -925 -693 1000 -91 -1448 -711 -468 226 966 -1610 -1263 555
1469 555 -342 520 -634 -1517 418 541 12 -237 -1737 175 915 -331 376 -1428 -411 2025 -242
1486 -242 -502 -110 -558 1439 1095 -1068 -278 28 1031 1393 -1171 -93 430 338 1660 -375 -1006 1254
1504 1254 525 758 345 -1521 832 1189 214 552 -970 156 1624 -344 132 -330 -959 1783 614
1521 614 -1135 177 -872 675 1335 -1303 -480 -382 -109 1071 -1030 -1331 522 -525 592 -167 -1970
1538 -1970 259 260 -426 462 -1788 -675 966 -377 -86 -762 -1221 1188 -48 -723 54 -1223 856
1555 856 1031 -1192 -212 -76 -308 1417 -811 -715 755 -144 1224 232 -1043 772 310 428 820 -1092
1573 -1092 229 1571 -158 614 -375 -491 1442 176 100 131 -579 1037 644 -689 462 -467 302 1349
$$ packed form
1451c59j01j67J54J625j189j063J75K32J693j091j357P37K43O94P40k576L47J818
1469E55q97Q62j154q83J935J23n29k49j500J912P40j246P07j804J017K436k267
1486b42k60L92m48J997l44k163P90L06J003L62k564J078N23r2J322k035o31K260
1504A254p29K33m13j866K353L57r75L38j522J126J468j968M76m62o29K742j169
1521F14j749J312j049J547O60k638Q23R8K73J180k101l01J853j047J117p59j803
1538a970K229Jo86Q88k250J113J641j343K91o76m59K409j236o75P77j277K079
1555H56J75k223R80J36k32J725k228R6J470q99J368r92j275J815m62J18L92j912
1573a092J321J342j729P72r89j16J933j266p6L1p10J616l93j333J151r29P69J047
$$ plain form
1591 1349 -644 -192 499 -452 727 -33 -1164 399 -174 40 224 -1014 72 165 -708 633 -874
1608 -874 -670 574 -503 -591 7 -875 232 153 -840 151 -694 -65 318 -662 -229 -134 -503 548 -157 -887
1628 -887 243 -124 86 275 -775 200 125 59 177 -278 -123 373 -93 208 342 -295 645 85 -6 467
1648 467 -147 352 568 206 188 180 -86 739 185 60 396 -208 484 42 -83 134 227 -101 148 57 -164 166
1670 166 -119 103 -213 -262 378 -216 -244 127 -433 -219 -42 -572 -11 13 -501 11 -390 -282 -350 -310 22 -328
1692 -328 -421 -126 -402 -377 248 -351 -105 -16 -123 -173 -132 86 65 132 15 15 -33 237 81 -93 221 -78 19 297
1716 297 -74 104 89 83 73 187 -31 258 150 186 271 294 259 67 321 217 41 129 323 134 66 250 166 66
1740 66 26 149 34 -69 184 -51 -183 -82 -32 -141 130 41 -38 -107 -146 -162 -134 -280 -143 -159 -188 -341 -261 -374
$$ packed form
1591A349j993M52O91r51J179p60j131J563n73K14J84j238J086R3q73J341j507
1608h74K04J244j077q8N98q82J107p9r93R91q45O29L83r80M33R5l69J051p05p30
1628h87J130l67K10J89j050R75p5o6J18m55J55M96m66L01J34o37R40n60r1M73
1648D67o14M99K16l62j8qk66Q25n54j25L36o04O92m42j25K17R3l28K49r1k21L30
1670A66k85K22l16m9O40n94k8L71n60K14J77n30N61K4n14N12m01J08o8M0L32l50
1692c28r3K95k76K5O25n99K46Q9j07n0M1K18k1O7j17%m8K70j56j74L14k99R7K78
1716B97l71J78j5oj0J14k18K89j08L6Q5K3l5j92K54j04j76Q8J94j89o8J84q4j00
1740F6m0J23j15j03K53k35j32J01N0j09K71q9p9o9l9j6K8j46J37j6k9j53Q0j13
$$ plain form
1764 -374 -119 -213 -116 -176 -143 -215 -294 -219 -26 -66 -144 -130 -224 -74 -117 -41 86 -158 48 157 -151 93 -8 -143
1788 -143 258 92 41 320 -164 379 288 -144 179 234 262 380 129 210 314 126 153 273 -101 291 -38 40
1810 40 134 -153 324 158 -244 153 81 -215 330 -516 -82 107 -483 169 14 -392 10 -205 -214 264 -608 -241
1832 -241 -154 -558 85 -157 -397 193 -253 18 -140 -588 154 -61 -339 265 -392 -322 474 -366 220 -85 -449
1853 -449 475 -77 -396 337 -262 251 530 -544 274 353 -131 579 -241 -63 575 -113 514 301 -450 503
1873 503 348 -70 590 -554 134 717 -276 464 -56 -256 789 150 -327 488 -409 147 364 -741 209
1892 209 -95 -240 765 -585 -234 377 -505 380 -58 -1057 634 -249 -328 195 -1023 4 458 -618
1910 -618 106 -499 -689 774 -600 -337 63 -889 576 144 -866 201 -341 -176 758 -792 -177 250
$$ packed form
1764c74K55r4R7o0L3p2p9P5J93m0p8J4r4J50m3P6J27k44K06J09l08K44j01j35
1788a43M01j66n1K79m84N43r1m32L23N5K8J18k51Q1J04j88K7J20l74L92l29P8
1810D0R4k87M77j66m02L97p2k96N45q46M34J89n90O52j55m06M02k15rM78q72L67
1832b41Q7m04O43k42k40N90m46K71j58m48P42k15k78O04o57P0P96q40N86l05l64
1853d49R24n52l19P33n99N13K79j074Q18P9m84P10q20J78O38o88O27k13p51R53
1873E03j55m18O60j144O88N83r93P40n20k00J045o39m77Q15q97N56K17j105R50
1892B09l04j45J005j350L51O11q82Q85m38r99J691q83p9N23j218J027M54j076
1910f18P24o05j90J463j374K63M00r52J465m32j010J067n42J65R34j550O15M27
$$ plain form
1928 250 -163 714 -260 -604 568 -33 246 358 -842 497 437 -282 492 -457 -162 978 -242 288 217
1947 217 -404 1067 431 -324 509 -429 413 855 -773 81 214 21 1000 -416 -426 543 -271 299 165
1966 165 -888 340 191 -250 454 -848 -159 704 -331 35 -213 -600 530 -144 -437 182 -884 162
1984 162 327 -989 -34 -390 -357 847 -654 -630 100 -363 242 -80 -757 526 -128 127 272 -814 -76
2003 -76 648 -288 266 -96 -501 761 85 -115 372 -324 617 435 -261 104 -167 -106 711 -276 -162 300
2023 300 -163 744 324 -415 453 207 46 270 -667 142 317 17 449 -246 -458 639 -56 8 83 -446
2043 -446 316 148 -385 54 -272 -178 433 -284 -31 -26 -225 370 -261 -375 -23 -163 21 123 -566 -28 -26 -313
2065 -313 174 -320 -301 43 -24 126 -68 -408 100 183 -412 168 -112 16 358 -354 137 -5 -1 319 116 -86
$$ packed form
1928B50m13Q77r74l44J172o01K79J12j200J339o0p19P74r49K95J140j220N30p1
1947B17o21J471o36p55Q33r38Q42M42j628Q54J33j93R79j416j0R69q14N70j34
1966A65j053J228j49m41P04j302O89Q63j035L66k48l87J130o74k93O19j066J046
1984A62J65j316R55l56L3J204j501K4P30m63O05l22o77J283o54K55J45j086P38
2003g6P24r36N54l62m05J262o76k00M87o96R41j82o96L65k71O1Q17r87J14M62
2023C00m63R07m20p39Q68k46j61K24r37Q09J75l00M32o95k12J097o95O4P5n29
2043d46P62j68n33M39l26R4O11p17K53Nj99N95o31j14L52j40J84J02o89N38Kk87
2065c13M87m94J9L44o7J50j94l40N08Q3n95N80k80J28L42p12M91j42ML20k03k02
$$ plain form
2087 -86 246 126 60 313 -159 434 296 -61 340 145 9 376 2 157 150 62 249 -8 122 177 -74 106
2109 106 455 -116 8 280 -79 321 104 -102 -19 -10 75 82 26 -32 -384 -188 128 -150 -104 192 -182 -44 -18
2132 -18 -330 -50 23 -406 -197 -68 -68 -162 -198 -121 -244 -206 43 -157 -168 -14 -70 -83 293 -20 17 9 84 56 146 95
2158 95 -56 81 231 2 153 272 54 4 136 316 -1 284 94 146 282 -5 16 152 136 290 170 208
2180 208 190 -85 139 -25 -134 182 -133 42 -83 -56 6 64 -52 -172 -115 -31 -7 43 -152 -196 -64 -80 -141 -130
2204 -130 -244 13 -73 -248 -226 -204 -63 -243 30 -329 -1 -168 -78 -10 48 -27 -38 -28 -222 111 4 -232 -277
2227 -277 96 52 46 246 159 -177 162 0 132 220 166 2 164 -14 71 40 250 228 75 45 11 -69 207 192
2251 192 -124 -104 331 97 -94 110 -29 -82 276 91 14 93 43 115 152 144 -111 8 -32 -107 -84 -153 -73 -25 -172
$$ packed form
2087h6L32j20o6K53m72N93j38l57M01j95j36L67l74J55pq8J87k57J30N5k51J80
2109A06L49n71J24K72l59M00k17k06Q3RQ5Pn6n8l52J96L16k78M6K96l74J38K6
2132a8l12K80P3m29K09J29%r4l6P7j23L8K49k00j1J54n6j3L76l13L7qP5k8R0n1
2158I5j51J37J50k29J51J19k18n0J32J80l17K85j90N2J36k87K1J36j6J54j20L8
2180B08j8k75K24j64j09L16l15J75j25K7O2N8j16j20N7Q4K4N0j95m4J32j6o1J1
2204a30j14K57q6j75K2K2J41j80K73l59L28j67R0O8N8p5j1J0j94L33j07k36m5
2227b77L73m4oK00q7l36L39j62J32Q8n4j64J62j78Q5l1K10k2j53l0l4q0K76j5
2251A92l16K0M35k34j91K04j39n3L58j85p7P9n0P2L7qk55J19m0p5K3o9Q0M8j47
$$ plain form
2276 -172 -59 -8 -16 -160 -158 -51 -14 -209 -198 -122 -113 -201 109 -68 -167 -34 144 5 -74 -66 -62 103 214 -146 117 81
2302 81 -19 239 122 108 -26 183 51 -70 69 85 188 206 155 122 34 -174 225 160 -117 18 -48 287 -26
2325 -26 109 -32 -21 -2 91 247 54 -42 -85 31 -195 45 -130 17 -21 -13 -168 -23 125 -274 -190 92 21 -167
2349 -167 -163 -141 -147 -243 2 -24 -250 -94 -220 -103 -42 -279 -142 52 28 -187 48 -340 90 41 -131 -134 -40 -23 33
2374 33 -140 -49 -111 -58 125 -279 85 96 145 16 230 -48 42 150 369 97 -105 307 210 18 57 61 0 431
2398 431 154 51 397 -6 60 141 -97 168 181 -186 129 -61 -174 65 28 83 46 -235 194 83 -68 18
2420 18 -148 -40 -32 -107 -162 -154 -354 203 -233 119 -72 -291 58 -227 -280 2 -95 -317 49 -106 -136 134 34
2443 34 170 -50 -187 64 76 21 29 106 -136 294 -128 79 10 -125 217 135 -24 17 -82 210 151 121 103 -35
$$ packed form
2276a72J13N1qj44KJ07L7j95J1P6Rq8L10j77r9J33J78j39p9QMJ65J11l60K63l6
2302H1j00K58j17j4j34K09j32j21J39J6J03J8n1l3q8k08L99o5k77J35o6L35l13
2325b6J35j41J1J9R3J56j93r6m3J16k26K40j75J47l8Qj55J45J48l99Q4K82p1j88
2349a67MK2or6K45k6k26J56j26J17O1k37J37J94k4k15K35l88M30m9j72lR4J7N6
2374C3j73R1o2N3J83m04L64J1M9j29K14k78R0J08K19k72k02M12r7j92L9Mo1M31
2398D31k77j03L46m03O6Q1k38K65J3l67L15j90j13K39l7N5l7k81M29j11j51Q6
2420A8j66J08Qp5n5Qk00N57m36L52j91k19L49k85n3K82r7k22L66j55l0K70j00
2443C4J36k20j37K51J2n5QP7k42M30m22K07o9j35L42q2j59M1r9K92n9l0j8j38
$$ plain form
2467 -35 24 367 -36 130 77 -113 321 -96 -215 103 32 15 61 -183 53 6 -149 280 -99 -353 117 -15
2489 -15 -160 -45 -162 -19 -6 -72 82 -273 -76 29 -220 -50 -109 -13 69 -199 -107 89 -183 31 33 -302 81
2512 81 -156 -108 82 -186 -169 185 -229 -60 -104 -168 55 -148 -93 57 35 -10 88 36 170 -15 69 208 -1 -76
2536 -76 278 -50 152 217 20 70 106 -74 406 -67 -157 13 129 17 -51 157 96 44 77 48 -31 -62 103 8
2560 8 -9 -260 -1 103 -79 -165 -129 9 46 41 63 124 -295 -32 74 -272 144 -214 -42 -104 -285 -141 170 -27
2584 -27 41 -138 -86 173 -59 -119 173 -36 41 -108 -82 110 -38 -80 65 -69 64 70 -87 176 106 38 113 57
2608 57 59 221 -11 -23 374 -83 277 -65 26 51 -5 81 54 85 43 -96 141 17 -217 -129 94 -119 49 -34
2632 -34 42 91 37 -114 -161 29 24 -77 -179 29 31 -150 -183 -116 -186 44 -85 38 -71 -333 -117 100 -166 -97
$$ packed form
2467c5N9L43m03J66n3j90M34m17j19L18p1j7M6k44K36m7j55M29l79k54M70j32
2489a5j45J15j17J43J3o6J54l55J97J05k49J70n9R6Q2k68R2J96k72K14Kl35L83
2512H1k37M8J90k68J7L54m14J69m4o4K23k03N5J50k2m5R8n2J34j85Q4J39k09p5
2536g6L54l28K02O5j97N0L6j80M80m73r0J70J16j12o8K08o1n2L3k9p9l1J65r5
2560Hj7k51K59J04j82q6L6J38L7nK2O1m19K63J06l46M16l58J72o2j81J44L11j97
2584b7O8j79N2K59k32o0K92k09P7j49K6J92j48m2J45j34J33Oj57K63p0o8P5n6
2608E7KJ62k32j2L97m57L60l42R1K5n6Q6k7L1m2j39K37j24k34Q8K23k13J68q3
2632c4P6M9n4j51m7J90nj01j02K08Kj81l3O7p0K30j29J23j09k62K16K17k66O9
$$ plain form
2656 -97 13 -115 -18 -105 86 -78 1 -148 57 33 6 -82 -146 -60 -112 -80 -159 -121 -2 144 52 12 22 43 256 59
2682 59 56 78 90 287 129 80 -63 -174 34 159 46 72 22 233 94 16 33 -184 -123 82 -112 -77 15 -18 -17
2707 -17 95 50 44 -38 103 -105 -170 120 -162 -8 -212 -46 -192 78 -42 -96 -70 -320 -11 -91 -66 -156 104 -19
2731 -19 108 51 -90 4 -110 -73 57 36 -224 -13 14 18 90 -32 -104 85 -95 21 15 190 -61 -139 -64 168 218
2756 218 238 -70 97 42 6 216 99 153 -59 47 115 -95 -26 66 69 -99 126 84 57 213 -55 -44 -63 -118 -104
2781 -104 -40 56 200 -117 58 -197 -150 19 -196 86 140 -125 -22 -94 -277 86 -22 -131 42 -90 85 -251
2803 -251 -67 74 224 -63 142 3 79 -102 -17 103 -111 -54 49 -59 -133 252 -219 22 -9 -42 193 -15
2825 -15 -218 -13 -31 142 232 160 -72 19 -109 -34 70 -92 67 220 31 111 88 159 162 -259 281 -213 -238 345
$$ packed form
2656i7J10j28R7q7J91j64P9j49K05k4k7q8o4Q6n2L2p9L8J19J46r2m0J0K1K13j97
2682E9lK2J2J97j58m9j43j11K08J25j13K6n0K11j39p8J7k17O1K05j94L5R2l3J
2707a7J12m5oq2J41k08o5K90k82J54k04J66j46K70j20n4K6k50L09q0K5r0K60j23
2731a9J27n7j41R4j14L7J30k1k60K11K7MP2j22p2J89j80J16oJ75k51p8P5K32N0
2756B18K0l08J67n5l6K10j17N4k12J06O8k10O9R2Lj68K25m2k7J56k68J1j9n5J4
2781a04O4R6J44l17J75k55M7J69k15K82N4k65J03p2j83L63j08j09J73j32J75l36
2803b51J84J41J50k87K05j39P6j81Q5J20k14N7J03j08p4L85m71K41l1l3K35k08
2825a5k03K05j8J73R0p2k32R1j28P5J04j62J59J53j89Q0k3P1Lm21N40m94k5N83
$$ plain form
2849 345 -94 193 57 -95 56 62 23 144 23 27 -126 -207 32 26 -55 117 -284 -228 164 -251 -239 20 -138 88
2873 88 -221 -191 172 -116 69 4 -79 165 179 6 7 5 -82 -79 55 38 -59 -22 23 102 101 -70 70 14 147 -90 93
2900 93 -124 -120 193 -56 120 235 -117 107 49 -22 215 39 -147 -6 59 -133 133 -128 173 153 -78 55
2922 55 48 -33 -9 62 -10 263 -134 162 151 77 52 5 38 39 -164 83 -111 -221 -4 -188 -88 -165 -232 85 -67
2947 -67 -82 198 -95 -261 -163 -2 24 -71 -271 -4 188 -108 -2 -114 16 199 -59 124 -84 -17 154 87
2969 87 -101 42 46 189 197 -25 88 18 -93 114 52 41 182 243 85 179 10 54 231 59 153 -71 62 42
2993 42 33 345 -15 -97 33 40 38 68 -1 23 139 -117 -23 32 -11 -28 -109 -227 -66 -79 -172 -95 -150 -20 -177 -324 39
3020 39 -338 45 192 -63 -101 181 -269 -167 -85 -183 6 135 151 -146 -229 39 33 -118 88 -8 59 151 137 -63
$$ packed form
2849C45m39K87j36j52J51Ol9J21j21Mj53q1K39oq1J72m01N6L92m15J2K59j58K26
2873H8l09L0L63k88J85o5q3K44J4j73Jkq7LJ34j7r7L7M5P9jj71J40n6J33k37J83
2900I3k17ML13k49J76J15l52K24n8p1K37j76j86J41O5j92K66k61L01k0k31J33
2922E5pq1K4P1p2K73l97K96j1p4k5m7L3Jk03K47j94j10K17j84J00p7o7L17j52
2947f7j5K80k93j66R8J61K6r5k00K67J92k96J06j12J30J83k58J83k08O7J71o7
2969H7j88J43MJ43Qk22J13p0j11K07o2j1J41O1j58R4j69M4J77j72R4k24J33k0
2993D2rL12l60q2J30PkL0o9K4J16k56R4N5m3j7q1j18J61j3r3P7n5J30j57j47L63
3020C9l77L83J47k55l8K82m50J02Q2r8J89J29J6k97q3K68oj51K06r6O7R2j4k00
$$ plain form
3044 -63 195 -68 105 -111 -80 70 -35 -57 85 19 -141 -73 -121 5 121 4 -142 127 -92 -98 -133 62 -17
3067 -17 -92 55 -63 137 140 -4 18 100 29 69 -57 16 -55 80 20 6 -26 40 -207 12 9 41 96 65 -4 18 22 -5
3095 -5 -12 -31 104 -71 -121 -27 69 -6 -100 103 96 27 -90 -90 152 -21 52 39 -44 -14 74 7 -12 223 -101 -63 86 126
3123 126 27 -99 -195 -51 74 150 70 -60 18 174 156 149 -27 -30 48 -18 107 39 -85 -34 -3 41 0 2 -145 -119 77
3150 77 -15 54 -103 -182 -176 -117 17 122 -55 -81 19 -92 -139 -76 174 27 -254 -103 167 74 -118 48 7 13 -23
3175 -23 -50 -24 -62 -6 84 112 123 -25 1 -127 -48 96 65 -11 -44 -39 21 -1 31 -35 86 -49 -151 -55 152 135 -103
3202 -103 -40 -121 -18 64 -102 164 94 91 151 107 -22 -44 24 110 -11 -145 50 95 -89 -4 24 113 155 -137 -95 -50
3228 -50 -34 -156 350 99 -9 -169 -68 -46 -127 -3 -170 -179 -202 53 -16 -103 -211 -92 54 60 29 -26 -11 -134 -45
$$ packed form
3044f3K58k63J73k16L1J50j05k2J42o6j60O8m8J26J16j17j46K69k19ol5J95p9
3067a7p5J47j18K00Lj44K2Q2p1M0j26P3p1J35o0j4l2O6k47K19lL2N5l1o9K2Mk7
3095epj9J35j75n0R4R6p5r4K03po9j17%K42j73P3j3q3L0Q8o7j9K35l24L8J49M0
3123A26r9j26r6J44J25P6q0j30P8J56j8pj76lP8o6J25o8j24N1L1M4m1Kj47K6J96
3150G7r2O9j57p9ON9J34J05j77k6J00j11m7O3K50j47k81J51K70r3j92J66m1Ol6
3175b3k7K6l8N6R0K8J1j48K6j28P9J44l1p6l3NO0k2L2o6J21j35j02R6K07j7k38
3202a03O3q1J03Q2j66K66p0lO0m4j29k2O8Q6j21j34J95M5j84Q5K8Q9M2k92M2M5
3228e0J6j22N06k51j08j60J01K2q1J24j67rk3K55o9q7j08J19J46Ol1n5J5j23Q9
$$ plain form
3253 -45 82 -197 -101 -44 -83 -96 85 -70 -16 117 -53 -64 -3 -69 70 93 -40 78 -24 53 -32 9 2 6 25 16 1
3280 1 17 224 47 99 14 119 16 -73 -113 167 112 104 -31 75 36 21 7 124 -12 -58 -63 -130 20 -23 44 148
3306 148 183 -70 11 -72 -182 -150 -39 -140 -33 -118 7 -5 -120 92 -191 72 30 -92 68 -117 -62 -69 -11 31
3330 31 -40 140 -85 -94 -51 95 79 -36 -58 102 85 146 49 -56 -49 -70 86 64 75 19 103 28 29 17 49 25 131 220
3358 220 -217 -11 -100 -57 111 158 83 224 66 82 -60 108 3 -163 99 -38 -135 268 78 -130 125 -183
3380 -183 9 139 -82 -124 -208 -41 -60 -9 -79 -36 -73 20 105 -85 -12 -69 21 180 -84 -227 156 -94 85 248
3404 248 -187 3 55 61 167 -169 67 -6 105 263 12 162 118 224 107 83 -115 127 66 -132 201 186 -61
3427 -61 -6 55 68 110 -79 -37 58 -32 113 78 13 103 104 -11 125 -171 -12 40 17 133 -132 -6 -40 -41 77 -82
$$ packed form
3253d5J27k79R6N7l9j3J81j55N4J33j70j1O1o6J39K3j33J18j02P7q5M1pMJ9rj5
3280AJ6K07j77N2q5J05j03q9m0K80n5qj35J06l9j5j4J17j36m6no7J50m3O7J04
3306A48L5k53Q1q3j10L2J11j01J07q5J25j2j15K12k83K63m2j22J60j85N5pN8M2
3330C1p1J80k25rM3J46j6j15k2J60j7O1r7j05Pk1J56k2J1n6Q4p5Jj2L2k4J06Q9
3358B20m37K06q9M3J68M7p5J41j58J6j42J68j05j66K62j37r7M03j90k08K55l08
3380a83J92J30k21m2q4J67j9N1p0M3l7R3Q5j90P3n7R0J59k64j43L83k50J79J63
3404B48m35J90N2OJ06l36K36p3J11J58k51J50m4J06j17k4j98K42o1j98L33j5k47
3427f1N5O1J3M2j89M2R5r0J45l5o5R0Jj15J36k96J59N2k3J16k65J26l4jJ18j59
$$ plain form
3453 -82 119 -79 -128 -164 52 72 -42 -255 -60 -142 -240 57 -57 20 -63 -34 -209 5 -94 9 197 -33 168
3476 168 72 -48 186 -20 35 145 -37 42 101 28 -60 21 -131 223 -53 -157 124 -83 55 61 6 -145 76
3499 76 8 -45 -36 85 35 -6 -51 80 -64 40 -41 66 70 106 123 185 36 156 -41 4 112 31 -38 -120 -210 47
3525 47 46 -146 57 -57 -214 -125 64 -72 93 -94 55 -129 100 27 -88 13 208 -16 -132 78 -153 204
3547 204 -62 -229 -61 110 -67 88 -150 -77 -147 -52 39 -171 13 37 69 114 50 36 -71 73 231 87 53
3570 53 76 144 71 66 -4 41 171 -14 78 245 0 27 21 -6 84 13 -215 88 -156 -6 225 92 91 191 -194 -407
3596 -407 94 -129 24 9 -71 -37 -7 -34 20 10 138 -85 -69 -38 -116 -41 -157 -71 -79 -68 17 -50 -210 -80 49 -7
3622 -7 -184 34 -71 -79 29 -169 -1 -133 85 98 56 70 -37 134 44 -36 134 117 109 63 72 -122 -31 -99 123 47
$$ packed form
3453h2K01j98m9l6K16K0j14k13J95q2r8K97j14P7q3K9j75K14r9J03J88k30K01
3476A68r6j20K34k06N5J10j82P9N9p3q8Q1j52L54k76j04K81k07J38On5j51K21
3499G6o8n3RJ21n0m1m5J31j44J04q1J07ML6J7O2j49J20j97M5J08q1o9q2r0K57
3525D7jj92K03j14j57Q9J89j36J65j87J49j84K29p3j15J01J95k24j16K10k31L57
3547B04k66j67J68J71j77J55k38P3p0R5R1k10J84K4L2M5o4j4j07J44J58j44l4
3570E3K3O8p3np0M5J30j85R2J67k45K7ok7R0p1k28L03k44J50K31j33jJ00l85k13
3596d07N01k23J53j5q0L4L0k7N4j0J28k23J6L1p8P5j16Q6qJ1Q5o7j60J30J29n6
3622gj77K18j05qJ08j98J68j32K18J3m2J4j07J71r0q0J70j7qm6Rj94R1o8K22p6
$$ plain form
3648 47 82 -50 161 107 -3 -29 25 96 31 4 28 79 -90 185 -41 -24 -116 -44 -42 95 -101 208 -2 -131 116
3673 116 -129 -11 -82 -24 -17 -85 208 10 -54 119 -53 -140 39 -24 1 160 -55 -96 -42 116 37 -118 -13 29
3697 29 -165 -20 -13 -112 64 59 24 -88 -81 -9 21 122 -33 117 22 262 -12 -214 89 -64 -22 240 35 43 268
3722 268 327 122 108 21 99 -133 64 109 -10 10 146 -143 -229 89 228 -37 6 -205 76 114 -196 -41 67
3745 67 -82 38 143 -24 -243 18 106 -135 189 -165 -210 -71 -81 -109 95 -28 7 126 -37 -61 -113 44 -22
3768 -22 48 -63 -33 -201 182 233 5 192 47 154 -118 135 -174 -142 -91 -148 66 155 -121 88 -170 2 -115
3791 -115 39 137 -109 -42 104 160 -31 154 -18 -157 11 -36 54 -85 34 -35 -30 65 88 89 43 -193 65 47 -38
3816 -38 101 124 -5 -87 53 159 -25 -65 149 12 -10 198 24 255 -49 -78 -127 -156 56 -31 24 32 -117 21
$$ packed form
3648D7L5j32K11n4j10k6N4P1o5k7K4N1j69K75k26J7r2P2KJ37j96L09k10j29K47
3673A16k45J18p1N8Po8K93j98o4J73j72q7J79o3K5J59k15m1N4J58p9j55J05M2
3697B9j94J45Pr9J76nl5j12PP2L0J01j55J50r5K40k74k02L03j53M2K62k05QK25
3722B68N9k05j4q7P8k32J97M5j19K0J36k89q6L18J39k65M3k11K81L8l10J55J08
3745F7j49J20J05j67k19K61Q8k41L24l54m5J39j0k8K04j23L5J19j63k4n2J57o6
3768b2P0j11L0j68L83N1k28J87j45J07k72K53l09L2N1n7K14Q9k76K09k58J72j17
3791a15J54R8k46O7J46N6j91J85j72j39J68m7R0j39J19o9NR5K3Jm6k36K58j8q5
3816c8J39K3j29q2J40J06j84m0K14j37k2K08j74K31l04k9m9k9K12q7N5Qj49J38
$$ plain form
3840 21 -143 -59 134 -50 47 -76 19 104 -94 88 79 69 -82 106 -34 68 80 44 -24 27 -12 113 -40 -84 354
3865 354 11 134 195 338 63 166 87 15 37 -7 230 -65 80 70 39 -4 111 -91 124 72 144 -57 -165
3888 -165 235 21 -84 89 32 -39 33 -40 -16 -127 -47 157 32 103 -160 -125 -79 -212 99 57 -184 43 17 -131
3912 -131 -117 78 30 172 142 -67 -47 -35 106 -22 -10 -39 53 4 -120 -84 -169 1 -211 -68 -45 -8 202 119 45
3937 45 103 -36 -19 35 60 54 -69 65 18 -72 -33 -121 16 133 195 92 -46 74 -14 8 -96 -251 66 -16 -63
3962 -63 -54 -9 105 -47 -95 15 -16 209 12 -29 -37 48 -10 -154 -36 -28 -166 31 -139 -88 14 45 31 -119 78
3987 78 -31 142 -79 -51 25 -143 60 207 9 -71 63 17 -1 94 -98 18 -49 -2 19 -35 73 -68 118 -11
4011 -11 151 194 6 42 17 -100 -129 -70 -105 -152 14 132 52 33 -13 36 21 -164 -1 63 111 8 3 236 20 -92
$$ packed form
3840B1j64Q4J93j84R7j23R5Q5j98J82rj0j51J88j40J02J2l6o8N1l9J25j53m4M38
3865C54l43J23O1J43k75J03p9p2K2m4K37k95J45j0l1m3J15k02K15n2P2k01j08
3888a65M00k14j05J73n7p1P2p3K4j11Q0K04j25P1k63L5M6j33L11m2k41K27k6j48
3912a31J4J95m8J42l0k09K0J2J41j28J2k9R2m9j24L6q5J70k12J43K3L7K10q3p4
3937D5N8j39J7N4K5oj23J34m7r0L9q8J37J17O2j03j38J20q8K2j04j55L17q2m7
3962f3RM5J14j52m8J10l1K25j97m1qQ5n8j44J18Qj38J97j70N1J02L1j4j50J97
3987G8j09J73k21K8P6j68K03J47j98q0J34m6j8R5j92J16o7M7K1n4J08j41J86j29
4011a1J62M3j88L6k5j17k9N9l5m7J66J18q0j9m6M9j5j85J63O4M8j03nK33k16j12
$$ plain form
4037 -92 33 198 62 -15 62 32 -73 9 215 -7 -2 -3 -89 137 75 -39 7 1 64 149 4 71 59 -79 -62 -60 68
4064 68 -15 -16 123 5 -54 -96 11 -197 -48 98 -30 -61 64 -90 25 27 -256 -188 63 58 164 -3 -67 -61 61
4089 61 26 -67 19 117 -9 87 -15 118 141 122 -103 -7 78 210 18 71 118 189 204 140 -49 -95 79 -48 20 -136
4115 -136 -61 -95 56 -150 140 19 111 45 -147 87 26 7 -116 -100 -12 -94 -1 71 -40 -59 -100 75 -37 -169
4139 -169 -2 -114 104 95 -84 -27 -6 117 -85 96 -59 -31 37 69 44 -11 -18 -112 40 46 -10 -51 -29 -125 86 45
4165 45 76 233 68 -128 29 -9 -167 -82 -135 204 2 146 -2 5 -61 -189 98 154 41 106 51 31 217 165
4189 165 -16 196 -161 -86 133 146 41 -101 125 -21 47 -63 -54 166 -98 -128 23 -95 -80 55 -114 -8
4211 -8 82 6 -82 -148 -57 53 -9 42 135 43 4 63 159 100 27 -26 -57 28 33 116 61 63 -18 28 83 17 -22 -147 8 119
$$ packed form
4037i2J25J65j36p7P7l0j05Q2K06k22Njq6K26o2j14M6oO3Q5j45O7j2j38J7KJ28
4064F8q3jJ39j18n9m2J07k08J49J46j28l1J25j54J15Kk83O8K51nJ06j67o4OJ22
4089F1l5r3Q6R8j26R6j02J33K3j9k25R6Q5J32j92N3M7P1J5o4j89m6J74j27O8j56
4115a36P5l4J51k06K90j21R2o6j92K34o1j9j23J6Q8q2R3P2j11j9m1J75j12j32
4139a69J67j12K18rj79N7K1J23k02J81j55K8O8L2k5n5pr4J52On6m1K2r6K11m1
4165D5L1J57j65j96J57l8j58Q5n3L39k02J44j48Po6j28K87N6j13O5n5k0J86n2
4189A65j81K12l57P5K19J3j05j42K26j46O8j10RK20k64l0J51j18J5J35j69J06
4211hR0p6q8o6R1J10o2N1R3r2l9N9R6n9p3n3l1Q5NQ3n5Kq1M6N5o6l9j25J55J11
$$ plain form
4241 119 -57 -58 -83 60 -40 147 -57 -8 -70 -39 41 323 151 0 109 14 -90 -64 -26 -29 -62 54 66 35 -46
4266 -46 -149 -194 128 -144 -68 -57 44 -213 -39 49 -87 55 -155 -119 103 2 -82 21 37 -134 -12 92 -6
4289 -6 102 4 67 7 150 37 -188 -149 -67 7 181 19 3 -134 179 20 161 -7 203 8 -14 95 75 -70
4313 -70 63 -40 69 -54 -36 -19 32 5 -43 23 120 203 73 -112 -128 -13 187 -18 -161 28 146 -55 -60 -95
4337 -95 -110 10 81 -177 -227 24 -117 -5 -28 -114 70 12 -105 -103 -204 -224 111 2 -49 -61 -66 -119 -29 53 -103 71
4363 71 20 45 -66 -131 74 -34 56 -59 -256 -35 -52 -194 38 111 -4 162 107 -41 -60 61 227 -15 -116
4386 -116 -58 38 160 14 148 -14 -119 122 239 -146 22 -15 -28 101 99 34 -54 -38 -1 73 64 -172 0 -35 53
4411 53 -92 35 -101 139 -258 180 -48 -53 -25 -189 71 -79 34 60 85 186 141 -140 -26 -15 -83 87 85 -112
$$ packed form
4241A19j76jk5J43j00J87k04M9o2L1Q0K82j72j51J09r5j04K6L8ll3J16J2l1q1
4266d6j03m5L22k72P6J1J01k57J74Q8j36J42k10L6K22j01q4J03J6j71J22J04r8
4289fJ08r8O3o0J43j13k25L9Q2P4J74j62j6j37L13j59J41j68K10j95k2J09k0j45
4313g0J33j03J09j23J8J7N1k7m8O6R7Q3j30j85j6J15K00k05j43J89J18k01nl5
4337i5j5J20P1k58n0K51j41J12k3q6J84n8j17Kj01k0L35j09n1j2nn3R0Q2j56J74
4363G1n1K5j11o5K05j08R0j15j97K21j7j42K32P3j15J66n5j48j9J21J66k42j01
4386a16N8R6J22j46J34j62j05K41J17l85J68l7j3J29ko5q8J6L7P4rk36J72l5Q8
4411E3j45J27j36K40l97M38k28nK8j64K60j50J13K6K5J01m5k81J14J1o8J70kj97
$$ plain form
4435 -112 -6 -100 72 -34 66 2 -208 -118 -54 194 77 61 122 107 -2 -65 173 96 -77 16 -15 3 126 71
4459 71 233 65 -64 4 -80 -57 26 25 -230 42 27 33 181 -23 -60 -3 108 37 -1 134 105 23 212 35 42 2
4485 2 127 -10 43 -119 -51 51 27 -26 42 101 23 153 36 206 1 -24 19 52 110 99 40 -2 -72 65 -60 22
4511 22 100 -1 -94 -42 -128 140 -26 -131 97 23 96 81 26 -85 98 -28 -86 -26 -101 103 82 50 -58 -47 38
4536 38 35 10 -12 237 220 -61 -25 76 -4 11 71 -45 59 56 72 -24 -129 57 -18 -87 93 -112 32 86 47 -126
4562 -126 -54 40 -192 22 -118 -158 -126 -34 -54 -13 -21 -77 163 -64 -172 -88 30 67 -139 18 -46 -29 -151 -125 1
4587 1 14 -67 88 116 -36 183 113 119 137 -34 -84 -66 5 7 42 11 6 -51 -48 -189 213 166 3 112 23 -143 60 111
4615 111 -61 21 32 -32 18 11 -19 120 -78 36 201 115 -24 -78 -42 -118 -124 91 93 -52 174 -29 45 -50 -243 17
$$ packed form
4435a12J06r4J72j06J00o4k10R0O4K48j17j6O1j5j09o3K38p7j73R3l1J8J23n5
4459G1J62j68j29O8q4K3Q3jk55K72j5OJ48k04l7N7J11p1l8J35k9q2J89j77Pm0
4485BJ25j37N3j62O8J02k4n3O8N9p8J30j17J70k05k5M3L3N8j1n9m2p0J37j25Q2
4511B2P8j01r3N2q6K68j66j05K28p4P3j5n5j11J83j26n8O0p5K04k1l2j08J1Q5
4536C8lk5k2K49j7k81L6J01q0J5O0j16J04lJ6r6j05J86p5o9J80k05J44N4l9j73
4562a26P2R4k32K14j40m0L2R2k0M1qn6K40k27j08Q4J18L7k06J57o4J7j22K6J26
4587AJ3q1J55K8j52K19p0OJ8j71n0J8P1KL5l1nn7Lj41M02m7j63J09q9j66K03N1
4615A11j72Q2J1o4N0pl0J39j98J14J65q6j39n4L6p6oK15Kj45K26k03P4r5j93K60
$$ plain form
4641 17 -156 -40 -81 294 -94 -119 17 6 -79 12 94 -251 95 29 -122 -99 -74 -124 -16 -116 -16 124 -67 -14
4665 -14 -65 69 99 -95 11 -5 134 186 91 -17 -28 150 68 -161 98 -75 -144 197 -151 -86 196 276 -171 -3
4689 -3 26 37 -58 -11 51 144 -39 -47 -3 135 -65 -129 175 -156 -17 53 -49 -159 51 74 103 -138 -141 107 105 -111
4715 -111 263 -67 40 -149 -102 -54 -102 29 2 79 -4 -91 -47 -14 -63 -10 -70 -156 -15 90 -54 46 -149 28
4739 28 -163 24 -130 -49 101 -14 22 56 -34 -22 -71 88 -2 136 -27 -123 -15 -187 -18 54 -140 147 47
4762 47 -173 142 124 -116 40 -48 122 -31 -136 -27 152 88 -57 90 132 103 32 80 62 -43 47 -25 -11 86
4786 86 -43 23 20 113 66 -106 -73 6 38 4 93 -112 28 150 -174 72 111 -26 -49 -42 -98 44 9 25 71 -130
4812 -130 147 8 83 -132 106 -70 246 -123 -150 104 -99 127 -157 121 171 82 -13 -37 -98 43 -23 28 117
$$ packed form
4641A7j73J16m1L75l88k5J36j1q5R1Q2l45L46o6j51K3K5n0J08j00J00J40j91N3
4665a4n1J34L0j94J06j6J39N2r5j08j1J78q2k29K59j73o9L41l48O5K82Q0m47J68
4689cK9J1r5M7O2R3j83qM4J38k00o4L04l31J39P0j02j10K10K3K9k41lK48kk16
4715a11L74l30J07j89M7M8m8J31k7P7q3q7M4L3m9N3o0q6J41J05j44J00j95J77
4739B8j91J87j54Q1J50j15L6L4r0J2m9J59r0J38j63r6J08j72J69P2j94K87j00
4762D7k20L15j8k40J56q8J70j53j05J09J79o4j45J47M2k9p1M8j8j05R0p2J4R7
4786H6j29O6lR3m7j72L3P9L2l4Q9k05J40J22l24K46L9j37k3Pn6J42l5J6M6k01
4812a30K77j39P5k15K38j76L16l69k7K54k03K26k84K78N0q9r5k4o1J41o6N1Q9
$$ plain form
4835 117 38 -58 146 91 43 -116 137 39 24 68 -66 -174 93 63 -222 92 -41 -88 190 26 -24 128 -13
4858 -13 17 121 -32 -107 -127 123 54 -111 -4 -130 -82 47 212 52 40 -90 51 25 -87 95 -71 16 -7
4881 -7 -113 -83 -33 -185 -31 11 136 -7 134 -2 10 -43 158 43 -159 -61 19 -110 -59 -143 -113 -48 153 75 293
4906 293 45 117 56 -34 112 -102 121 14 -38 154 -41 -49 -13 -50 -27 138 290 137 75 24 2 -5 31 -139 7
4931 7 -113 110 -3 -39 42 -88 -10 -21 245 -189 36 39 -15 7 39 -14 -42 -15 -73 172 121 -99 24 3 -260 -61
4957 -61 53 -125 156 -22 -121 43 44 -96 -69 140 125 -62 66 104 124 -39 88 -53 64 20 33 20 92 83 -149
4982 -149 -95 21 183 -55 49 -127 15 88 -87 -20 81 -81 67 81 147 88 249 113 25 -16 18 48 32 -59
5006 -59 -216 180 68 -67 134 -178 -181 -51 -80 -64 -181 44 75 59 -188 7 -38 171 154 92 -23 -316 -31
$$ packed form
4835A17p9r6K04n5m8j59K53r8j5M4j34j08K67l0k85L14j33m7K78j64n0J52j41
4858a3L0J04j53p5k0K50o9j65J07j26M8J29J65j60j2j30J41k6j12J82j66Q7k3
4881gj06L0N0j52J54M2J25j43J41j36J2n3K01j15k02R8Q0j29N1q4L0O5K01p8K18
4906B93k48P2o1r0J46k14K23j07n2J92j95qL6l7K3J65J52j53o2n1k2pL6j70J46
4931Gj20K23j13l6Q1j30P8j1K66m34K25Ln4K2L2n3k8K7n8K45n1k20J23k1k63J99
4957f1J14j78K81j78r9J64Jj40K7K09j5j87J28L8K0j63J27j41J17m4J3j3P2rk32
4982a49N4J16J62k38J04j76J42P3j75O7J01j62J48J4O6n9J61j36q8m1L4L0j6r1
5006e9j57L96j12j35K01l12lJ30k9J6j17K25L1j6k47J95m5K09j7o2j15k93K85
$$ plain form
5029 -31 99 71 36 -104 -64 -101 -121 87 22 -26 124 -38 -107 6 138 97 164 87 77 149 -63 6 118 100 4 83
5055 83 37 13 118 -17 29 212 23 160 12 102 27 112 27 -100 86 65 34 -46 -24 -112 -62 -32 -42 -84 131 -126
5081 -126 -195 -59 42 -31 114 12 84 63 -133 -88 -101 -87 -124 8 -61 52 -24 -12 -97 94 172 151 -85 45 31
5106 31 -107 -64 -16 -231 -179 -12 -222 98 -172 -23 30 9 119 73 -116 147 -135 34 248 -152 8 -7 58
5129 58 112 -223 -12 -90 31 47 139 120 80 63 -11 85 67 -1 -94 36 -1 -1 -13 131 83 13 -62 -170 74 111 88
5156 88 -141 -62 51 -150 -176 17 -40 108 1 30 97 -75 -153 7 43 5 -102 34 90 -121 -9 74 65 1 -37
5181 -37 6 5 -131 -196 176 5 20 70 35 -29 146 -29 70 -96 23 24 -59 0 104 237 -4 173 -65 86 -99
5206 -99 -2 68 -127 -8 -11 -139 59 36 -6 -33 99 12 -268 79 42 14 107 112 -26 -23 112 -62 -3 71 72 7 121
$$ packed form
5029c1J30k8l5j40M0l7k0K08o5m8J50j62o9J13J32m1O7p7j0P2k12O9J12j8r6P9
5055H3m6k4J05j35M6J83j89J37j48R0p5Q5q5j27J86k1l1q0K2q8N0L0j0m2K15k57
5081a26o9J36J01p3J45j02P2k1j96M5j3J4l7J32o9J13p6J2q5J91P8k1k36J30j4
5106C1j38M3M8k15N2J67k10L20k70J49N3k1J10m6j89K63k82J69K14m00J60j5O5
5129E8N4l35K11p8J21J6R2j9m0j7p4R6j8o8r3J30l7%j2J44m8p0p5j08K44L7k3
5156H8k29P9J13k01k6J93n7J48j07K9O7j72p8J60L6l8j07J36N6k11J12Q3ro4l8
5181c7M3jj36o5L72j71J5N0l5o4J75j75R9j66J19Jq3N9J04J33k41J77k38J51j85
5206i9R7P0j95J19lj28J98k3m2k7J32q7k80L47l7k8R3Nj38LJ35j74N9P4Jo5J14
$$ plain form
5233 121 -116 33 -243 4 -20 -24 -284 66 -18 81 -166 169 -10 -84 32 8 45 23 -3 37 93 -116 28 -19
5257 -19 17 12 -27 -99 94 -4 48 26 -67 110 90 97 12 -135 42 183 20 82 -20 -72 115 9 -291 -68 20 137
5283 137 34 83 -157 -94 23 48 22 -92 45 110 -78 -4 48 -16 -178 -71 -16 -13 83 -16 164 -109 -185 -108 165
5308 165 -15 -186 139 236 -12 -55 -153 37 -97 -48 18 118 -170 -56 -136 141 3 -172 -101 -64 5 -71 73
5331 73 8 -16 -147 89 78 -33 -49 154 156 -110 50 206 62 -65 -108 42 -191 17 -232 1 84 -17 39
5354 39 12 1 49 -27 16 -57 -98 31 111 52 33 -21 70 114 38 129 -43 -113 60 -85 -53 -72 110 -95 147 -200
5380 -200 -61 60 0 -53 -55 -95 182 104 -57 64 211 -8 214 -119 -66 -72 -196 -58 -244 171 -79 13 -42 -79
5404 -79 144 89 -20 22 264 -82 -51 77 21 -130 -114 -13 -101 -52 -28 -43 -5 134 293 -11 -30 -37 -31 -18 1 108
$$ packed form
5233A21k37J49k76K47k4mk60L50q4R9k47L35j79p4J16k4L7k2k6M0N6k09J44m7
5257a9L6nl9p2J93r8N2k2r3J77k0Pq5j47J77J41j63O2j02n2J87j06l00K23Q8J17
5283A37j03M9k40O3J17K5k6j14J37O5j88P4N2o4j62J07N5LR6r9J80k73p6P7K73
5308A65j80j71L25R7k48m3r8J90j34M9O6J00k88J14q0K77j38j75P1L7O9p6J44
5331G3o5k4j31K36j1j11j6K03Kk66J60J56j44j27m3J50k33K08k49K33Q3j01N6
5354C9k7j1M8p6M3p3m1J29Q0n9j9n4R1M4p6R1j72p0J73j45L2j9J82k05K42l47
5380b00J39J21o0n3km0K77p8j61J21J47k19K22l33N3oj24J38j86M15k50R2n5l7
5404g9K23n5j09M2K42l46L1J28n6j51J6J01q8M9K4j5L8J39J59l04j9pOJ3J9J07
$$ plain form
5430 108 -41 8 4 -20 146 45 -249 76 -199 -114 46 -124 123 241 7 -21 -39 -108 115 -158 158 33 -107
5453 -107 116 73 -105 207 -83 -89 116 -28 -76 205 -154 -117 -73 -45 -29 51 -17 41 46 14 -80 162 180 -94 51
5478 51 -100 -88 -66 1 79 106 -59 -200 -30 31 -181 -53 69 19 -56 -61 80 143 47 94 141 -17 161 20 -193
5503 -193 -73 -22 -116 2 -110 66 -24 -52 22 -87 90 8 80 55 -3 -150 4 39 241 2 0 50 99 120 35
5528 35 29 -9 -208 12 51 124 79 -37 48 -12 37 -33 -194 -44 -22 -13 -64 -31 -17 -46 -191 125 55 52 35 4 119 -166
5556 -166 166 -34 94 -197 111 -70 -161 49 24 -25 85 -192 135 89 120 31 -134 72 152 216 -245 -147 -105
5579 -105 -29 -48 -5 -56 202 95 107 -156 -67 -83 -7 -12 -58 -120 -132 127 105 128 -68 -23 32 -79 -29 28 -149 -119 -120
5606 -120 -94 152 131 52 -39 133 80 -64 -40 -197 87 23 18 150 -26 182 58 -50 4 56 -39 -80 66 -88
$$ packed form
5430A08j49M9mk4J66j01k94L25k75Q5J60j70K47J18k34k8j8o9K23k73L16j25j40
5453a07K23m3j78L12k90oK05j44m8K81l59L7M4K8J6Q0o8N8Nl2r4K42J8k74J45
5478E1j51J2K2O7P8K7j65j41J70O1k12J28J22n0p5nJ41O3r6M7M7j58J78j41k13
5503a93J20N1r4J18j12J76r0k8P4j09J77q2P2k5n8j47J54L5K02k39kN0M9K1q5
5528C5ol8j99K20L9P3m5j16Q5o0M9p0j61J50K2Rn1L3J4k9j45L16p0lj7l1J15k85
5556a66L32k00J28k91L08j81r1K10k5m9J10k77L27m6L1q9j65K06Q0O4m61R8M2
5579a05P6j9M3n1K58j07J2k63Q9j6P6nm6o2j2K59k2K3j96M5N5j11N0N7j77L0j
5606a20K6K46k1p9r1J72n3j44K4j57K84o4nJ32j76K08j24j08N4N2r5m1J46j54
$$ plain form
5630 -88 -231 124 -32 -53 32 -73 -24 -10 232 -99 26 -75 139 -141 311 -150 -67 236 -141 107 127 -199
5652 -199 -20 -44 42 78 23 -105 51 -103 142 106 -118 11 39 4 207 16 223 43 -19 115 -32 2 -43
5675 -43 46 -156 -116 108 166 16 -139 -65 -39 28 -33 47 61 147 -235 -49 170 25 -58 -101 -199 -117 -54 -188 -48
5700 -48 97 34 -19 137 34 -63 -58 90 12 -35 125 -60 62 -64 -24 112 -111 -90 82 -22 148 -72 -93 3
5724 3 -105 -42 128 -54 -177 -230 195 207 87 -53 -92 44 119 -63 25 -51 -53 149 82 -111 -124 14 -23 4 -4 31
5750 31 68 28 24 7 1 142 44 77 -49 -45 -249 58 -39 -6 -27 133 22 -14 -127 -99 -28 40 -72 57 -60 -8 -67
5777 -67 -132 -117 17 68 3 215 141 -14 56 -34 -50 152 -256 5 16 -74 124 93 25 -26 79 -69 141 -60 110
5802 110 141 -265 -31 -69 -202 6 31 -139 115 35 -12 -86 71 142 -198 19 243 -47 -1 -96 -11 -16 49 -61
$$ packed form
5630h8j43L55j56k1Q5j05M9J4K42l31J25j01K14k80M52m61Q3L03l77K48K0l26
5652a99J79k4Q6L6n5j28J56j54K45l6k24J29K8l5K03j91K07j80o2J34j47L4m5
5675d3Q9k02M0K24N8j50j55P4K6O7o1Q0J4Q6l82J86K19j45q3m3r8Q2O3j34J40
5700d8J45o3n3J56j03r7NJ48p8m7J60j85J22j26M0J36k23K1J72j04J70k20k1R6
5724Cj08O3J70j82j23n3M25J2j20j40l9J36P5j82Q8p6kK02o7j93j3J38l7K7qL5
5750C1L7m0mj7oJ41r8L3j26Mk04L07r7L3k1J60j11l6j13K8P1O8j12J29j17N2n9
5777f7o5J5J34N1o5K12p4j55P0r0j6K02m08K61J1r0J98l1o8n1J05j48K10k01J70
5802A10L1m06K34l8j33K08K5j70K54q0m7p4J57P1l40K17K24k90M6r5Q5nO5j10
$$ plain form
5826 -61 136 64 45 146 -169 18 -79 112 -189 91 -125 97 85 -102 11 31 -39 -51 15 105 193 -110 204 37
5850 37 74 -46 -78 -45 -79 -103 -150 -2 -22 27 -89 -134 22 32 -22 -78 -136 28 -59 169 64 69 170 171 33 -90
5876 -90 2 92 295 127 170 164 45 115 57 76 103 147 -81 149 -70 10 151 -122 -7 44 -51 -30 -174 122 -50
5901 -50 30 178 -36 -126 123 320 -24 -24 -43 57 -34 114 -94 -157 76 91 -21 168 129 -94 38 -96 -74 -7
5925 -7 63 -54 -69 -14 147 249 60 -131 36 -129 90 60 3 -105 60 -141 -113 37 -44 153 157 19 -125 71
5949 71 15 76 -21 122 11 -75 -97 83 48 171 -166 61 -242 -10 109 -169 -49 36 -29 42 215 35 -154
5972 -154 89 29 9 -34 9 -186 22 44 -38 99 -71 37 81 97 -38 54 37 155 -69 201 174 -50 64 54
5996 54 41 -165 -300 29 -166 -98 118 44 -53 -141 -140 15 -23 9 -59 81 86 33 -28 95 -109 -82 104 55 8 -168
$$ packed form
5826f1J97p2j9J01l15J87r7J91l01K80k16K22j2j87J13K0p0j2O6R0Q8l03L14j67
5850C7L7j20l2L3l4k4m7J48k0M9j16m5J56J0n4n6n8J64q7K28j05NJ01Jj38j23
5876i0R2R0K03j68M3oj19P0n8J9K7M4k28K30k19Q0J41k73J15N1r5K1j44K96j72
5901e0Q0J48k14r0K49J97l44%j9J00r1J48k08o3K33J5j12J89l9k23J32j34K2O7
5925gP0j17j5N5J61J02j89j91J67j65K19l0n7j08J65k01K8J50q1J97Mj38j44J96
5949G1n6O1r7J43j11q6k2J80l5J23l37K27l03K32J19k78J20Q5o5P1J73j80j89
5972a54K43o0k0m3M3j95K08K2q2J37j70J08M4J6j35R2j7J18k24K70k7k24J14j0
5996E4j3k06j35L29j95O8K16p4r7q8JJ55l8L2o8J40Nn3o1J23k04K7J86m9m7j76
$$ plain form
6022 -168 -222 -70 129 2 138 44 -36 31 -32 28 208 -113 59 -11 6 -47 143 -70 -107 51 58 -86 -200 67
6046 67 -23 -63 46 -235 116 -220 60 17 102 -72 9 -84 -156 53 180 149 190 -143 -31 20 56 124 9 -25 -52
6071 -52 18 64 -6 -157 -62 -97 228 -90 -8 61 -141 113 133 80 15 52 -35 167 -74 -46 -110 -54 -80 -84 157 -36
6097 -36 -70 123 -2 55 153 -240 -112 20 -26 -169 132 -49 107 224 56 -165 -193 41 -9 76 -50 -227 29
6120 29 8 -239 -14 19 -128 -3 -3 44 182 -2 108 106 -175 -124 -118 19 8 71 -20 -8 66 74 -183 -58 -40 -176
6146 -176 16 173 155 -36 -56 -185 153 -177 76 9 56 -3 53 -25 -146 -143 78 43 101 141 72 -67 45 186
6170 186 -30 -25 88 16 -51 43 71 73 -34 3 -75 -106 146 -21 26 19 -99 28 -12 -259 66 64 -64 15 129 74
6196 74 -27 129 -21 12 149 62 42 30 -73 21 104 -49 -8 -42 118 -24 -88 87 71 24 -236 -25 164 49
$$ packed form
6022a68n4J52J99j27J36r4q0O7o3O0J80l21J72p0J7n3J90k13l7J58Pj44j14K67
6046F7r0m0J09k81L51l36K80m3Q5j74Q1r3p2K09J27l1M1l33J12N1L6O8j15l4k7
6071e2P0M6p0j51R5l5L25l18Q2O9k02K54K0n3o5L7q7K02k41K8o4N6k6mK41j93
6097c6l4J93j25N7R8l93J28J32m6j43L01j81J56J17j68k21k8K34n0Q5j26j77K56
6120B9k1k47K25L3j47J25%M7J38j84J10kk81N1OJ37j1O3r1J2P4Qk57J25J8j36
6146a76J92J57j8j91k0j29L38l30K53o7M7n9N6p8j21LK21l5N8M0o9j39J12J41
6170A86k16NJ13p2o7R4K8Kj07L7p8l1K52j67M7pj18J27m0k47L25kj28P9J14n5
6196G4j01J56j50L3J37q7k0j2j03R4Q3j53M1l4J60j42o4J75j6m7k60K11J89j15
$$ plain form
6220 49 -85 149 -45 -60 -50 29 33 -146 -218 -19 -47 -48 41 11 175 -18 74 111 -19 -4 -28 -64 140 11 46 56
6246 56 92 -251 64 56 95 7 -133 213 83 -113 239 -134 44 60 -153 26 3 -54 78 244 -8 141 60
6269 60 -246 -29 -138 9 -4 -304 212 18 -76 14 -82 54 107 -126 93 -129 -109 136 -3 -10 -5 -8 68 130 -19
6294 -19 -14 -46 157 -16 -2 75 39 -10 163 27 -205 192 -77 103 -151 -9 87 -121 -25 85 -39 -78 270 -176
6318 -176 175 -24 -217 49 -22 -8 -28 -131 -5 41 60 -19 -51 -59 -120 -78 -90 -57 -265 -25 -35 -85 10 145 51 46
6344 46 -64 100 88 -59 195 108 -189 117 -92 -126 -160 -182 125 203 -159 56 -8 -113 77 -159 -96 53 16
6367 16 -140 55 -193 -2 140 -46 78 45 -97 26 99 11 -116 241 -42 11 34 -149 39 174 -211 -144
6389 -144 59 -27 -8 62 96 -48 -41 116 -28 -50 7 -5 70 -195 31 -163 -99 221 -16 -8 -11 -43 -28 -186 -22 -161
$$ packed form
6220D9j34K34j94j5J0P9Mj79p2J99k8jQ9l0J64j93R2L7j30J5k4l6K04j29L5J0
6246E6L6l43L15qL9q8j40L46j30j96L52l73J78J6k13J79k3n7J32J66k52J49q1
6269F0l06K17j09J47j3l00N16j94r4R0r6J36N3k33K19k22K0K45j39pNlP6O2j49
6294a9Nl2K03j73J4P7l6m9J73j36k32L97k69J80k54J42R6k08R6J10j24l9L48m46
6318a76L51j99j93K66p1J4k0j03J26M6J9p9l2qo1M2j2L3k08K40j0n0R5J35r4n
6344D6j10J64j2j47K54q7k97L06k09l4l4k2L07P8l62K15o4j05J90k36O3J49l7
6367A6j56J95k48J91J42j86J24l3j42J23P3q8j27L57k83N3K3j83J88J35l85O7
6389a44K03q6J9P0L4j44PJ57j44k2N7j2P5k65K26j94O4L20k37Qll2J5j58J64j39
$$ plain form
6415 -161 -222 18 28 -97 -13 88 15 32 -237 90 115 20 23 -86 10 43 -29 86 148 -126 18 -148 -113 130 49
6440 49 -113 -198 63 -98 43 56 157 90 84 -131 -76 -51 43 -60 -72 -33 207 44 83 -41 -33 140 -77 -86 -104 171
6466 171 -35 -78 -16 -65 -53 90 -13 17 -147 -16 -153 36 35 211 -51 29 54 181 -284 61 -113 174 135
6489 135 -30 12 -21 140 -14 32 -79 60 42 97 -54 -164 32 -31 -15 44 69 51 -46 185 -61 -28 213 -79
6513 -79 -190 38 -80 -19 65 -98 154 28 79 110 -51 -104 21 68 195 -12 -18 -93 -178 3 178 39 -43 153
6537 153 66 217 130 -137 129 24 -8 -59 100 27 -209 -128 38 14 94 15 101 38 142 109 44 -68 56 -8 147
6562 147 -86 -69 26 95 55 -159 88 -173 -206 -27 -23 75 131 122 159 -169 64 -28 81 -76 321 114 -158 22
6586 22 211 55 -45 -176 -22 70 -57 27 -178 -79 -78 -125 6 -90 -70 -43 103 -4 5 -32 122 147 -153 13 -58
$$ packed form
6415a61o1K40J0j25Q4J01p3J7k69L27K5r5Lj09R6L3p2J15O2k74J44j66L5K43q1
6440D9j62q5K61j61J41J3J01o7ok15N5K5R4j03j2L9K40j63L9j24QJ73k17rj8K75
6466A71k06m3O2m9J2J43j03L0j64J31j37J89jJ76k62Q0K5J27m65L45j74K87l9
6489A35j65M2l3J61j54M6j11J39j8N5j51j10J96o3J6N9K5j8r7K31k46L3K41k92
6513g9j11K28j18O1Q4j63K52j26N1L1j61n3J25M7J27k07op5q5J81J75j39q2J96
6537A53q7J51q7k67K66j05l2n1J59p3k36Q1J66k4Q0p9Q6o3J04l3o5j12J24o4J55
6562A47k33J7R5O9m0k14K47k61l3J79MR8N6rL7l28K33r2J09j57L97k07k72J80
6586B2J89j56j00j31J54R2j27Q4k05R9Jm7J31r6K0K7J46j07Rl7J54K5l00J66p1
$$ plain form
6611 -58 -75 23 -21 32 16 -47 1 127 -46 243 -46 61 -100 -25 -46 -31 -188 -48 46 -4 -2 46 93 -118 -207 48
6637 48 -56 -111 -85 49 -40 -32 91 15 167 -141 -16 -36 73 179 -98 -19 89 -54 32 -55 -95 -98 19 -64 10
6662 10 -139 -27 4 -93 -101 10 -112 -16 -4 104 25 -32 52 -87 68 -37 -87 -114 92 -30 48 73 -2 76 41 -110
6688 -110 55 -182 -49 -178 -149 -31 85 -165 169 -119 -41 205 -121 147 57 109 28 39 -53 -151 -59 102 29
6711 29 -10 30 -38 73 168 24 -62 120 -45 171 -83 15 -65 24 -17 5 -33 203 -15 193 12 97 -75 25
6735 25 40 -119 75 -241 -115 -122 -148 82 160 105 200 219 -38 -61 -21 -190 93 153 -15 -50 -100 -58 -48 -162 4
6760 4 90 22 128 99 13 28 -41 47 -4 -7 -97 -81 -146 178 53 -35 75 121 145 -164 84 88 -77 -29 -117 -26 183 25
6788 25 -26 -1 -157 126 312 -137 23 136 104 -40 -138 -103 141 -46 -50 81 74 129 29 -47 49 -31 61 154 -126
$$ packed form
6611e8j7R8m4N3j6o3M8J26j73K89k89J07j61P5k1J5j57J40R4n0KM8M7k11q9K55
6637D8j04n5K6J34q9QJ23p6J52l08J25k0J09J06k77P9J08j43Q6q7m0lJ17q3P4
6662A0j49J12L1r7qJ11j22R6J2J08p9n7Q4j39J55j05n0k7K06j22P8K5p5P8l5j51
6688a10J65k37J33j29K9J18J16k50L34k88P8K46l26K68r0N2q1J1r2r8R2J61p3
6711B9l9M0o8J11R5j44q6J82j65K16k54R8q0Q9m1K2l8K36k18K08j81Q5j72J00
6735B5J5j59J94l16J26pk6K30P8n5R5J9k57k3M0j69K83O0j68l5n0M2J0j14J66
6760DQ6o8J06k9q6J5o9Q8n1lr0J6o5L24j25q8J10M6K4l09K48Mj65M8q8R1K09j58
6788B5n1K5j56K83J86m49J60J13l2j44r8L5K44j87mJ31pN5j00p6R6q0R2R3k80
$$ plain form
6813 -126 -113 -156 167 105 -8 190 41 -121 60 154 79 130 -14 42 -2 -147 78 -68 60 -73 -2 -225 164
6836 164 -162 211 65 90 -116 49 42 6 44 -120 33 89 -58 -44 -4 -21 43 -139 83 29 21 -40 -121 -43 84
6861 84 94 -94 15 -32 -144 -29 -84 138 132 87 18 -104 -67 -55 -54 181 8 242 128 -25 34 -50 -68 -74 -55 -21
6887 -21 94 33 -83 60 13 62 -27 -56 -125 -93 -37 50 90 -91 -3 42 -88 -209 -58 -72 -166 -107 240 75 76 -100
6913 -100 -19 17 52 17 -124 -136 283 135 -54 -333 -67 -67 -56 98 25 -79 -98 -120 -117 22 9 11 88 98 185 50
6939 50 -129 -168 197 -11 -55 40 -72 132 -71 -94 161 14 -61 174 209 100 -65 -28 94 3 -58 2 -50 -68
6963 -68 -87 22 -26 -110 13 -157 -4 5 -62 124 -27 -168 -3 -197 -143 -54 -48 -90 -48 5 -15 -39 -27 -15 -88 62
6989 62 -59 -26 85 66 47 -3 55 113 -26 138 -29 -44 95 -167 314 -98 10 205 -73 7 -17 -235 -175 -26
$$ packed form
6813a26J3m3L23o2j13J98j49j62J81R4p5N1j44N6m4j45K25j46J28j33P1k23L89
6836A64l26L73j46K5k06J65pl6L8j64J53N6j47J4M0j7O4j82K22n4qo1q1P8J27
6861H4J0j88J09m7j12J15n5K22om5o9j22L7J2JK35j73K34j14j53N9q4j8oJ9L4
6887b1J15o1j16J43m7M9q9k9o9L2N6Q7M0j81Q8M5j30j21J51j4r4N9L47j65Jj76
6913a00Q1L6L5l5j41j2M19j48j89k79K66%J1J54p3j04j9k2LJ39j3KP7J0Q7j35
6939E0j79l9L65k08m4R5j12K04k03k3K55j47p5K35L5j09j65L7J22r1o1O0n2j8
6963f8j9J09m8q4J23j70J53Ro7J86j51j41J65j94N4Q9Om2M2N3k0k4J2J2p3J50
6989F2j21L3J11j9j9n0N8N8j39J64j67j5J39k62M81m12J08J95k78Q0k4k18O0J49
$$ plain form
7013 -26 -72 27 31 126 303 -92 282 150 21 14 -99 -58 -34 -123 10 6 46 -222 -155 -87 33 39 -58 -153 88 107 -87
7040 -87 -51 -172 63 20 -28 -41 113 -116 86 8 -73 212 -47 150 -140 -43 -92 -26 -56 118 83 -73 -58 59
7064 59 -40 -77 -81 200 -179 66 -92 -54 44 -29 355 41 -69 -43 -79 62 90 10 31 -53 -76 96 -76 -264 -115
7089 -115 99 115 2 36 114 84 -82 244 75 112 -81 -141 203 -66 62 -29 -70 -232 -82 3 -31 63 -118 -153
7113 -153 -131 -83 17 123 107 -15 61 228 19 -4 -89 -9 37 -61 116 0 182 12 -29 -56 -73 -18 95 95 -7
7138 -7 -158 81 82 -166 33 12 124 45 18 -13 -102 -3 -116 -59 52 123 -26 17 41 -5 -127 124 163 -46 77
7163 77 -66 50 -96 92 -127 82 28 -93 126 200 -126 -25 109 -95 -24 86 -37 35 61 -57 -85 -101 54
7186 54 -106 137 -108 86 186 193 -29 14 233 -133 109 -70 18 117 177 -120 -26 -71 -255 -184 -78 -65 -33 -98
$$ packed form
7013b6m6R9MR5J77l95L74j32j29pj13M1K4q9J33mM0k68O7O8J20Or7r5K41J9j94
7040h7L6j21K35m3m8j3J54k29K02p8q1K85k59J97k90R7m9O6l0J74l5j56J5J17
7064E9r9l7mK81l79K45j58L8R8p3L84l14j10K6l6J41K8q0K1q4k3J72j72j88J49
7089a15K14J6j13L4P8l0j66L26j69L7j93o0L44k69J28r1m1j62J50Q5l4R4j81l5
7113a53K2M8J00J06j6j22P6J67k09k3q5Q0M6r8J77j16J82j70m1k7j7N5J13%j02
7138gj51K39Jk48J99k1J12p9k7l1q9R9j13N7J11P1j49M3K4m6j22K51L9k09J23
7163G7j43J16j46J88k19K09n4j21K19P4l26J01J34k04P1J10j23P2K6j18k8j6J55
7186E4j60K43k45J94J00Pk22M3K19l66K42j79Q8R9O0k97R4m5j84P1J06J3L2o5
$$ plain form
7210 -98 145 10 -39 71 -99 108 6 -76 -158 -134 32 80 -51 -151 -132 -69 218 40 -128 -23 -40 -86 -9 96
7234 96 -47 3 194 19 -113 -24 52 56 -85 -19 17 101 -196 -67 71 19 -138 42 -33 68 161 178 -85 0 49
7259 49 -155 -105 -6 -242 -177 -53 -196 26 46 -135 -86 133 -73 -55 70 36 -10 125 -26 6 -27 36 10 -19 -26
7284 -26 166 25 72 106 -39 -68 -13 120 -44 -209 -80 7 43 -39 35 68 60 150 56 249 -2 104 -8 -1 109
7309 109 -54 82 7 51 117 41 102 -186 42 -2 202 68 -57 -50 -23 63 94 4 -88 94 8 143 137 -17 166
7334 166 -29 149 -41 247 74 83 174 -90 -124 -94 -195 -205 13 32 63 -114 -34 111 -37 -126 -72 97 15 24 -102
7359 -102 -328 105 -46 -114 62 81 2 -105 -146 110 -34 -136 116 20 64 158 -76 -51 147 -135 111 106 71 -105
7383 -105 -57 11 39 -142 161 -1 -252 -3 -179 -56 -93 -16 11 106 -17 -39 82 -53 155 -162 -30 49 23
$$ packed form
7210i8K43j35m9J10j70K07j02q2q2K4J66M8j31j00J9O3K87j78j68J05j7m6P7J05
7234I6j43N0J91j75j32Q9P6Mj41O6L6Q4k97J29J38n2j57J80p5J01R3J7k63Q5M9
7259D9k04N0R9k36O5J24j43K22K0j81M9K19k06J8J25l4m6J35j51L2l3O3k6k9p
7284b6J92j41M7L4j45k9N5J33j64j65J29Q7L6q2P4L3qR0r4J93k51J06j12PJ10
7309A09j63J36p5M4O6p6O1k88K28m4K04j34j25PK7Q6L1r0r2J82q6J35oj54J83
7334A66j95J78j90K88j73RR1k64l4L0j01j0K18J9L1j77Q0J45j48q9N4J69q2Rj26
7359a02k26M33j51o8J76J9p9j07m1K56j44j02K52r6M4R4k34K5J98k82K46nl5j76
7383a05M8O8K8j81L03j62k51K49j76J23l7P7K7R5j23k2J21j35K08l17J32P9k6
$$ plain form
7406 23 99 -187 -59 -119 -67 101 -67 -101 133 13 -126 64 -87 -63 -45 -37 50 77 -79 -227 9 90 -55 -26
7430 -26 -8 -172 -185 -113 -38 -94 21 -97 93 27 61 -215 -27 -99 46 26 -18 112 -160 48 80 -68 115 34
7454 34 66 73 -161 -134 -80 -87 -135 84 105 -84 12 70 64 28 -23 91 -69 67 -41 100 15 24 53 -122 59 -15 110
7481 110 -202 17 135 -97 104 139 -70 -57 126 -56 97 88 45 94 -10 -48 61 69 -77 21 -91 132 82 -43
7505 -43 -74 -90 -304 90 -32 -50 158 80 -45 87 235 -144 -21 56 -96 80 -127 -57 35 -91 -32 17 53 50
7529 50 163 -128 5 -124 11 -75 8 89 -126 -78 17 112 13 145 31 34 9 -19 132 207 -93 -45 -108 199 19
7554 19 -84 38 -8 135 26 62 -156 1 -34 -26 -66 153 49 98 60 -83 153 55 -65 52 -104 136 -147
7577 -147 106 25 1 16 -178 -32 106 183 -47 -15 -80 121 90 5 29 -15 -128 49 -28 -116 85 -306 102 62
$$ packed form
7406B3P6k86J28o0N2J68j68l4K34j20j39J90j51K4J8QQ7K7j56j48K36Q1j45K9
7430b6J8j64j3P2P5n6J15j18J90o6L4k76J88p2J45k0m4J30k72K08L2j48J83q1
7454C4L2Pk34K7N4pm8K19K1j89R6N8ol6n1J14j60J36j08J41q5RK9j75J81p4J25
7481A10l12K19J18k32K01L5k09J3J83j82J53rm3M9j04l8J09Qj46R8j12K23n0j25
7505d3l1j6k14L94j22j8K08p8j25J32J48l79J23P7j52J76k07P0R2j26N9M9L6l
7529E0J13k91J33j29J35q6Q3Q1k15M8R5R5r9J32j14Lk5k8J51P5l00M8o3L07j80
7554A9j03J22m6J43j09L6k18J57l5Qm0K19j04M9l8j43K36r8j20J17j56K40k83
7577a47K53q1k4J5j94J46J38P7k30L2o5K01l1q5K4m4j13J77p7q8K01l91M08m0
$$ plain form
7601 62 -14 -74 -112 -46 194 78 -104 -6 49 123 -24 -30 -21 -204 50 -6 -75 62 -226 52 117 -20 -45 -44 -1 102
7627 102 -85 18 194 36 29 48 -119 -73 166 -9 88 -119 -93 -108 -75 -37 171 48 -68 -122 -60 1 67 171
7651 171 -16 192 -40 111 160 -64 -206 46 52 -48 119 -43 -132 193 83 -30 155 138 32 -134 -34 -119
7673 -119 17 51 148 -23 90 2 -108 166 -252 37 123 10 -91 58 63 -62 -41 80 -32 -122 108 28 74
7696 74 -43 -9 0 46 5 -90 186 -105 53 150 -252 131 -157 100 -66 124 -189 97 -60 -38 70 -177 9
7719 9 96 -82 189 -22 -131 -47 -38 -56 -159 56 -99 163 -97 47 53 -114 200 59 48 156 104 51 -30 -10 -46
7744 -46 23 -31 -41 -65 260 106 -4 59 -74 -55 -9 -118 117 69 -206 21 82 46 -43 -56 75 -87 12 142 -11
7769 -11 190 -53 -41 -36 5 25 129 28 -85 -35 42 -19 -80 -88 -103 -34 154 -28 247 15 -12 26 2 -131 114 144
$$ packed form
7601F2p6o0l8O6K40j16j82R8N5P4j47oRj83K54n6o9J37k88K78O5j37k5JM3J03
7627A02j87J03J76j58pJ9j67M6K39j75R7k07K6j5L3L8K08j23j16n4O2O1O6J04
7651A71j87K08k32J51M9k24j42K52Oj00J67j62q9L25j10j13J85j7j06j66J00q5
7673a19J36L4R7j71J13q8j10K74m18K89Q6j13j01J49Nj25K1J21j12r0K30q0M6
7696G4j17L4RM6m1r5K76k91J58R7m02L83k88K57j66J90l13K86j57K2J08k47J86
7719IQ7j78K71k11j09Q4Rj8j03K15j55K62k60J44Oj67L14j41j1J08n2n3q1K0l6
7744d6O9n4j0k4L25j54j10O3j33J9M6j09K35m8k75K27O1l6q9j3J31j62R9J30j53
7769a1K01k43J2NM1K0J04j01j13N0P7o1o1qj5O9J88j82K75k32k7L8k4j33K45L0
$$ plain form
7795 144 4 -106 37 -26 -53 157 -42 220 -37 84 49 50 -39 196 112 143 134 -165 -67 69 -67 122 -20 118
7819 118 -17 -188 -124 101 -171 -53 29 42 -46 109 5 5 -26 103 168 -14 -48 54 -86 -55 9 48 138 150 -60
7844 -60 87 90 150 -54 9 -43 154 54 142 39 -51 60 -12 -17 -37 41 -70 -70 61 44 79 -69 59 50 -30 121 33
7871 33 -54 99 -63 -28 137 -137 78 26 99 23 27 -24 189 164 -87 94 32 23 -59 35 63 -120 25 0 -114 -15
7897 -15 -155 73 31 -180 -20 52 101 -98 -30 81 90 92 28 64 -128 300 105 -111 -21 -47 27 -36 13 -109 22
7922 22 21 174 -110 -74 39 39 36 43 48 126 87 -17 103 78 171 -4 -27 -111 195 -91 -29 -91 -32 80 -69 156 -103
7949 -103 -74 62 14 77 -22 96 -81 -33 -152 5 3 32 -33 -140 -70 -67 -67 -56 76 -1 260 139 -101 103 46 -60
7975 -60 222 -98 -119 42 71 -111 -48 58 85 22 -143 14 -3 189 -28 -64 27 103 98 -43 44 -107 -191 119 15
$$ packed form
7795A44j40j10J43o3k7K10j99K62k57J21l5Jq9K35q4L1rk99R8J36j36J89j42J38
7819A18j35j71O4K25k72J18Q2J3q8J55j04%l1J29O5j82l4J02j40L1O4L9R0J2k10
7844f0J47LO0k04O3n2J97j00Q8j03r0J11p2nk0P8j11%J31j7L5j48J28rq0J51q8
7871C3q7J53j62L5J65k74K15n2P3p6Mn1K13k5k51J81o2rq2R4K8j83J45k5j14R9
7897a5j40K28m2k11J60P2M9j99O8J11RKo4L6j92M28j95k16R0k6P4o3M9j22J31
7922B2jJ53k84L6J13%lPNP8l9j04J20k5R3j75k3q4L06k86O2o2N9J12j49K25k59
7949a03K9J36m8O3r9J18j77M8j19J57kK9o5j07P0L%J1J32p7K61j21k40K04n7j06
7975f0K82l20k1J61K9j82O3J06K7o3j65J57j7J92k17l6R1P6nj41Q7j51q4L10j04
$$ plain form
8000 15 -73 -112 -3 -64 2 -5 -17 185 -101 117 -36 56 -26 -45 -52 136 -103 -113 -87 -16 30 -97 142 140 55 85 -45
8027 -45 96 -287 -143 86 -92 -92 -153 -183 -143 94 79 240 4 -58 61 201 -64 -9 -167 113 81 62 92 7
8051 7 53 183 22 69 -76 171 -16 -68 35 6 156 -105 -95 -18 58 -62 -88 -55 35 -115 60 -14 -214 28
8075 28 318 78 103 -214 -21 -131 -134 29 60 25 -15 90 -158 -80 -61 -9 -174 235 79 -213 295 -109 -14 -74
8099 -74 -62 -58 -83 -93 35 2 61 -16 -190 90 -59 103 77 -23 -77 -91 119 -69 -101 -58 -171 -9 -76 -100 -36 104
8125 104 86 81 -75 -124 140 175 -20 60 -41 14 -20 7 -6 45 -152 39 -135 -55 76 89 -79 12 -49 -138 172
8150 172 18 13 -119 156 128 32 -211 110 68 50 337 -53 55 -24 -54 156 -88 -9 62 12 14 -22 83 -11 -42
8175 -42 142 -148 82 210 21 110 -75 -22 14 29 -90 73 106 8 -106 44
$$ packed form
8000A5q8l9J09o1O6pj2K02k86K18j53R2q2j9pJ88k39j0K6P1M6j27K39kq5L0j30
8027d5J41l83J44K29j78%o1l0M0K37j5J61k36o2J19J40k65N5j58K80l2j9L0q5
8051GM6J30j61M7j45K47j87n2J03k9J50k61J0P7P6j20k6L3R0j50J75p4k00K42
8075B8K90k40K5l17J93j10lJ63L1l5m0J05k48P8J9N2j65M09j56k92N08m04R5o0
8099g4J2Mk5j0J28l3N9p7j74K80j49J62k6j00n4j4K10j88l2M3j13J62o7k4O4J40
8125A04j8nj56m9K64L5j95Q0j01N5l4K7j3N1j97J91j74Q0J31J3j68R1o1q9L10
8150A72j54nj32K75k8r6k43L21m2j8K87l90J08p9l0K10k44P9P1n0Kl6J05r4l1
8175d2J84k90K30J28j89Q9j85N3L6J5j19J63L3r8j14J50
8191D4
$$ Imaginary data points
##PAGE= N=2
##DATA TABLE= (X++(I..I)), XYDATA
$$ plain form
0 0 0 0 0 0 0 0 0 0 0 0 0 0 0 8 -8 8 -8 8 -16 16 -17 24 -29 32 -40 48 -56 64 -72 81 -96 109 -122 141 -159
35 -159 177 -201 226 -254 281 -314 351 -390 431 -477 526 -582 642 -709 780 -858 945 -1040
53 -1040 1147 -1268 1400 -1553 1725 -1923 2155 -2428 2759 -3166 3685 -4369 5317 -6733 9105
68 9105 -14150 51793 -77064 -40094 7718 -66417 118120 -6467 -71965 58065 -21218 22776
80 22776 43984 -106693 28554 33502 -27373 55348 -59241 -36363 82562 -28326 -3196
91 -3196 -6158 -66090 62467 28433 -41796 5026 -54075 20176 53294 -47491 -3434 -19200
103 -19200 -14657 70520 -28739 -41613 13973 -31197 41910 13758 -59194 25982 -2735 5737
115 5737 29045 -66387 2368 39686 -17365 38496 -29868 -44697 63922 -11107 -4175 18998
$$ packed form
0@%%%%%%%%%%%%%Qj6J6j6J6k4L2l3M1n3O1p2Q8j04J20j36J53j77K05k31K63l00
35a59L36l78M27m80N35n95O65p41Q21r08J003j108J224j351J489j638J803j985
53a040K187k415K668k953L278l648M078m583N187n925O851q054R686j2050J5838
68I105k3255O5943j28857L6970M7812p4135J84537j24587o5498J30030p9283M3994
80B2776K1208j50677J35247M948o0875Q2721j14589K2878J18925j10888K5130
91c196k962n9932J28557l4034p0229M6822n9101P4251L3118j00785M4057j5766
103a9200M543Q5177r9259j2874N5586m5170P3107k8152p2952Q5176k8717Q472
115E737K3308r5432O8755L7318n7051N5861o8364j4829J08619p5029O932K3173
$$ plain form
127 18998 -54879 39383 37817 -37784 21122 -22196 -9237 62847 -29818 -9328 23150 -29009
139 -29009 44038 9006 -46194 27983 -824 2104 33560 -36704 -2107 27387 -12834 21482
151 21482 -16206 -24538 35176 -2832 -241 5211 -31385 15862 18604 -17553 4506 -13727 -1180
164 -1180 22029 -16165 -5093 -6639 -8010 22444 -10554 -15595 5536 -12478 11674 6373 -27789
177 -27789 5225 169 -3078 13167 -21205 -3463 10559 -9675 9847 -9576 -17781 21722 -4233
190 -4233 -5703 12043 -23021 7246 17175 -15716 7762 -711 -7777 18745 -4485 -7423 10196
203 10196 -6649 12690 7436 -14955 10579 1250 -1123 15172 -7235 -3229 13888 -3165 2828
216 2828 5144 -6890 7718 5090 37 1847 -4103 4329 4648 -1718 2284 -1124 -2444 5959 -1376
$$ packed form
127A8998p3877R4262j566p5601N8906m3318J2959P2084r2665K0490L2478n2159
139b9009P3047l5032n5200P4177k8807K928L1456p0264L4597K9494m0221L4316
151B1482l7688q332N9714l8008K591N452l6596M7247K742l6157K2059j8233J2547
164a180K3209l8194J1072j546j371L0454l2998n041K1131j8014K4152n301l4162
177b7789L3014n056l247J6245l4372J7742J4022k0234J9522j9423q205L9503k5955
190d233j470J7746l5064L0267R929l2891K3478q473p066K6522k3230k938J7619
203A0196j6845J9339n254k2391K5534r329k373J6295k2407M006J7117j7053N993
216B828K316j2034J4608k628n053J810n950Q432L19o366M002l408j320Q403p335
$$ plain form
231 -1376 -2948 1420 -1452 1768 -2178 -1842 -1775 -3358 2621 -1044 -5615 458 -2517 -4508 2672 -5497
247 -5497 -3518 1831 -5025 -593 -2883 -4849 718 -2338 -2793 1370 -5780 -1806 2324 -6162 1483
262 1483 361 -4919 2423 90 -3792 1816 426 -1471 2934 -1198 405 1446 -385 3168 487
277 487 965 3280 586 87 4383 63 1042 5483 49 1648 3191 964 1036 3656 1707 785 3068
294 3068 1588 993 652 2655 556 344 2636 249 -434 1292 1130 -1949 1343 621 -2430 154 -15
311 -15 -2287 -1225 1404 -2458 -1638 -63 -2514 -1763 -736 -1420 -2819 -258 -1547 -2922 -1753 -1135 -2344
328 -2344 -2135 -28 -2959 -1875 -239 -2017 -1556 -189 -1070 -1648 258 -1106 -610 -424 932 -48 -1222
345 -1222 1669 -883 104 2379 27 396 3117 404 303 2834 -269 2417 1968 1287 2050 393 2459
$$ packed form
231a376j572M368k872L220l946L36O7j583N979l665m571O073k975j991P180q169
247e497J979N349o856M432k290j966N567l056m55M163p150L974M130q486P645
262A483j122n280P342k333l882N608j390j897M405m132J603J041j831L553k681
277D87M78K315k694m99M296m320R79M441n434J599J543k227P2K620j949r22K283
294C068j480n95l41K003k099k12K292k387o83J726j62l079L292p22l051K584j69
311a5k272J062K629l862Q20J575k451P51J027o84j399K561j289j375J169O18j209
328b344K09K107k931J084J636j778M61J367q81n78J906j364M96J86J356r80j174
345a222K891k552R87K275k352L69K721k713j01K531l103K686m49o81P63j657K066
$$ plain form
362 2459 2642 620 2340 2458 -452 4140 1623 -1295 3169 595 961 2308 -259 -14 1052 503
378 503 1227 -796 -996 1917 -1793 489 -355 -3048 594 205 -1600 -1562 -2007 -1162 -214 -1672 -979 -3476
396 -3476 -1724 1844 -4215 -1600 -976 -4122 1333 -203 -4605 -992 -1467 -795 1804 -4541 -1098 43
412 43 -1957 3434 -3341 -3368 3836 -1002 78 2538 -5248 1538 5138 -2505 2516 -1165 -907 6013
428 6013 372 -320 1107 -822 5428 3468 -3387 2729 325 1946 6550 -2965 -970 3773 1733
443 1733 3278 704 -2501 1920 3342 2357 -582 -3559 2672 2155 1185 478 -4737 401 3740 -110
459 -110 -1311 -3332 -1683 3908 -1022 -2079 -2440 -4428 4918 117 -5571 -642 -3681 678 3885 -6525
475 -6525 -4144 739 -1980 3922 -3456 -6985 2568 -746 1185 -1 -7938 593 4059 -1845 949
$$ packed form
362B459J83k022J720J18k910M592k517k918M464k574L66J347k567K45J066n49
378E03P24k023k00K913l710K282q44k693L642l89j805L8m45Q45R48j458O93k497
396c476J752L568o059K615O24l146N455j536m402L613m75O72K599o345L443J141
412D3k000N391o775k7P204m838J080K460p786O786L600p643N021l681K58O920
428F013n641o92J427j929O250j960o855O116k404J621M604r515J995M743k040
443A733J545k574l205M421J422r85k939k977O231n17r70p07n215N138L339l850
459a10j201k021J649N591m930j057l61j988R346m801n688M929l039M359L207j0410
475f525K381M883k719N902p378l529R553l314J931j186p937Q531L466n904K794
$$ plain form
490 949 -4250 -3253 6862 -93 -1393 -1564 -3244 5208 3578 -2716 -796 -598 3325 5599 -2423 -1554
506 -1554 1053 2896 5591 -1174 -1963 632 3308 5570 -1017 -3000 2107 1939 4847 1668 -6075 2620
522 2620 3653 893 3265 -5324 -1154 5823 20 729 -2449 -5169 6397 1406 -3382 1121 -6511
537 -6511 2609 6057 -6587 -1751 -1049 -2481 6065 -2564 -6752 1280 -2508 2957 505 -8515 1044
552 1044 25 -605 2572 -6748 -3038 4085 -1484 276 -2419 -5545 4072 1037 -992 -1086 -4085 3484
568 3484 2315 -1761 194 -3098 1883 5835 -2960 109 120 -1267 7524 -842 -2747 3056 -1346 4806
584 4806 3281 -5205 3473 1847 94 6841 -4888 -864 6873 -2551 4201 612 -5446 6370 1255
599 1255 -1950 3837 -5090 1449 5710 -5026 2425 -1267 -3076 6202 -2743 -3290 2182 -4143 2277
$$ packed form
490I49n199R97J0115o955j300j71j680Q452j630o294J920J98L923K274q022Q69
506a554K607J843K695o765p89K595K676K262o587j983N107j68K908l179p743Q695
522B620J033k760K372q589M170O977n803P09l178k720J1566m991m788M503p632
537f511R120L448j2644M836P02j432Q546q629m188Q032l788N465k452r020R559
552A044j019o30L177r320L710P123n569J760k695l126R617l035k029r4k999P569
568C484j169m076J955l292M981L952q795L069J1j387Q791q366j905N803m402O152
584D806j525q486Q678j626j753O747j1729M024P737r424O752l589o058J1816n115
599A255l205N787q927O539M261j0736P451l692j809R278q945n47N472o325O420
$$ plain form
614 2277 1673 -6498 1694 -1279 -2085 3397 -5576 -1807 1568 -2941 1459 -2169 -4431 2290 -1579 -714
630 -714 152 -5405 2191 156 -2489 1891 -4360 -199 3308 -3469 773 -57 -3485 4683 -898 -2102
646 -2102 3363 -3491 3054 2992 -4253 3524 403 -1359 5642 -2369 -837 5092 -2703 3418 2287 -3692
662 -3692 4849 802 -866 4244 -2183 761 4392 -2257 2385 857 -2435 4362 -996 -865 2888
677 2888 -2307 1505 1686 -2687 1369 -70 -1845 2292 -2107 -903 665 -2333 846 -1094 -1922 758
693 758 -1856 -547 82 -2891 105 -582 -2481 994 -2394 -1331 690 -2671 276 -673 -2124 932
709 932 -975 -1551 1178 -2368 200 1099 -2638 1637 -254 -1527 2229 -761 -367 1848 -655 391
725 391 1800 -962 1339 617 122 2068 -265 1059 1450 -105 1307 1387 -358 1700 1000 -94 1759
$$ packed form
614B277o04q171Q192k973q06N482q973L769L375m509M400l628k262O721l869Q65
630g14Q66n557P596k035k645M380o251M161L507o777M242q30l428Q168n581j204
646b102N465o854O545o2p245P777l121j762P001q011J532N929p795O121j131n979
662c692Q541m047j668N110o427K944L631o649M642j528l292O797n358J31L753
677B888n195L812J81m373M056j439j775M137m399J204J568k998L179j940q28K680
693G58k614J309O29k973K996o87j899L475l388J063K021l361K947r49j451L056
709I32j907n76K729l546K568Q99l737M275j891j273L756k990L94K215k503J046
725C91J409k762K301p22m95J946k333J324L91j555J412Q0j745K058p00j094J853
$$ plain form
742 1759 227 519 981 720 411 647 672 -1 365 262 213 -165 328 -238 -202 26 -428 -19 -551 10 -607
763 -607 -805 -339 -858 -922 -466 -710 -1313 -226 -1296 -1311 -100 -1212 -720 -599 -818 -911 -347 -980 -621 -625 -643
784 -643 -286 -1162 -213 -562 -516 -81 -87 -304 -50 430 -387 345 351 377 595 450 761 508 613 667 783 400 1253
807 1253 697 513 1431 435 1015 1060 694 651 606 1035 717 536 602 658 -208 1450 231 -3 927 -329 -24
828 -24 500 -246 12 362 -431 243 -493 -454 339 -1586 389 -456 -1650 447 -892 -1408 293 -1445 -1450
847 -1450 300 -1784 -476 -552 -1668 391 -1752 -695 252 -1891 322 48 -2417 982 -469 -1996
863 -1996 1968 -1541 -410 1320 -1473 945 278 -1110 1965 -551 137 2012 -2158 1559 2035 -2063
879 -2063 2863 93 -1295 3497 -734 188 2664 -1331 1868 1383 -1529 3072 -1076 101 3573 -2472
$$ packed form
742A759j532K92M62k61l09K36K5o73L66j03m9l78M93n66L6K28m54M09n32N61o17
763f07j98M66n19o4M56k44o03J087j070j5J211j112M92J21k19r3N64o33L59mj8
784f43L57q76R49l49M6M35ok17K54M80q17P32OK6K18j45L11k53J05N4J16l83Q53
807A253n56j84R18r96N80M5l66m3m5M29l18j81O6N6q66J658j219k34R30j256L05
828b4N24p46K58L50p93O74p36L9P93j925J975q45j194K097j339n16J701j738n
847a450J750k084J308p6j116K059k143J057R47k143K213k74k465L399j451j527
863a996L964l509J131J730k793K418o67j388L075k516O88J875m170L717M76m098
879b063M926k770j388M792m231R22K476l995L199m85k912M601m148J177L472o045
$$ plain form
895 -2472 1315 1881 -2380 2842 381 -2432 3088 -1225 -26 2302 -3215 1508 415 -2348 2817
910 2817 -2210 -1647 3087 -3167 273 1118 -4097 2462 -674 -2880 2256 -3653 -315 2075 -4155 1347
926 1347 -443 -3640 3593 -2373 -2291 3164 -4202 1202 1711 -4701 2646 -660 -2264 3654 -3613 -392
942 -392 3318 -3891 3469 622 -4203 5254 -1382 -1266 4639 -3827 1276 3888 -3530 3246 143 -2287
958 -2287 5512 -2160 326 3598 -4400 3971 1945 -3933 4796 -978 -1450 5568 -3443 431 3141
973 3141 -3585 4252 -868 -2964 4125 -2564 596 3280 -5447 2656 1640 -4720 4227 -2817 -2640
988 -2640 4642 -3826 484 1070 -4933 3333 -682 -3656 3533 -4338 -303 3932 -5987 1655 511
1003 511 -4512 4937 -2512 -3586 3780 -3730 941 2420 -5609 3344 -207 -2933 5002 -4414 -567
$$ packed form
895b472L787N66m261N222k461k813N520m313J199K328n517M723j093k763N165
910B817n027N63M734o254L440Q45n215O559l136k206N136n909L338K390o230N502
926A347j790l197P233n966Q2N455p366N404N09o412P347l306j604N918p267L221
942c92L710p209P360k847m825R457o636J16N905q466N103K612p418O776l103k430
958b287P799p672K486L272p998Q371k026n878Q729n774m72P018r011L874K710
973C141o726P837n120k096P089o689L160K684q727Q103j016o360Q947p044J77
988b640P282q468M310N86o003Q266m015k974P189p871M035M235r919P642j144
1003E11n023R449p449j074P366p510M671J479q029Q953l551k726P935r416L847
$$ plain form
1018 -567 4859 -4314 2353 1312 -4886 5149 169 -2313 4283 -3704 1519 3734 -4065 3219 -25
1033 -25 -2117 5973 -2081 -1284 4431 -3620 3099 2495 -4247 3850 -340 -916 4164 -3503 711 3041
1049 3041 -3263 3371 -483 -3726 5069 -1750 -623 2877 -4494 1715 1880 -3503 2425 -1745 -1777 3973
1065 3973 -3596 -76 1362 -4339 3552 -517 -4295 3103 -2837 -954 3082 -4370 242 1397 -3299
1080 -3299 2825 -2216 -2488 3188 -2564 752 1269 -4629 2253 891 -2981 3072 -1825 -1084 3620 -2501
1096 -2501 278 909 -2002 3104 -281 -1488 2236 -1838 1194 2683 -2756 2083 1123 -1527 3184
1111 3184 -702 -646 2664 -426 1237 744 -1712 2061 226 -107 2384 -2278 770 2111 -2031 1494
1127 1494 173 -1586 2424 -551 -910 952 -1446 1103 561 -2014 1084 -1247 -930 1483 -2280 -710
$$ packed form
1018e67N426r173O667j041o198J0035m980k482O596p987N223K215p799P284l244
1033b5k092Q090q054P97N715q051O719o04o742Q097m190n76N080p667M214K330
1049C041o304O634l854l243Q795o819J127L500p371O209J65n383N928m170l2N750
1065C973p569L520J438n701P891m069l778P398n940J883M036p452M612J155m696
1080c299O124n041k72N676n752L316N17n898O882j362l872O053m897P41M704o121
1096b501K779O31k911N106l385j207L724m074L032J489n439M839r60k650M711
1111C184l886N6L310l090J663m93k456L773j835l33K491m662L048J341m142L525
1127A494j321j759M010k975l59J862k398K549n42k575L098k331L17K413l763J570
$$ plain form
1143 -710 930 -1941 425 -180 -2335 896 -701 -658 479 -1636 65 -146 -1249 492 -951 -971 1385
1160 1385 -1092 -488 689 -1192 669 400 -518 444 -364 329 663 -408 640 461 -493 1462 -116
1177 -116 -96 1397 179 614 981 29 512 719 413 630 -37 749 610 -198 1305 -12 -243 1351 269
1196 269 93 554 -13 -32 616 84 269 41 47 365 -728 362 5 -560 356 -15 -968 -107 -232 -751
1216 -751 -95 -469 -766 -577 -315 -651 -744 69 -464 -839 -300 -281 -1008 -40 -85 -848 52 -22 -593 -534 137 -323
1238 -323 -178 629 -181 -381 94 83 -439 515 179 -57 714 400 29 57 519 446 260 840 345 10 624
1259 624 563 -119 834 622 -129 444 332 150 239 1082 185 54 396 203 134 307 340 -176 327 68 -229
1280 -229 -280 319 -3 -397 219 -529 -346 -105 -210 -354 -188 -11 -604 -274 -287 -464 -616 13 -356 -746 -121
$$ packed form
1143g10J640k871K366o05k155L231j597M3J137k115J701k11j103J741j443k0K356
1160A385k477O04J177j881J861k69r18R62q08O93L34j071J048j79r54J955j578
1177a16K0J493j218M35L67r52M83K07l06K17o67P86j39q08J503j317k31J594j082
1196B69j76M61n67j9O48n32J85k28OL18j093J090l57n65R16l71r53Q61j25n19
1216g51O56l74k97J89K62l36r3Q13n33l75N39J9p27R68m5p63R00p4n71N9O71m60
1238c23J45Q07q10k00M75j1n22R54l36k36P71l14l71K8M62p3j86N80m95l35O14
1259F24o1o82R53k12p51N73j12j82Q9Q43q97j31L42j93o9J73L3n16N03k59k97
1280b29n1N99l22l94O16p48J83K41j05j44J66J77n93L30j3j77j52O29l69l90O25
$$ plain form
1301 -121 -559 -521 -188 -108 -582 -175 -123 -606 -280 -8 -84 -377 238 -164 -345 379 -15 -89 165 303 -230 536
1323 536 333 -2 229 361 462 100 813 305 146 620 480 40 418 638 -29 880 385 11 259 750
1343 750 207 -64 426 -20 2 600 372 -427 130 386 -351 -45 -52 -360 53 355 -343 -674 -83 -257 -28
1364 -28 -157 -404 -847 -145 59 -880 -635 -382 -409 -223 -94 -886 -620 318 -143 -524 -451 -326 -354 303 -212
1385 -212 -587 -106 294 270 -318 -313 -368 193 846 -7 -455 145 538 277 723 -155 -146 738 797 281 -485 141
1407 141 738 876 415 -43 -318 657 1182 -77 -8 189 498 1079 34 -427 -249 509 852 -55 -791 -77
1427 -77 -164 589 555 -1050 -301 749 -1 -61 -635 -995 426 554 -195 -780 -1212 452 341 -814 -337 -1449
1447 -1449 -32 1051 -632 -1292 -415 -503 779 55 -1565 -477 -200 704 440 -1539 -431 370 356 816
$$ packed form
1301a21m38L8L33Q0m74M07N2m83L26K72p6k93O15m02j81P24l94p4K54J38n33P66
1323E36k03l35K31J32J01l62P13n08j59M74j40m40L78K20o67R09m95l74K48M91
1343G50n43k71M90m46K2N98k28p99N57K56p37L06pl08M13L02o98l31N91j74K29
1364b8j29k47m43P02K04r39K45K53k7J86J29p92K66R38m61l81P3J25k8O57n15
1385b12l75M81M00k4n88Nn5N61O53q53m48O00L93k61M46q78RQ84N9n16p66O26
1407A41N97J38m61m58k75R75N25j259O9J97L09N81j045m61J78P58L43r07p36P14
1427g7q7P53l4j605P49J050p50o0n74l60J421J28p49n85m32J664j11j155M77j112
1447a449J417J083j683o60Q77q8J282p24j620J088K77R04k64j979J108Q01j4M60
$$ plain form
1465 816 -989 -1184 1495 419 338 13 -1434 754 1445 16 -67 -715 338 1823 -222 -47 -215 -271
1483 -271 2169 243 -1072 668 31 990 1203 -1224 -382 744 302 1034 -1122 -698 1032 101 868
1500 868 -573 -1697 1091 871 -339 191 -1506 -74 1533 -642 -469 -812 -588 1582 -530 -1108 -485
1517 -485 -1008 967 528 -2009 -126 -162 -216 1087 -1515 -1083 426 -94 575 -561 -1602 653 311 -72
1535 -72 369 -1778 75 1361 -491 159 -544 -548 1522 150 -672 221 -692 1444 686 -865 414 -46
1553 -46 514 1667 -762 -214 829 75 1217 20 -1019 1237 379 703 515 -1229 784 888 -254
1570 -254 660 -585 -569 1334 -393 -412 104 -966 874 396 -922 113 -601 414 518 -1094 -87
1587 -87 -214 -781 960 -785 -1330 552 -443 -27 -138 -1231 -54 301 -383 232 -909 -210 749 -594
$$ packed form
1465H16j805j95K679j076q1l25j447K188O91j429q3o48J053J485k045J75j68n6
1483b71K440j926j315J740o37R59K13k427Q42J126m42P32k156M24J730r31P67
1500H68j441j124K788k20j210N30j697J432J607k175J73l43K24K170k112n78O23
1517d85n23J975m39k537J883l6n4J303k602M32J509n20O69j136j041K255l42l83
1535g2M41k147J853J286j852O50p03mK070j372q22Q93r13K136p58j551J279m60
1553d6N60J153k429N48J043p54J142j197j039K256q58L24j88j744K013J04j142
1570b54R14j245J6J903j727j9N16j070J840m78j318J035p14J015J04j612J007
1587h7j27n67J741j745n45J882r95M16j11j093J177L55o84O15j141O99R59j343
$$ plain form
1605 -594 -4 -395 -878 856 -67 -605 229 -492 109 857 -695 -77 5 -227 662 -242 -131 493 5 479
1625 479 454 -647 669 427 25 602 -307 237 606 67 327 212 -213 904 221 54 417 -382 389
1644 389 610 -359 571 37 -149 362 -184 -9 145 -276 229 37 -335 161 -202 -69 143 -571 -200 49
1664 49 -386 -216 -237 -471 -58 -155 -229 -252 -515 -26 -49 -455 69 -186 -302 32 -70 -191 45 -201 61 -35
1686 -35 -191 -113 -186 196 47 -139 101 131 163 346 137 -93 381 101 209 232 246 108 50 391 298 371 262
1709 262 221 62 176 262 -34 375 29 106 222 -20 -40 78 147 29 246 50 -146 -17 89 -110 -308 -192
1731 -192 -257 137 -41 11 -234 -58 -76 -241 -158 -447 -183 -345 -216 -128 -24 -294 -81 -218 -360 -164 -184 98
1753 98 -97 -161 -10 -87 -82 -226 -230 -159 86 -153 129 6 115 97 141 210 -54 282 352 81 202 205 94 175 83
$$ packed form
1605e94N90l91m83J734r23n38Q34p21O01P48j552O18Q2k32Q89r04J11O24m88M74
1625D79k5j101J316k42m02N77r09N44L69n39K60j15m25J117o83j67L63p99P71
1644C89K21r69R30n34j86N11n46J75J54m21N05j92l72M96l63J33K12p14L71K49
1664D9m35J70k1k34M13r7p4k3k63M89k3m06N24k55j16L34j02j21K36k46K62r6
1686c5j56P8p3L82j49j86K40L0L2J83k09k30M74k80J08K3J4j38n8L41r3P3j09
1709B62m1j59J14Q6k96M09l46P7J16k42k0J18O9j18K17j96j96J29J06j99j98J16
1731a92o5L94j78N2k45J76j8j65Q3k89K64j62J29Q8J04k70K13j37j42J96k0K82
1753I8j95o4J51p7Nj44mP1K45k39K82j23J09j8M4O9k64L36P0k71J21Lj11Q1r2
$$ plain form
1778 83 81 314 260 149 380 119 299 324 51 302 242 -78 269 77 -34 256 -154 30 314 -338 224 -30
1800 -30 -115 220 -70 -15 69 -286 -29 6 -234 252 -286 -241 10 -421 -208 -85 -449 72 -185 -463 251 -349
1822 -349 -24 116 -371 131 -140 -204 158 -282 -287 193 -200 -64 31 -487 462 -30 -91 214 -332 182 338 -361
1844 -361 74 357 -261 857 -95 -197 420 -96 571 245 -291 448 124 -248 573 -236 -103 722 -217 278
1864 278 48 -529 658 20 -59 277 -456 289 627 -573 225 -104 -553 782 -404 -311 170 -485 359
1883 359 45 -959 316 -134 -295 540 -975 -133 310 -491 456 -329 -655 537 -263 -352 310 -1051 324
1902 324 317 -898 393 -501 -257 818 -420 -162 45 -586 621 -27 -413 526 -350 417 823 -761 50
1921 50 350 -221 817 -263 -470 819 -16 553 143 -843 655 307 -219 551 -430 -123 978 -316
$$ packed form
1778H3kK33n4j11K31k61J80K5k73K51o0l20L47j92j11K90m10J84K84o52N62k54
1800c0q5L35k90N5Q4l55K57L5k40M86n38M5K51m31K13J23l64N21k57k78P14o00
1822c49L25J40m87N02k71o4L62m40nM80l93J36R5n18R49m92o1L05n46N14J56o99
1844c61M35K83o18J118r52j02O17n16O67l26n36P39l24l72Q21q09J33Q25r39M95
1864B78k30n77J187o38p9L36p33P45L38j200P98l29m49J335j186R3M81o55Q44
1883C59l14j004J275m50j61Q35j515Q42M43q01R47p85l26J192q00q9O62j361J375
1902C24pj215J291q94K44J075j238K58K07o31J207o48l86R39q76P67M06j584Q11
1921E0L00n71J038j080k07J289q35N69m10r86J498l48n26P70r81L07J101j294
$$ plain form
1939 -316 8 162 -315 1093 76 -408 394 -500 481 486 -890 232 -97 -78 621 -771 -613 458 -515
1958 -515 347 57 -1139 484 53 -211 285 -831 -123 622 -653 53 -456 -647 868 -303 -283 -56
1976 -56 -670 434 223 -817 90 -365 -263 694 -896 -324 445 -167 646 90 -637 527 71 20 339
1995 339 -866 111 638 -36 601 -312 -199 1103 -151 53 105 -387 621 554 -368 361 -46 351 478
2014 478 -375 1 115 -67 621 -300 -579 663 -368 -18 298 -707 266 131 -85 26 -476 -250 505
2033 505 -356 -53 -281 -742 408 148 -464 58 -246 250 325 -479 -278 130 -45 320 -210 -465 110 -246
2053 -246 349 114 -516 301 85 -30 357 -389 -153 422 -92 -125 10 -171 447 22 267 311 14 384 292
2074 292 -269 203 58 2 461 -284 132 129 123 302 86 -20 56 74 97 243 -193 218 250 21 120 -185 -208 213
$$ packed form
1939c16L24J54m77J408j017m84Q02q94R81Nj376J122l29J9O99j392J58J071r73
1958e15Q62k90j196J623m31k64M96j116P08P45j275P06n09j91J515j171K0K27
1976e6o14J104k11j040R07m55J02R57j590N72P69o12Q13n56p27J164m56n1L19
1995C39j205R77N27o74O37r13J13J302j254K04N2m92J008o7r22P29m07L97J27
2014D78q53L76J14j82O88r21k79J242j031L50L16j005R73j35k16J11n02K26P55
2033E05q61L03k28m61J150k60o12N22l04M96P5q04K01M08j75L65n30k55N75l56
2053b46N95k35o30Q17k16j15L87p46K36N75n14l3J35j81O18m25K45M4k97L70r2
2074B92n61M72j45n6M59p45M16loJ79k16j06P6J8K3J46m36M11L2k29R9l05k3M21
$$ plain form
2098 213 31 19 72 -231 17 133 -112 -49 -172 -346 -33 -186 -210 -23 -133 -49 -171 -447 -150 -80 -203 -13
2120 -13 -228 -116 -60 -114 89 -238 -82 13 -263 -253 41 -143 -118 32 -274 -48 236 -100 99 99 42 160 67
2143 67 208 97 2 318 116 166 175 -33 94 -58 4 107 173 235 188 -108 69 -62 -140 106 -14 186 -52
2166 -52 192 43 159 94 -95 -55 -93 101 -145 -28 -52 -328 -146 -99 -119 -33 -128 -115 4 -212 -1 97 -12 -195
2190 -195 -105 -82 -175 -234 -163 28 -432 -19 -120 -78 64 129 37 -16 41 21 -50 42 227 15 -174 -3 3 63 219
2215 219 -58 243 188 95 -9 245 182 56 145 121 155 53 18 -6 -20 134 -3 191 118 -69 107 3 -96 -86
2239 -86 75 -52 -291 -14 85 -56 -17 80 -241 -292 -31 -117 -1 -213 -95 -117 -69 -240 -99 -170 82 -149 154
2262 154 -96 -137 -25 -127 -19 -226 -96 -218 -143 -88 -132 -44 96 -18 -266 -139 -29 -38 -30 99 177 42 68 -214
$$ packed form
2098B13j82j2N3l03K48J16k45O3j23j74L13j53k4J87j10Q4j22k76K97P0j23J90
2120a3k15J12N6n4K03l27J56R5k76J0K94j84K5J50l06K26K84l36J99%n7J18r3
2143F7J41j11r5L16k02N0Rk08J27j52O2J03O6O2m7k96J77j31p8K46j20K00k38
2166e2K44j49J16o5j89M0l8J94k46J17k4k76J82M7k0Q6r5J3J19k16K11R8j09j83
2190a95R0K3r3n9P1J91m60M13j01M2J42O5r2n3N7k0p1R2J85k12j89J71OO0J56
2215B19k77L01n5r3j04K54o3j26Q9k4L4j02l5k4j4J54j37J94p3j87J76j04r9J0
2239h6J61j27k39K77R9j41L9R7l21n1K61q6J16k12J18k2M8j71J41p1K52k31L03
2262A54k50m1J12j02J08k07J30j22P5N5m4Q8J40j14k48J27J10rQJ29P8j35K6k82
$$ plain form
2286 -214 -33 65 45 -47 107 274 96 254 -75 132 121 130 -31 15 89 -155 -38 16 57 26 165 9 -112 38
2310 38 46 -7 115 206 -28 7 -5 68 -34 69 91 81 50 -172 -183 69 -115 -18 -189 27 -70 29 -189 -292 -36
2335 -36 -135 -5 -164 -271 -73 -22 42 -238 -213 -310 60 -188 -169 -78 20 -72 51 90 -125 -47 19 177 -35 105
2359 105 -133 0 254 62 48 173 -232 -25 172 -122 -103 326 243 250 -84 115 1 114 219 76 -4 232
2381 232 -20 17 -61 -114 32 283 -26 -77 28 39 158 55 -43 -144 -72 -159 201 -227 5 46 -63 -14 -85 -86
2405 -86 -206 29 93 33 -318 130 -123 23 110 -336 210 -76 -172 -50 -300 -325 65 17 -37 -81 -243 0 -241
2428 -241 -57 205 -283 -30 135 -97 -115 218 106 220 189 -33 95 101 162 133 -40 197 260 158 203 -46 94
2451 94 365 -45 203 -145 -183 139 169 -8 56 -97 54 468 -148 -114 15 50 237 -45 -166 172 -173 -172 -30
$$ packed form
2286b14J81R8k0r2J54J67j78J58l29K07j1Rj61M6P4k44J17N4M1l1J39j56j21J50
2310C8Qn3J22R1k34L5j2P3j02J03K2j0l1k22j1K52j84R7j71K16r7R9k18j03K56
2335c6r9J30j59j07J98N1O4k80K5r7L70k48J9R1R8r2J23L9k15P8O6J58k12J40
2359A05k38J33K54j92j4J25m05K07J97k94J9M29q3Pl34J99j14J13J05j43q0K36
2381B32k52L7p8n3J46K51l09n1J05J1J19j03r8j01P2q7L60m28K32M1j09M9p1j
2405h6j20K35O4o0l51M48k53J46Q7m46N46k86r6J22k50k5L90m8n4m4j62K43k41
2428b41J84K62m88K53J65k32j8L33j12J14l1k22J28OO1k9j73K37O3j02M5k49J40
2451I4K71m10K48l48l8L22L0j77O4j53J51M14o16L4J29L5J87k82j21L38l45JJ42
$$ plain form
2474 -30 -116 85 36 -44 3 -153 -260 -62 -276 163 -209 -256 161 -153 -216 57 -148 9 71 -173 8 -106 -29
2497 -29 133 -166 16 59 -183 172 131 -233 292 -23 -191 260 -22 48 -65 -9 344 278 -79 86 176 104 -8
2520 -8 -30 326 137 86 69 -12 94 302 81 23 184 -163 237 -97 -105 55 24 123 57 -45 -107 -234 -155 36 -17
2545 -17 -123 -111 -129 -28 -58 -272 -141 -78 -215 -2 -256 -183 20 -325 62 157 -123 146 -157 -73 -192 -52 -115
2568 -115 171 -287 76 -11 -114 174 43 29 134 -106 -49 167 -90 73 -46 35 15 9 242 101 -169 211
2590 211 148 -7 19 -29 65 113 -150 51 -39 163 154 -11 50 108 -16 -94 42 51 57 205 -78 66 -4 -10 103 95 -53
2617 -53 -73 82 -71 117 -107 -9 -184 -38 -27 -29 -69 -180 6 -74 -248 -71 13 138 65 88 -164 36 -61 44
2641 44 64 -79 104 -237 20 70 -40 -118 69 20 -51 17 82 40 -60 31 39 -49 -70 31 105 150 -59 107 69 46
$$ packed form
2474c0q6K01m9q0M7j56j07J98k14M39l72m7M17l14o3K73k05J57O2k44J81j14P7
2497b9J62k99J82M3k42L55m1l64N25l15j68M51k82P0j13N6L53o6l57J65R0p2j12
2520hk2L56j89n1j7q1J06K08k21n8J61l47M00l34qJ60l1R9o6j02o2j27P9J91n3
2545a7j06J2j8J01l0k14J31O3j37K13k54P3K03l45L87R5k80K69l03Q4j19J40o3
2568a15K86m58L63q7j03K88j31j4J05k40N7K16k57J63j19Q1k0oK33j41k70L80
2590B11o3j55K6m8R4M8k63K01r0K02rj65O1N8j24p8J36ROJ48k83J44p0oJ13qj48
2617e3k0J55j53J88k24R8j75J46J1km0j11J86q0j74J77Q4J25p3K3k52K00r7J05
2641D4K0j43J83l41K57N0j10p8J87m9p1O8O5m2j00R1Qq8k1J01P4M5k09J66l8k3
$$ plain form
2667 46 107 93 -60 79 -9 58 90 63 91 -36 -36 -45 84 90 -46 -130 246 148 109 64 9 52 -85 -159 -121 3 -22 -2
2695 -2 3 -10 -179 53 -120 43 -40 -225 -99 73 36 144 -114 -151 14 -11 -91 -50 32 -65 161 -70 62 28 -113
2720 -113 46 111 -61 47 -77 72 -52 -137 45 84 -84 -104 41 167 -127 17 330 -50 15 -74 28 -51
2742 -51 177 65 55 177 210 -38 -45 -9 149 -35 -51 -93 119 205 -46 -130 12 -111 52 17 -127 156 -247 103
2766 103 -126 -95 49 -10 -227 64 -34 -50 40 -269 -189 -181 -109 8 -41 -200 -129 -19 -119 -123 -253 -195 -82 -169 227
2791 227 -81 86 -179 -56 98 97 -182 -49 111 -78 211 30 78 162 -59 76 129 2 296 29 91 234
2813 234 -135 147 334 99 -41 -65 -18 269 -83 122 179 -18 -13 237 -39 135 58 -10 75 -40 69 -105 9
2836 9 20 75 -44 56 -249 32 148 -32 -76 -6 -134 14 -179 -167 -54 -13 27 -21 -130 -17 -65 -90 38 -157
$$ packed form
2667D6O1j4j53J39q8O7L2k7K8j27%rJ29Oj36q4L76r8l9m5n5M3j37p4L8J24k5K0
2695bNj3j69K32j73J63q3j85J26J72l7J08k58l7J65k5q0M1Q2r7K26k31J32l4j41
2720a13J59O5j72J08j24J49j24q5J82L9j68k0J45J26k94J44L13l80O5q9J02p9
2742e1K28j12j0J22L3k48pL6J58j84j6m2K12Q6k51q4J42j23J63l5j44K83m03L50
2766A03k29L1J44n9k17K91r8j6R0l09Q0QP2J17m9j59P1J10j00mj30N8J13q7L96
2791B27l08J67k65J23J54jk79J33J60j89K89j81M8Q4k21J35N3j27K94k67O2J43
2813B34l69K82J87k35j40k4M7K87l52K05N7j97NK50k76J74p7o8Q5j15J09j74J14
2836IJ1N5j19J00l05K81J16j80m4P0j28J48j93J2J13M1M0m8j09J13m8k5J28j95
$$ plain form
2860 -157 -24 41 2 -86 136 -22 113 -21 -49 -35 -94 125 132 -279 76 -71 -144 110 148 52 -13 7 98 -9 59
2885 59 241 -83 69 57 -30 46 -66 -101 176 88 110 241 41 -8 72 8 75 -50 -144 188 -88 2 108 40 -79
2910 -79 135 -86 -18 -67 -89 185 -9 -152 -227 -399 109 -181 -77 -74 -171 52 17 -90 -261 -52 -155 134 -18
2933 -18 -150 213 -124 -142 23 -268 -71 -41 -131 123 -70 -96 41 -97 70 3 -103 -17 39 -81 -80 -63 -195 97
2957 97 9 25 49 96 217 -45 -6 115 -50 83 173 -103 90 160 -26 -26 74 107 15 36 -38 -10 -92 176 9
2982 9 -52 89 -197 61 -66 -164 137 118 106 12 -261 -151 -81 -87 78 -16 -140 -8 19 -20 38 -100 -38 -128 -88 71
3008 71 -66 -107 -43 -62 -67 -71 -207 47 119 -230 114 -128 83 -28 -188 11 -77 18 -6 54 70 -4 39 136 125 -10
3034 -10 111 103 11 250 -31 -142 69 263 50 193 75 186 320 77 276 -12 40 144 -128 163 -22 -106
$$ packed form
2860a57J33O5l9q8K22j58J35j34k8J4n9K19Pm11L55j47p3K54L8r6o5K0R1j07O8
2885E9J82l24J52j2q7P6j12l5K77q8K2J31k00m9Q0o4O7j25r4L32k76R0J06o8j19
2910g9K14k21O8m9k2K74j94j43p5j72N08k90J04Lr7K23l5j07j71K09j03K89j52
2933a8j32L63l37j8J65k91J97L0r0K54j93k6J37j38J67o7j06Q6N6j20JJ7j32K92
2957I7q8J6K4M7J21k62L9J21j65J33R0k76J93P0j86%J00L3r2K1p4K8q2K68j67
2982Io1J41k86K58j27r8L01j9j2r4k73J10P0oJ65r4j24J32K7l9N8j38O2r0M0J59
3008G1j37m1O4j9nmj36K54P2l49L44k42K11j11j60J99q8R5k4O0J6p4M3R7j1j35
3034a0J21qr2K39k81j11K11J94k13J43j18J11J34k43J99k88N2J04k72K91j85q4
$$ plain form
3056 -106 21 51 -76 88 -43 -264 -75 -135 43 -166 -62 114 -321 -101 -77 -106 44 -58 -56 150 -15 -238
3078 -238 -293 -70 -176 -36 -134 -159 -78 -120 -71 14 126 -10 -17 79 -8 -3 -27 45 -87 5 20 77 167 -189 34 85 17
3105 17 -7 -40 94 14 196 -149 -176 169 -77 150 -39 -78 -24 -105 86 -238 -38 152 158 81 92 135 -16 -14 52
3130 52 -13 42 -99 -64 -18 20 132 79 -73 -229 123 -50 71 -83 -97 -29 85 -29 87 13 131 -154 -245 -84
3154 -84 -106 -151 43 -151 3 -91 -39 71 -45 -73 1 47 -82 24 121 -220 95 -38 45 149 173 -76 44 139
3178 139 -19 63 -26 -37 41 173 33 -112 -35 -70 -29 143 15 -22 193 -45 30 -37 -78 -80 -85 96 2 -149 45
3203 45 -100 39 -2 61 -119 -68 -36 145 -236 96 -76 -157 -125 -74 -155 31 66 -69 -39 -167 23 31 -122 -69 -159
3228 -159 -24 44 -108 -195 -73 65 -67 -22 57 -220 98 -7 -50 150 -50 -9 -17 1 82 68 79 231 -113 -59
$$ packed form
3056a06J27L0j27J64j31k21J89o0J78k09J04J76m35K20K4k9J50j02KK06j65k23
3078b38n5K23j06J40r8k5Q1m2M9Q5J12j36pR6q7Nk4P2j32R2J5N7R0l56K23N1o8
3105A7k4l3J34q0J82l45k7L45k46K27j89l9N4q1J91l24K00J90Op7J1M3j51KO6
3130E2o5N5j41L5M6L8J12n3j52j56L52j73J21j54j4O8J14j14J16p4J18k85r1J61
3154h4k2m5J94j94J54r4N2J10j16k8P4M6j29J06R7l41L15j33Q3J04K4k49J20R5
3178A39j58Q2q9j1P8J32j40j45P7l5M1J72j28l7K15k38P5o7m1knJ81r4j51J94
3203D5j45J39m1O3j80N1L2J81l81L32j72q1L2N1q1J86L5j35L0j28J90Qj53N3r0
3228a59J35O8j52q7J22J38j32M5P9k77L18j05m3K00k00M1qJ8Q1j4J1J52l44N4
$$ plain form
3252 -59 178 -196 -303 -1 -98 79 -64 20 109 298 -112 -42 -136 -191 3 209 144 39 2 69 39 37 -184 -141 16
3277 16 -43 35 -149 -137 74 -109 24 -273 -154 22 4 -56 -17 78 -127 -47 -71 103 75 -60 -154 5 -59 16 10
3302 10 -18 8 -86 -70 -105 -22 -34 144 46 33 3 34 -73 23 -1 11 -4 58 290 -75 -316 -6 -11 24 21 65 55 87
3330 87 77 25 -64 90 122 75 -35 -1 0 -143 60 46 15 161 126 123 -131 195 -38 -20 -20 -49 -257 -149 -23 83
3356 83 -87 -222 -39 145 -1 -103 -146 -171 -144 -50 11 -277 -238 -33 -155 -73 30 157 -72 -32 256 -59 -260
3379 -260 -80 142 -132 90 121 18 -63 -74 -79 -188 -88 10 -9 -7 9 -87 27 13 -48 145 154 -21 -44 46 -12 22
3405 22 189 -56 -39 -43 212 153 92 -78 -91 51 177 159 -101 23 8 117 -29 -186 75 44 6 157 18 -67
3429 -67 46 -108 112 79 -33 78 -137 -230 -35 -85 -139 96 162 2 -129 -67 125 3 88 -108 40 -14 -51
$$ packed form
3252e9K37l74j07L02r7J77j43Q4Q9J89m10P0r4n5J94K06o5j05l7O7l0kk21M3J57
3277A6n9P8j84J2K11j83J33k97J19J76j8o0L9R5k05Q0k4J74k8j35r4J59o4P5o
3302A0k8K6r4J6l5Q3j2J78r8j3l0L1j07R6k4J2j5O2K32l65k41L10nL5lM4j0L2
3330H7j0n2q9J54L2m7j10L4Jj43K03j4l1J46l5lk54L26k33J8%k9k08J08J26J06
3356H3j70j35J83J84j46j02m3k5K7R4O1k88L9K05j22Q2J03J27k29M0K88l15k01
3379b60J80K22k74K22L1j03q1j1nj09J00R8j9KJ6r6J14j4o1J93Rj75k3R0n8L4
3405B2J67k45J7mK55n9o1j70j3J42J26j8k60J24j5J09j46j57K61l1l8J51j39q5
3429f7J13j54K20l3j12J11k15r3J95n0n4K35O6j60j31O2J92j22Q5j96J48n4l7
$$ plain form
3452 -51 -213 -201 -190 88 4 20 29 68 -47 -67 -144 -28 170 21 114 23 -171 81 -186 -88 31 176 169 131 -2
3477 -2 -106 216 -69 214 9 20 27 174 16 167 -11 19 255 93 27 -170 -53 102 -92 62 4 8 -117
3500 -117 -4 -137 38 -4 -112 -16 -102 12 -235 -264 -16 38 11 8 -14 102 129 -53 -98 -133 -85 -265 -48 17 -16
3525 -16 -50 -131 -66 -173 -23 9 0 39 10 184 13 53 -3 3 208 150 47 -118 81 -58 -6 180 242 73 -111
3550 -111 26 6 -41 -21 -54 38 -6 198 170 52 107 -89 72 -1 40 -22 -160 79 -88 -39 132 -36 65 66 67
3575 67 -119 -26 64 -75 0 -31 167 104 -119 -83 -118 -63 -25 -133 -38 28 71 -102 -110 -67 38 -81 -21 -72 -147 3
3601 3 -52 -142 26 -14 -163 -238 -81 81 71 -10 -144 -104 -160 76 -5 -30 66 114 86 -59 -87 49 120 2 4 62 177
3628 177 136 24 109 -157 -66 126 -95 42 6 64 -19 146 107 -22 125 -90 -103 130 -4 -89 -158 -155 72 141
$$ packed form
3452e1j62J2J1K78q4J6RL9j15k0p7J16J98j49R3r1j94K52k67R8J19J45pl8j33
3477bj04L22k85K83k05J1PJ47j58J51j78L0K36j62o6j97J17J55j94J54n8Mj25
3500a17J13j33J75m2j08R6q6J14k47k9K48N4k7lk2J16K7j82m5l5M8j80K17O5l3
3525a6l4q1O5j07J50L2rL9k9J74j71M0n6OK05n8j03j65J99j39N2J86O2j69j84
3550a11J37k0m7K0l3R2m4K04k8j18N5j96J61p3M1o2j38K39j67M9J71j68J01JJ
3575F7j86R3R0j39P5l1J98o3k23L6l5N5L8j08R5O6M3j73qM3J05j19O0n1p5J50
3601Cn5r0J68m0j49p5J57J62j0q1j34M0n6K36q1k5R6M8k8j45k8J36P1j18KN8J15
3628A77m1j12Q5k66R1J92k21J37l6N8q3J65l9j29J47k15j3K33j34q5o9LK27O9
$$ plain form
3652 141 -69 110 -88 -16 -1 159 -51 -44 85 -11 75 -37 0 50 -123 55 -25 -138 -301 -57 -102 66 -225
3675 -225 -127 -139 -212 33 -78 29 -127 -98 -34 0 67 117 -3 -119 43 52 -17 -74 -60 -7 61 197 -56 9 39 63
3701 63 -31 -17 -163 -19 -28 144 -75 -231 -32 102 275 -24 -23 116 -105 33 16 5 16 -19 -59 41 -150 -122
3725 -122 82 -111 4 -166 55 -65 98 102 208 20 -87 -168 -160 -136 5 3 25 -179 -109 -144 59 86 -121 -183
3749 -183 -64 95 -20 114 -12 -46 -10 -203 30 -183 -53 -25 -25 2 48 130 254 -2 -161 59 -134 48 98
3772 98 233 -17 -152 9 71 77 -6 2 75 -50 144 103 -44 215 141 -1 -87 33 15 -161 27 -30 13 -221 -72
3797 -72 -83 75 38 272 -101 -185 125 -63 -58 -65 -18 -168 -168 -115 -46 24 -56 -165 -84 -6 -14 -147 -169 8 -149 -315 120
3824 120 38 51 -152 -101 -87 -113 137 143 -54 12 98 5 210 110 -15 -15 20 -133 -12 -101 84 -37 17 -24 -42 -22
$$ packed form
3652A41k10J79j98P2J5J60k10PJ29r6Q6j12L7N0j73J78q0j13j63K44m5J68k91
3675b25R8j2p3K45j11J07j56K9O4L4O7N0j20j16J62Ro9n7J4N3O8J36k53O5L0K4
3701F3r4J4j46J44rJ72k19j56J99J34J73k99JJ39k21J38j7j1J1l5m0J00j91K8
3725a22K04j93J15j70K21j20J63MJ06j88j07q1QK4J41kK2k04P0l5K03K7k07o2
3749a83J19J59j15J34j26l4L6j93K33k13J30K8%K7M6Q2J24k56j59K20j93J82N0
3772I8J35k50j35J61O2Oq3QP3j25J94m1j47K59p4j42q6J20j8j76J88n7M3k34J49
3797g2j1J58l7K34l73q4L10j88NpM7j50%N3O9P0q0j09Q1P8qj33k2J77j57j66M35
3824A20q2J3k03N1J4k6K50Oj97O6Q6r3K05j00j25%L5j53J21q9J85j21N4m1j8K0
$$ plain form
3850 -22 9 -12 108 91 -1 -153 127 161 122 109 47 -67 -1 53 9 185 -170 54 -38 -13 14 35 -140 139 15
3875 15 -102 -104 54 89 -140 -111 -30 -45 -11 11 -167 -179 -171 -12 35 -3 -139 -60 55 -60 -200 -62 -171 -60 -240
3900 -240 60 -183 -92 85 -212 74 -180 21 24 153 161 -47 98 90 20 136 -126 181 17 -78 1 -30 34 -92
3924 -92 50 62 181 204 -57 30 -90 106 126 21 1 -86 71 -32 -34 20 -26 35 116 -166 -51 -59 -255 38 67
3949 67 160 -22 -15 63 178 0 -88 -158 -176 54 -104 -124 97 -81 -106 -92 2 -114 -138 -72 9 51 60 4 -178 -101 11
$$ packed form
3850b2L1k1J20j7r2j52K80L4l9j3o2j14O6N4m4J76l55K24r2K5K7K1j75K79j24
3875A5j17kJ58L5k29K9Q1j5L4K2j78j2QJ59M7l8j36P9J15j15j40J38j09J11j80
3900b40L00k43R1J77k97K86k54K01LJ29Qk08J45qp0J16k62L07j64r5P9l1O4j26
3924i2J42J2J19K3k61Q7j20J96K0j05k0q7J57j03kN4m6O1Q1k82J15qj96K93K9
3949F7R3j82PP8J15j78q8p0j8K30j58k0K21j78k5J4R4j16k4O6Q1M2Rn6j82P7J12
$$ [...]
8191a8
##END NTUPLES=NMR FID
##END=
