##TITLE=1H_AEBC0104
 CDCl3
 8 sc, 
 2.4.2024
##JCAMPDX= 6.0         $$ Bruker NMR JCAMP-DX V2.0
##DATA TYPE= NMR FID
##DATA CLASS= NTUPLES
##ORIGIN= UXNMR, Bruker Analytische Messtechnik GmbH
##OWNER= root
$$ XWIN-NMR		Version 3.5
$$ Tue Apr  2 14:24:18 2024 Russian Standard Time (UT+4h)  she@DPX200
##.OBSERVE FREQUENCY= 200.1311
##.OBSERVE NUCLEUS= ^1H
##.DELAY= (6, 6)
##.ACQUISITION MODE= SIMULTANEOUS
##.ACQUISITION SCHEME= undefined
##.AVERAGES= 8
##.DIGITISER RES= 18
##SPECTROMETER/DATA SYSTEM= spect
##.PULSE SEQUENCE= zg30
##.SOLVENT NAME= MeOD
##.SHIFT REFERENCE= (INTERNAL, MeOD, 0, 15.7039)
##AUDIT TRAIL= $$ (NUMBER, WHEN, WHO, WHERE, WHAT)
$$ ##TITLE= Audit trail, XWIN-NMR		Version 3.5
$$ ##JCAMPDX= 5.01
$$ ##ORIGIN= Bruker BioSpin GmbH
$$ ##OWNER= she
$$ F:/spectra/data/she/nmr/H-F/1/audita.txt
$$ ##AUDIT TRAIL=  $$ (NUMBER, WHEN, WHO, WHERE, WHAT)
(   1,<2024-04-02 14:22:59.21 +0400>,<she>,<DPX200>,
      <created by zg, POWCHK disabled, PULCHK disabled
       configuration hash MD5:
       00 E9 B6 7A A2 85 ED C7 34 08 36 98 17 FE 4E 26
       data hash MD5: 16K
       CC 3F 82 7D 47 22 B0 AE D9 CD 69 6A A8 88 C4 A4>)
$$ ##END=
$$ 
$$ hash MD5
$$ E7 58 81 90 96 E5 4E 9A 38 1B AF 96 91 BB F4 BE
##$RELAX= 
##$RELAX= 
##$RELAX= 
##$RELAX= 
##$RELAX= 
##$RELAX= 
$$ Bruker specific parameters
$$ --------------------------
##$DU= <F:/spectra>
##$EXPNO= 1
##$NAME= <H-F>
##$PROCNO= 1
##$TYPE= <nmr>
##$USER= <she>
##$AMP= (0..31)
100 100 100 100 100 100 100 100 100 100 100 100 100 100 100 100 100 100 
100 100 100 100 100 100 100 100 100 100 100 100 100 100 
##$AQSEQ= 0
##$AQ_mod= 1
##$AUNM= <au_zg>
##$AUTOPOS= <>
##$BF1= 200.13
##$BF2= 200.13
##$BF3= 200.13
##$BF4= 200.13
##$BF5= 200.13
##$BF6= 200.13
##$BF7= 200.13
##$BF8= 200.13
##$BYTORDA= 1
##$CFDGTYP= 0
##$CFRGTYP= 5
##$CHEMSTR= <none>
##$CNST= (0..31)
1 1 145 1 1 1 1 1 1 1 1 1 1 1 1 1 1 1 1 1 1 1 1 1 1 1 1 1 1 1 1 1 
##$CPDPRG= <>
##$CPDPRG1= <>
##$CPDPRG2= <>
##$CPDPRG3= <>
##$CPDPRG4= <mlev>
##$CPDPRG5= <mlev>
##$CPDPRG6= <mlev>
##$CPDPRG7= <mlev>
##$CPDPRG8= <mlev>
##$CPDPRGB= <>
##$CPDPRGT= <>
##$D= (0..31)
0 1.2 0 0 0 0 0 0 0 0.06 0 0.03 0 0 0 0 0.0002 0 0 0 0 0 0 0 0 0 0 0 0 
0 0 0 
##$DATE= 1712053378
##$DBL= (0..7)
120 120 120 120 120 120 120 120 
##$DBP= (0..7)
150 150 150 150 150 150 150 150 
##$DBP07= 0
##$DBPNAM0= <>
##$DBPNAM1= <>
##$DBPNAM2= <>
##$DBPNAM3= <>
##$DBPNAM4= <>
##$DBPNAM5= <>
##$DBPNAM6= <>
##$DBPNAM7= <>
##$DBPOAL= (0..7)
0.5 0.5 0.5 0.5 0.5 0.5 0.5 0.5 
##$DBPOFFS= (0..7)
0 0 0 0 0 0 0 0 
##$DE= 6
##$DECBNUC= <off>
##$DECIM= 32
##$DECNUC= <off>
##$DECSTAT= 4
##$DIGMOD= 1
##$DIGTYP= 9
##$DL= (0..7)
0 120 120 120 120 120 120 120 
##$DP= (0..7)
150 150 150 150 150 150 150 150 
##$DP07= 0
##$DPNAME0= <>
##$DPNAME1= <>
##$DPNAME2= <>
##$DPNAME3= <>
##$DPNAME4= <>
##$DPNAME5= <>
##$DPNAME6= <>
##$DPNAME7= <>
##$DPOAL= (0..7)
0.5 0.5 0.5 0.5 0.5 0.5 0.5 0.5 
##$DPOFFS= (0..7)
0 0 0 0 0 0 0 0 
##$DQDMODE= 0
##$DR= 18
##$DS= 0
##$DSLIST= <SSSSSSSSSSSSSSS>
$$ [...]
##$SUBNAM2= <"">
##$SUBNAM3= <"">
##$SUBNAM4= <"">
##$SUBNAM5= <"">
##$SUBNAM6= <"">
##$SUBNAM7= <"">
##$SUBNAM8= <"">
##$SUBNAM9= <"">
##$SW= 18.051750892319
##$SWIBOX= (0..15)
0 0 2 0 0 0 0 0 0 0 0 0 0 0 0 0 
##$SW_h= 3612.71676300578
##$TD= 16384
##$TD0= 1
##$TE= 0
##$TE2= 300
##$TE3= 300
##$TEG= 300
##$TL= (0..7)
0 120 120 120 120 120 120 120 
##$TP= (0..7)
150 150 150 150 150 150 150 150 
##$TP07= 0
##$TPNAME0= <>
##$TPNAME1= <>
##$TPNAME2= <>
##$TPNAME3= <>
##$TPNAME4= <>
##$TPNAME5= <>
##$TPNAME6= <>
##$TPNAME7= <>
##$TPOAL= (0..7)
0.5 0.5 0.5 0.5 0.5 0.5 0.5 0.5 
##$TPOFFS= (0..7)
0 0 0 0 0 0 0 0 
##$TUNHIN= 0
##$TUNHOUT= 0
##$TUNXOUT= 0
##$USERA1= <user>
##$USERA2= <user>
##$USERA3= <user>
##$USERA4= <user>
##$USERA5= <user>
##$V9= 5
##$VALIST= <valist>
##$VCLIST= <CCCCCCCCCCCCCCC>
##$VD= 0
##$VDLIST= <DDDDDDDDDDDDDDD>
##$VPLIST= <PPPPPPPPPPPPPPP>
##$VTLIST= <TTTTTTTTTTTTTTT>
##$WBST= 1024
##$WBSW= 4
##$XGAIN= (0..3)
0 0 0 0 
##$XL= 0
##$YL= 0
##$YMAX_a= 132435
##$YMIN_a= -105800
##$ZGOPTNS= <>
##$ZL1= 120
##$ZL2= 120
##$ZL3= 120
##$ZL4= 120
##$ABSF1= 10
##$ABSF2= 0
##$ABSG= 5
##$ABSL= 3
##$ALPHA= 0
##$AQORDER= 0
##$ASSFAC= 0
##$ASSFACI= 0
##$ASSFACX= 0
##$ASSWID= 0
##$AUNMP= <proc_1d>
##$AZFE= 0.1
##$AZFW= 0.1
##$BCFW= 1
##$BC_mod= 2
##$BYTORDP= 1
##$COROFFS= 0
##$CY= 11.3945322036743
##$DATMOD= 1
##$DC= 2
##$DFILT= <>
##$DTYPP= 0
##$F1P= 15.7292609196834
##$F2P= 12.9074282941183
##$FCOR= 0.5
##$FTSIZE= 0
##$FT_mod= 4
##$GAMMA= 1
##$GB= 0.15
##$INTBC= 1
##$INTSCL= 1
##$ISEN= 128
##$LB= 0.24
##$LEV0= 0
##$LPBIN= 0
##$MAXI= 10000
##$MC2= 0
##$MEAN= 0
##$ME_mod= 0
##$MI= 1.114404
##$NCOEF= 0
##$NC_proc= 0
##$NLEV= 6
##$NOISF1= 3.799351
##$NOISF2= 2.8
##$NSP= 1
##$NTH_PI= 0
##$NZP= 0
##$OFFSET= 15.70392
##$PC= 1
##$PHC0= -25466.49
##$PHC1= 21.58731
##$PH_mod= 1
##$PKNL= yes
##$PPARMOD= 0
##$PSCAL= 0
##$PSIGN= 0
##$REVERSE= no
##$SF= 200.130013532006
##$SI= 16384
##$SIGF1= 3
##$SIGF2= 2
##$SINO= 400
##$SIOLD= 16384
##$SREGLST= <1H.CDCl3>
##$SSB= 0
##$STSI= 0
##$STSR= 0
##$SW_p= 3612.71676300578
##$SYMM= 0
##$S_DEV= 0
##$TDeff= 0
##$TDoff= 0
##$TI= <>
##$TILT= no
##$TM1= 0
##$TM2= 0
##$TOPLEV= 0
##$USERP1= <user>
##$USERP2= <user>
##$USERP3= <user>
##$USERP4= <user>
##$USERP5= <user>
##$WDW= 1
##$XDIM= 8192
##$YMAX_p= 0
##$YMIN_p= 0
$$ End of Bruker specific parameters
$$ ---------------------------------
##NTUPLES= NMR FID
##VAR_NAME=  TIME,          FID/REAL,        FID/IMAG
##SYMBOL=    X,             R,               I
##VAR_TYPE=  INDEPENDENT,   DEPENDENT,       DEPENDENT
##VAR_FORM=  AFFN,          ASDF,            ASDF
##VAR_DIM=   8192,          8192,            8192
##UNITS=     SECONDS,       ARBITRARY UNITS, ARBITRARY UNITS
##FACTOR=    0.0002768,     1,               1
##FIRST=     0,             0,               0
##LAST=      2.2672688,     0,               0
##MIN=       0,             -105800,         0
##MAX=       2.2672688,     132435,          0
$$ Real data points
##PAGE= N=1
##DATA TABLE= (X++(R..R)), XYDATA
$$ [...]
1003a779O238q810N042J812n976P123o612K057N328q712O300k470j546O865r121
1018d261M834J730n446P557p793K495N646r382P414l658j895Q627j0505M839K120
1033B322o175Q752q140J471O676r153P234l873k275R378j0332M409J801o344R816
1048E567q502M03P362r090P285l528l618J0186r250K973K323o294R487p195p39
1063b630O792p879P002l730l788R800q562L189J626o634J0017o686j309O611p662
1078c843P068l062m384R108p400L303Q71o367R706o406o46N466p866Q069l304
1093C13m798R108p493L827J141p341R945n525j048N332p900P795k420n030Q188
1108D094o993L932J290p563R412m951j091N436q302P549j279n657Q053o490L107
$$ y = [-1779, 4459, -4351, 691, 2503, -3473, 3650, -2962, -905, 4423, -4289, 2011, -459, -2005, 4860, -4261, 573, 2303, -3143, 4414, -3379, -884, 4762, -4620, 2794, -864, -2759, 5868, -4637, 202, 2322, -3853, 4899, -3241, -1770, 4906, -4247, 2987, -886, -3161, 6217, -4115, 294, 2095, -4249, 5567, -2935, -2532, 4830, -4260, 3025, -503, -4121, 6065, -3185, -212, 2111, -4183, 5304, -1891, -2630, 4162, -3717, 3285, -445, -4233, 5567, -2995, 194, 1820, -4814, 5203, -1483, -2792, 3819, -3843, 3225, 163, -4221, 4887, -2513, 790, 1661, -4706, 5000, -1406, -2052, 3414, -4452, 3617, 313, -4485, 4623, -2870, 957, 2098, -5243, 4702, -823, -1871, 3461, -4439, 3356, 936, -4094, 4094, -2899, 1033, 2323, -5240, 4172, -779, -1870, 3566, -4736, 2813, 1534, -4123, 3930, -2560, 547]
1123E47K358p625P988l600j322N002p503O313p45m952O969o084K961K621p309
1138d381P121l055j245N041p120N151J91m568N861n258K388K480o224N833k832
1153f17o48M287o469M816k00l698N490n185K300K634n885N259k465r02M174n597
1169b706L625J69l253M642m466J891K193m904M757k589o18M058n369L393L45l299
1185b131M624l887R37K564m351L699j789q73L375m128K486J69k395L750l436J072
1201c14K030l594L312j548j037L216l596J871N01k312L016k407M22J592k534K307
1217I25j270m15K211k724J797o9j536K586k299O02J382k473K208j015o78J890
1233A122k092J215k0j193J963j713O24P68j730K008j230k44J602j981J274mj243
$$ y = [547, 2905, -4720, 3268, -332, -1654, 3348, -4155, 2158, 1413, -3539, 3430, -2654, 307, 2928, -4381, 2740, -315, -1560, 3481, -3639, 1512, 1703, -2865, 2996, -2262, 126, 2606, -3618, 2215, -617, -1265, 3022, -3447, 1369, 1169, -2529, 2961, -2224, 76, 2710, -3175, 2084, -381, -1283, 2891, -2706, 919, 1088, -2165, 2477, -1989, -98, 2095, -2809, 1948, -641, -1259, 2799, -2570, 823, 1168, -2131, 2493, -1394, -457, 2107, -2244, 1455, -334, -1207, 2168, -1960, 526, 695, -1700, 2050, -1386, -314, 1716, -1878, 1434, -114, -1151, 2065, -1531, 340, 841, -1471, 1545, -862, -440, 1152, -1382, 925, -345, -760, 1451, -1273, 524, 455, -1081, 1505, -794, -192, 1190, -1283, 925, -90, -768, 1122, -970, 245, 225, -968, 995, -718, -94, 674, -1056, 952, -278, -522, 1080, -901, 373, 369, -874]
1250h74J891j452J71R73j567J343n03n48J220j182O53O2p48J277j015K50N79j114
1268e84J120n23m82J174j138L19M43q37P15k55k38L90l05L50k62L3L04m59N10
1287B75k24k64N88o06K28K28n41L84j02j20K39k18J13Ro6J09j48K70j71k3L04
1308B64m65K82J51m82M52k16k81N19m06O1J72j73R4J8k0lj3J84k01J36J42l98
1330a83K83k7k78L54j61j45L77m16N6K27k29J35O2j26J21Rl0L4N2k0j14J53j77
1353d3NJ35k00Q2Q1k40J07J26j98J86r6N3M1op3R1O3k09Q2J63k77J45Q6l94M05
1378A15j36k66L75k47N6K25k65K27q5N9N4j45J65j30k4K63m03K46jl75N10l72
1400a54n5M56n34L12Q7l57N25l54RL05l88L22k34O4J79m24M24k29k18N70o63K79
$$ y = [-874, 1017, -435, -264, 709, -858, 485, -18, -566, 654, -528, 125, 187, -561, 716, -299, -49, 530, -584, 536, 13, -469, 705, -433, -114, 329, -508, 207, -48, -286, 104, -201, 149, -113, -80, 224, -235, 275, 51, -213, 375, -231, -3, 225, -316, 68, -34, -154, 85, -133, -20, -11, -77, 32, -116, 154, -17, -40, 264, -201, 81, 232, -250, 202, -14, -295, 224, -182, -121, 51, -122, -28, -10, -30, -33, -46, 138, -63, 73, 215, -183, 100, 73, -205, 149, -12, -157, 220, -196, -140, 87, -142, -7, 55, -71, 50, 59, 29, 63, 115, 95, -19, 134, -43, -38, 97, -103, -21, 60, -180, -73, 53, -145, 41, -55, -2, 39, 33, -40, 51, 114, -95, -13, 150, -127, 18, 104, -290, 115, -21, -287, 88, -159, -103, 122, -143, 84, -1, 58, 112, -33, 132, 2, -22, 241, -162, 84, 83, -292, 218, -154, -209, 247, -287, 25, 112, -245, 280, -74, -65, 240, -148, 174, -60, 4, 183, -241, 183, -46, -264, 306, -357, -78]
1422g8L17p53Q32k80k65N60n19L08k2l14N36m38J81K5m46P36o26oN76q40P42j44
1444H2n61Q91n98K03K21o32P71l47j84M42o35N88k48l25O85o80M86p0p11J122
1464E00o35p4N88q87Q41j20o84Q88o25L71R7p04Q12n17K18R8q29J110m53l29P78
1485D44r80Q94q4r39J121n78J48L42r48J021l59k96N14r21R68j71p53R54p91O31
1505B17J18j122J272m89j37N91j094R61lo93P92q00N37K28r23Q29m98K37L27j184
1525h34J278m20l69Q54j225J015J93j161J070o13K91L43j205J207m13k22O46j310
1543h75J335k56r48J360j180P33M20j569J580n84k85J011j589J253M8j046J139
1560E47j103P53L77j468J407p69J59Q14j806J523m5j066J471j515Q67O73j709
$$ y = [-78, 239, -514, 318, 38, -227, 333, -186, 122, 100, -214, 322, -116, 65, 90, -356, 380, -246, -252, 324, -516, 226, 82, -479, 412, -186, 17, 238, -394, 377, 30, -154, 288, -347, 241, -7, -332, 353, -327, 159, 89, -622, 500, -135, -209, 379, -508, 333, 213, -471, 417, -208, 163, 260, -444, 368, -149, 69, 167, -662, 448, -5, -334, 444, -536, 358, 274, -665, 456, -122, 26, 368, -580, 441, 82, -214, 300, -621, 347, 176, -577, 377, -414, 217, 335, -787, 485, -4, -141, 450, -644, 317, 314, -379, 413, -387, 150, 378, -545, 284, -214, 23, 350, -834, 444, 24, -345, 509, -716, 299, 492, -669, 401, -212, 79, 422, -783, 424, 11, -211, 435, -875, 460, 204, -744, 616, -564, 169, 589, -980, 600, 16, -269, 742, -847, 406, 454, -592, 547, -556, 197, 574, -894, 513, -256, -97, 717, -1089, 434, 389, -677, 794, -721, 146, 819, -890]
1577h90J322n96LR49j780J214J4o33J056j606J199M84j620J464r67L07J052k012
1595a040J326J9p28J216j681Q82O67j372J236j168N96R77j961J346l62k13J286
1612A026k099J204N83j436J464j441M56J444k071J049k63k88J407j998Q73N40
1628D50r98J370j629N42J469k062J314o16l16J835k140O36P20j214J540j566J92
1645d73J453j692J111o93k90J794j953O63L82q47J674j675O8J364j517J238q24
1662b17n77J862j477K87K51q22J620j285j37J015j027J248r75m92J735j457O49
1679B01L0j068J876j216l65J053j057J084n72o60J392j006M32l2q53J647j072
1696a86n1O78j113J361n97q06J375r97N12J01j126J412o58k23O44r51J094k85
$$ y = [-890, 432, -164, -161, 788, -992, 222, 236, -397, 659, -947, 252, 736, -884, 580, -387, -80, 972, -1040, 286, 305, -423, 793, -888, -6, 661, -711, 525, -643, -47, 930, -1031, 315, -47, -260, 1026, -1073, 131, 714, -722, 742, -699, -243, 1201, -870, 179, -84, -372, 1035, -963, -90, 450, -548, 822, -807, -265, 1204, -858, 456, -160, -476, 1359, -781, -145, 575, -639, 901, -665, -473, 980, -712, 399, -294, -584, 1210, -743, -80, 302, -545, 1129, -546, -478, 886, -631, 607, -217, -794, 1068, -409, -122, 129, -693, 927, -358, -495, 520, -507, 741, -234, -726, 1009, -448, 201, 231, -837, 1039, -177, -542, 511, -546, 538, -34, -694, 698, -308, 124, 92, -761, 886, -186, -237, 441, -672, 689, 92, -714, 661, -336, 176, 277, -849, 563, -95, -318, 326, -625, 469, 184]
1714A84o70Q72p82O95m9r06J204o75K3M80j059J053j77p42R69p41L77L18r79Q82
1734B77l55J5N05r06P60j89l95O67p88N18J88q19P85l60r8N17q05N48O5m15N44
1755B59m59K26K27n23M72k39mL31o14N30j31l68N79n73K09M05n92L79j22k05M92
1776B79l94R8J16j23J57j92J11L7k95L62k70k0L10l77J71R2k81L81k16k0J84j71
1798f1P6N9j23R6q2Q3k6r3J93k11M6O7j57J70l6j48K34j88J27R8k65J82O3j50
1822d6Q3J4m8j3k8M1r7R3j4r5K04j84j6J91j52N2P9j56J50J1j01P9p4L2P1j36
1848f0N9n5J31j46k0J94j51R5Jj77K06n1m3J05n2n5Q8o7mj2J9l9m1J00j78J96
1874D3n1j35K49n0j61K70j92K9J23k49J88q5J6P1j35J61j61RJ85k58J77p4j38
$$ y = [184, -486, 386, -396, 299, 250, -656, 548, -127, -104, 376, -683, 370, 193, -549, 420, -321, 56, 374, -605, 277, -78, -63, 442, -464, 296, 107, -288, 379, -409, 109, 297, -522, 263, -97, -195, 322, -483, 65, 130, -285, 259, -200, 26, 253, -270, 202, -37, -41, 290, -324, 206, 75, -293, 286, -287, -78, 327, -265, 114, -8, -213, 279, -115, -17, 99, -24, 133, -59, 52, 89, -206, 156, -114, -134, 176, -201, -30, 62, -219, 162, -54, -74, 110, -61, 15, 74, -49, 47, -35, 48, 22, -71, 122, -89, -43, 24, -133, 37, 1, -147, 87, -101, 26, 124, -141, 41, 104, -46, 37, 51, 3, -10, -38, 3, -94, -1, -15, -110, 94, -90, -106, 85, -67, -15, 64, -92, 58, 69, -32, 47, -27, 5, 76, -60, -1, -56, 75, -71, -91, 103, -48, 47, 48, -129, 77, 26, -17, 88, 36, -19, 69, 2, -2, -14, 5, -34, -75, 25, -153, 43, -8, -143, 106, 56, -105, 165, -27, 2, 125, -124, 64, -21, -5, 66, -69, 92, -69, -60, 125, -133, 44, -30, -168]
1897a68M04l82J36K43m05K88l2k54M18l79K35n9k17M09l50K1J38l03M52k82q0
1918a67M95o59M81L6n09P58n52p8N09o48N81k91k09N65n35L31j06m25Q74o56J40
1939f5L97p81R07m52l94R09q72N62L9p71J000o18n3M98q42R34l95l87Q16q28O17
1960B21Mq89J310q20N5O36j182J260l94p26R94q97O21K10j160J237p03J21O09
1979E07j357J382l14p20J109j271R64K50j511J504o99k8Q05j625J357o5q47J195
1997F36j397Q99N40j635J515q10K04R36j899J507k80p20J330j774J003P52j724
2014i17J493q84M3J265k022J269L5p93J461j857R62Q22j704J546j177J38J511
2031A191k273J239Q1q63J709k000O28J136j616J399j116k7J755k048J045k9q14
$$ y = [-168, 236, -146, -10, 233, -172, 116, 84, -170, 248, -131, 104, 45, -172, 237, -113, -92, 46, -257, 195, -87, -167, 328, -331, 150, 186, -323, 435, -117, -195, 314, -334, 247, -44, -253, 312, -223, 108, 2, -423, 451, -205, -65, 332, -449, 458, 6, -388, 521, -351, 211, 250, -521, 479, -139, -192, 306, -536, 398, 3, -384, 432, -396, 221, 225, -664, 646, -174, -119, 517, -665, 595, 201, -525, 469, -428, 193, 403, -757, 480, -223, -102, 507, -850, 532, 218, -502, 607, -664, 300, 550, -961, 543, -156, -184, 621, -1004, 353, 288, -559, 636, -761, 138, 678, -957, 558, -252, -48, 888, -1011, 496, 216, -504, 826, -948, 55, 807, -917, 576, -308, -265, 1000, -1022, 247, 282, -511, 950, -907, 55, 877, -827, 719, -458, -320, 1191, -1082, 157, 238, -625, 1084, -916, -288, 848, -768, 631, -485, -512, 1243, -805, 240, 211, -603]
2048f03J903k147N45J129j640J701j374k04J985k138J011l3r39K125j995K65J111
2065G02j455J714j383l32J955j851R99l38r86K423k089J29J193j566J930j363
2081c18o54K104j694Q86k41r96K233j682l9R05j399K008j315q33K045j599J031
2098D42l02j327K334j388q7Q32j468J970r05r88J612j214J074k91j446K081j102
2115a73K7N54j612K165p66j066J496j288J205j10j622J937p28q9N24j501J754
2132G07m08q89J083j260J317n4j600J658p00J58N98j754J725j57r34J031j237
2149g16J152J95j508J281o40L13N60j658J340n0n54Q03j384J108M46j486J197
2166C99p25L07P80j574R67Q8m54P30j266Q68M52j129Q33p29M54P24j459Q26j9
$$ y = [-603, 1300, -847, -302, 827, -813, 888, -486, -690, 1295, -843, 168, 135, -804, 1321, -674, -409, 702, -753, 961, -422, -754, 1201, -650, 349, 11, -975, 1448, -641, -512, 681, -885, 1045, -318, -972, 1132, -562, 324, 83, -913, 1320, -362, -401, 504, -895, 1113, -202, -1035, 1010, -589, 442, 140, -1187, 1147, -241, -328, 504, -964, 1006, 101, -887, 725, -489, 585, 294, -1152, 929, -173, -146, 408, -1204, 961, 195, -871, 625, -663, 542, 432, -1190, 747, 19, -70, 454, -1047, 707, 299, -590, 493, -767, 550, 496, -1104, 554, -146, 12, 610, -1144, 581, 424, -510, 521, -716, 436, 631, -877, 404, -236, 77, 637, -1021, 319, 269, -285, 518, -866, 242, 688, -798, 399, -326, -19, 761, -813, 154, 242, -212, 518, -748, 120, 572, -557, 276, -453, 1, 725, -734, 92, 73]
2185G3k69Q62j240N05O06q71O78o25J80P68j100M95m8k19P44j077M66M19o34P14
2205D27p94J29Q48r69M74p4k96Q48q89J25M41l88M63n73o1O73o04L03j51j53P16
2226D95p40J88K47l93N70m78j89P12n59K57j10k67O33n34N3J37k26M31l12o6L86
2247B35m00L27j51k78N70l41qJ75l17L62j56k76L84k34J54k8j98K53m4l3K7j95
2269a72L77k08j01K31j95K01l1l14L26o2j41J38j36P5M3j48J04p6J24kq5J10o1
2292cQ7K6j59J39q6n0J52j62M3N3j49J13jl5J09r8nK4j9M8o1M2M1j03J23n6kJ4
2320B5p1J1J22j57P3K4r6J44o1m7O0M7j24k3J51q4kK2r0O6N1j41R6Mj45J69m5
2347b1k4RQM3L3m5pK4l1MM8K4j05J2Nm5J23j32K3J07j13M6O3n8Mj6K8OL1n4mq
$$ y = [73, -196, 666, -574, -69, 537, -334, 344, -281, -101, 667, -433, 62, 14, -205, 539, -538, -72, 347, -287, 427, -367, -238, 610, -359, 115, 41, -255, 593, -296, -171, 270, -118, 345, -228, -289, 384, -220, 83, -68, -221, 495, -245, -57, 190, -203, 367, -111, -300, 412, -147, 110, 0, -267, 366, -168, -115, 22, -204, 227, -85, -151, 235, -165, 162, 11, -267, 303, -38, -46, 129, -188, 174, 18, -258, 126, -108, 46, 18, -180, 73, 29, -4, 23, -172, 205, -3, -104, 127, -68, 133, 102, -212, 114, 52, -89, 49, -87, -12, 31, -117, -13, -89, 35, 33, -52, 58, -3, 84, 110, -49, 90, 4, -46, 106, -56, -13, 40, -109, 4, 3, -32, 77, -21, -26, -2, -21, 27, -34, 8, 49, -54, 69, 13, 11, 25, -46, -35, 87, -70, 3, 27, -69, 75, 14, -33, 27, 74, -50, -73, 78, -6, -8, 14, -76, -10, 41, -100, -4, 0, -145, 24, -21, -45, -36, -28, 15, 48, 3, -4, 20, -11, -7, 41, 65, -40, -28, -23, -68, 55, -77, -54, 53, -60, -14, 49, -9, -5, -21, 7, 13, 44, -10, -14, -22]
2379b2N1r3J12m3oL7j01O7O0j58Q3M3n9N7l2L5M4j8k1n2P4p9J6K6j15Q0O8k06
2407a52J65l5m6J45j01j2R0o3OK1L3%n6L9j78J96Jj11N7q0N5O3j31O8J12q9k1
2434b4J8n4J42j21ON0JP1j43N4O2j12P0j34K5J76j38j2M1J5J26j38n4J08L1r0
2460b4p9L0R5K6r2o8J07P4j46j8M1M9J10j99j1J93Nq7o6P9O5oj87oJ45R7k57K8
2488a02O6Q5j5j69j9L15n5j74o0J42J70j48r6k0R6J9j74J2J36O6j6k91J81K37
2512A86j55j03j2J36J64j88k07J56K02o2k66K7J59N8j27k79L31J43j80j41O5J44
2534E1J71l49m2K88P3j65k29Q3K46o1j37j99L06J72k75j07N4K46O9m07L8L75j9
2557A82j42k72J92L33k30k02m2L23J03m08j0J59J35L2m51R7M97k58j08r9J47L46
$$ y = [-22, 29, -64, 48, 5, -1, 36, -65, 2, 62, -96, -13, 30, -29, 28, -4, 31, 75, 57, 36, -16, 58, -21, -5, 21, -94, -14, 54, -152, 13, -22, -68, 77, -24, -36, 54, -9, -3, 18, 51, 51, -5, 34, -144, 52, 53, -58, -1, -81, -26, 37, -94, -26, 86, -3, -24, -6, -60, 82, -39, -33, 17, 18, 89, -54, 0, 62, -50, 20, -114, -89, 87, -51, -63, -22, -7, 119, -19, -73, 35, 66, -24, -103, -73, 22, 48, -44, -112, -5, 69, -77, -95, -54, -5, 105, -94, -105, 88, 93, 6, -60, 19, 84, 78, -109, -115, 30, 127, -130, -102, -36, 49, 34, -135, -154, 161, 106, -68, -128, 14, 184, 36, -60, -80, 16, 35, -139, -127, 9, 75, 59, -232, -51, 186, 31, -72, -84, 52, 216, 28, -179, -23, 179, 117, -149, -122, 37, 95, -32, -311, 20, 163, -17, -158, -93, 51, 222, -127, -169, 119, 192, 27, -202, -119, 127, 66, -71, -270, 36, 208, -67, -174, -120, 126, 195, -212, -174, 201, 182, 40, -232, -40, 293, 63, -139, -181, 142, 245, -163, -173, -14, 121, 153, -298, -201, 296, 38, -70, -169, -22, 324]
2579C24l74k14K36K39M9m80Q4K68J2j23l40K12M15l38j77O0J67L27n16n3L92r
2601A61%l88R7M14j44j36k67J99M08m30j49K02L8L16n41p6N30j28J4l22K0N68
2623C86l23k21R0J38K10m73j11L62L0J20m02m2N64k37j62%q2N27l29l39M14j12
2645HK38l08k55N24j35p2p3j83O05l11l03K89j39M88l29m88O87k12J7K6m08N93
2667B59j03l20J77j87M37k16l42L09p2K37j33m53O98j89j99K02l87M85K8n09L50
2688G2o5R7l3m81N11k0o5M8m41N94n2m07L62k82K83J07n74M60j9j27K25m87L40
2711D6J63l92K25k85K41J74m30L42j01k4K78n28L26J76l69L35l40J71K78n26K71
2732C1m1m0K44m15J83J82k65K39k39J63K05m49K50n9r9L78l97J30Q7k17K86k96
$$ y = [324, -50, -264, -28, 211, 260, -220, -136, 132, 144, 21, -319, -107, 308, -30, -207, -147, 20, 347, -169, -222, 170, 161, 161, -227, -130, 284, 140, 4, -263, -64, 344, -86, -235, -33, 5, 321, -220, -296, 234, 106, 120, -202, -182, 386, 63, -158, -68, 70, 280, -193, -304, 58, 88, 208, -194, -236, 328, 91, -71, -71, -153, 374, 45, -294, 120, 8, 246, -62, -317, 207, 72, 0, -73, -256, 349, 38, -265, 24, -115, 373, 44, -444, 243, 31, 48, 74, -334, 259, 156, -164, 13, -174, 263, 47, -295, 14, -58, 179, 46, -407, 291, 102, -97, 105, -282, 203, 231, -278, 72, 7, 104, 71, -410, 101, 81, 16, 64, -377, 217, 165, -242, 120, -162, 121, 228, -346, 114, 95, -32, 193, -294, 46, 209, -183, 42, -243, -2, 172, -258, 84, -17, -41, 237, -291, 35, 211, -158, 177, -163, 8, 286, -240, 31, -10, -50, 194, -221, -38, 144, -121, 118, -121, 42, 247, -202, 48, -11, -110, 268, -129, 1, 88, -129, 157, -139]
2754a39L2K70k20O5jr6K51k43N2J56j56J93j76k1J76l08K54o8j88L34k43lJ98
2777A19k67K23m4j18K15j54N5k2q4K88k66Q9N3k54J90r8oQ3q5Q1O4j73J40k2r
2802bj9m9J13j5k4O1q0P6k2j03J46j13l1P9m4N0L1j22P1Jn7O7l0L2qN0p6K7Nr5
2832h1N0L9r4Q6pm4P2J2j00J54q1j5P4r2J01o6oj3M3k4k2L7q7N7K9m7J9j2JM9
2862C2K3j23P9L6n6MM7m1MK4j1K4m0k4l2On2O2P0r0J23j4k4J5j5o8K3N0j5m5K8
2893@J0j6nRm9O6p0K9M4o1M8L3j2P5j61N9P1o5Kl8pO6l2k3j3Q3J3j85J83m6j04
2924i6J63j20J11L5k50K39o9mN5j49J25k2l0R0j50Q8Q9j97J98j43N8J26k81K20
2948H6%j59K01k12L0J21j85J79j43N1J77l07J57n2m1K83l53J59J97l50L24k55
$$ y = [-139, -107, 163, -57, 8, 7, -89, 162, -81, -29, 127, -29, 164, -12, -33, 143, -165, 89, 21, -167, 167, -76, -79, 119, -148, 75, 31, -87, 128, -26, 29, 7, -77, 211, -55, 34, 87, -167, 23, -75, -81, 2, -83, -2, 62, -111, 29, 7, -2, -21, -70, 43, 28, 4, 65, -15, 61, 39, -64, 82, -31, -62, 17, -27, 23, 54, -68, 3, 4, -53, 14, -16, 16, 8, 58, -18, 9, 14, -81, -31, 8, -86, 0, -7, -51, 21, 33, -67, 87, 6, -9, 65, -27, 74, 8, 2, -11, 32, 8, -14, 23, -64, -7, 22, -25, -6, -18, -17, 32, 55, -68, 11, 47, -9, -5, 42, 1, 5, 29, 18, 42, 2, -22, -54, -48, -100, -38, 32, -58, 65, 51, 27, 42, 27, -41, -18, 32, 17, -28, 0, 10, -6, -11, -2, -51, 15, -55, -26, 18, -43, 5, 38, 26, 101, -60, -1, 70, 5, 7, -31, -38, 28, -4, -27, -40, 43, 56, -129, 54, 8, -96, 67, -53, 58, 93, -157, 82, 13, 9, 64, -85, 40, 18, -12, 78, -72, 16, 105, -92, 106, -37, 21, 147, -134, 86, 86, -73, 128, -84, -54, 67, -118, 61, -82, -31, 146, -161, -4, -56, -97, 186, -167, -8, 189, -161, 163, -92]
2970i2P7K76m63K22J1r5K60l59R2K24k56K92l45N0L75m32K46m3k33M87m35P6K80
2993B15l88L75l25n3M54m48K19j09j40N15m85J25J57l11M83m34l9N42n46L64j89
3014a8k92O89n83J27K30m22N43k78k46N26m84L58j38l15P30n56J84Q1m99P44l71
3035A0k97N77n34M03J7o38P40l15PJ50n09O98k91k46M70n40N87j55o11Q60m27
3056d4J9K99q00Q21j96m19N47m87M53Oo24P10l77J13K20o89P63j74l72M84o75
3077d22O24J03p83P01l89R2M04q66P10K3m10N32o37M42K36p46O14m36J43M93r12
3098d84O28rl27N29p43M23L42o84N06k96Q5M64q21L93J06k83N86p49K89L84o13
3119b74N42m59K9O27p97L27Q9k89O18o48O5M76m90M20m07n4O71p24L12o3j75O06
$$ y = [-92, -15, 261, -202, 20, 31, -64, 196, -163, -71, 153, -103, 189, -156, -106, 269, -163, 83, 40, -193, 294, -141, -65, 215, -173, 202, -123, -176, 278, -170, 49, -60, -200, 315, -170, -45, 112, -199, 284, -150, -189, 353, -193, 171, -18, -310, 379, -204, -77, 153, -269, 274, -4, -250, 276, -208, 150, 12, -303, 427, -129, 55, 136, -363, 381, 10, -287, 290, -244, 159, 176, -462, 278, -37, -30, 120, -389, 309, 18, -228, 242, -298, 289, 134, -477, 383, -44, -25, 274, -526, 295, 99, -320, 227, -260, 193, 199, -425, 285, -92, 21, 241, -448, 315, 141, -231, 253, -422, 202, 305, -478, 223, -166, -74, 330, -536, 174, 197, -213, 319, -318, 124, 360, -386, 228, -208, -65, 428, -484, 144, 135, -192, 337, -406, 17, 359, -325, 181, -115, -30, 434, -387, 6, 112, -171, 415, -334, -45, 339, -274, 268, -191, -162, 465, -332, -5, 84, -205, 413, -235, -170, 306, -184, 236, -171, -225, 446, -278, 34, -29, -204, 402]
3141D02o75J25L86m68M51l45j66P30o48K70mk42N93n37MK89l48M79l98j78N80
3162C00m42K16j30k46O83m76l9K53l60N26l10k69N91l88J56l6k93N35l44L0J51
3183A08l51N25k72k52M42k83J92k8l65N53k63r7K10l17M56k20j99K85k26K39r6
3204D1k61L86k22L8P9k79M00k16o1K05k47K32L2l00K41q4j2Q0k37K81r7p8J63
3227H4k26K35l9k10K48j22N2J10k96K33J6j48J81k03Q9R8k14J43p4K0K7j66J77
3250A5oo6J51j60P8Q3j74J09q7OJ87k48J73q8l7J03j48J36K5j42J20k3j0R2j83
3275i4J12J5r1J90j74N0M3j18J36r9J0O5j04J22r8qQ9j12J07k6m5K8l9PR8r4N0
3302B0K3j18J14o6j5P2p8J08p9j6Q3l9L7j21J28l6j0k0P5p7N1j0lJ2o7L5M0j07
$$ y = [402, -273, -148, 238, -230, 221, -124, -290, 440, -208, 62, 58, -184, 409, -128, -124, 165, -183, 296, -102, -280, 300, -142, 74, -56, -302, 381, -95, -134, 119, -241, 285, -25, -294, 297, -91, 65, 29, -264, 271, -73, -43, 108, -243, 282, 10, -242, 200, -83, 109, 81, -284, 269, 6, -91, 119, -198, 258, 38, -161, 124, -102, 137, 41, -220, 166, -56, -18, 61, -218, 182, -34, -95, 110, -137, 95, 127, -173, 68, -16, -28, 52, -185, 96, -1, -79, 84, -142, 93, 54, -156, 92, -30, 22, 132, -164, 69, 85, -63, 118, -85, 4, 102, -112, 31, -43, -23, 4, -162, 15, 9, -57, 94, -66, 12, 95, -79, 30, -57, -51, 136, -112, 61, -27, -64, 39, -109, 27, 52, -90, 30, 7, -3, 89, -94, 18, 33, -58, 132, -42, 8, 51, -67, 69, -30, -20, 45, -59, 63, -35, -43, 46, -66, 41, 15, -30, -2, -41, -34, 64, -30, 20, 43, -75, 39, -27, -42, 30, -48, 60, -19, -35, 48, 9, 46, -75, 53, 17, 7, -13, 62, -15, 36, 26, 23, 35, -32, 3, 43, -64]
3330f4O7j1K3N2o8jn8P8n1rR5n7q7J75j14k8J00o4K8l1R1n6K6n4jM8nn7R7k9m1
3361fPoP0r4L7j4n7J1O0J3q4O7kl6M1Nn1M1J5Pp4R6o3M6L8p0J5lj0qJj7K2K3k7
3396gK1plj3K7Kn5Q3o0J11j05l8J16p3l4P0q4L4N7p7N1k6K9K0j5Rk4k1K9o5J02
3427E4j21J2O6l3j1Q8j19P9Op0P3j5%O8q6J1J0MMq0J04k1kl9l2O9K6r9N8l0K5
3458aK6%k6P3m2o3N5l6M5l5j5l8M8J4o8M3J7PNK6k7J20j20J1J7m3O3k6p6L9jJ3
3490Ek8k7Q8l6l4n3P7J2J1n1L1j3J05n6j04O9J4j6qk8P6N0j80P6J7JM5j18R2L
3520B0j3K5q3J24K6j63J18o2k2R9j41J3J40r5M5q0K1Q9n9Ol8N6Q2j27k3J06n1
3547A3L3j02PJ05j35O8p4J6J54j05j01J04nJ29r3p9R0j4j2j9p2K08j21q2J09n1
$$ y = [-64, 3, -8, 15, 67, -1, -2, -60, 18, -33, -42, 53, -4, -91, 84, -30, -58, 42, -22, 6, -25, 66, 10, 36, -18, -19, 29, 24, -33, 64, 35, -6, 1, -5, 65, -29, 8, -6, -63, -52, 8, 21, -63, 4, 2, -34, 7, 12, -39, 2, 17, 24, -50, 46, -17, 29, 67, -3, 12, 9, -1, -9, -8, -25, -3, 20, -7, 14, 7, 4, -9, 18, 20, -35, 48, -12, 99, -6, -44, 72, -1, -35, 35, -49, -15, 42, -35, 16, -10, 19, 39, 24, 33, 9, -12, 17, -48, 54, -67, -55, 11, -22, -33, 55, -64, 15, 21, -49, 24, 9, 9, 77, -9, 2, 12, 16, 20, -60, 44, 23, 21, -18, -50, 19, 45, -54, 4, -26, -1, 25, 25, -1, 72, 30, -33, 22, -14, 31, -4, -19, -57, -9, 5, -63, -20, -3, 4, 9, 35, 8, 128, 8, 19, 36, -7, 56, 30, -46, -7, -8, 5, -23, -50, 38, 2, -32, -85, -8, 4, 15, -36, -5, -18, 87, 31, -73, -4, 10, -6, -14, -42, 34, 84, -96, -20, -3, -2, 43, -75, 17, 20, 7, 32, -51, 73, 99, -64, 54, -8, -30, 69, -72, -59, 81, -14, 31, -49, -28, 61, 2, 8, -30, 26, 108, -19, -42, 64, 13, 46, -56, -49, 56, -79, -11, -85, -69, 85, -20, -121, -17, -22, 107, 14, -65, 25, 11, -1, -20, -92, 116, -5, -87, 22, -29]
3573b9J21p9j41J84o9R4r0j51K69o7q3N8mJ29r9j48J78j19O4k6j68K84j24Lmj40
3599a57K88p4j19J10o3J46q1j86J95l9L4m3j12K57p1j41P4j36J72L6l12K75q5
3622c2P1K4k05K13K3j41R2j19J12k4p6O6j08R7N6k13K33J7p0M8k32J82J22j69
3646c3L1p1J00P5k22J31jPM6k09J72R6j28O2j23J08P5k18J27J3l4J29k47R6O2
3671D4q5N1j03N6J82k51R0j5m1K45k94Q5J03j57J43j07M4J47k02Q6J6p9J48k20
3695a14P9R3j46J95k46J12J49k03J66j36j1K18j97M0P3j53K13k14J0J70j43O7
3717B2j00lJ49j38J01Oj57K39j37r4K09j32O0Kj36K25j59k0J00j27J60p3n4R5
3741C8r5P7K2j40J94r5m1J08j55K03j53m1J32r8L1M0j16P5Mm2Q8j40J49n3l3P7
$$ y = [-29, 92, 13, -128, 56, -13, 81, -9, -160, 109, 42, -41, 17, 13, 142, 43, -105, 73, -46, 18, -8, -176, 108, -16, -13, -17, -157, 131, 57, -62, 48, -15, 131, 50, -136, 59, 20, 54, 11, -101, 156, 85, -56, 18, -118, 54, 90, -222, 53, -32, 39, 63, -142, 71, 94, -47, 45, -74, 38, 14, -62, 4, -104, -7, 49, -164, 69, 86, 16, 64, -168, 14, 136, -33, -2, -73, 27, 102, -120, 11, 10, 17, 63, -146, 26, 122, -6, 56, -67, 41, 116, -102, 25, 38, 4, 133, -114, -18, 44, -41, 10, -93, -37, 145, -106, -16, -31, -72, 173, -121, -36, 67, -90, 53, -54, -10, 137, -65, 21, 37, -42, 106, -114, -35, 58, -88, 107, -139, -27, 122, -81, 85, -51, -62, 156, -41, -1, 72, -81, 132, -82, -72, 98, -45, 22, -78, -81, 68, -70, 31, 37, -120, 119, -18, -112, 97, -35, 25, 27, -109, 116, -43, -63, 37, -90, 70, -3, -57, 38, -57, 20, 42, -98, 96, 1, -40, 68, -87, 116, -37, -78, 54, -44, -13, 27, -89, -14, -10, -52, 36, -104, 45, -8, -41, 36]
3767C6j04J20Mj60J95j58J28K9j80J23l4o8J17j07O6Q3j50M8j1O1P1j57L0L8p
3792A3km3J4L1p2Q3m9JM5p3N5j8n0J06j0p9P8p5P4k2l6P7l1J7o1QL3rm3M4n5P
3824d2P9j01N7j3K5j3J4K0n6M4J8p0OP2j01J11l2j8j2n6J07m1rM0j5l4PK7k3K2
3854A3kj0qL1j8k7L3n3R9p2k0P0Qr4P9k5m5Q7o3K5oJ4po0O5n4O8m1kN7r1KQ1p2
3888c8O2o0J6P9m4j1J4k5l3L3Kj3LP0m7k5P2q9M8Mo2M6M1n0L3l2pK1J4ok2mnl4
3922d9RM3n1K8n6J00K2o5L5J5Mj7l5N3m0l6P3n9P9m3j20J52p0RK7k3K5n5J4J47
3952A16k02R4J1j8K7l5nJ5n0K7jK1Qk6K2m6k8J46j26O6Nq9J14j6k7N4j26J17p3
3981b5p6J45j04R0Kj09J36n3n3R6j43K25j03j56K47j71J49K2k13J64j64J8J04
$$ y = [36, -68, 52, 56, -104, 91, -67, 61, 90, -90, 33, -1, -69, 48, -59, 7, 90, -60, -12, -23, 38, 109, -48, -18, 20, 13, 11, -32, -18, 13, -59, 24, -25, -24, 21, -52, 3, -15, -65, 41, 31, -48, 30, -45, 29, 7, -29, 48, 17, 34, -27, -19, 14, 5, -38, 6, -49, -42, 37, -64, -7, -20, 5, -8, 6, 26, -30, 14, 32, -38, -32, 40, -61, 50, 18, 0, -12, -68, 39, -2, -11, 29, 14, -20, -13, 14, -9, 13, 11, 1, -7, 24, 6, -21, 12, -41, 58, -14, -34, 36, 44, -50, 29, 4, -41, 46, -17, 8, 2, 16, 9, -51, 14, -40, 28, -13, -15, 42, -49, -47, 34, -38, 24, -36, -20, 59, 15, 4, 18, -7, -40, -7, -5, -18, -15, 55, 8, -17, 55, -34, 14, 18, -44, 2, 43, -7, 26, -6, -13, 8, 22, 16, -6, -10, -15, -49, -40, 3, -48, -20, -76, 24, 46, -19, 16, 31, 35, 18, -17, 36, -4, -40, 33, -26, 53, 10, -110, 42, -28, -19, 8, -15, 10, -45, -31, 116, -86, 8, 19, 1, 28, -7, -12, 3, -47, -20, -21, 0, 8, -18, 4, -42, -70, 76, -50, 16, 21, -68, 46, 30, 3, 57, -69, 48, -25, -101, 44, -60, 30, 32, -77, 59, 6, -47, 49, -94, 131, 28, -128, 119, -52, 97, 119, -94, 70, -94, -76, 28]
4004B8j55J86n0r6J10j03P5O4j65J95j55J7J99k53J24Jl4L0q4O6J30k64J55m7
4028b6M4R6k64J50L7j13J65j27P6Q4k26K19j64rJ42k56J76K5p2J24k06R7J27k02
4052a03J84r6j5K32l65J74qr7K46k78Q3J66k05J52n8j08K67k34N4Q9j50K05k11
4075g6J6J57j78K17k01n8K56k10R4M0j91K69k10k3K47k65K32j33q2K44k16R3O4
4098H6k15K84j37r9J37j64K19j09j58K95j91R7L3k68L48j13j18J62j62J63m6j62
4120a18K78j64M1M1k98L51j28p1J54j80K00l1k02K45j23N0L2k37K62q7k6M0k11
4143a82K52K9k54K21j44J03Q6k77K23k2o8J40k31J61J01j53Q8j07N2J04k57J73
4165C8n1o5J94k08M7J88k23J61j48M1J14j29P1l4qJ77k97J27J14j31R6j49M8J15
$$ y = [28, -127, 59, 9, -87, 23, -80, -5, 59, -106, 89, -66, -49, 150, -103, 21, 22, -12, 18, -66, 0, 130, -134, 21, -26, 18, 114, -150, 0, 37, -76, 89, -38, 38, 122, -104, 115, -49, -58, 84, -172, 4, 29, -43, 81, -125, -28, 99, -103, 81, -15, -30, 202, -163, 11, 3, -94, 152, -126, -43, 123, -82, 70, 12, -96, 171, -63, -9, 80, -70, 135, -76, -60, 97, -81, 136, -65, -123, 133, -77, 17, 57, -134, 135, -75, -98, 149, -116, 116, -17, -99, 145, -71, 22, 86, -129, 155, 18, -81, 56, -108, 111, 2, -156, 139, -52, 45, 78, -190, 158, 45, -73, 89, -73, 90, 44, -118, 160, -4, 37, 78, -220, 131, 3, -68, 86, -94, 106, 75, -127, 118, -5, 45, 77, -160, 102, 15, -11, 29, -182, 70, 99, -155, 66, -78, 25, 111, -166, 57, 35, -33, 107, -124, 37, 138, -15, 73, -34, 18, 122, -135, 38, -13, -78, 116, -92, -45, 143, -80, 81, -67, -26, 88, -41, 30, -4, -12, 165, -132, -5, 109, -22, 74, -75, -27, 88]
4189H8r8m5N5l3J26j34J8J35k10K00j23l0K15k08L7PJ7P8j06M5kj15J42p9o1J71
4215I0r1JN1j44K09j41j3J07j11J39j95L5J01m9kJ8o0J37m2r5Q9j11J26nj38J87
4241I3j42J08o6n7J07m5l2J0j3N1m5L1J3q3J35p1m4P1nljj3P6m8n1K5j6l0M4m1
4271d2L5Qj7K6p1O2l5L0P4o2qL1r0P9J2m8K3r3N6P0q5M6j9L7n8qK2kl6pM7L5n
4304Gm4M3l0j9N2k2K0kj8qL0O2o0l4K6N0m1K6n2K0krJk0J0L6l0m0O9J8m4j1M1
4337B5j7j2n2K4J7l9P5K4j07P6o7J6O1r0O3k0Mk2Q7m3Mj6L5l3Qk1N0j8j1J6%l1
4369a4JK3NK3m1l1L5j0j5L3k3J5l4K1K9Ql0m1K5L0J5r6Q6j4l0L4Nl4L1j1j3N0
4401C2mm7K8K3l2J0J5K1q2K2L3l4PmL9k1L5oj3K2k2nj6k3J6lJ0m%lL6m7L6n5J0
$$ y = [88, -10, -55, 0, -33, 93, -41, -23, 112, -98, 102, -21, -51, 164, -44, -7, 0, 17, 95, -11, 34, 32, -83, 59, -20, -81, 90, -1, 0, 51, -93, 116, -25, -38, 69, -42, 97, -98, -63, 38, -11, -13, 5, -55, 82, 40, -55, 34, -77, 49, 44, -94, 93, -49, 59, -7, -64, 43, -2, -34, -24, -37, 14, -31, 0, 13, -70, 65, -6, -50, 21, 16, 13, 12, -1, 75, 27, -24, 1, -15, -45, -1, -42, -7, 1, -16, 10, -61, 1, -34, -4, 70, 8, 0, 31, -59, 20, 32, -16, 7, -86, -30, 40, -45, 1, -18, 19, -39, -47, -25, -27, -63, -70, -23, 12, 7, -37, 6, -24, -43, 9, -13, 7, 5, -13, -21, 9, 71, 11, -23, 3, 53, 12, 38, -14, 6, 4, -5, -4, -24, -14, 22, -8, -48, 21, 39, -5, -16, 25, 8, -4, -56, -32, -15, -54, 21, 45, -62, 14, -53, -37, 24, -66, -3, -23, -19, -41, 46, 3, 7, -9, 26, -7, 1, -20, 30, 12, 1, 17, 17, -14, -13, 10, 15, 38, -3, -34, 1, -9, -24, 9, -14, 1, -33, -12, 17, 25, -5, -46, -21, 9, 24, -72, 14, 0, -30, 4, 9, -25, 6, -5, -18, 32, 28, -19, 9, 32, 0, 10, 25, 46, -36, -14, 19, -15, -8, -12, 27, 6, 41, 35, 22, 44, 22, 17, 1, -22, -6, -9, 1, -3, -3, -6, 30, -17, 19, -36, -26]
4436b6K8MmL7r7J46j7l0k7k0L6j0o4P4r4K9Q1Mo1rJN2n7K9J0k7l1O9m2L1qj6J8
4469In1P4q2O6k3L1l2K8Rl8l6K0k2Q7k3M4k5p8N2M2j11L3R2r9P1o0lN1q7J06p0
4500b5l6O1k4O3q7K6M7rm1O7k9J2j7m6P0q6O3m6K5j7J6j9l7L0K1Jj3O5k4j0N3
4531E4r5P2n0k4N1J3J5L0q9K1J0J8l6n2J32o3l0lm4J32j2n6m3N8l8M9j34J43j07
4560g8J8O5o2L2L2o9O2M4j9j0n4KJ08o1J8q0P9K9j41P5Ok7O1m5N8k7l0R3j36O4
4590GK6o9O9p0j9J48j20QK8q5O1n4K7R1o4J9k6M1N7r0L0k1K2K3j30M7J06q5P0
4619D7p1j0J23q2k5lm6J75j14o9J02j5L2p9j9J56j22N0j7k6Q0j04k5L8%P3m2j03
4647i6K17j47M9o3L7P8p8r4J38l1Qrn8J20n6K3j8q0J12k2l4M9j10R2N4j83J47
$$ y = [-26, 2, 6, 2, 39, -58, 88, 71, 41, 14, -6, 30, 20, -44, 30, -64, -35, 46, 50, -11, -20, -19, 33, -24, 5, 15, -12, -43, 26, -16, 15, 7, -9, 9, -42, 32, -50, 16, -7, 24, -8, 20, 29, -9, -45, -25, -47, 40, 17, 61, 36, -42, 10, 52, -59, -26, 66, -33, 38, -22, -25, 26, -61, 45, -25, -61, 0, -24, 39, -48, -22, 25, 16, -25, 42, 13, 25, 8, -38, 32, -54, 9, -37, -12, -29, -13, -32, -69, -39, -18, -17, -30, 35, 11, 1, 54, -41, 31, -19, -43, 8, 21, 36, 66, -23, -2, 8, 26, -10, -62, 70, 7, -23, -26, -70, 62, 50, -6, -49, 9, -29, 20, -114, 29, -78, -60, 5, -57, -25, 7, -62, 0, 44, 25, 15, -39, -37, 71, 10, 28, -52, 27, 56, -85, -10, -4, -31, 30, -15, 43, 16, -14, 79, -57, 7, 33, -36, 33, -37, -56, 92, -28, -20, 8, -77, -16, -70, -43, 48, -16, 3, -23, 18, 75, -15, 15, -6, 16, 39, -91, -44, 62, -23, 47, -24, -34, 89, 7, -18, -21, -67, 108, -6, -75, 27, 12, 44, -35, -54, 102, -20, 30, 13, -13, 67, -37, -62, -24, -24, 49, 7, -96, 121, -26, 23, -40, -3, 75, -3, -97, 41, 10, 18, 9, -49, 71, 15, 38, 20, -60, 52, 30, -4, 45, -65, 27, 81, -102, 45]
4674D5n6M8J8j25J35r9K3L5j00J20O0j92J24r1J06M5j80J06nq0J26j37N8P0j28
4699g4Q8j0RN2j54J56j00NN2r3R3M9q2O1l8jom9K6K5r2J04j13R1O0j45Q6m4R8
4728E4qm4M7k4n7P7q5j0O2m9P2n9K8K5q5Q6n4K0K3m4j7L8l2J31j30J3J00j08P6
4757D6k3n4L5m0l9Q0q0R9Rm2J1J5Km5L9N2j07LJ11j45J68j09m1Q0p3M5N0q5O8
4786C0j3MO0j20L7J2l8Q1l8M8p6k4K6L7LQr3J11o2rM7n4M8Rn7N1m8K3j1J6L6r4
4818e0L8L7l7j0M4l6L5k2m9L8j5Q3J4j24K6M3K7k4j3L4m9K5L0p0K9kjLJ0j8R7
4849I3p7j7Jk6M3k9N8k2nJ7m1nJ3o5P1J2K0l6n3O0Rl1K7k5%P8o2K2n0N8jmn2O5
4883D6k9llp8R8q2M0M3n0k3N6kko7QN5J2k6J3oj9oN3j9%j1J3k1j9M1NJ5J5pMn7
$$ y = [45, -11, 37, 55, -70, 65, -34, -11, 24, -76, 44, 104, -88, 36, -55, 51, 96, -84, 22, 17, -63, 63, -74, -16, 54, -74, 14, 4, 13, 65, -89, 67, -33, -28, 24, -69, 24, 73, -9, 52, 14, 13, 7, -42, -16, 9, -83, 21, -92, -1, 59, -86, 0, -44, 54, 46, 2, 49, 25, -32, 45, -40, -50, 12, -37, 35, -24, 4, 29, -56, 30, -24, -4, 19, -25, -42, -4, -36, 95, -35, -22, 78, -30, 46, 23, -31, 4, -36, -75, 5, -75, 24, 33, -9, 2, 17, 19, -26, 13, 65, -42, -39, 72, -73, 95, -14, -55, 25, -48, -3, 47, -38, 30, 17, 21, 81, -39, -2, 10, -28, 53, 15, 63, -13, -37, -11, 26, 29, 37, -56, 55, -7, -16, 31, -23, 25, 34, -23, 28, -20, 3, -8, 8, 44, -50, -12, 25, -12, -22, 22, -14, 21, -1, -50, -12, -27, 56, 70, -54, -28, 15, 42, 18, 5, 39, -10, 15, 45, -25, 4, 2, 1, 4, 14, -4, 93, 16, -1, 0, -26, 17, -12, 46, 24, 19, 36, -5, -10, 3, -62, 9, 21, 41, 5, -48, 12, 21, -10, 17, -8, -8, 70, 8, 30, -20, 38, 37, 33, -19, 46, 17, 14, 11, -67, 31, -51, -11, 32, -18, -41, 15, 13, 11, -56, -48, 7, 19, -7, 6, 0, -19, -25, 28, 9, 9, -2, 11, -10, -29, 12, 17, 32, 47, 40, 44, -13]
4919a3pM8o5K3L3l2J1j3l1R0o3l2O4pl2J10j54Q8qM9m6k3mJ7k5J6l0R7m6m5K8
4950bqq0R8jk0J2j2O3l0jLm6N4k4K6l0n2J03p3l5P7k2KMLQ1r4k5R6q6L6m2n7J55
4984G3j17L2j3pQ3q5OJ01q9L7j3j7M9p2K2J6n3M9L2o8O6p0M1L6j31J38q7O5l1
5013gJ2L6q3N4L3j06P3M6p7N2l1j7P0n5J9j6k6O3j12J06lp6O7OJ8j3q1R0k1m3
5043b2J32j50J06l6r3P2n7J19Nj27O1J%J6j24J22J7m5Q4j01l6J43j73R8J6j30
5069a02J54j10O6J17j89J56j00O4K5j19J09l0l9J34j95P1M4p5J4j2k0R3j24R1
5093B3kn3J10j02QQ7j28J75j64N4P7j68O1m4L7J14j28PN5o1Q4r6k2J49q1L5n9
5120c2L5O4q1mR5j16J08r3k5J04q4O0kq4R4k8j1JqQ9o2k3Q5p4L1m3l2J03j66O5
$$ y = [-13, -20, 28, -37, -14, 19, -13, -2, -15, -46, 44, -19, -51, 13, 6, -26, 84, -70, 18, 10, 59, 13, -10, -14, 3, -22, -6, -36, 61, 15, -30, -2, -10, -90, 8, 7, -13, -1, -13, 50, 20, 19, 22, -24, 30, 6, 32, 2, -50, 53, -20, -55, 22, 0, 2, 6, 9, 90, -4, -29, 67, -19, 17, -25, -82, 73, -44, -12, -25, -32, 51, -34, -28, 73, -16, 21, 8, -9, 40, -32, -10, 6, -47, 2, 34, -34, 32, -38, 3, 39, -92, 46, -41, 24, -7, 5, 41, -42, 12, 45, -61, 12, 58, -19, 33, 2, -15, 55, 0, 19, 3, -23, 40, -72, 34, 31, -45, 22, 28, 46, 33, -48, 42, 21, -22, 110, -40, 66, 30, -63, 9, -48, 71, 76, -51, 10, 11, 11, 27, -97, 25, 42, -3, 81, -20, -56, 87, -86, 12, 28, -102, 52, -58, 8, 125, -64, 92, -8, 56, 81, -38, 71, 41, 2, 136, -59, 12, 56, -19, -5, -17, -37, 56, -68, 23, 21, -32, 78, -24, -16, 71, -57, 118, -46, 8, 85, -83, -22, -66, -29, 85, -43, -36, 19, -42, 42, -54, -76, 73, -8, 27, -32, 3, 67, -14, -18, 77, -39, 69, -24, -49, 55, -29, 31, 29, -55, 39, 11, 0, 1, -7, 82, 20, -3, 82, 8, 39, -4, -36, 67, -99, -34]
5150c4O1j02J35J0r7K7n9J38k4j45J42m1J4j9l0J35l2r4K8n7J58j12n9J09k7m5
5176b0K7j15J06j7m4J22j01O0M1j23J13q9K0Q3j34P2K9j06J27q2j0J00q3Q6q3
5201b1P5m8p0Q2N8q3J3k2K2K8o2Lj9M5M8o5N3j7oK3q0O9O4j06M3o5J40o1p4K0
5231a3L2o1L4J2qP9j06M7m5K3O5p6M9j1l5R8q5j0N5o2m1L5J6K2n1K2K5k8J3k2
5261b7N1lm1L7l9k0Q5n0K3j8nL3m5k2P0p4J10m4J3K2p8J1M6o8J34r9j8M1K8mm6
5292CK0l0L1J4o9K1jj9j0M0j4k5M6j1j5L3Rj9k0J1M6o9J7nL5J7o0%Q3Lo8pN6k
5326D1J2k4J2m9M7k9o4J19r9oN2j1ok6J1L5m3N7roJ8k4K2kJ3n5m6N8Njj3J6m5
5359d0M0Ok8O6p2J4l5j0R4l9M8oj4m7K5J9Oqo3j0O4k3K8K6n6LO7m9plK1K9j9n
$$ y = [-34, 27, -75, 60, 70, -27, 0, -59, 79, 55, -90, 52, 11, 25, 6, -24, 111, 79, -15, 13, -44, 114, 2, -57, 52, 25, -20, 7, -108, -2, -19, -63, 59, -42, 18, 59, -64, 49, -40, -20, 63, -71, 1, 30, -76, 51, -31, -41, 59, -24, 62, -21, 54, 6, -64, 18, 76, -7, 6, -16, 6, 34, -28, -25, -44, 1, 49, -16, 37, 20, 14, 37, -43, 26, 90, -16, 27, -38, 102, 41, -33, -13, 19, -42, -8, 4, -4, 75, -31, 16, -29, -6, 59, -17, 32, 21, -14, 84, -1, -11, 44, -18, -59, -24, -8, 14, -37, -15, 10, -18, -5, -27, 24, 21, -20, 17, -22, -42, 43, -7, 16, -2, -7, 26, -19, -41, 29, -45, 65, 21, 34, 56, -22, -11, 35, -33, 101, 2, -16, 25, 53, 49, 3, 23, -7, 24, 38, -31, -10, -11, -30, -40, 0, -14, -39, 7, -4, -19, 14, 23, 4, -16, -5, 41, -28, -11, -16, 19, 36, -24, -24, 59, 62, -6, -13, 43, 41, 53, 29, 41, -8, 39, 10, -54, 65, -34, -40, 12, 1, -5, -31, -20, 15, -28, 29, 20, 14, 32, 8, 30, 28, 41, -14, -60, -2, 3, 2, -11, 5, -40, 0, 6, -22, 44, -28, -14, -49, -59, 35, -4, 44, 38, 24, -23, 2, 21, 27, 19, -44, -54, 10, -13, 15, 41, -15, -12, 55, 6, -1, -4, 17, 46, 27, 22]
5393B2l7N4jn8K1j9k0M5k9k2P4o7N1j3j3j8N2n8O8Pk1J0j8M2l9j2lm9L3J4MO3
5425F3l8K4j3l8L0mn3L5lmm0l0R3n6M7k1K6%Ml6O%QJ2l3lN7m2M9k9rJ9l0J8Qr
5461HL0Ln8L4rj4Jrj7L8l8LK7k5PL5j4pK0m3O8n4J6Ml8Q4m1l4N9l4M9Km4k0K0
5496In6M9j7J1M2q6N2l7pO7o3K5K3j6Km2J6L2pN6p7J8L7k0k1rQL6l8j0K5rN9l0
5530B2m3N4K1n7N7r0M2jPljj6n0P8L1o9M6l8N8jk9K2r4P3K9n5J5LN1k8Jj21J23
5563C7n4L8q5MO8m1M3l0K7RM4r1P4p7J06j34PJ10m9lJ3p2Q9j4o3N3j7O2m2k1N2
5594D3m6qL7r6J28l7n8Q1q2N7N1j25R6m8J2Pk9N7J5n6L6k9J04j13m0J08n0L4j5
5623C4p0L6l3lQ3j10N5J06j51M3K5l6O6o4M0L8l5K3j04K2R8j38J36q7M5J2q3L7
$$ y = [22, -15, 39, 38, -20, 1, -18, -38, 7, -22, -44, 30, -37, 14, 1, -12, -30, 22, -36, 32, 39, 18, 28, 10, 52, 13, 1, -2, -51, -18, -4, 0, 63, 25, 49, 36, -2, 28, 24, -29, 6, 3, -1, -41, -71, 22, -34, 13, -8, 18, 18, 22, -14, -8, -8, 0, 12, -21, -24, 33, -9, 40, 11, 2, 21, -9, 9, 17, 8, 38, 41, -17, 17, 8, -6, -5, -14, -31, 7, -31, -28, -1, -26, -19, 16, 2, -5, 15, -28, 40, -14, 2, 6, -32, 52, 11, -23, 36, 2, 51, 53, 9, -11, 9, -47, 2, -15, -4, 38, -48, 4, -33, -40, 27, -36, -11, 12, -4, -2, -44, -28, 4, -3, 53, -24, -6, 31, 11, -10, -19, -11, 25, -13, -23, 2, -7, 52, 22, -21, 33, 54, -3, 54, -36, 6, 5, 12, 9, 8, -8, -58, 20, 51, -18, 28, -10, 48, 47, 18, 40, -54, 19, 48, -7, 8, 11, 62, 34, 35, -86, 37, -17, 21, -64, -60, 8, -33, 10, -20, 7, 16, 60, -31, 43, -34, 72, -62, -55, 55, 6, 3, 16, -56, 33, 19, -44, 9, -8, 54, 12, -9, 43, -3, -11, 26, -70, 58, 21, -37, 44, -38, 19, 70, -55, 41, -7, 5, 12, -17, 40, 55, -1, 35, 6, 110, -3, -43, 65, 15, 49, 34, -36, 0, -33, -36, 47, -63, -8, 98, -53, -10, 15, -21, 45, -19, 21, 59, 24, 47, -57, -35, 63, -75, 61, -26, 19, 31, -52, -15]
5651a5j1L5M9p4M0jm0L1l8J6L5j02J40p0K7j0K5n2J09j18M5n2L3N4m9j8j4j3N7
5680A9n0J0J7l1Q7r7M6k5K4o1M1mN9p7N2M3p2J04n5o8R1j42J36l6o0P2m3K6m0
5709c4%J28j31oP6j7l5J8k8P8j0m1PPlmq7R4Ll7K4m8M8l1l0P8n3M9nk3M0n6j5
5742d4M3j4K0Nj2L3l5K8K1r2J1PN9O4j39J6L8L3kr4J6O0n1N3J7p2J7j7L2MPl6
5774b4j6K2O6q0Q7j07O9O2r5N4n9J7L0Jk2K9j1K7q2j7J3k0O4j5L0k5M2o4N2ko4
5805c8N4L8j9m6L8M0j02J6L2mj6m6M1K1n3M8J0L7l7Ql5j2M8j3OK3k4m3N3n2P8
5836E1k5k0J4k8J4j8KM3p2l9P0m5K3N1l1l2O1k7K8J8l6l0N4J1n0j9L4m5K2L0p2
5867f3KM5J5J8l0K0j3Pl6O4n8k1O9K8m3J7m5MJ8lQl5K3L4j7l1qL9jMpq9J03j1
$$ y = [-15, -26, 9, 58, -16, 24, 23, -17, 14, -24, -8, 27, -75, 65, -5, 22, 12, 37, -15, 94, -24, 21, -31, 2, 56, 7, -11, -25, -38, 19, -31, -21, -4, -35, 52, -45, 1, -24, 0, -61, -20, -24, 35, -42, 10, 53, -19, 85, 30, -38, 53, -89, 47, 11, -49, 23, -20, 6, -34, -34, 94, -37, -43, 33, 16, -19, -1, -29, 49, 39, -2, 5, 12, 9, 5, -82, 12, 15, -22, 2, -46, 2, -29, -59, 19, -34, 15, 10, -13, 27, -29, -44, -1, -15, 5, 10, -2, 31, -4, 24, 45, -47, -36, -29, 30, 94, -45, -29, 9, 42, 40, -54, -38, 22, -29, 24, 41, -31, -14, -31, 1, 5, 12, -24, -40, -18, 48, -32, 55, -52, 17, 79, -16, 38, -21, -4, 26, 27, 5, 34, 23, 50, -32, -49, -36, -56, 8, -7, 23, -2, 40, -24, 28, 26, -38, 16, 54, 35, -11, 27, 67, -35, -19, 13, 9, -7, -53, -12, 9, -44, 4, 14, 51, 14, 22, -13, -25, 23, 10, 16, 39, 15, -28, 25, -27, 51, 26, 6, 20, -8, 6, -12, -10, 33, -39, -78, -8, -53, -30, 21, -10, -42, 19, -8, 20, 38, 2, -28, 26, 37, -13, -32, 2, -43, -21, 9, -63, -61, -16, -1, 17, -13, 7, -6, 1, -35, 29, -29, -50, 19, 47, 4, 21, -24, -20, -2, -5, 3, -32, -9, 25, 8, -23, -31, 8, 7, 11, 4, -85, 18, 7]
5901GRm3L0rK6l7rlL1Oqm1pN3K6K2p6J9J9K2l7O9j8l9m3Q5j17Q7n8jJJ5L9Np5
5936e0K5MJ7L0m6oML1K7m1n4P1k8rJ7n3J02Nk4nm8K8M6p2NK2j7J2Rl2K1k5K8o
5970a2K0n4K5PM1q0P1L7m5M5q7O7l9J4o4O3m2K6K7Jk5QN7o9JmK5j4L4k8L9p0P1
6003D6p2L9J%M0j3J4n6nk6J7K1K2l0k7N3j6l1N6k9Rlk3M7k8M4qo1Q5p5M3j6m3
6036b5J5J8mpJ2P0p5k6N6L4l2kq2P9J3q8J0J3K1k8K2J5k2M6m8J8M7k9KPn9N2K2
6069D5p0mK5J4j1kJ5N2p0L3j9O1p3l6P0L0n1K1n2J10j20O3L0q7K1J6k7L0o4K2
6099b8M0p3J17nj1m6m0O9J4q3M9ql6N5l6K6L3m0k6LLK0J9Qm2L3M8q5O6p2kQ0p6
6132b6oj0J1N4j25O9O7r2N5o%L3q3K8P9l4l3L1j7K4m6L8Qn0P4q8QK7KQ8q8j1K1
$$ y = [7, 16, -27, 3, -6, 20, -17, -26, -29, 2, 8, 0, -41, -48, 5, 31, 53, -23, -4, 15, 37, 0, 69, 51, 12, -31, 54, -63, 24, -34, -35, -34, -19, 20, 25, -50, -25, -21, -4, 26, -20, -26, -22, 9, 36, -5, -59, 12, -16, -25, -8, -61, 41, 46, 22, 17, -31, -3, 43, -29, -24, -2, -19, -7, 2, -30, -9, -34, -6, -12, 8, -46, -21, -14, 27, -53, 18, 55, 10, 55, -32, 35, -4, 10, -54, 9, -33, -7, 20, 21, -4, 4, 61, -8, -7, -11, 14, 0, 34, 6, 45, -25, 46, -26, 13, 14, 14, 54, 41, 55, -1, -6, -32, -15, 6, 28, -2, -29, 24, 8, -23, 33, 4, 13, 10, -13, 34, 6, 50, 42, -19, 66, -9, 34, 18, -25, -10, 8, 4, -3, 9, 79, 4, -22, 34, 68, 36, 34, -48, 31, 44, -44, -34, -21, 0, -28, -6, 9, -13, 33, -15, 3, 50, 21, 23, 30, -29, 23, 45, -25, -29, -4, 10, -1, -3, 12, 64, -6, 27, 8, 69, -4, -40, 30, 60, 9, 30, -22, 88, -32, 31, 61, -26, -5, 11, -16, 14, -50, -28, 12, -61, 56, 51, 40, -6, -46, 23, 37, -46, 3, -5, -41, 14, -22, 4, 37, -3, -29, -26, -23, -3, 16, 24, -18, 15, 63, -22, 44, -28, -30, 50, -26, -32, -42, -31, 23, -102, -33, 34, -58, -3, -9, -9, 24, -59, -31, 48, 14, -19, 12, -5, 19, -27, 11, 19, -31, 43, -45, -37, -10, -8, 80, -8, -19, 2]
6165Bl9L6k3L0j5l7P6OJ3mn3n3Q8q8O9J5j28J23qj3Op8R2L7l5l3k0R5m7r6J18
6196C6p1M1Rn6Q8o0mK9l6J0L2MMK4k7J5m8k9J53j64Q9n6K0j1J1nK3j0J6p1N9j
6228A4j7k2J3L9Mq0J1L3kJ9%PrlnK5l0PK7l7lL3rj6l1O2m1K0k9j2O8l4m6N7K6
6263C9m2m5N5joNk5QNL4m6%PK0k8N7p3L9N3o2jL3l1N5n0%R%k4k8P8p3L7N1j6k2
6299A2n6k1M0K1k4J02q5L9j4k5k9Q7k1n6K2k0P2l2rj7RL7k8o6J02jl4p6J8Q2q1
6330e2P2lj6oj2l4O7K7l6n7J3P5mo8JK7j8L6k0K5m8J2%N5k7l6M2Qn5j7N1LJ1j3
6364CnP9j19N8j5jJ1m9M8k3L0l3M5K1n7N4p1LO3n6Lm6M3O8q6M9K4o4J7k2P2m0
6396DJ6o4N9N4m0p2O4jk7M6q5qO8n7O0K5o3j1RN6j2n0J0J7J3Qj9j1J5l1L6R2j03
$$ y = [2, -37, -1, -24, 6, -9, -46, 30, 36, 49, 45, -8, -61, 27, -61, 8, 23, -105, 18, 10, -3, 3, -75, 17, 54, 19, -14, -34, 61, 14, -82, 36, -35, 6, 15, -41, 47, -13, -17, 12, -24, -14, 18, 22, 26, 50, 23, 38, -10, -39, 114, -50, 39, -17, 3, -8, 3, -2, 21, 11, 27, -44, 15, 14, -3, -25, -12, 27, 31, -49, -38, -5, -7, 12, 12, 19, 10, 7, 2, 27, -3, 4, 31, -6, -9, 24, 15, -1, -32, 30, -11, 9, -20, -32, 36, 2, -44, 13, 39, -3, -48, 7, 6, 0, 5, -20, -12, -7, 27, -19, -19, -12, 8, -20, 37, -36, 3, 56, -6, -7, 26, -5, 50, 0, 0, 9, 9, -15, -43, 35, -38, -1, 50, 34, 12, -44, -65, -25, -4, -28, 74, -11, 28, 14, -11, -40, 47, 26, -30, -8, -28, 44, 12, 3, -14, -5, 32, 4, -62, 40, 39, 5, -71, -53, 29, -52, 20, 17, 1, -5, -17, -51, 16, 43, 7, -50, -37, 38, 34, -34, -33, -6, -24, 12, -8, 17, -31, -19, -19, 36, 9, -27, 15, 23, -32, -49, 2, 5, 16, 3, -2, 77, -42, 16, 1, 0, 11, -38, 10, -13, 17, -16, 29, 50, -7, 47, -24, -21, 42, -14, -11, -57, -14, 54, -32, 17, 41, -23, -6, -28, 44, 4, 20, -44, 15, 69, 29, -43, 21, 20, -7, 39, -46, -54, 14, -43, 17, 42, -21, -32, -23, 33, 21, -29, -19, -2, 11, 19, 0, -11, 4, -27, 9, 101, -2]
6429bK0K0o3M7n0j2O1J9j6J5mm1j6L1l1qK2K3j2j0k3K6j5N1l2L0l8O3p9j6M3N1
6461E4l8m0jO6m3L6n0rK4j3L9Mj6J9o9K6llK5k7LPM5l9pk4L2k4K5qqJ8J1J1k0
6496ClJ7j3oLJ5mj6lK3l1j7M1pK5m0n2L1P8l5J8j02M0N3o7O6n4N9m8k6K9L1K9
6529C7rp5N3M5o2Om1K0N8p6L8Q8j8k8k2K0j1No4L3OJ7m6Q4o4P9j00L6p4R9j4k0
6561@l0K7lj8J1J02p6j6j3l5P9k0N0m0%J2p8J00n2l7J13q7JP2j13P6p3P0P2j49
6591e5N4k2M2ol4J6Ok6Q4n2l5P3n4O9m8m2O5j7NLrj0l8L2%%J1l4J4Q6j28K6K6
6624Bl9Q3q7mO0n8L8J1k8P1j13K0M3m3Q3m1OM5l8K7k9K3ROr9R7j08J01o4L4Lj3
6656bK9J5o4N2l6K7K0p8L2j9j0M0l3M2J2p5L5j6N3J5r2P8j7l1J0J2J9O9r8N8k0
$$ y = [-2, 18, 38, -25, 22, -28, -40, 21, 40, 24, 39, 35, -6, -22, 9, -22, -30, -8, 15, 3, -7, -30, -4, -19, 32, 0, 30, -8, 55, -24, -40, 3, 54, 16, -24, -25, 41, -2, 34, -16, -25, -1, -14, 25, 29, 13, 32, -37, -11, -14, -17, 8, -19, -16, -9, 36, -3, -10, -34, -2, -26, -1, -9, -17, 1, 12, 23, 3, 0, 17, 4, -2, 1, 16, 12, -4, -7, 16, -15, -32, 9, 2, 27, -13, -65, -34, 44, 9, 27, -75, -35, 18, -49, 17, -37, 22, -26, -52, -23, 8, 37, 28, -47, 6, 51, -11, -5, -46, -26, 32, -44, -6, 82, 64, 36, 14, 34, 23, 28, -36, -3, 3, 20, -26, 58, -6, 73, -27, 9, -65, 34, 20, 0, -30, -3, -6, -24, -13, 89, 13, -3, -16, -51, 28, 8, 58, 18, 18, 30, -48, 52, 0, -37, 76, -11, -10, 62, -51, 25, -48, 22, 94, -55, -1, -23, 19, 13, -21, -5, 1, -25, 59, 7, -28, 45, -9, 60, 12, -30, 35, 18, 23, 26, 17, 7, -31, 1, 1, 1, 12, -22, -8, 78, -50, -24, 2, -37, 46, -41, -45, 15, -43, -5, 6, -22, 49, -64, -44, -1, -44, 39, -2, 4, 49, 11, 38, 9, 32, 41, 47, -52, 45, -63, 38, -26, 8, 11, -2, 27, 42, -22, 30, -6, 21, 41, -37, -5, -24, -34, 6, -27, 15, 27, -48, -13, -29, 24, 39, -53, 25, 8, -23, -13, -1, 18, 87, -11, 47, 27]
6687B7l0K8n6Q8k0o3P1r0OL2JJ6j0o4O6m9PO4J9o2k5N3lm8P8pl3M4l7l4J3K6L1
6720C9n2L5L0l9M6r2pL0k2k7P1J6j7j3k5j1K0L9J0p5Q1p0L2J4k1L9k6%K5n5L1
6751FJ5p0Q6k7j0l1mO4Qm4O0m4lkk5K4K6K5m4p1N5LnNj4M5n7J7J1K8l3O4r2j7
6785e1P4l8N4p1M4J5l9k5O3Nl1m7M8ljJ6K1%nl5j3J6Qk7MJ9M0l5j5m1NL7J0N8
6819F0m6OJ2m2J7QQj2m4N9Lk5qk0oK3j3j9l9P6kj4j3P9l7ll9N1l3K1J7nl8J9l6
6854c5J0N4%K5r4O1j4j4l1J8M1k6K0J1j8m0P5l7MN5j12L9N5m4K9k6QK6n4M4k2
6885Hj8lP6l8j0Qno6O4Mp4N8J8p7N3j9L3l4j1L0n9N4nrj5N2k3J8l5kj0K0O6r3
6919d4M0Pkj5j6L1O7k6r2Q2r6J22j06N3j5LK6l6L5ml0j4JK8K5j0p3P3p8R1k6J8
$$ y = [27, -3, 25, -31, 57, 37, -26, 45, -45, -39, -7, -6, 10, 0, -64, 2, -47, -40, 24, 43, -19, -44, 9, 6, -42, 36, 29, -4, 40, 3, -31, -18, 8, 39, -13, 22, 52, 13, 59, -33, -40, -10, -32, -59, 12, 28, 11, -2, -27, -38, -18, 21, 31, -44, 37, -33, -1, 13, -8, 31, 5, 5, 30, -25, 6, 21, -49, 37, 10, 0, -31, -35, 29, 37, -7, 53, 9, 6, 4, -21, 3, 29, 54, 10, -61, -6, -3, -8, -3, -17, 28, -29, -12, -1, 27, -6, 58, -34, -51, 23, -15, 39, -32, 12, 27, -12, -37, 26, 31, 0, -47, 1, -2, -3, 13, 34, 34, 29, -6, -19, -3, 5, -22, -18, 1, 41, 6, -9, -50, -45, -8, 2, 60, 14, 20, 32, -10, 7, 15, 23, 11, -33, 26, 29, 4, -4, -24, -30, -7, -20, -39, -78, -2, -4, -18, -31, 48, 11, 8, -31, 20, -13, 8, 25, 20, -18, 1, -35, -25, 29, 29, 54, -40, 21, 7, -7, -38, -20, 21, -5, 15, 26, 8, -32, 43, 6, 10, 65, -47, -8, 47, 3, 32, 6, 14, 40, -14, 30, 8, -10, -13, 63, 25, 15, 23, 18, -48, 16, 20, -54, 4, 22, -55, -2, -21, 12, -22, -33, -3, -62, -8, -13, -22, -37, 15, -8, 10, -25, -27, -37, -17, 49, -44, -4, 3, 1, -14, -30, 1, 68, 42, -50, 32, -64, 58, -48, 5, -10, -7, 19, -17, 18, 14, -16, -30, -29, -1, 24, 14, -59, 14, -64, 27, 1, 19]
6951A9l9pL6k8N6k6rj2L7n5J9J1KJ8Lp7O7J5qn0O3p3O3n0J0K7k4rKL8j1k8n0O8
6985bj8L6j2K6qk3j9L4N1r4P2mm4n3R0l7j2K7K2k5k0MN8j6k4m2Q9n9K8qj8L7n6
7018b0NM8m1LOj7k0Q7n3P3n9k3P9p6pN1q0L2K6m6N6k9P6j18Q0l8J4Qk0j5J4J3
7050Ik1j7M8M1l9k0qK1K2n8MkJ8M1m7pJ1Q2o5j7K0Nl9M2n7NM1Nm0K0J2J1j8kL
7085Dj2M2nn3M3jk9J1j6K2K2Qkn0j2nJM5n5N5N9o6j5j7NM1l3M9oq4M9jLLk8L3
7121EK5l9L2r9J11k8k1O8o0NM0k0K4k6j0M1nK5p6k9M3K3n7K5k0O3n4j3J07j33
7151e3L2L5m5L1j07R6N4n3L7op0L5O6k1j2l4M0K8k5k7kj6O0l6j8k4M6L5Jk8k7
7182hrN1n0l2N2k3k0k6L6R4o5l7M3J4J8Rj4k4m9J05r1KL4J9m0m6R1Mo7L9M5j16
$$ y = [19, -20, -27, 9, -19, 37, 11, 2, -10, 27, -28, -9, 2, 4, 22, 25, -52, 15, 30, 22, -28, 35, -38, 25, -25, -15, 12, -12, -21, -19, 19, 8, -20, -70, -2, -20, 16, 4, 30, 22, -1, -20, 14, 65, -29, 43, 39, -5, -58, 32, -5, -17, 10, 32, 7, -13, -9, 49, 33, 9, -33, 56, -3, 25, 17, -1, 36, -20, -15, 33, -8, -5, 1, -16, -36, 51, -2, 71, 12, -11, 68, -8, -15, 36, -44, -12, 14, -32, 24, -5, 71, -47, 33, -5, 9, 17, -3, -18, -4, 9, -12, -29, 19, 60, 21, 1, -7, 14, 36, -22, -18, -20, -2, 39, -8, -15, -4, 78, 13, -4, 16, 21, -18, 24, -33, -28, 13, 18, -22, -2, 10, 21, 3, 1, 4, -8, 34, 29, -24, 19, 18, -11, 0, -16, 6, 28, 36, 34, -16, -28, -33, -32, 13, -42, 13, 72, 6, -9, -26, -21, 20, -13, 36, 30, -54, -5, -6, -3, 0, -28, 5, 30, -9, 23, -76, 35, 7, -14, 54, -6, -1, 39, 19, 43, 17, 7, 48, 43, 68, -8, -37, 6, 29, -28, -3, -23, 40, -14, -27, 80, -53, -21, 14, -31, 0, -107, -11, 43, -10, 27, 21, -49, -14, 52, 31, 19, -15, 25, 53, 28, 1, -1, -17, 43, 7, -11, -35, 11, 46, 47, 19, -8, -17, 34, -16, -48, 4, -19, -39, -65, -29, 65, 0, -37, 6, 20, 38, 47, 33, 9, -40, 65, -26, -24, 10, 29, -11, -57, 34, 38, -29, 10, 55, -61]
7214f1P7L4m9j0N2r2L3K9PL1o6j3j2P1k0kj7L8j6J7r0J4R3Jk9m6N4n4NN2j5m5
7246b9n2Q2K3n0OM0pQo7l5P4P8r7L8l4M8l6J5jJ1M9m7o2J5K3lN7q3O6m5P3r8K5
7279a5mLk1M3nN4l0o2K2K4j6K0m8K8M7p5O7m8K8k1k8nk5O2M6n9J7m1J1MO8k4J2
7312B9k4l8j5N5L6n0L9l6K1k1L3m7L7n4J2k8P5Nnj2p2J5J01n4J1L6l8K3m9kK5
7343HLj4Kk9O5j6k3Q0o0q5P2j3K8m5L5j9N0l1m7M9m3L7Jj9njJ3n7Q4k6N8J3p3
7376hM2k4Nk0rL7K3o1J8rM2J6k7l2k4N7L3o9J7j1O5q3L3l3L7J5N7q7j4L1k7K2
7408A2rl4O5j7p0L1j9P4p9O4k3K0kN2m3o1J8K4L3m3R3j16j1K8J9kM3m6n1R6j2
7439C4k6J0m4j2L2Pj2j3J1K0k5kJ1Qm6Q0Pk0K8o8J4L6k5j8J3j8J8K0M0n3j9%o
$$ y = [-61, 16, 50, 1, -9, 43, -49, -16, 13, 20, 51, -15, -28, -40, 31, 11, 9, -8, 30, 14, 31, -59, -45, 48, 49, 20, -26, 28, -26, -21, 31, 16, -29, -81, 1, 24, -26, -20, 20, 13, 21, -46, -81, -7, 71, -26, 12, -22, 26, -10, 5, 4, 15, 64, 17, -45, -30, -7, -10, 47, -36, 30, -15, 58, -40, -15, -19, -16, -37, 6, 1, 55, 25, -37, -15, 9, -7, 13, -35, -7, 40, -35, 32, -16, 12, -9, -37, -42, -67, -5, 41, -18, -1, -42, -31, -27, 41, 17, 29, 5, -33, -48, 7, 43, -7, 32, -4, 17, -4, 29, -18, 19, -35, -23, -51, 24, 29, 24, 12, -60, -45, 56, 2, 13, 49, 11, 34, -15, -17, 8, 11, -3, -1, -30, 35, 19, -4, 76, 16, -69, 3, -10, 18, -27, 8, -11, 39, 8, -39, 10, -33, 4, 5, -14, -19, -20, -7, -64, 20, -6, 52, 65, -8, 34, 10, 15, -5, -14, 23, 46, -15, 3, -6, 36, 52, 25, -7, -31, 26, 59, -10, 7, -4, 61, -22, 11, -22, 15, 30, 87, 0, -14, 17, -10, 12, 3, -31, 34, 17, -53, -22, -41, 33, -46, 18, -5, 15, 13, 65, 22, -39, -21, 3, 36, -7, 86, -30, -41, -13, 6, 4, 47, 1, -50, 46, 34, 8, 18, -26, -38, -6, 1, -11, -24, -13, 7, -18, -20, -9, -1, -47, 33, 40, 20, 48, -20, -6, 30, 5, -13, 0, -18, 0, 20, 60, 7, -12, -12, -18]
7472a8p5R1L0%m9L2j0O6j00K9j7j6R8n8J2j0l8OK8oJOPQK1l6K1l6J2njK4k1M7
7506D3o2J3J3rL5o7J8Rj8L9kL4p3L3j6K8K3m7L5k3l0pK2K4J3q6K0nL3P2n1Mk9
7539a4N1k2k5K2mJ9j3J7o1P3l2j7J1Lj4j2Qj0nL6Jq3O6Mj6K6l7K3j4M1k3L7m0
7572dmN2m8K4n1N0j02N8K3oJ6l9L1k1k2N7Jo8M7j0L5L0n0pl5P7l4l1Q3k9j6K9
7604C6q1O8M3o6k8l0L0n3P7j7M7Pm3j7j4%NjK2N4n3J9j0ML5Kj12O4L3K5l7n0o
7637d7Q5L9r3kN2l3qJ8l9JR0o2l3P5o7Q1r3J10m8m0M5n8O2Jj2n1O4j9j1Ppj0K1
7670A8k5Ml5K4LMjnP7m5o1M8L6o5L4l5Q3j02P0j2Pl5Qk4J1rL7rq6J34j2p9R1k0
7704B9k4l8JN4l4K0O4m8J0k9j2POk5%j2N3j3k7K1j2J5Nk9N7o3J0pL5j4K0k0M6
$$ y = [-18, -93, -2, 28, 28, -21, 11, 1, 67, -33, -4, -21, -37, 61, 3, 15, 5, -33, -27, 1, -5, -4, 2, 9, 17, 38, 2, 23, -13, -1, -6, -7, 17, -4, 43, -19, -6, 7, -2, 33, -34, -16, -7, -25, 14, 12, 46, -27, 6, -10, 18, 41, -6, 29, 6, -24, -31, -9, 15, 28, -58, -38, -43, -10, 62, 11, 15, -14, 37, 15, -10, 12, 8, 27, 14, 31, -30, 43, 11, -6, 5, 8, -6, -18, -10, -20, -25, 11, 12, -71, -5, -1, -17, 9, -28, -5, -19, 22, -1, 36, -4, -8, 44, -4, 20, -31, 19, -83, -25, -2, -8, 8, -31, 0, -21, -43, 14, 15, -53, -6, -16, 19, 49, -1, -8, -43, 34, 0, -31, 52, 23, 7, 36, -45, 23, 66, 0, -28, -58, -28, -81, -4, -21, 26, 33, -10, -27, -41, -41, -36, -37, -15, 39, -14, 5, -5, -1, 34, 36, -76, -12, 21, 46, 9, -41, -47, 38, 77, -16, -18, 34, 1, -7, 11, -28, -27, 63, 1, -32, 43, -24, 57, -36, 74, 26, -14, 31, -27, 35, 36, 24, -27, 37, 18, 7, 14, 7, -3, 18, -7, -3, -38, -14, -11, -7, -8, -13, 64, 19, -42, 6, 42, -23, 11, -24, 59, -43, 27, 15, 22, -13, -5, -29, -18, -27, 10, 1, -85, 49, 37, -42, 49, 29, 5, -33, -32, 22, -12, 8, 72, 24, 34, 5, -7, 0, 6, -19, -19, -31, 22, 9, -18, 3, -9, 6, 11, -18, 39, -24, -14, -21, 14, 0, 20, 0, 46]
7737D6j6kk8l1K3M0ql8n7M2kJ1N8o0J9J3K4Ll0L8l9l0Q0l8o4Q1m1RlJJ9m6j3O4
7771B5l5L3m9N1k4j9k0M0J1j1OpM2p2N8Pp2O8l5K4k9J6N9j02N0N2rj7k3k7j0L6
7803A7Lm0RK0m3jJ9M4k8k3L3mm7L1mj3L8q4Q5m4K9K8j5n1O9l9J3P5j00O2N1p4
7835A6K5j6j3J0l7ok6J41r8j1RK9Om0j4L5J3o0Q9p0K2l8K2PmP0o4J0RJ3k4L5p2
7868c2J5M9m9M4k6K0j2r5J60r9L9Rk7j6M6l4O1j01N0l6P1l3J9mj0K4m8k8J7qM2
7899HJ5j3k1Jl0Q9o1j9OOJk7K0L6OKm8J0LRJ4j1L8o5J0N8k2N4n1l1J0O5p7L2K8
7934D5n6m9O4N1k3k7J6k1k8K9L7n2l2N1K2k7J0%J4n6K0K7o8N0J0l0nJ6m9R3j9
7965A3N2r5J5Llj2j8L1kL1L0k1m9J7j8J6PoJ6o0O3J1p7qM5Q0o9N6p5NK6Oj8m2
$$ y = [46, 30, 28, 0, -31, -8, 32, 24, -14, -71, -29, -31, -20, 38, -22, -3, 10, 34, 37, 7, 45, 6, -24, 56, 18, -46, 35, -6, 3, 0, 1, 20, -26, -39, 25, -10, 23, -26, 25, 1, -18, -38, 2, 13, 2, 8, 1, 43, -29, 29, 36, -36, 32, -3, 21, -8, 8, 67, -35, 15, 67, 58, 41, 18, -9, -19, 17, 20, -20, -11, 9, -34, -35, -16, 28, 0, -23, 10, 6, -41, -10, -14, -27, 11, -73, 12, -32, -3, 25, 10, -41, 28, -11, 2, 77, -23, 39, 90, 16, 41, 25, 12, 22, -15, -21, -47, 94, -4, -15, -6, 23, 29, -11, -25, 10, 23, -37, 52, -18, 4, -34, -12, -5, -9, 61, -3, 7, 16, 29, 5, 40, -32, -17, 32, -17, 27, 1, 21, 9, -86, 74, -25, 14, 23, -4, -20, 26, -8, 53, -48, 2, -34, 37, 4, 23, 19, 9, 33, -15, -43, -26, -34, 8, 23, 10, -11, -10, -40, 49, -12, -31, -25, -19, -18, -45, -25, 11, 17, 19, -29, -19, -16, -7, 7, -4, 34, -31, -21, 37, 15, 69, 18, -13, -3, 62, -15, 17, 45, -11, -60, 4, 55, 32, 5, 21, 0, -28, 1, 38, -14, -46, 5, 27, 0, 10, 10, 24, -32, -12, 15, -53, -3, 7, -23, -28, -12, -61, 32, 13, 65, -30, -15, -12, -15, -27, -45, -14, -16, 15, 45, 24, -25, -8, -26, -10, -3, -9, 7, -53, 10, 21, -56, -64, -19, 61, -8, 48, -27, -22, 4, 10, -8, -50]
7999e0J43r3j8LRN5l0l4LL2j4l9R8p5J7pKj5K3l5l2N2O8n0Rk6Rm9k0N3OL3j4m0
8033b6j5K4J6L3k2p0M8l4P2p2N6l7M7Omk3K7m1M2K9q0O2m3M2J0l3l7mj8N6j6J4
8065Ij6N8l4m0L2PJ3n3L1l7O6p3P4l9K6K9m8mJ1l4M5j8K4jj7K5m2RnQl1M6l7N8
8099D2n2Rj1k9N3k7%J2o2N1K7k0J1l6L8M6o7O5k5o3K0k3P0ql5N0l8l4K8M1j8l5
8131b0M3m4Ml7N4p5J37j12l9N9P9k7n2K2N7m8l0K0J9k5L2L1k9llJ9j11Q5j0M5
8161D1r8N4j3L8k1l7L4K9j9l6O0m9M0j8m5O9k0kmk7nO8p5Jj0M7M5k0k0p
$$ y = [-50, 93, 0, -18, -15, -6, 49, 19, -15, -12, 20, 6, -33, 65, -10, 7, 0, 2, -13, 10, -25, -57, -5, 63, 13, 22, -4, 5, -44, -64, -11, -5, 28, 14, -26, -41, -17, -1, 32, 10, -60, -12, -46, 26, -46, 10, -27, 20, 26, 22, -1, 26, -15, 27, 56, -24, 38, -5, 37, 47, 14, -23, -27, -45, 11, -5, 9, -7, 51, 17, -23, 9, 16, 29, -24, 7, -30, 36, -37, 37, -2, 24, 53, 5, 1, 12, -22, 23, 5, 29, 28, 11, 36, -6, 3, -2, 6, -25, 21, -16, 42, -10, -1, -12, -41, 12, -15, -15, -3, -65, -14, 13, -7, 4, -32, 6, 52, -15, 50, 25, -38, -18, -41, 29, 21, -14, 36, -2, -36, -8, 33, 15, -20, 23, -21, -17, -54, 0, -75, 62, -50, -89, -30, 49, 22, -30, -8, 49, 1, -29, -9, 10, -15, 17, 48, 19, 16, 13, 32, -79, 6, -4, 41, -57, -3, -16, 22, 1, -36, -2, 27, 8, -28, 32, -17, 23, 5, -40, 29, 9, 7, 3, -24, -29, 39, -36, -35, -45, 2, 47, 27, 7, 0]
8191@
$$ Imaginary data points
##PAGE= N=2
##DATA TABLE= (X++(I..I)), XYDATA
0@%%%%%%%%%%%%qJ6j6J6k4L2l2M0m8N6p2Q8j04J20j36J52j76K08k35K67l04L44
34A84l92M40m91N49o13O85p64Q50r45J045j153J273j408J552j707J883k074K284
52A198k517K775l066L390l758M181m669N242n923O751p783R106j0871J3353j7123
67i714K3570l7449J15146n2206j20513J20962j37788J74145n3604j18970J84808
78H8387r5989J803K9247j28386J85950n9826q2323R5913p7962J05235k6245j41604
90a05800J33079k6643K5632J4085j21418J10679o133n5666M8487n5267Q4548j2364
102C3219r3353O1961j3652M7434j4593q5335R0847j2816o348l049o8989J07520
114D2846j6265n2880M2008n4516P7771j9959q5634R5400l2972K5355M138j01584
$$ y = [0, 0, 0, 0, 0, 0, 0, 0, 0, 0, 0, 0, 0, -8, 8, -8, 8, -16, 16, -16, 24, -24, 32, -40, 48, -56, 64, -72, 80, -96, 112, -123, 144, -160, 184, -208, 232, -259, 290, -323, 362, -402, 448, -497, 548, -605, 668, -740, 812, -895, 988, -1086, 1198, -1319, 1456, -1610, 1780, -1978, 2203, -2466, 2776, -3147, 3604, -4179, 4927, -5944, 7409, -9714, 13856, -23593, 91553, 39347, -81166, 39796, -97992, 76153, 22549, -96421, 88387, -7602, -5799, 23448, -104938, 81012, 21186, -61137, 34776, -43186, 62049, 35804, -105800, 27279, 636, 26268, 40353, -81065, 29614, 23481, -32185, 16302, -38965, 45583, 33219, -60134, 1827, -11825, 35609, 21016, -64319, 26528, 13712, 7364, 4315, -64674, 42846, 26581, -26299, 15709, -38807, 38964, 19005, -66629, 28771, -4201, 21154, 25292, -76292]
126g6292J12935k0100m4348N8901q1642Q6370N610j08540R1679l8792J9111M3700
138D8592j15422Q6732O094n6836O2389p6901N2903M2036r6531O3370k2666k391
150h631N2321r3398N0794K9371m7236M4134o0016K0952N2527o5531L1186q988
162b515p370M2060n9082J7570K5587k1186K1775l7721J4326L0346l2360J1939
174C369j6935J2620K6327m0093J3547m56j194K0148l6919J9859J2171j9236J6539
187I747k8914J9188K0556l4790K1250j4282L748K6603m3782K1549P856j9351K9709
200A9087l4600R077K6826l6799K3097r002p954L3497l7000Q434J5057k0791K6564
213A5493k1861l869K7506k6605J2601k146j3203K8646k1548k030J5488j7290J6096
$$ y = [-76292, 36643, 16543, -27805, 31096, -50546, 35824, 41434, -67106, 24573, -14219, 4892, 48592, -66830, 19902, 25996, -30840, 31549, -45352, 7551, 49587, -46944, 16426, -6240, -8631, 43690, -49708, 1086, 30457, -16779, 27355, -32661, -11709, 40818, -24713, 6473, -2515, -9885, 32175, -26907, -9337, 16250, -4936, 16839, -20882, -6556, 23790, -8570, 3369, -13566, -946, 25381, -14712, -1165, -1621, -2815, 17333, -19586, 273, 12444, -6792, 9747, -19167, 21, 20577, -14213, 7037, -7245, -3497, 23106, -20676, 873, 8729, -10622, 19087, -15513, -6436, 20390, -16409, 6688, -2314, -10268, 23229, -13771, -5337, 9720, -11071, 15493, -6368, -10237, 17269, -9336, 3265, 1119, -12084, 16562, -4986, -7016, 8472, -8818, 7278]
226G278p429j0446K0530j1592J115K603r020J3550n795m324O148m856O184m026
240h0m143O444k857K196k496j763N465l695J046j353j49N400n573J570K13j824
256a599O015p064J799M058o561O686m501k506Q989q748K910L098o990Q245m208
271c77l031P449o327L234R46n344O790m046o59M370o131M458j53m675O268l919
287a147l81M218n496L338J275m272M468k039j323L853l474Q70J606k947K144m31
303B62j403K066j514Q2R32j291J234o33l16J524j532R44M90j828J908o27j170
320h72K173j461o70J693j512J65J088j458N65Q93j289N72O79r97N91J88n84Q18
338E82l32m28M91k51L8k27k6J37m19N48m76q4R83j197Q35K45j130J577p86l70
$$ y = [7278, -151, -10597, 9933, -1659, -544, 2059, -6961, 6589, 794, -3530, 2618, -2238, 3946, -80, -4223, 2221, -636, 1560, -936, -2699, 2766, -929, 117, -1236, -1385, 4015, -1558, 12, 225, -1599, 4416, -2648, -849, 3209, -3352, 3334, -1167, -3673, 5316, -3432, -522, 2576, -4414, 3831, -377, -3408, 4041, -2286, 948, 1894, -3450, 3340, -706, -1365, 3005, -3126, 1332, 1179, -3496, 2772, -1147, -1528, 2690, -2806, 532, 1807, -2465, 2003, -36, -1359, 2494, -980, -110, 1496, -1451, 693, 262, -1141, 925, -589, -507, 425, -866, 368, -265, -581, 943, -589, 355, 845, -983, 925, 298, -872, 1301, -160, -830, 863, -649, -484, 604, -854, -289, 604, -685, -113, 566, -431, 160, 348, -236, 582, 250, -178, 313, 62, 100, -127, -153, -16, -435, 113, -363, -447, 536, -661, 174, 419, -711, 866, 80, -290]
358b90J031j016P06j72n93N10o56J249j382l00K130k695J935J51k846M522k508
375b24j360L893l889K634J65l817M960k625l06K082m365M829j673k771M668m575
391b374L434P16n786O783k954r46M070o668N554N13n594N593l971J786K710o719
407c853M845n72j072K469n460M923L38l365L434m654M660J329o688N146j925J080
423F35K092p152N669R9j961J955n967P053j93n633N413n503N673J895j0633R343
439B785k344j238N376j1561R148K392q967P492p566N226N781j3852Q787j284j393
454a218P575j4374Q463N147r747Q413r423M460R958j5964O921L40k392R705j4711
469f847M110Q109p576N554q787L496R830j1643L597j979J719Q809j4402L685N176
$$ y = [-290, 741, -275, 431, 259, -334, 176, -480, 769, -613, -913, 1217, -1478, 457, 608, -2238, 2284, -224, -1584, 2309, -1580, 1054, 1219, -2598, 2362, -263, -569, 1513, -2852, 1977, 304, -2467, 2201, -2374, 1060, 1776, -4010, 2773, -181, -1127, 2943, -3725, 1829, 2342, -3252, 2341, -1630, 156, 2866, -3853, 992, 420, -652, 1817, -3643, 1280, 1618, -1747, 1687, -2967, 1693, 3022, -3666, 1480, -445, 635, 2727, -4425, 1244, 1343, -618, 1337, -4630, 2423, 2230, -3403, 2010, -3493, 2180, 4075, -6558, 2785, 441, -797, 4579, -6982, 2166, 4558, -4409, 3083, -4483, 743, 6524, -7328, 1459, 175, -1218, 6357, -8017, 446, 5593, -4154, 4259, -5164, -704, 9254, -6710, 211, 551, -1841, 7864, -6847, -2737, 5372, -2204, 3350, -5437, -1941, 7889, -3754, -157, -2136, -417, 8392, -6010, -2325, 2851]
484B851l225N902j2201M148R230q755L505o670M418R594j4244M282L31P36Q962
499H864j7335O203Q103q107Q464j3975M563J4893j7545O470k696j553J6450k0734
513g935L172J0361r156J2408j6072K75J9437j6872O317m251m780K1943j9915j037
527f105J1278j0190J5105j4213o347K1036j2606L881l812p048K1584j3599m299
540e335P286o768J5248j2190p698J6259p885N647o760p506J9950r702l144J664
554i34n364J6992j1001p216J0411n182J0323j0470o905J7756r138L244m257p689
568i430K1933j3192m822Q164r696J7704j0851j1173J9203j0622P123l471j3350
581a2480K3959j0996m446P611j3529K0694p903j4568J8834j1568Q909j02j8817
$$ y = [2851, -374, 5528, -6673, -2525, 6705, -2050, 1455, -5215, -797, 8797, -5447, -1165, -834, -98, 8864, -8471, -2268, 5835, -2272, 6192, -7783, -3220, 11673, -5872, 598, -2098, -3651, 12799, -7935, -4763, 5598, -3558, 8850, -7222, -6947, 12490, -4382, 1935, -2316, -7096, 14847, -5068, -6105, 5173, -5017, 10088, -4125, -10472, 10564, -2042, 1839, -1973, -9021, 12563, -1036, -5335, 1951, -4817, 10431, -1759, -9457, 6802, -1083, 4564, -2196, -9702, 10248, 546, -2598, -934, -6298, 10694, -307, -7523, 2888, -2294, 8029, -2441, -9346, 8410, -728, 2516, -1741, -9430, 12503, -689, -5511, 2653, -7043, 10661, -190, -11363, 7840, -2782, 4341, 870, -12480, 11479, 483, -3963, 3648, -9881, 10813, 2910, -11658, 7176, -4392, 4517, 4415, -14402]
594a4402K3077o675n888Q666j5547J8238j576j6057J4859q471P565K296j8309
607a2224J7202k703l841O075j4773J5170R44j2957J0108p825P959L112j5796J1974
621B425j422l98L577j3061J2348N30p059N918r492J0601J189j2707J0489n499
635b561M213L535j4660J2621r48m189O325j2242J1120K057j1209R507p624N845
649A790M623j5218J1820k218k566P670j4483J0320L704j1140R759q395M043P758
663G467j4649Q784m43l089P980j2412O504M463q379P395p647L153P094j1576O539
678A184j278k006P681j0315M083L934n672N680o350K191N333p394M327k791M95
693h98N413q479M242N44k616N624p715L374L799o094N293m499Q76N627p699M086
$$ y = [-14402, 8675, 2000, -3888, 4778, -10769, 7469, 5893, -10164, 4695, -3776, 3789, 6085, -12224, 4978, 2275, -1566, 4509, -10264, 4906, 5850, -7107, 3001, -4824, 3135, 6247, -9549, 2425, 1003, 605, 4182, -8879, 3469, 3999, -3060, 2858, -6634, 3967, 5156, -7551, 2938, -2561, 1652, 5187, -9473, 3148, 2200, -1989, 4336, -7906, 3214, 5271, -5938, 3569, -4055, 1790, 6413, -8805, 3015, 797, -1769, 5901, -8582, 1738, 5442, -5698, 4061, -4334, -291, 7467, -7182, 1602, 1159, -1930, 6050, -6362, 142, 4605, -3774, 3621, -4026, -873, 6221, -5355, 1184, -94, -2100, 5581, -4734, -651, 3283, -2389, 3291, -3059, -868, 4465, -2929, 1398, -1393, -898, 4515, -3964, 278, 822, -1794, 3830, -3885, -511, 3288, -2806, 2487, -2012, -1136, 4491, -3208, 878]
709H78n60j971N694p402L135K609n077N733n424Q27N735p616M576p10l093O924
725D258o528J332L498m988M940l376j011N012n221K816m93k525N242m557P68K437
741A604l752M143k393j343M040l483J646J8k069L455k311q8J300j801K197j683
757e20k21J514j699J788j344l45K193k299J211J32j396K322j758Q6J092j509J508
774G55j088j06J240j790J603p05r23K216k124Q34R39k061K207r19q09J869j761
791f23Q39L73j393J426p97j14P51j175R80k80m98R62q74M96K26q52J088m61l60
810b86R51q55J67M98q66M21J86n67L20J64m34K54J32m42L94J53m26L73N5l03K72
831A61l5o4P2j03q6l3J43j25j34K84k68m2L99m20K58K24n42O07j10m76P28m98
$$ y = [878, 318, -1653, 4041, -3361, -226, 2383, -2694, 3039, -2385, -1558, 4177, -3439, 1137, 427, -2666, 4258, -2270, -938, 2560, -2428, 2512, -864, -1875, 3137, -2084, 732, 239, -2286, 2956, -1601, -833, 1604, -2148, 1995, -398, -1741, 2299, -1184, 462, 480, -1589, 1866, -445, -533, 767, -1034, 1163, -520, -741, 773, -926, 862, -482, -827, 1366, -933, 278, 410, -986, 1336, -422, -336, 756, -753, 755, -333, -439, 801, -989, 614, -91, -1014, 1202, -922, -88, 851, -1210, 997, 78, -731, 1138, -623, 216, 589, -804, 622, -175, -289, 462, -713, 267, -13, -511, 451, -423, 73, 299, -553, 535, 74, -286, 665, -190, -23, 475, -391, 30, 216, -351, -31, 133, -301, -47, 85, -357, 37, 190, -236, 137, 192, -111, 161, 126, 62, 134, 31, -55, -88, 55, -70, -204, 80, -188, -230, 169, -251, 7, 231, -311, 296, 186, -290, 438, -60]
853f0j30O75p56L01J77o04O11l09j80M12m75N42l16j36P55r09P42p6q09J348r76
874a73k21J170j458R88j6j102J384r17J98M78j144J471q07j18R87j635J711n26
892B70j182K134j931Q42P71k381K508j161o96J970k580J910J36j982K489j955
908h38R31R61k683K914j463l54K083l505L032k78k657L561k992J214J805m153
924b422L560j098j015K773l834K928J5k534L526l490J952J617m646M464k258o06
940a068L595n361L642L72l357M431m244J864K456n021M375k236l46L889o020M120
956A091q3l110N192n765K602K959o290N633l192o23N571p490M205P77l929O008
972C556o186K186L638o377N805l925l26O024q185M658K76m221P347p220J858M603
$$ y = [-60, -190, 485, -271, 30, 207, -397, 214, -95, -275, 137, -338, 204, -112, -248, 507, -402, 340, 264, -545, 803, -173, -394, 776, -682, 306, 290, -812, 572, -345, -147, 331, -813, 658, -149, -267, 720, -915, 796, 270, -912, 1222, -709, 133, 904, -1477, 1031, -130, -826, 1144, -1436, 474, 610, -1372, 1117, -838, 93, 1054, -1629, 1285, -178, -532, 1551, -1954, 1078, 800, -1857, 1704, -1288, -74, 1731, -2422, 1138, 40, -975, 1798, -2036, 892, 907, -1627, 1899, -1591, 361, 1978, -2668, 1796, -462, -1068, 2527, -2834, 808, 1180, -2177, 2254, -1990, -126, 2330, -2691, 1684, -552, -898, 2991, -3029, 1091, 1008, -2102, 3090, -2675, -73, 2886, -3404, 2229, -963, -1586, 3985, -3505, 700, 1477, -2452, 3556, -2630, -444, 3194, -3183, 2622, -1303, -1629, 4395, -3790, 868, 1144, -3077, 4270, -2950, -1092, 3511]
988C511o904O118l757j235O901p852M090P8l822P457p306J658M187o494O668m823
1004a525j220P557q226M438l33m244Q663p614J206M399o483P207n127j642P708
1019D764p977M950j428m426R733q460J678M112p411R116n800k595Q826q583N450
1034A949r92n834J0672p967J060M103p794R621n510l341Q762q493O004r52o913
1049e625J1177p359N69M506q536R779m059m569Q545p818N457j81p415J0029n875
1064a375N28L742q341R472l506m282P761p873O047L12p963R661n384O02L973q628
1080e254Q640k533l941O659p622O134K51p398Q908n836J713L970r345Q877k379
1095H44l714P043q469O029J254p720Q339n600J595M316r229P885j978l195O694
$$ y = [3511, -3393, 2725, -1032, -2267, 4634, -3218, 872, 950, -2872, 4585, -2721, -1063, 3124, -3370, 3298, -1525, -2745, 4812, -3414, 1024, 691, -3553, 5110, -2504, -1298, 3101, -3382, 3825, -1302, -2944, 4764, -3213, 1737, 309, -4117, 5616, -2844, -1166, 2946, -4465, 4651, -1149, -3744, 5082, -3501, 1949, 957, -4877, 5795, -2172, -1112, 2991, -4803, 4818, -692, -4033, 4729, -3764, 2240, 1288, -5625, 5552, -1807, -1238, 3268, -5268, 4511, 452, -4117, 4428, -3390, 2067, 1886, -5529, 4500, -1375, -847, 2895, -5446, 4026, 520, -3762, 3999, -3874, 2173, 2485, -5478, 4183, -1201, -599, 3374, -5254, 3386, 853, -3088, 3571, -4051, 2083, 2334, -5064, 3844, -1992, -279, 3691, -5654, 3223, 844, -2870, 4173, -4296, 1733, 2987, -4733, 3606, -1994, -399, 3917, -5312, 2573, 595, -2600, 4094]
1110D094q580N701J776p454Q060n607J154N396r457O935j006l772O948p877M004
1125C15K691o820O751m755O20N148q098N832j061l138O673p398L305K791o269
1140c413O461m461n1N218p117M653q37k894N996o278K542K327m983N621m231K14
1156a233M563o257M394j136k593N801n865K094K255m727N148l540l46M231n285
1171b496L671r94k218N014m960K050J577m117N051l464m81M044m945L357n42k690
1187b143M660l931J131J684l569L926k314o20L196l825K773n44k171L996l461
1202a212J063J432l172L463j874r20K947l176K019j33j912L052k402P07J024k138
1218a232K534j677j93J943k595J998m67j614K736k298O84J023k138K222j146m07
$$ y = [4094, -4486, 1215, 2991, -4463, 3597, -2010, -856, 4540, -4917, 2018, 1012, -2760, 4188, -3689, 315, 3006, -3814, 2937, -1818, -1198, 3950, -4148, 1684, 623, -2515, 4158, -3240, 65, 2856, -3413, 3048, -1413, -1464, 3754, -3363, 1290, 453, -2441, 3555, -2723, -181, 2146, -2837, 2784, -1447, -1233, 3330, -2927, 1467, 331, -2262, 3539, -2326, -232, 2023, -2704, 2444, -1096, -1442, 2789, -2496, 1175, 181, -2037, 2977, -1983, 67, 1644, -2473, 2578, -886, -1367, 2677, -2268, 1089, 547, -2143, 2517, -1414, -283, 1401, -2168, 1758, -556, -1176, 2020, -1805, 968, 424, -1747, 2249, -1212, -149, 1283, -1889, 1574, -300, -1220, 1727, -1449, 570, 437, -1475, 1577, -825, -118, 906, -1232, 1302, -375, -568, 1375, -1220, 778, 311, -1303, 1433, -865, -181, 842, -1296, 926, -220, -627]
1234f27J572j864J417l62r54J912j816Q98M41j619J983j280k62J530j935J364
1250C98j73j168J774j389M63P15j411J332m90m02R71j128R05j97p43J213j062
1267c92M00L91j142J167m43m54R85r61M33L36o75O41l02j2J74k94L97l44P5K02
1287A82n00N18j68l04N46n29K23J32k71K75r7m0J92j85J40r7J05J6k81L89k76
1308c0m9L69n44K67R5n03M85p3k85M13k19Q1R2j75J79m6M0j35MJ97k92K0K57l79
1332b31K73M8l90L97j17k26L92j38r7J64m7k1O0n7l6J23j3j19%M0r3J25j24J2
1356g5J62j87K8J56j34L0J24j72K16q2j06O6L6j56QK22k78o1L54l96K22J31l17
1379b09K78R2l24K78j08J4J19j38J14r2J0L8j94K25k17r4L78m02L24M0l95N23
$$ y = [-627, 945, -919, 498, 136, -818, 1094, -722, 176, 617, -1002, 981, -299, -561, 969, -966, 398, 225, -943, 831, -558, -95, 620, -791, 541, 51, -351, 620, -508, 397, 200, -543, 670, -392, 8, 399, -743, 424, -19, -473, 512, -449, -16, 320, -355, 286, -16, -28, 146, -148, 249, -95, -20, 182, -318, 200, 32, -272, 274, -255, -32, 100, -171, 104, 7, -33, 159, -26, 114, 17, 122, 138, -143, 246, -30, -79, 290, -254, 13, 108, -395, 90, 17, -268, 145, -74, 7, 99, -76, 103, 57, 97, -38, -34, 163, -129, -109, 148, -231, 42, 90, -300, 97, -20, -246, 146, 8, -89, 75, 28, 7, 67, 10, -26, 97, 84, -35, -35, 5, -88, 37, -87, -75, 87, -100, -72, 84, -50, -20, 104, -68, 148, 66, -40, 26, 62, -94, -86, 136, -142, -203, 151, -245, -23, 108, -209, 69, 161, -163, 115, 7, 21, 140, 2, 116, 24, 34, 72, -122, 103, -114, -208, 170, -232, 92, 132, -263, 260]
1401B60l30l6M44n51L66K2l55M05l20Q6J02l28L89l29J12K08m69N72k76k28O46
1422C90o52L31L28p69O58k17k10M09m80K90Jk97M46n72M93o6n44Q07n61J07M50
1443C42p91P22m8n51O59n70L31J60o29O03l34N8K07n93O65l09n9M71q72Q00P3
1464C35p26Q72p07K01N70j078O76j6l51N68q02N90p1l71N96p60O00L47j065R76
1484C84n06J6P57j308Q64J19o68P84q99M54M93j009P45n07L01M67j131Q51j24
1503H3k93Q14j224P84L47r80R69p90J97Q21j290O76j17k22P55j135N65K00m65
1522c05P88j114O68O18j239J014n99q7J030j458P29K47o19Q72j138N49M90j068
1540f22R89q30L95Q78j645J220k98m83J343j678P66O68j350J201r64J63J091j632
$$ y = [260, -70, -106, 338, -213, 153, 175, -180, 225, -95, -9, 93, -235, 154, -175, -63, 145, -324, 248, -28, -256, 390, -262, 69, 397, -372, 286, 69, -141, 268, -212, 78, 79, -218, 228, -344, 149, 83, -461, 346, -215, -108, 342, -449, 273, 225, -326, 333, -237, 94, 254, -375, 228, -106, -48, 159, -434, 231, -78, -137, 334, -538, 262, 335, -391, 481, -226, -25, 545, -533, 143, 127, -224, 344, -458, 132, 61, -310, 286, -474, 126, 473, -592, 384, -122, -106, 651, -657, 207, 326, -342, 442, -457, -3, 490, -519, 226, -281, 20, 487, -644, 207, 83, -210, 604, -620, 164, 511, -469, 500, -290, -93, 728, -562, 114, -3, -225, 530, -605, -40, 160, -305, 483, -631, 37, 655, -584, 430, -169, -256, 774, -684, 45, 292, -327, 545, -593, -44, 446, -622, 367, -463, -68, 810, -835, 385, 87, -396, 947, -731, 35, 703, -647, 554, -410, -247, 844, -788]
1558g88R99j89m43J216j578P71N02j100J368j296L78J251j902J230m15n04J653
1575A153j891M93P78j104J245j264K32J240j544J062o34j56J515j905Q20L41r64
1592e83J582j624J53J418j575J093p43l00J637j713O49J45o77J547j645L30J035
1609G29j342J438j257j65J817j925Q08L2r87K031j654q4J224j284J401j123l78
1626g19J734j543R05l86q92K206j681l9J012j432J799j153p82J921j488P76j75
1643F3j064K047j345%P15j163J691j052n94J507j410J108l90j190K074j231K3
1660b11N89j419J850o66r93J434j088R68j91j166J650r62K49L10j363J884q05
1677G0o97J202j335J252r1j450J631p75J67M80j308J391l06n89Q21j051J044l7
$$ y = [-788, 211, 22, -421, 795, -783, -12, 490, -610, 758, -538, -160, 1091, -811, 419, 4, -500, 1153, -738, -245, 533, -571, 674, -590, -358, 882, -662, 400, -234, -390, 1125, -780, 40, 381, -583, 999, -625, -472, 946, -629, 464, -279, -579, 1058, -655, -6, 139, -538, 1009, -636, -306, 729, -613, 825, -432, -597, 1220, -705, 103, 135, -852, 1179, -475, -559, 665, -619, 782, -341, -719, 1015, -528, 377, -9, -901, 1305, -376, -415, 597, -835, 964, -189, -971, 950, -538, 238, 63, -1001, 1046, -299, -299, 416, -747, 944, -108, -702, 805, -605, 503, 113, -1077, 997, -234, -211, 378, -1041, 809, 143, -850, 584, -504, 464, 273, -893, 757, -205, 44, 354, -1009, 875, 70, -627, 575, -760, 492, 401, -1049, 582, -193, -26, 454, -854, 537, 231, -358, 463, -588, 456, 419]
1695D19j202J420j001M12M75j498J454l81n66J037j293R48K48j067R96o58K91
1712C4N23j195R40k32k51P45j202Q42J49q60R50q49K52P29j252Q87p5m30P43r00
1732d52N07L25o22N38n65K69M21q71O42k99j58P22r54N48K43o72P29n41K7O46
1752D83p04L39o5k24N57n72J74J06k02L74n22J45M27o57M80j23l18P64o45Q2L59
1773B58m86M21j49j42L25k75J05q6j26L33l37J96L0l15M07k38q2L67l54K07J30
1794A89l66K71q6m7J70j94J41n8j03R4q9Q2j6o6J17p6J08O0k41J67l3j43K24o0
1818D5o2J14j30l6J59j23m7J9O6q7O9Q4j86K04k7j52J97j09l0J78j72L0L7r6O0
1843EJ7n7kL4l3j3O7Pj02J31l5n3J78k01P7P6j70J75m7j49J12j11L3L7J2l2j8
$$ y = [419, -783, 637, -364, 48, 523, -975, 479, 98, -468, 569, -724, 224, 472, -595, 401, -257, 34, 557, -638, 302, 70, -181, 564, -638, 204, 353, -507, 443, -406, -154, 575, -677, 210, 135, -295, 448, -452, 55, 380, -242, 296, -269, 0, 421, -450, 192, -107, -265, 457, -497, 51, 294, -378, 351, -190, -163, 483, -221, 118, 53, -171, 386, -186, -12, 94, -108, 266, -256, -111, 316, -341, 139, 16, -302, 462, -183, -101, 258, -228, 193, 44, -98, 227, -48, 57, -29, -155, 178, -159, 37, 67, -248, 159, -79, -161, 206, -148, 59, 189, -177, 94, 8, -39, 131, -63, 78, 20, -83, 11, -78, 4, -12, -78, 39, -37, 71, 131, -110, 57, 24, -119, 105, 45, -17, 97, -33, -69, 90, -33, -80, -61, 5, -82, -13, 71, -115, 89, 62, -90, 107, -2, -32, 146, -26, 4, 41, -55, 5, 22, -35, -37, -3, -36, -49, 18, 25, -77, 54, 19, -34, 144, -57, 20, 96, -74, 101, 54, -95, 17, -94, -61, -24, -12, -44, -62]
1870f2J59j57J9J26j62Q5J19k99L04q1r8K23j98oL7j18J61r1K3N6j85K64k22J12
1894IJ49l51L59j58j98M41l85J07J57m27M23j30j98L24l43K85p0j65M10l92J86
1915C3Q5l53N88m51n0M47n87M67l6n32O63m21P5K64o33O68k41j03L29n71O10r0
1937A61m96P60o91L69K50r24R57m17k96O68q94P29J4p14Q68o20K62M20j051J024
1957C79l63k36P57j180R14L4q98J098r52L83O51j389J116l05l70J039j337P52
1975I3L15q81R84r76N01O70j460J149n23k59J318j754Q85L81j142J356j249L36
1993b56J155j636J019l24l66J405j786Q22L95j021J490j474K02J285j699J216
2009D27o04m66J814j983O65O32j180J691j493L4J455j628J151o50n41J947j931
$$ y = [-62, 97, -60, -41, 85, -77, 8, 127, -172, 132, 51, -47, 176, -22, -28, 9, -109, 52, -39, -16, 40, -145, 119, -103, 9, 158, -193, 166, 8, -190, 251, -134, -27, 130, -297, 126, -4, -202, 122, -221, 64, -6, -171, 239, -153, 33, 118, -235, 353, -98, -148, 299, -288, 179, 143, -389, 274, -147, -72, 192, -441, 227, -14, -117, 212, -359, 251, 161, -335, 425, -266, 103, 353, -571, 386, -31, -327, 341, -553, 176, 190, -524, 344, -276, -14, 406, -645, 379, 16, -220, 537, -643, 271, 305, -593, 505, -447, -64, 587, -802, 314, 9, -361, 678, -659, 93, 408, -473, 511, -465, 36, 706, -754, 395, -128, -387, 931, -823, 62, 443, -699, 657, -592, -256, 899, -737, 282, -42, -408, 997, -789, 33, 428, -593, 897, -577, -375, 910, -789, 427, -177, -643, 1171, -812, -147, 485, -695, 996, -497, -463, 992, -636, 515, -135, -676, 1271, -660]
2026f60O34L70j122J923j655j95J695j706J255o05r25K213j725M09N00j244J959
2043A121j429l10J424j554J487q37r58K254j761N41L41j536K429j405n48J554
2059H13j614J580o01j284K122j398N41K18j560K330j262n28J289j628J813n96
2075B35j484K242j426N75L96j866K345q22p80J211j565J747l65j567J877j231
2091d78P50L25k030K277o55o67J188j839J843r9j675J714j134P87M82k093J864
2108E60m30l98R56j915J662J52j418J403j326J055N93k154J752m22k82J111k056
2125a157J432M50j376J223j323Q37Q30j902J263m03kJ013j945J191M55j051J122
2142F57j365O32J072j756J001l83n5J160j795P56L92o96R64j354N57J018j406
$$ y = [-660, -26, 344, -778, 1145, -510, -705, 990, -716, 539, -66, -991, 1222, -503, -94, 406, -838, 1121, -308, -618, 806, -748, 739, -98, -1056, 1198, -563, -22, 319, -1217, 1212, -193, -741, 813, -801, 779, 178, -1106, 1016, -382, 159, 377, -1183, 1147, -115, -643, 646, -982, 831, 235, -1249, 993, -433, 142, 538, -1328, 1017, 195, -585, 626, -939, 808, 443, -1124, 753, -478, 272, 597, -1433, 844, 189, -478, 710, -1129, 714, 615, -1060, 654, -480, 307, 789, -1304, 560, 130, -268, 688, -1227, 435, 587, -831, 572, -754, 301, 894, -1260, 492, 70, -212, 899, -1157, 275, 725, -651, 572, -751, 86, 916, -986, 277, -126, -128, 885, -1060, 131, 586, -465, 657, -708, -76, 996, -760, 241, -142, -197, 963, -832, -76, 316, -380, 584, -770, -213, 805, -601]
2159f01R08o10P2J227j687O24L96o73J128j337J79J112j144O77n44j01J188j259
2177d45M34J40m51J109j223J17R01r02P40n90k38J185j069J94J49m81J030q81
2195b81j05P07n85O41n36k94J049q03K49K5n19J080p71j25O03o47P38m67n19R22
2215C62n01R4K7l90Q55m31j91K85l61O34m09k86O98m79K12J8o01Q01l33k22L43
2236A25m53N23j30l76M88k36J82k5l96N66k50m6K30m55M37o0m63M73k48J37J60
2257A83m87M09o6j05K21k82K26L0k38J99j31J26k8k28L26k33L3K22l97K75O8k78
2279a55J80j10L9J05j48O7M8K3J9j21Q4j1o0J01j40N0J45k50J83o1j5P3o5N3M5
2304G9j19J03n7oL3k0J4k6l0P2j27J23r0m1J09o5k6J52j37J5J28j66Q3M1l3j1
$$ y = [-601, 307, -303, -231, 996, -691, -67, 329, -344, 784, -553, -374, 738, -406, 271, -273, -374, 814, -445, -11, 129, -322, 787, -436, -319, 582, -320, 420, -170, -408, 777, -292, -98, 51, -430, 600, -281, -386, 321, -264, 377, -159, -453, 596, -207, 42, 67, -452, 628, -143, -268, 335, -312, 426, -41, -560, 362, -139, -45, -18, -408, 447, 16, -175, 110, -251, 383, -26, -312, 386, -93, 119, 137, -464, 337, 4, -218, 125, -328, 195, 65, -311, 177, -59, 123, 98, -298, 268, 18, -28, 202, -253, 184, 124, -339, 134, -114, 23, 183, -304, 105, 39, -66, 155, -127, 99, 129, -109, 90, -41, 85, 57, -171, 155, -78, -45, 177, -220, 55, 123, -155, 25, -85, -46, 59, -89, -22, 26, 49, 68, -53, 31, 20, -40, 61, -79, -29, 116, -134, 49, -12, -27, 46, -19, 34, 79, -40, 63, 6, 0, 33, 13, 27, 1, -29, 43, -84, 39, -51, -92, 17, -48, -74, 78, -59, -44, 84, -82, 1, 42, 9, -2]
2330bM2l7l2K8Qn7N7m6jR9j16L9M8n5J1N6p9N9L0q8O4L6k5q1J09j06J6J5J6m1
2360c3L7m6L2Pj09J99p8l6J18p6oP8m0o8QK0o3O7k9j00J15Om1Q3j14O5J25j34
2388a3pJ15p2j6pQL1m8j8OL4pq0K1OK0P8j07P2pl6J35j16k8J17j46L1M1o7R7l0
2419Gm6JR1J2j31L1J01o3N9k9p7J63n1p4L1j3Q2r8o1O9K2j2j18j2J65o1M9k8j10
2448a01K24j00r2P7J9O4j08o4Q1N8r9m4nJ48n1o1J2J7J75j53j25K03j7Rj04r4
2474a31K11N0j74m6O7J20p7j38j3K24J1j63lR6R3j7k55K4K83l8k03n0J11J33r4
2499B1j46L8J66mk22mK11K7j14j80J36L24j76k42N7J75J04k26j48K24J57j16k48
2522a86L9K36oj29j57J40K92l06j60J62J69P5k72j53L60R1k26j62P9L08j42k00
$$ y = [-2, 40, 3, -29, -1, 7, -50, 7, -39, -40, 59, -57, -18, 30, -25, -14, 42, -37, 22, 52, -36, 28, 64, 39, -42, 67, -39, -23, -8, 8, -33, 4, -42, -10, -3, -112, 87, 9, -27, 91, 15, 9, 87, 47, -21, -13, 7, -56, 11, -18, -118, -3, 3, -38, 45, -69, -4, 121, -13, -20, 95, 23, 7, 0, 8, 39, -9, -27, -21, 13, 6, -74, -53, -47, -27, 51, -56, 16, 9, -27, 108, -8, -36, 81, -65, -34, 7, -60, 37, 7, -39, -38, 53, 65, -66, -35, 66, 3, 62, 33, -44, 119, 68, -6, 25, 12, 94, -4, -65, 4, 26, 14, -104, -116, 49, -12, 37, 9, -101, 123, 23, -69, 8, 27, 91, -17, -81, 0, 58, -41, -85, -90, 58, 7, -54, -42, -25, 150, -3, -128, 75, 58, 67, -37, -131, 80, 130, -44, -90, -23, 97, 20, -118, -131, 93, 104, -59, -62, 34, 127, 110, -145, -121, 162, 124, -79, -129, -18, 115, 21, -125, -87, 79, 75, -147, -151, 60, 87, -27, -207, -71, 253, 77, -165, -108, 67, 171, -55, -203, 21, 178, 62, -186, -147, 89, 83, -46, -203, -63, 229, -77, -237, -75, 94, 169, -103, -256, 104, 195, -31, -193, -114, 194, 52, -148]
2544a48m0J88K96m08j40L05J4J34k97j06M38j00j64j17J10L58k68k75J13K16J09
2565B18l81l2L29m7kk95M0N09k94j69M6J14K77l43k37K77J30l6k93o4M73p6j75
2588c1j99J35M63l88k36K87mK10k51l14M92jj43j74j07N13j58l13O2J31L58l97
2610f5k32L68l6J74l22j97N51j16k12L5j27N19k45n20L60L7K00k40l16N73q9k5
2632G5j88j93O92k11l67J94p3L94k23m62M65M7p1o0l96N60J2l43Q0j00M38p1n05
2655c06L56n5J55l6n44N81N6k69J09l17L13K10o11L33n2J81O4n16M38Q7j39J35
2677A73m82M73J06n04K96j86J55K82p13L97J32j69J51m08K22L50m20K48k71K00
2697C2K93n90L27l3o5L18n70J87L07l70K90k55M7M45n64J47J22j10L47m90J47
$$ y = [-148, -188, 0, 296, -112, -252, 53, 67, 201, -96, -202, 236, 136, -28, -145, -35, 323, 55, -220, -107, 109, 218, -163, -195, 134, 87, 85, -210, -170, 339, 45, -124, -78, 36, 313, -30, -267, 10, 140, 104, -189, -253, 220, 144, -31, -230, -95, 368, -20, -256, 31, 27, 237, -14, -328, 164, 163, 20, -154, -261, 252, 94, -219, -157, -26, 332, -65, -297, 71, 35, 209, -113, -310, 241, 125, -87, -52, -179, 340, 95, -425, -65, -28, 172, -68, -384, 189, 100, 75, -113, -306, 386, 175, -192, 2, -71, 323, 100, -362, 103, 150, 79, 19, -377, 183, 195, -148, -68, -168, 270, 199, -306, 50, -5, 150, 114, -430, 151, 207, -62, 47, -270, 43, 253, -358, -25, -77, 104, 168, -348, 90, 177, 38, 173, -309, 164, 270, -234, 62, -124, 31, 313, -400, -3, 129, -40, 111, -297, -75, 275, -145, 103, -168, 32, 325, -265, 62, 29, -36, 282, -288, -101, 206, -164, 126, -129, -82, 363, -201, -54, 68, -42, 305, -185, -38]
2718c8K55l07K74l24K2M18m62K13l0k07M53m54O4L18l19K58j80j12L67k83J57
2739H3r0j03L50l27%J42k36L10k12j37M23k91J45q5j67L75j98j00J98j02J75j48
2761Ej21K25j07K2n8q6K69k31k1J82k10K24m5j82K13j09NJ15j20J37r3K2Pj20
2785g7J40p8j07K14k06J27K4j54J25j6n4J44j77J06N9j30J20p5L5k9m6J45j32
2808d2N8ko6J39r9lN7j9mP9j48J22Qj10O8n7L4k7N8Oq8J8M5p7P4p0j1R6o3L1O2
2839F9p8N3Pp8O1k2jJ2Lj6k0Pk3J5KK2Kj5k0M0L3n7N2m0k5M5m3L0J8k8m8L2o0
2872g1KP4p5K9N6ml3O4m4l9R0o5jK2l8J1%K1j8k2MK5j0KK3J0k3LQ6j04P0j2j03
2905g0J29p3k7P3q8J5P0q9Q9j04O3lk1J14j02N5L5j75J19k0L9K3r0M9Q2j84J16
$$ y = [-38, 217, -90, 184, -140, -118, 300, -162, 51, 21, -186, 267, -187, -123, 195, -124, 134, -46, -158, 209, -74, 83, -7, -110, 240, -87, -87, 55, -181, 129, -83, -220, 203, -88, 57, -28, -195, 180, -18, -118, 80, -22, 153, 5, -116, 109, 2, 24, -34, -120, 149, -82, -103, 79, -131, 93, 48, -134, 79, -30, -25, 90, -30, 107, 14, 36, 43, -77, 63, -15, -122, 92, -114, 13, 37, -117, 8, -8, -62, 82, -95, 11, 70, -60, 60, -15, 20, -9, -55, 90, -42, 16, 14, -52, 87, -12, -15, 42, 23, 19, 98, -50, 72, 80, -30, 38, -19, 15, -12, 46, 52, -36, -18, 27, -50, 24, -46, -57, 39, -24, 7, 69, -9, 44, 51, -27, 34, 12, 11, 23, 26, 10, -10, -3, -26, -11, -9, 13, 15, 0, -20, 20, 53, -4, 48, 8, -17, 28, -15, 15, 33, 5, -43, -11, -71, -69, 5, -70, -41, 15, 11, -22, 42, -2, -41, 49, -16, -17, 5, -33, -22, -22, -1, -19, -41, -37, -12, -22, -20, 3, 13, -10, -7, 79, -25, 45, 33, -70, 59, -14, -41, 32, -56, -41, 29, -60, 29, -75, -12, -15, -36, 78, -24, 31, 66, -109, 10, -10, 29, 52, -38, 11, 93, -91, 25]
2932B5j06j1J60j39J27j09J3J36j84J40J2j46K23j61k2J84k98K80j36j28K74k79
2954a45J65J6j40J75j23q6K45k11K15j46q6L51l52J29N3j72L19l12j6L25l51K46
2976I9r8k06M07k51N5l6j76M85l86MK65l31L90k62k41N00m01K33Ll43N36k75j16
2999a45K76l02L84j83l08N35m03J89Q3m85O85l37p6K67m94N87k06l55M98m27K72
3020E5Q8n62O70k29r5L09o02O28j68m10N58n12L30J72p81P98k83j07L73o84O10
3041A58M3m86M89m88L48K54p22O44k69p6M11p94O40K9n09O32o86L44M62q66O51
3062B09k56q3N90q74M91K19m99M96o41L02M59q18N44k71l3O09q75M31K33n28O41
3083C46o68J77O05q05N52k66j42P12q28L16J37l91P13p64J36O45p73M69k92j08
$$ y = [25, -81, -92, 68, -71, 56, -53, -40, 96, -88, 52, 64, -82, 141, -20, -42, 142, -156, 124, -12, -140, 134, -145, 20, 36, -104, 71, -52, -138, 107, -104, 111, -35, -121, 230, -122, 7, 60, -112, 207, -105, -121, 204, -147, 99, 1, -205, 202, -49, 6, -30, -206, 279, -107, -103, 162, -169, 221, -41, -282, 218, -183, 50, 53, -290, 246, -29, -145, 131, -171, 213, 30, -278, 257, -146, 43, 126, -359, 326, -11, -87, 180, -314, 273, 67, -288, 210, -217, 55, 143, -419, 251, 22, -73, 236, -366, 262, 94, -316, 242, -270, 60, 232, -549, 249, -34, -141, 232, -452, 158, 201, -285, 204, -284, 64, 318, -404, 240, -29, -105, 306, -488, 152, 181, -328, 304, -382, -38, 424, -442, 209, -47, -130, 460, -414, 77, 296, -203, 293, -348, -46, 413, -405, 139, -132, -165, 444, -431, 0, 233, -295, 346, -322, -145, 460, -345, 207, -59, -201, 511, -317, -1, 136, -255, 458, -306, -170, 475, -298, 171, -121, -229]
3103b29P78p79J93K07m37P02o28m4O42o50M52k87k90Q57o78J01J47l73P44n78
3123a50j46O21n45N27l44l17P64n24R1J14m14P29m84j71N11n30N19k08m52P68
3143C59m69J11R0m38P68l89j76L14m24M84j45m03N59l16Q3J04m12N68k59j72L42
3164A79m53N54j59m13N21l54K05O3m97N79j63j57K08l66M06l0l43M01k42J29J03
3185A71m89M35j34lJ99m44M02K3l31K72k18J42Q9l68L40q8q8K35l78L37J6k64
3207a44K71k42J76J63m35K60m3o1K01k92J62K9j58K45k77J68J29l11K80j28k4
3228c1J58k97K14N0j26K09l05R9J94k46J35p3KJ43k61J02N7o7J42j89O5J31j30
3251b4Q9j57J2J95j85M1Q0j40J95j59PJ83k37J60j04oJ34j17O2m8j7J53j81L5
$$ y = [-229, 549, -230, -37, 170, -267, 435, -193, -237, 405, -245, 207, -80, -370, 487, -191, -90, 57, -316, 428, -150, -296, 325, -220, 307, -37, -354, 410, -114, -23, 91, -323, 406, -78, -249, 262, -268, 251, 43, -409, 359, -110, 1, 91, -347, 421, 32, -144, 170, -254, 230, 85, -318, 241, -75, 8, 112, -300, 268, 9, -163, 179, -274, 280, 121, -292, 229, -125, 80, 143, -354, 225, 62, -95, 113, -253, 153, 123, -220, 181, -61, 68, 171, -318, 117, -17, -20, 179, -265, 137, 160, -171, 101, -117, 25, 114, -254, 86, -2, -90, 145, -233, 104, 120, -144, 127, -115, 61, 224, -211, 49, 6, -55, 146, -146, 16, 45, -113, 132, -145, 23, 152, -159, 121, -7, -31, 127, -170, 44, 94, -32, 177, -128, -29, 165, -81, 54, -19, -17, 126, -135, -33, 24, -43, 99, -90, -25, 106, -24, 65, -92, -80, 115, -70, -29, 51, -89, 106, -53, -46, 137, -100, 60, -44, -50, 84, -33, 29, -19, -36, 117, -64, -29]
3275b9P7j52J94q0o0J34j67N9j3LO3m1lQ2p5J0m2RM8l4Qrk0J08j83J31N2j34L2
3304c2J1k8R2l5j9P0o6O3r7O3l5L1j4k6j4J04j33M2J2m0O4l4J0N0j7m1M4p2R8
3333E1l2K4l1J2j0q8R2M1j12P8k9j8NN4q0O7n9M7J9K9pq9M2j1N0m4Mj3J0k8K4
3364bl1O1o0M5k0N1r2L3l7P1j8NN1q8NqN0m7q6P2M6p3Q0k7l4O1L6j5K3k9k0J6
3396A9RnkJ2o2O3Om4L2K4j12R8rj5ml0kN8q9L2P6r8J17p7l3M3JL3q3M3n6K9L5
3429Ij7m7Q2n0M5L9j29M7M3j06O3J6k4O7n9q1N7JN2m7P4p3M0Or1P2K3pK2m0kL1
3461A6Jo8L2j4P3k9p8J02j4J2r1KJ09l8Mo3l0J03J7qoj3J1m6p0R9j9j8Ol6J01
3492D7K6j08L6OM3k6mq1N9k8J14j61M6Q4j04RmO5M8j14jJ13Jl9p3M0J24j08rM
$$ y = [-29, 48, -104, 90, 10, -50, 84, -83, -24, -37, -34, 29, -12, -15, 67, -8, 2, -40, -31, 17, -17, -9, -18, -38, 70, -113, 18, 70, -64, -32, -21, -49, 43, 8, -11, 59, -7, 56, -41, 22, -13, 18, 4, -22, -36, 68, -65, -23, -11, -51, 13, -21, -11, 39, 22, -19, 25, -47, 51, 19, 43, 12, 24, 14, -74, 18, 59, -53, 25, -4, -22, -17, 37, -43, 24, -35, 12, 31, 60, 53, -36, 6, -5, 45, 1, 5, -8, 2, -26, -2, -33, 28, -32, 13, -7, 44, -48, -15, -52, 19, 1, 6, 57, -31, -26, -34, 16, -31, -117, -45, 1, -72, 8, -19, -53, 8, 44, 29, 52, 23, 3, 19, 28, 23, 21, 33, -29, 34, 40, -4, 28, 52, -60, 38, 29, 14, 10, -20, -22, 36, -53, -21, 55, -43, 74, -3, -36, 7, 8, 41, -42, 1, -55, -26, 9, -8, -55, 27, -23, 22, 61, -68, -21, 22, -84, -21, -5, -29, 38, -21, -102, -45, -44, 8, -39, 35, -38, 2, 8, -83, -11, 12, 5, 27, -13, -15, 16, 17, -51, -19, -33, 40, 11, -67, 35, 21, 33, -58, -56, 53, 15, 19, -44, -74, 29, 46, 38, 32, 19, 30, -16, -86, 13, -6, -24, -18, -54, 47, 73, -35, 1, 7, 50, 24, 20, -61, -2, -30, 84, -77, -31, 53, -51, -42, -46, 19, 67, -47, -48, 65, 66, 27, -46, -6, 118, 10, 1, 5]
3522Ek3M0q6O3l0M2Q3j57oJ29n8n3j6N4K7N9j23K9M5Q3j08j56J63L9k9n1n8J71
3550G8n0j15J09m3J38n8j92J51OK4J3j59J86n3jj2p1J60n4k14J68ML0pj13J68
3576I3m1j4m0j33J90L8k03O9oJ08j8j77J41M3m4Mj59K04rj21J07q9J20O9k48J66
3602E0K7mJ9j84Q3R9j59N1r4J34J03j87Q0n0N8O1k23P7J41q6P1j78Q3J51k40N9
3628e8J7M5J03k72J01J21n6P1j98J29J33k17J41o1m0J51k43J28N8n5J37k14n3
3651a32K27j42O0o7J6K43l07Q9KrK03l20P7J42j28Q1j11k3K62j84n9NL6J96k03
3676d6m0J18n1J68k10mK25j74J02q6r3J75p1r0J69j28J30j34n0J44j10J20o5j20
3700a21K52j48M4K5j71K46j01j92K81j95J08j5j79K63j20m1J09j50K36j21o3J81
$$ y = [5, -18, 22, -64, -1, -31, 11, 94, -63, -69, 60, 2, -51, -67, -13, 14, 73, -50, -21, 24, 107, -1, -157, 6, 45, 16, -35, -93, 78, 28, -87, 22, -21, 117, 59, -133, 18, 24, 48, 61, -98, 88, 35, 34, 22, -49, 111, 57, -157, 11, 15, 45, 38, -75, 93, 52, 38, -2, -135, 55, 93, -110, -41, -47, 61, 43, -134, 7, 50, 6, 10, -149, 55, 46, -75, 32, -57, 63, 132, -116, 50, 77, 73, 92, -92, -9, 90, -69, -18, -112, 22, 125, -62, 18, -32, 26, 87, -136, -59, 82, -4, 67, -111, -28, 123, -117, -58, -41, 4, 107, -165, -64, 57, 1, 72, -126, 3, 136, -81, 60, -1, -41, 110, -133, -5, 53, -2, 135, -79, -132, 95, -47, 13, -54, -38, 205, -102, -13, -11, -20, 183, -137, -60, 82, -46, 35, -76, -99, 163, -21, -80, -75, -39, 157, -46, -86, 32, -19, 149, -61, -65, 160, -14, 88, 2, -91, 84, 13, -77, 92, -36, 94, -40, -90, 54, -56, 64, -1, -121, 131, -17, 27, 52, -119, 127, 26, -166, 115, -80, 28, 13, -166, 97, -23, -64, 45, -105, 131, 10, -53, 128]
3722A28j54J29n5j92K79j80pJ44k12J76k2j66J90j12N6Q9k51K18Rj07Q2q6J39
3745I5n7j31K08j62N9K4j63J36m2j2N1j51J10P0p7J30j48R5L3j48J39j00O5O0
3769H4j83R9O6j00O9q8N3O5j10L2J4J3J05j80J07M7r8N3q3j7Q2r5J05q1q4J99
3795G4j77Q5N1q6Q4q5k7J50j22R5m9j2K5o6J05m2pL7q8pJ22o9j9JM1O2q2lM1j4
3825A8kj5o4L8j9M0j2j6M7n3nL5m0O8Km6O4o4K1j2L4K5k8o0J7L5j0lL1k4J2k9
3857a5J8k6JK4j8L3k0M2j3q7J02p0L7Ql7m3Q0l0l8K9Ol3N9qp6R3q%k5N0n5M3k6
3890ck8j0L1J9J1o7K9K8j4mqO8l8Om2pJ15o7m6P4j40J36J7o3k4L1o%rj5K5j7p1
3923h9K7J37q6jP1n3N3o1l4R1n4jN8j07M3j1k7K4nP7r3M0N0j12J18%j16R1%r9
$$ y = [128, -26, 103, 48, -144, 135, -45, -52, 92, -120, 56, 34, -132, 58, -54, 2, 91, -160, 58, 67, -40, 42, -44, 95, 38, -93, 115, -47, 12, 36, -127, 9, -33, -45, 6, -145, -35, 35, -42, 88, -60, 35, 68, -80, 59, -41, 24, 84, -99, 0, 66, -34, 35, -53, 0, 65, -45, -13, 1, 14, 119, -61, 46, 93, -5, 48, -35, -52, 30, -65, 40, -41, -125, 74, -103, -18, 33, -53, 31, -54, -81, 69, -53, 42, -7, -19, 6, -60, 45, 3, -4, 33, -55, -62, 60, -9, -28, -27, 14, 76, -6, -9, 32, 18, 16, 1, -63, -25, -44, -4, -16, -32, 15, -38, -43, -8, -48, 20, 22, -24, 40, -24, -3, -15, 19, 44, 16, -44, -27, 8, -2, -5, 26, 2, 14, -15, 3, -23, -22, 2, -16, 17, -3, 39, 26, -61, 41, -29, 8, 16, -21, -64, 16, -14, -52, -23, -17, -50, 9, 1, -75, 18, 10, 10, -15, 35, -20, 23, -3, -31, -41, -10, 9, 20, -47, -18, 10, -4, -8, -16, 52, 14, 20, -22, -29, 86, 19, -27, 47, -93, 43, 60, -3, -27, 4, -2, -2, -11, -26, -1, -18, -89, -62, 75, -11, -12, 59, 6, 59, -2, -36, 55, 1, 0, 58, -49, -6, -17, -44, -20, -25, 52, -41, -1, 49, -63, 55, 55, -61, 30, 30, -69]
3953f9R0q1P9n3PN5j10R0nl6J3j0N8L5j41J77r1o0J15j54J19j3p1O3k8KR9q1J3
3982A2mo2R5j34J28L8j81J73n9l9J34j94J38p3j9J08j81J16O8j06Q0j21P5P6j62
4007i4J24L2j03Q1j42P4Q0j25J51j10m3K07k13J09op4K09k09pJ28q2J40j70J0
4031c3J77j99J11n5j05K61k37N0J90l16J87o5q2J70j26J57q8o0K28k04N8Oj56
4054a31K46j72m1J95k73K71j18j36L39k01j7J41j75J73j08p1J82j58J44n0j70
4075a30K60j39J4Q3k39K76j15j77K92j75J03m3k05K86j17NN2j93K40k0j02J45
4097A01k19J70l7k29L41j66K4J03k86L46r8j28K09k35J52M7k74K60p0J3L9k43
4119a80K31j0j07J51k55J36K17l17J70o5K5J43l14K04M3j34J59k47J20J78k73
$$ y = [-69, 21, -60, 19, -34, -27, 28, -82, 8, 3, -33, -20, -30, 28, 63, -78, 99, 8, -52, 63, -91, 28, 15, -56, 7, -21, -19, 80, -1, 12, 8, -54, 41, -93, 35, 73, -108, 65, 6, -33, 101, -93, 45, -28, -47, 61, -120, -4, 64, -42, 38, -83, -8, 68, -94, 30, 62, -41, 40, -102, -28, 52, -73, 78, -32, -75, 132, -81, 28, 22, -52, 157, -52, -59, 69, -13, 127, -43, -33, 144, -55, 56, 1, -104, 157, -80, -30, 160, -156, 31, -34, -116, 54, -72, 85, -3, -63, 165, -39, 19, 25, -131, 115, -57, -98, 97, -176, 95, -23, -159, 180, -21, -38, 103, -72, 101, -7, -78, 104, -54, 90, 40, -130, 130, -9, 5, 88, -151, 125, 10, -167, 125, -50, 53, 10, -195, 91, -26, -21, 31, -162, 78, 58, -44, 101, -118, 52, 15, -214, 127, -39, -15, 88, -198, 148, 50, -78, 131, -104, 48, 95, -179, 81, 11, 24, 63, -180, 51, 41, -66, 85, -170, -34, 183, -134, 36, -29, -4, 139, -175, 29, 72, -62, 97, -150, -30, 148, -125]
4140a25J60q0L6J25k38J30R8j28J56k72J06K02k18Q6n2J3J87l20Q8P1p7J20j56
4163h8J16R1j85J64j07j07K60j84O9oj31J67j18nJ24q6R6j53m8K59j23j2P0j31
4187f8K09j38l3O7j13J47j08l7J75j29j5P1j24J73j04k1J08j23J48p4q1J64j09
4210a5O9o2j11K04j47K0Q5j48J69l4j27J33k6Nk1p8J48j07L0P5r2R6n8o9J02n9
4236a8K4M1r4J40p0m8J8m3P8l2n4O8n2Q5n7Lk8R4l4J6q3O7M1q9L1l9K3O1l6l0
4266a7j4j3R2m2K4J3k7J4l4L7j0nk1J2k7O9q9M5j3J1Jll2J7l8M1K8l6L9p9P7J6
4298C6m4On5L3LJ2lOn9L6K8J4n8P9n2J0l0O8L8n3M7o3K0k0j7P1j6j4l8K8rK1o5
4331d0K0KK4pK8Jn3P0r1j1M1N8j0j0k6qJ6J8k5k9k0N7k5QOL4j9rR5p0n0OL8n8
$$ y = [-125, 35, -45, -9, 116, -122, 8, 106, -22, 134, -138, -32, 170, -48, 38, -14, -1, 186, -134, -46, 25, -52, 68, -88, 28, 119, -66, 98, -9, -116, 144, -40, 29, 23, -108, 59, -59, -64, 60, -26, 70, -83, -131, 128, 5, -7, 63, -68, 141, 3, -30, 37, -76, 71, -37, -74, 101, -28, -43, 28, -96, 77, -27, -48, 60, -63, 85, 11, -70, 94, -15, 54, -8, -119, 85, -62, -42, 43, -105, 64, 30, -97, 36, 10, 15, -6, -84, 64, -43, -13, 62, -30, 66, 8, -61, 41, -18, 6, 47, -47, 93, 23, -25, -7, -50, 28, -4, -58, 10, -42, 43, -14, -11, -39, 55, 21, 37, -46, 21, 62, -27, 4, -35, -12, 49, 13, -17, -31, -44, 48, 6, 30, 43, 16, 30, -4, 33, 23, 18, -3, 9, -18, 51, -38, 7, -6, 5, 6, 3, -29, -12, -50, -9, 19, -17, 22, -57, 20, 36, -8, -2, -57, -24, -21, -9, -12, -6, -65, -29, -1, 13, -45, 34, -18, -8, -38, 30, 68, 15, 62, -1, 19, -1, -18, 53, 37, 23, -15, 13, 4, 25, -40, -20, -18, 6, -1, 27, 28, -25, 45, -46, -57, -16, 42, 32, 22, -4, -12, 4, 22, -3, -32, -52, 5, -20, -12, -6, 28, 9, 0, 95, 25, -25, -19, 19, -39]
4365c9kO4k7M6Pn9l1M9K6o7L1k7MJ6pK2j3n9KO4M1q8N3k9oJ3J8l4J6K7o8R5n3
4398a5P6J1n9J4J9k3rkk3ok9M5m8Q8p5N2k7J4P7r6K7jK8p2N5k0j1jk8l7J9J01
4430D4o6l1O6J8oK5q9O8l8k0K8J8qk6M0jKo4K3J4k6K1k2mL6j8K5m2P5n9M7n3N
4463a8K2K3m4j6M6L3l4%j7L8Lq3J22j02O4l3P8j17K7N7k0k8LJ2m4L8oNRj4pL3
4495C0m0O1l7l8M3j4l2NJ4M4L2n2m6J00q5%J5j0J7mj3K4m7L2K4l7N6kk2J5q4J21
4527G0m5k4L0q0R5jj06L6J7J9j0o0Q0Qn8M9o7L9R3j39L8j5%P5j84J27L9j03N6
4556b1j6k7J34j07j5K1L1J11j97O3%PN9m4kM0l0L8o0k3J21j22O8J3lL2j03J7Q7
4585G2q4N6j24%J68j31pOk5J74j95N0J46j29OL3r7J97j46l6P3m5R5o4n1R2o2Q2
$$ y = [-39, -41, 23, -4, 42, 49, -10, -41, 8, 34, -33, -2, -29, -25, -9, -16, 6, -7, -66, -64, 0, 41, -47, 6, -23, -29, -16, 2, -32, -16, 11, -57, 38, -15, 61, 72, 13, 27, 46, 23, 14, 12, -11, -17, -46, -1, -49, 39, -36, 16, -11, 3, 80, -16, 11, 10, 38, -34, 21, 1, -10, -11, -39, -76, -57, 44, -22, -53, 13, 31, 25, 50, -39, 29, -9, -29, -1, 17, 9, -17, 23, 22, 24, -40, -17, -3, -29, -8, -30, -34, 2, -16, 9, -33, 42, -17, 30, -23, -18, 4, 27, -17, -33, 13, 46, 12, 12, -5, 33, 36, -47, 75, -27, 37, 4, 82, -35, -8, 49, 29, 1, 4, 16, -28, 10, 4, 9, 18, 4, -3, 30, -10, 51, 14, -24, 19, 5, -27, -22, -8, 36, 68, 16, -30, 70, -15, -15, 0, -10, 7, 3, -10, 14, -33, -1, 23, -14, 42, 40, 18, 33, -51, 70, 25, 1, 31, -49, 46, 45, -61, -25, -8, 11, 1, -59, 21, 29, -29, 20, -47, -8, 85, -54, -16, -31, -31, 44, -140, -13, 26, -77, -21, -37, -64, 70, -37, -52, -31, 0, 111, -86, -23, -23, -16, 43, -1, -3, 37, 7, 45, -15, -38, 83, -39, 29, 42, 39, 71, -32, -15, 72, -12, 44, -80, -80, 88, -43, -50, -44, -69, 105, -90, -40, 106, -23, -17, 16, -81, 116, -30, -66, 7, -38, 57, -7, -58, 34, -28, 54]
4613E4r0J2J48j07Jk8J0J8K1o0R5j00Q3p5n5J26o2L1j3j33K04r3n2J06j08M7K8
4640Hn7N5pK1qk7J31j07m1J23j39J03J4j19Q7n7L6M6j06Q4j1o6J03j65J69L6j29
4667b3L7l2M8K8j99J49K9n3N8j08J25j0q5J0QM2N9j45P1L2n8J04j47R2N2j51O5
4694bL8j8J3q7P6J9p1J19j08K3N1q2%J9j8J12j34N8K6o4J14j35J9P0l3j7l5j5
4722f2J57j90O7K0n0J60j79M6R5j24J16q1l3J07n7K9o9K2O7mm6O8j22R5j4n6O5
4749B7n0L3j1j15J69j14J9R3j05K7L5m7Q2o4O9j7r2J11m8l4P5p0N0k2mk8L2Pj3
4778en1P3ROJ0q0J04n3n2P2p1M7L3p1K2k0L6L5q8O0k1l2L8q6M8Q3o7J3k0O3q5
4809e0M2L5l9oJ8m8N9m7M3j2j1ONk4LJj2P8m0m8L7j5M9m9j8M1nM6m8rk8K8J8M3
$$ y = [54, -36, -24, 124, 17, 18, -10, 0, 18, 39, -21, 74, -26, 57, -18, -73, 53, -9, 22, 9, -124, 80, -13, -65, 41, -67, -20, 8, -49, 6, -1, 20, 12, -15, 116, 9, -32, 91, -48, 55, 69, -50, 37, -20, 16, 62, -44, 40, 29, -37, 66, -99, 70, 106, -23, 14, -18, 30, 58, -141, 8, 37, -16, 42, -66, 59, 49, -36, -26, -18, 24, 83, -62, 9, 41, -17, 87, -60, 32, 84, -67, -2, 36, 18, 31, -56, 20, 39, -32, 87, -21, 2, 53, -29, -29, -10, -28, 84, -50, 8, 34, -30, 84, -51, -32, 38, 5, -12, -47, -62, 95, -95, -28, -8, -58, 102, -77, -31, 64, -60, 56, -25, -58, 49, -8, 21, -48, -26, 41, 37, -9, 59, -63, 32, 18, -38, 27, -23, 10, -1, -116, 53, -61, -42, 51, -54, -27, 8, -39, 43, -21, 48, 31, -61, 50, 2, -32, 43, -27, 23, 1, -3, -31, 1, 8, -5, -56, 17, 26, 32, 42, -38, 66, 13, -39, 33, -38, 9, 42, -29, -7, -27, 9, 44, -44, 16, -5, -37, 1, -85, -37, 46, -21, -8, -28, 35, -50, -8, 27, -12, -18, 0, -48, 11, -36, 7, -5, -16, -10, -5, -29, -26, -25, -37, 41, 1, -47, -10, -25, 24, -25, -43, -2, -7, 39, -9, -18, -46, -18, 0, 43]
4843D3n7J4K6m1L4m1j1O7m2L8J1n4OKJ7LNL0q1j8K0L0L1k8kO3j00L9K2k3Pn0J8
4876b2M9k3J5j5n5M2rmL0l6P2k9kk6L1J5l0QPk6mP2k1k5Rj8P0j41P8KRN8o7L1
4910D5l0m0K7n3lJ08o0L8%j2kmp8N9L0%l2Norj6P6n3K8Nm9K5%j7k5N5ONl0jN9
4946E1l2n1L%L8j7K7oNl4J7N2o8N0j8l6L2n6k8L2K5L1l3O4k6l4O0p4L6m4L2K7
4978B5l6jK1m9O4k5oM6o1Q4l9p6J44j02K8L8j16J14l8m1O9mo1O1r2N3jKj0j0O
5009a3lk0K9KN2l3p0J55j24J8Q4j61P7J7p1M4j6KJ22j54P1N0p6M3l4O6q2K8L6
5038C9r6M4N6p0N8r7J3J20r0RM9l3N6l5n0N9j10J08q7O2N9j45P7k3J5R5j23L3
5066gM5q6O0k0k7J20j06N4No0Q9j00M6O6j63J25n8m7J15j39R8J4j6M0q9K4L0m8
$$ y = [43, -14, 0, 26, -15, 19, -22, -33, 34, -8, 30, 41, -13, -7, -5, 12, 15, 20, 50, -31, -49, -29, 1, 32, 4, 2, 65, -35, 4, 26, 3, 10, -40, -22, 27, 4, 19, 4, -51, -9, -18, -22, 8, -28, 44, 15, 13, -13, 18, 33, 3, 11, 18, -8, -12, 60, 39, 14, 23, 5, 75, -66, 12, 14, 23, 81, 14, 45, 15, -25, 2, -51, -54, 54, -6, 32, 32, 20, 18, 14, -64, -5, 25, 25, -7, -2, -8, -17, -33, 43, -10, 18, 23, -26, -1, -1, -18, -43, 12, 18, 23, -7, -8, 51, 19, -32, -29, -29, 9, -8, 19, 13, 18, -16, 1, 53, -15, 35, 17, -19, 13, -43, -71, -39, -14, 17, -16, 48, 22, -12, 48, -26, 10, -34, -2, 25, -11, -12, 9, -40, 24, -1, -7, 39, -22, 62, 23, -53, 91, -11, 17, 55, -61, 53, 15, -26, 43, 39, -22, 39, -53, 0, -1, 1, -9, -19, -13, -16, -36, -7, -5, 47, 14, -56, 99, -25, -7, 77, -84, -7, 10, -61, -17, -33, -31, 91, -63, 8, 58, -18, 25, -9, 57, -25, 3, 39, -57, -13, 43, -27, 31, -66, -53, 67, -23, -14, 35, 2, 58, 23, -27, 32, -78, 30, -57, 5, 64, -81, -4, -27, -12, 83, -40, -7, 38, -48, 12, -8, -35, 85, -21, 33, 38, -22, 67, -33, 13, 79, -84, 41, -17, -64, 51, -88, 10, 24, 8, 48, -41, -17, 13, -35]
5094c5P9p6m0J38j25Q9nn0J04j07LR4j66J41p3n4J00m5L3K6q1Q3Kp2L5m8P8k0
5122Hj5O5q0P0q4jJ06q2j5N5j04J37n3r7P9om1O7q1J74q6n4O1n0Q9j04nL6l2Q5
5152D2k7j00J27Lo3K9q8J29k2p8J23j41R0K9j44O9L9J3j9j67J32P8r3O5l3l0K5
5179a2Rn5kJ2P6q1P9m7O9l7k1Q6l6k0Jl1J4M2r9O2N0p7L4m8P8L1j26K8m3O9k9
5210b4k1K0N1%J7l8m6Q4k9J0n5m0J43j04M0ll3Q6j29O9P5q1NK5j09J00l5P2J7
5239F7j09R5l0k6M5j8LM3j17M9M0L1l5l1K4k8K5L0n5Om0jN3K1m6L1j9K6Om6qk0
5271c4R1p5l1N9Np7R4l2J9k1j9N2l0jJ1LL1m4k8K3%K1L0k6ln5J6j7O0l1K1Qo9
5304d9K0L1Qj0K4p4O2Mr7N3O7l3K3m6L6J2nLL3k0qrkm6K5NOm4P0q2M7K0k2L7j5
$$ y = [-35, 44, -32, -72, 66, -59, 30, 25, -25, 79, -28, -25, 69, -97, 44, -29, -83, 17, -28, 5, 31, -50, 33, 35, -37, -2, -50, 28, 8, -7, 58, -22, 48, -36, -37, 69, -13, -28, 27, -77, 60, 7, -90, -11, -17, -58, 9, -72, 102, 16, -38, 23, -27, 62, -42, -47, -11, -43, 42, 15, -85, 42, 45, -18, 11, -77, 52, 30, -48, 75, -66, 24, 53, -91, -22, 17, 30, 11, -156, -24, 54, -39, 26, -7, -37, -12, -3, -58, -60, -48, 28, -53, 26, -21, 48, 11, -10, 76, 40, 20, 21, -10, 4, 46, -53, 9, 59, -18, 16, -32, 46, 77, -49, -21, -64, 5, -24, -45, -25, 26, 26, 43, 5, -41, 43, 14, 24, -31, -71, 72, -32, 8, 5, -28, 58, -71, -2, 73, -8, -3, 22, -87, 13, -22, 50, 67, -42, 53, 23, -3, 42, 24, 27, 70, -47, 2, 42, 73, 38, 7, 31, 3, 28, 58, 3, 9, -31, -32, 21, 42, -4, 27, 8, 34, 40, -6, -14, -34, 57, -18, -49, 10, 15, -62, 32, 0, 19, -2, -21, 31, 1, 0, 11, 14, 45, 1, -27, -4, -4, 17, 47, 21, 18, -37, -21, -38, 22, -9, 12, 20, -49, -29, 2, 10, 0, 24, -50, 12, 16, -81, -28, 39, 6, 29, -17, 19, 31, 26, 29, 62, 42, 34, 25, 23, -23, 2, 7, 13, -31, 39, -43, 4, 24, 2, 39, 24]
5339B4j8J2L3r8Q2k9pL1m3M8l9NkL4j7l7J6J0J8n1K9N3j7l6N2l8M2n2O1n8jJk2
5372a4j7R0l8k8K1m8M4l0L6K4l1j5L7k5P%k7n0M1j2L4M6k4j1k6K8l6QL0%j1k1
5404a8K7k8N4m0O9m3m3L8Pn8K6J3k0K2pK7jJ2J6o5QO0k6j4NQl4Rk9PJ9k4nO2J8
5439E2n9oK6M1q3M3J1J0j0n7N6j7%l3O6o2l5L3M5l8LM6rj9L1l5J3p3R9q0L2J2
5471Cm2M4on2Q7j33O4N5k5J6L8J0p4%J8K2j2J4l4K1J2o4M2k3L2OK7o8K7m2O3j06
5503h0R7J2m3J2k2lLj%M7pK2j05K8P2l1j9J4k0N1o1J9%L6k8kJ2L5m0k1N2q7O3
5536Em0J2M0KO6j1r4M9oMk9%N0k6m5K5n8L6J1nK9q8R7n4j9N4J0l2L0q7Q9n0rN0
5570FrL7m2k8J03n0K8J0o5P5j8m6k2J9J4J2r8P8Q4j03K3k6J1Om6J20o3l0M5m7
$$ y = [24, 6, 18, 51, -47, 35, 6, -1, 30, -13, 35, -4, 1, -1, 33, 16, -21, -5, 5, 23, -28, 1, 54, 37, 1, 53, 15, 57, 5, 66, 8, 7, 8, -14, -31, 59, 21, -7, 14, -34, 10, -20, 16, 40, 9, -6, 31, 6, 13, 13, -14, -64, -23, -35, -1, 45, 21, 10, -16, 12, -24, -16, 14, 14, 3, -18, 9, -19, 35, -5, 64, 21, -22, 16, 23, -35, -9, 4, -16, 6, -1, 26, 25, 37, 53, -12, -4, 56, 30, 16, 21, 29, -5, 4, -25, -18, 1, -23, -28, 34, 52, -7, -13, 13, 54, -29, 14, 25, 35, 25, -32, 24, 7, 7, -26, 40, -22, -57, -24, 21, -17, -14, 32, 23, 4, 35, 0, 13, -60, 39, -41, -9, 3, -39, 5, -1, -53, 34, -99, -35, 20, -5, 11, 49, 59, -15, -15, 3, 25, 13, 27, -7, 14, 26, -38, 4, -19, 13, 19, 46, -22, 5, -37, 26, -80, 17, 29, -14, -2, -24, -27, -24, -25, -25, 22, 15, 37, -68, -40, 32, 1, -18, -4, -24, 27, -34, -15, -15, 21, -7, -9, 3, 38, -2, -23, 29, -58, 5, -35, -23, 17, 19, 85, 74, -20, 29, 23, 27, -2, -2, 48, 22, -23, 2, -56, -20, -9, -14, 15, -73, 24, -30, -49, 5, 15, -17, 13, -74, 15, -35, -44, 6, -3, 34, -8, -36, 67, 17, 45, 55, -10, 65, 47, 1, -21, -2, 12, 24, -74, 4, 88, -15, 8, -18, -7, -1, -47, 73, 10, -20, 25, -22]
5600b2J9J6%Oo6N6L0r2M9m7N1L3m4K3qMJ3l5l8R0m1L4r1M9O8o0%k4J7J31j07l7
5632b3N3l9K5n0O9Om8L9p7J9L4p0K1N8n7J14j25oJ58o9o5M7l4N7p5P2jq7J31j46
5662f9L7J34j10M2k7qL3j7nL7k9J3o0m5J40r9M7o0m7J27o9N5J7n9O5k7m6Q8r9
5691d1N4k4o4J18J6o8N9k6K7o5l7O9k3RK0k9J00j05N0k7n3P0J5q4O6n5M5Oq9Q8
5721B2k2q3J06o3M9m0K1N4m2L1K5n4K0qOL4j33O3N0n1K1m0kR2k1j1l9L1M9o4P1
5752G2n0oM6o4n1J11m4mm1LJ00l9o7M2j6L3K9k0qo5L9m3N7pj0K0o1lP3Ln0M5m
5785B0N1j3m3J8k5OJ1j8R8j23K9L1pj4Rp0R3n4k0M0l5PK5m4R3r0O2r3R7oj3l7
5817a5j9L0J3j1m7R5q2R1m7M5p3L8l4P6l6L6n6N0qp2P2k3O5j02K7m0K3m4K9J0
$$ y = [-22, -3, 13, 13, 19, -47, 9, 39, -53, -4, -51, 0, 33, -11, 12, 4, 8, 21, -14, -52, 38, -3, 31, -60, -11, 57, -3, -3, -27, -10, 121, 14, -23, 30, -9, 16, -34, 35, 41, -7, 32, -45, -26, 8, -62, -41, 17, -40, 74, -51, -57, 101, 32, -33, 14, -20, 37, -38, 34, 33, -54, 77, -69, -32, 102, -8, 34, 7, -1, 32, 15, 10, 47, 18, 31, -29, -74, 66, -33, 14, -46, -93, 34, -35, 20, 37, -22, 43, 16, -30, 58, -41, 13, -11, -75, 43, 59, -9, 50, 24, 51, -14, -51, 18, -5, 4, 24, -5, 95, -10, 40, 13, -40, 30, 45, -39, 27, -28, 17, 23, -66, 22, 0, -83, 23, -40, 9, -31, -10, 44, 2, 33, 58, 4, 24, 16, 22, 56, -77, -14, 36, -15, 6, -34, -36, 56, 35, 24, -15, 16, 65, 1, 72, 22, 16, 62, -2, -53, 58, 14, 10, -31, -28, 72, 33, -34, 8, -8, 25, 54, 34, 26, -39, 0, -43, 14, 7, -3, 17, -44, -47, 26, 29, -21, 24, 20, 71, 58, 15, 33, 8, 14, 25, 7, 105, -18, 11, 42, 35, 21, 30, -40, 53, -1, -21, 19, -16, -9, 16, -28, 65, -25, 37, -56, 41, 35, 22, -15, -34, -4, 9, -2, -49, 46, -36, 55, 8, 53, -20, 18, -16, 60, 24, 60, 4, 54, 46, -26, 46, 23, 88, -14, 13, -27, -4, -48, -19, -9]
5847ik0J0lL2R0m8l5Ml8J5rL0n3N7Ko9N5l1L0J2K8l1Oj4l1J1L6k9M4J2l6J7kn0
5881a7L7j5l9k3R1o0N1o5N3M2j13Q6m3N4Kl4p5J02m2mJ2k8J2L3K2qk6m1M0j2J4
5912FL1J0j4p0N9L6n4M9k5l7jk6N0J0q0M4J7o2R4m8NJ8k5J3o5L7M5J5j6K2k8l8
5944b8K8J8j6J5o%mj1N1o6J9K5ml3J6K1lln2O6n2K1K4L4j02RM0N2q1N5n7MM3n
5978A8Pk1Nj7RJ3k8k7J3kL2l4L6k0M2l0k3QN8m1KO2m2m1J4L4ln1Kl9J16n4m7P2
6012B3m4qQ6r1J0L8n7N8j1k9N7q3oL8LM3m2j8J3K8o3Q3k1O7q1k6J3rM3K3p2O8
6044C3n1M5k0l2rP8n7Qj4KJJ5k0J1j8K0m7M1RoN3p9M0J3q8K6R7o0qn0R5K6r3R0
6078E1p3O0j6k4O9o6k6N5o8N8J1k3J5p9O6P5j11Q0o7j7P3j03M3qk9J30q7%M7r1
$$ y = [-9, -29, -19, -22, 10, 100, 52, 17, 21, -17, -2, -11, 19, -34, 23, 25, -44, 11, -20, 10, 22, 50, 19, 25, 11, -20, -9, 27, -2, 42, 54, 18, 35, 33, -17, 20, 5, -34, -57, 34, -26, 25, -40, 13, 55, -58, 28, -15, 39, 41, 7, -68, 34, -8, -12, 0, -28, -16, 17, 39, 31, 5, -36, 4, -8, 6, 37, 47, 33, -37, 22, 58, 4, 53, 28, -9, -10, -36, 14, 24, -56, -12, 5, -57, 37, -11, -6, 12, -13, 0, -65, -28, 17, 32, 16, 38, 10, -28, 0, 18, 2, 17, 11, 11, 7, -4, 47, -19, 0, 25, 21, -12, 4, 25, 22, 19, -33, 33, -19, 2, 26, 60, -42, -33, 7, 59, -22, 33, -24, -20, 23, 18, 25, 4, 9, -8, 1, 14, -14, -41, -28, -30, 2, -32, 4, -16, 26, -4, -27, -19, 39, -2, 0, 62, 20, -21, -7, 27, 24, -27, -25, -64, 52, -2, -49, 23, -21, -29, 57, -34, -24, 14, -43, 15, 4, -25, 32, -51, -57, -19, -16, 27, -15, -33, -20, 8, -55, 28, 7, 74, -7, -33, -20, -29, 14, 37, -35, 33, -18, 27, 7, -25, -34, 44, -13, -5, -19, -17, -16, -1, -21, -10, -28, -8, -55, -14, -5, -11, 42, -37, 3, 16, -72, -46, 51, -9, -17, -67, 28, 54, -39, 51, -22, 38, 22, -2, 67, 1, -25, 30, -38, 20, 31, 8, 23, -56, 10, 85, -26, 54, -13, -30, 43, -60, -17, -25, -54, 76, -11, -11, 36, -55]
6108e5P4k0pN1o8M5K2n6L9m0m5K08j63J7k5M3j1m6N0j0n3P3p2K3P1q4O4o3j7J18
6138F3Oq4J8J6%j4k2R2j72J41r4L2NO3p5qJQ7mj04J15r0P0l2k2P2l6N3n7lnL7
6170D9n9J8j4J2J9p9P4k7N2n4m4P3pn2Mk6O3K1p3J11l7l8O0p6Q2j8k8j3qkJ7K1
6202B1l2j4L6rlJ8k1lM7n7J2j7L1k8jO9k7J3j0kk4nM9k5j6k6O2m8O2k1l9K3l9
6235b4K1k0k9M1L3j0k1RPM2o0k3K3l2O6j0N3o3mK0m4RK0o3J7L0J1J3l3nO2o3O8
6268D1m0J6J5n6LM3n2P7q8MQ0m0J3K4p2N9%j7k8K3k0L3n4K1l3P3n2RN0n8K2j1
6300a5jl1N6KM9p4M6qm1Qj8M3o5J2QL2j7LnLR%%j3R8o2m6J7M4Nl5oj2K3p9N0K8
6337Hm2M8o0O5l0j2J5N2l0l1M0k2Lj6j0PMN9j2m3oM0j4j2l2L1J2lj9qJ8jL8j9
$$ y = [-55, 19, -1, -8, 43, -25, 20, 42, -14, 25, -15, -60, 148, -15, 2, -23, 20, 9, -37, 13, 3, -50, 23, -49, -26, 45, -39, 25, -38, -55, 63, 69, -15, 3, 19, 19, 5, -17, 75, -97, 44, -50, -18, -13, 50, -25, -33, -32, 55, 51, -53, 62, -28, 42, 10, -12, 60, 24, 77, 20, 17, 12, 49, -10, 8, -6, 6, 25, -54, 20, -7, 45, -9, -53, 20, 13, -39, -35, -61, 2, 23, -50, 61, 24, -14, 46, -30, 52, 34, 6, -7, -15, -17, 0, 21, -11, -25, 11, 2, -1, 17, -4, -7, 40, -17, -5, -22, 9, -19, -20, 49, 22, 35, 25, 23, -1, -6, 43, 18, 2, -24, 38, -10, 52, 31, -8, 15, -24, -3, -23, -52, -11, 22, 12, -9, 0, 7, 49, -11, -34, -11, -43, 23, 13, 66, 3, -1, 19, -25, -16, 4, -59, -42, -12, -1, 12, -21, -26, 36, -27, 41, 1, 17, 32, -24, -21, 22, -30, 47, -41, -37, 43, 3, 16, 40, -32, 27, 27, 10, -18, 5, -15, 18, -36, -15, -48, 25, -27, -18, 32, -26, -4, -15, -16, -47, 9, 11, 60, -14, 32, 24, -17, -9, -27, 16, -49, -37, -29, 3, -14, -11, -16, -13, -4, -4, -4, -17, 81, 19, -27, -10, 34, 39, 4, -2, -14, 9, -70, -20, 8, -34, 14, -46, 19, -11, -23, -8, 44, 14, -17, 23, 1, 4, -12, -22, -15, -11, 48, 36, -7, -13, 27, 13, 1, -31, 0, 12, 9, -10, -18, 0, -1, 37, 18]
6371A8m2K1Q0q3J4M4r9M8l5M4J1m3K0j5P%J8Ok9J2K0l9k4K0J0mN9j7qm1J8j3N4
6404C2J5l8K8ko2O4Qk4l7j2K2Qj3oN0n8O5l4o2RM8M9l1n6M8pJ3n3j7M1k4L2nj5
6438b4L2Jn5J0N4ok1K5J9%K5o2J7l5j3J5L1j0K3j2r7J21l2l2J7J6n4P9o6O5k3
6469HM5m7Jj5j0J0m8L0K8Kl1j2J2j3L4Nj3l5M4N2n6l2P2k4j4k4L1mk0K3M2m0m7
6502d6P8l2n2J06r8J6M3o8M5M0j12J02nk0L8j9L3o0onMnj3N7o7L2P4l0J6m7n5
6533e6J13l0k3kj3QL9q4K6L8l3R5j05K2K0n7J24q6%J1LL4o5J3M1o2n5K3P8Nl4
$$ y = [18, -24, -3, 77, -6, 8, 52, -47, 1, -34, 10, 21, -22, -2, -17, -10, -10, 8, 14, -15, -3, 17, -22, -46, -26, -16, -20, 39, 22, 14, -27, -9, -22, 32, 47, 9, 37, 35, -27, 37, 45, 21, -16, -28, -6, 2, -11, -17, 33, -25, 40, 6, -56, -47, 1, 50, 19, -37, 11, 4, 17, -36, -53, -12, -36, -4, -9, -24, 8, 9, -46, -36, 18, 12, -9, 16, 35, 35, 60, -2, 15, -20, -33, -18, 13, 3, 26, 14, -83, 38, 6, -26, -9, 7, -47, 32, -34, 31, 8, 53, 6, 7, -8, -18, -8, -56, -26, 2, 4, -27, -39, -27, -40, -6, -1, -14, -49, -5, 47, -9, -41, 31, 7, -7, -31, 0, -4, -24, -1, 41, 1, -46, 32, 0, -52, 54, -44, -28, 15, -53, -8, 32, -80, 22, 17, -3, 35, 16, 49, -11, -17, -22, -18, -23, -36, 21, -46, -14, 60, 30, 46, -1, -56, 57, 27, 4, 2, -11, -3, 36, -48, -22, 16, -17, 78, -27, -5, 15, -42, 82, -4, -4, 7, 10, 44, -21, -8, 33, -29, -84, -61, 17, 22, -12]
$$ [...]
8191a7
##END NTUPLES=NMR FID
##END=
