##TITLE=1H_AEBC0102
 CDCl3,8 sc, 
 1.03.2021
##JCAMPDX= 6.0         $$ Bruker NMR JCAMP-DX V2.0
##DATA TYPE= NMR FID
##DATA CLASS= NTUPLES
##ORIGIN= UXNMR, Bruker Analytische Messtechnik GmbH
##OWNER= root
$$ XWIN-NMR		Version 3.5
$$ Mon Mar  1 11:38:09 2021 Russian Standard Time (UT+4h)  she@DPX200
##.OBSERVE FREQUENCY= 200.1315066352
##.OBSERVE NUCLEUS= ^1H
##.DELAY= (6, 6)
##.ACQUISITION MODE= SIMULTANEOUS
##.ACQUISITION SCHEME= undefined
##.AVERAGES= 8
##.DIGITISER RES= 18
##SPECTROMETER/DATA SYSTEM= spect
##.PULSE SEQUENCE= zg30
##.SOLVENT NAME= CDCl3
##.SHIFT REFERENCE= (INTERNAL, CDCl3, 0, 15.7039)
##AUDIT TRAIL= $$ (NUMBER, WHEN, WHO, WHERE, WHAT)
$$ ##TITLE= Audit trail, XWIN-NMR		Version 3.5
$$ ##JCAMPDX= 5.01
$$ ##ORIGIN= Bruker BioSpin GmbH
$$ ##OWNER= she
$$ F:/spectra/data/she/nmr/H-F/1/audita.txt
$$ ##AUDIT TRAIL=  $$ (NUMBER, WHEN, WHO, WHERE, WHAT)
(   1,<2021-03-01 11:36:47.89 +0400>,<she>,<DPX200>,
      <created by zg, POWCHK disabled, PULCHK disabled
       configuration hash MD5:
       00 E9 B6 7A A2 85 ED C7 34 08 36 98 17 FE 4E 26
       data hash MD5: 16K
       43 F1 11 CA 57 DA 26 9E 2B BB 71 14 79 16 F2 8F>)
$$ ##END=
$$ 
$$ hash MD5
$$ 8C A9 A8 C0 FA E9 BD D4 0E BA 6D F5 F7 69 4F FC
##$RELAX= 
##$RELAX= 
##$RELAX= 
##$RELAX= 
##$RELAX= 
##$RELAX= 
$$ Bruker specific parameters
$$ --------------------------
##$DU= <F:/spectra>
##$EXPNO= 1
##$NAME= <H-F>
##$PROCNO= 1
##$TYPE= <nmr>
##$USER= <she>
##$AMP= (0..31)
100 100 100 100 100 100 100 100 100 100 100 100 100 100 100 100 100 100 
100 100 100 100 100 100 100 100 100 100 100 100 100 100 
##$AQSEQ= 0
##$AQ_mod= 1
##$AUNM= <au_zg>
##$AUTOPOS= <>
##$BF1= 200.13
##$BF2= 200.13
##$BF3= 200.13
##$BF4= 200.13
##$BF5= 200.13
##$BF6= 200.13
##$BF7= 200.13
##$BF8= 200.13
##$BYTORDA= 1
##$CFDGTYP= 0
##$CFRGTYP= 5
##$CHEMSTR= <none>
##$CNST= (0..31)
1 1 145 1 1 1 1 1 1 1 1 1 1 1 1 1 1 1 1 1 1 1 1 1 1 1 1 1 1 1 1 1 
##$CPDPRG= <>
##$CPDPRG1= <>
##$CPDPRG2= <>
##$CPDPRG3= <>
##$CPDPRG4= <mlev>
##$CPDPRG5= <mlev>
##$CPDPRG6= <mlev>
##$CPDPRG7= <mlev>
##$CPDPRG8= <mlev>
##$CPDPRGB= <>
##$CPDPRGT= <>
##$D= (0..31)
0 1.2 0 0 0 0 0 0 0 0.06 0 0.03 0 0 0 0 0.0002 0 0 0 0 0 0 0 0 0 0 0 0 
0 0 0 
##$DATE= 1614584207
##$DBL= (0..7)
120 120 120 120 120 120 120 120 
##$DBP= (0..7)
150 150 150 150 150 150 150 150 
##$DBP07= 0
##$DBPNAM0= <>
##$DBPNAM1= <>
##$DBPNAM2= <>
##$DBPNAM3= <>
##$DBPNAM4= <>
##$DBPNAM5= <>
##$DBPNAM6= <>
##$DBPNAM7= <>
##$DBPOAL= (0..7)
0.5 0.5 0.5 0.5 0.5 0.5 0.5 0.5 
##$DBPOFFS= (0..7)
0 0 0 0 0 0 0 0 
##$DE= 6
##$DECBNUC= <off>
##$DECIM= 32
##$DECNUC= <off>
##$DECSTAT= 4
##$DIGMOD= 1
##$DIGTYP= 9
##$DL= (0..7)
0 120 120 120 120 120 120 120 
##$DP= (0..7)
150 150 150 150 150 150 150 150 
##$DP07= 0
##$DPNAME0= <>
##$DPNAME1= <>
##$DPNAME2= <>
##$DPNAME3= <>
##$DPNAME4= <>
##$DPNAME5= <>
##$DPNAME6= <>
##$DPNAME7= <>
##$DPOAL= (0..7)
0.5 0.5 0.5 0.5 0.5 0.5 0.5 0.5 
##$DPOFFS= (0..7)
0 0 0 0 0 0 0 0 
##$DQDMODE= 0
##$DR= 18
##$DS= 0
##$DSLIST= <SSSSSSSSSSSSSSS>
$$ [...]
##$SUBNAM2= <"">
##$SUBNAM3= <"">
##$SUBNAM4= <"">
##$SUBNAM5= <"">
##$SUBNAM6= <"">
##$SUBNAM7= <"">
##$SUBNAM8= <"">
##$SUBNAM9= <"">
##$SW= 16.9725356469052
##$SWIBOX= (0..15)
0 0 2 0 0 0 0 0 0 0 0 0 0 0 0 0 
##$SW_h= 3396.73913043478
##$TD= 16384
##$TD0= 1
##$TE= 0
##$TE2= 300
##$TE3= 300
##$TEG= 300
##$TL= (0..7)
0 120 120 120 120 120 120 120 
##$TP= (0..7)
150 150 150 150 150 150 150 150 
##$TP07= 0
##$TPNAME0= <>
##$TPNAME1= <>
##$TPNAME2= <>
##$TPNAME3= <>
##$TPNAME4= <>
##$TPNAME5= <>
##$TPNAME6= <>
##$TPNAME7= <>
##$TPOAL= (0..7)
0.5 0.5 0.5 0.5 0.5 0.5 0.5 0.5 
##$TPOFFS= (0..7)
0 0 0 0 0 0 0 0 
##$TUNHIN= 0
##$TUNHOUT= 0
##$TUNXOUT= 0
##$USERA1= <user>
##$USERA2= <user>
##$USERA3= <user>
##$USERA4= <user>
##$USERA5= <user>
##$V9= 5
##$VALIST= <valist>
##$VCLIST= <CCCCCCCCCCCCCCC>
##$VD= 0
##$VDLIST= <DDDDDDDDDDDDDDD>
##$VPLIST= <PPPPPPPPPPPPPPP>
##$VTLIST= <TTTTTTTTTTTTTTT>
##$WBST= 1024
##$WBSW= 4
##$XGAIN= (0..3)
0 0 0 0 
##$XL= 0
##$YL= 0
##$YMAX_a= 246767
##$YMIN_a= -260172
##$ZGOPTNS= <>
##$ZL1= 120
##$ZL2= 120
##$ZL3= 120
##$ZL4= 120
##$ABSF1= 10
##$ABSF2= 0
##$ABSG= 5
##$ABSL= 3
##$ALPHA= 0
##$AQORDER= 0
##$ASSFAC= 0
##$ASSFACI= 0
##$ASSFACX= 0
##$ASSWID= 0
##$AUNMP= <proc_1d>
##$AZFE= 0.1
##$AZFW= 0.1
##$BCFW= 1
##$BC_mod= 2
##$BYTORDP= 1
##$COROFFS= 0
##$CY= 11.3945322036743
##$DATMOD= 1
##$DC= 2
##$DFILT= <>
##$DTYPP= 0
##$F1P= 15.9154993809931
##$F2P= -4.1035820241983
##$FCOR= 0.5
##$FTSIZE= 0
##$FT_mod= 4
##$GAMMA= 1
##$GB= 0.15
##$INTBC= 1
##$INTSCL= 1
##$ISEN= 128
##$LB= 0.24
##$LEV0= 0
##$LPBIN= 0
##$MAXI= 10000
##$MC2= 0
##$MEAN= 0
##$ME_mod= 0
##$MI= 1.114404
##$NCOEF= 0
##$NC_proc= 0
##$NLEV= 6
##$NOISF1= 3.799351
##$NOISF2= 2.8
##$NSP= 1
##$NTH_PI= 0
##$NZP= 0
##$OFFSET= 15.70392
##$PC= 1
##$PHC0= -10919.85
##$PHC1= 12.00094
##$PH_mod= 1
##$PKNL= yes
##$PPARMOD= 0
##$PSCAL= 0
##$PSIGN= 0
##$REVERSE= no
##$SF= 200.130013532006
##$SI= 16384
##$SIGF1= 3
##$SIGF2= 2
##$SINO= 400
##$SIOLD= 16384
##$SREGLST= <1H.CDCl3>
##$SSB= 0
##$STSI= 0
##$STSR= 0
##$SW_p= 3612.71676300578
##$SYMM= 0
##$S_DEV= 0
##$TDeff= 0
##$TDoff= 0
##$TI= <>
##$TILT= no
##$TM1= 0
##$TM2= 0
##$TOPLEV= 0
##$USERP1= <user>
##$USERP2= <user>
##$USERP3= <user>
##$USERP4= <user>
##$USERP5= <user>
##$WDW= 1
##$XDIM= 8192
##$YMAX_p= 0
##$YMIN_p= 0
$$ End of Bruker specific parameters
$$ ---------------------------------
##NTUPLES= NMR FID
##VAR_NAME=  TIME,          FID/REAL,        FID/IMAG
##SYMBOL=    X,             R,               I
##VAR_TYPE=  INDEPENDENT,   DEPENDENT,       DEPENDENT
##VAR_FORM=  AFFN,          ASDF,            ASDF
##VAR_DIM=   8192,          8192,            8192
##UNITS=     SECONDS,       ARBITRARY UNITS, ARBITRARY UNITS
##FACTOR=    0.0002944,     1,               1
##FIRST=     0,             0,               0
##LAST=      2.4114304,     0,               0
##MIN=       0,             -260172,         0
##MAX=       2.4114304,     246767,          0
$$ Real data points
##PAGE= N=1
##DATA TABLE= (X++(R..R)), XYDATA
$$ [...]
1819a504J255K009k917N86J922j934mJ827j535r20K476r10j874K614o60k078L155
1836A508j015k510L233o25j957K395q05j508K151j80j683R27Q98j413M03J418
1852A237k279L63K615k841J06K462k936R44K290l388P55K186k187L83J162j458
1868e86j58J830n07k147J968O15k661K557R6l587L730M14l708K926l9k438K722
1885A027m3k524J361J323j350n84J832j474r83L648k359k224M367k021j647L828
1901B177k939j129L999j925j426J868n66o63J174M07k319O93K776k953j08K752
1917A818l453J306L060m628J009K780k888J090J008k336Q13J597p25j454Q44J149
1933I90j949J616M00l516L169J143l707K508j53k322L401q71k330J858J02k83
$$ plain form
1819 -1504 -249 1760 -1157 -571 1351 -583 -587 1240 -295 -1215 1261 351 -1523 1091 431 -1647 1508
1836 1508 493 -2017 1216 591 -1366 1029 224 -1284 867 687 -996 -69 829 -584 -181 1237
1852 1237 -1042 -679 1936 -905 -799 1663 -1273 -329 1961 -1427 -672 1514 -673 -290 872 -586
1868 -586 -744 1086 579 -1568 400 1015 -1646 911 1007 -2580 1150 1564 -2144 782 743 -1695 1027
1885 1027 984 -1540 -179 1144 -206 -790 1042 -432 -1415 2233 -126 -2350 2017 -4 -1651 2177
1901 2177 -762 -1891 2108 183 -1243 625 59 -604 570 977 -1342 -649 2127 -826 -934 1818
1917 1818 -1635 -329 2731 -1897 -888 1892 -996 94 1102 -1234 -421 1176 451 -1003 -159 990
1933 990 -959 657 1057 -2459 710 1853 -1854 654 501 -1821 1580 709 -1621 237 339 56
1949E6J69k94l92r0J837j054j972K661q16j042K825k929m59L569k463k46J594
1966I54k145J194J361j762l03N72P52o42j42P04j928J633J778l712J340J714k863
1983a495K455K69l391K608P79j969R13r1n66N47Q94r58j530K350J38k376K381
2000I58r89j957M115j694k662L258j101q36K346j630j112J762N05j338k72J405
2016G58j322O6K349k893m40L545k614k62K403k871O78K398k319m08J432l93l96
2033b89O98j06j543J438J320k764R52J482k612J912Q29l109J918J045j967R63
2049A67K07j115Q94N92p58q19J281j9j169J507p62j286K511q58j593K098r48o34
2067g04J871j338o84J379k55n00L12M5o12N39Q53j585J66J470j510L90J190k054
$$ plain form
1949 56 225 -69 -461 -551 1286 232 -1740 921 105 -937 1888 -1041 -1500 2069 -394 -640 954
1966 954 -1191 3 1364 -398 -701 -129 623 -19 -161 543 -1385 248 2026 -1686 -346 1368 -1495
1983 -1495 960 1229 -2162 446 1225 -744 169 78 -488 59 953 -5 -1535 815 953 -1423 958
2000 958 -31 -1988 2127 433 -2229 1029 -72 -908 1438 -192 -1304 458 963 -375 -647 758
2016 758 -564 -498 1851 -1042 -1482 2063 -551 -813 1590 -1281 -603 1795 -524 -932 500 107 -289
2033 -289 409 303 -1240 198 1518 -1246 -294 1188 -1424 488 1317 -1792 126 1171 -796 167
2049 167 374 -741 153 745 -13 -832 449 430 -739 768 6 -1280 1231 373 -1220 878 -70 -704
2067 -704 1167 -171 -855 524 269 -231 81 126 -486 53 906 -679 -513 957 -553 -163 1027 -1027
2085a027Q81J252j875N58Q02j209O73O04j095q2J057l55p77R37j63j094J706l69
2103D24j667J862j42j541J762l94j345J526J10j391Q48N69j243N35R04j443Q9
2120e37J610j547j63J754j484m16J965j405p02J832q50q50J514n67j030J336J29
2137E89j452J061N33j602R28Q17j740P25J135j678M53J127j476J94J231j247j61
2154e63J377r33o20J452p01p59J305k88j178J407k31j068J135Q5j080Q30L78j158
2172f10O11M94r74M39O53r74J01Q29r40J35P99q08j15R33p26k73R22n87l93R59
2192D75m79m42Q44l12o04Q90k59n96Q31j15p13P46K3q03P00K13r23O42L66r67
2212d83N27N14j065M04P05r97J76P72q72k0R49p95l01J151p01n52J098m28p29
$$ plain form
2085 -1027 -146 1106 -769 -211 591 -618 55 659 -436 -518 539 184 -593 344 181 -913 793 424
2103 424 -1243 619 477 -1064 698 304 -1041 485 595 -796 52 621 -622 -87 817 -626 -537
2120 -537 1073 -474 -637 1117 -367 -783 1182 -223 -925 907 57 -793 721 154 -876 460 589
2137 589 -863 198 731 -871 57 874 -866 -141 994 -684 -231 896 -580 -386 845 -402 -563
2154 -563 814 -119 -739 713 12 -747 558 270 -908 499 268 -800 335 420 -660 170 548 -610
2172 -610 1 495 -479 -40 613 -361 -260 569 -371 -236 563 -245 -360 573 -153 -426 496 -91 -484 475
2192 475 -4 -446 398 86 -518 372 113 -483 348 233 -480 266 289 -514 186 399 -524 118 484 -483
2212 -483 44 558 -507 -103 602 -395 -219 553 -319 -339 610 -185 -486 665 -36 -588 510 82 -647
2231f47J109k40q83J000l9j017R01K32j057O77N31j127M29Q09j208K87R25j053
2249c71m3J158r77k47J133p84m37J089m59o19R51j62q31R24O8r76P64L18j089
2268e90O36M85j110N99N47r68L04O03p89O4O78n49k22O93l38m61P68k25o05Q36
2288C56j88o74Q72k22m84N32j02m07M87O7n51L11K63m15O2L53n01R3N28n95k1
2309b36O28o79J87N02p55K24L74l66K63k20J57l03K38m1m53L75J41m90P24j5p99
2330e44Q07J0p33O15O1n99P10j64n14L79K45m03Q1L06l84j14O91n08l93R24m87
2351a4l71R34o90k66R27m80m14O48j83l30M61m7m90K54N45p27K7O62q38K95P83
2372F86j091J37P92o76J8M61n59K3M90j59m46K90K34m74M08J66q67N95M41r42
$$ plain form
2231 -647 462 222 -661 339 300 -717 184 416 -641 36 567 -560 -131 678 -530 -243 682 -371
2249 -371 -414 744 -233 -480 653 -131 -568 521 62 -557 394 232 -599 325 393 -583 181 499 -590
2268 -590 46 531 -579 20 567 -401 -97 506 -283 -219 459 -90 -312 381 43 -418 350 125 -480 356
2288 356 168 -506 366 144 -340 192 90 -317 170 237 -314 -3 260 -155 -93 260 -241 -148 380 -215 -236
2309 -236 392 -287 -100 402 -353 -129 245 -121 142 -78 79 -224 14 -27 -480 -105 36 -454 270 255 -544
2330 -544 263 273 -460 155 216 -383 327 163 -351 28 273 -130 -49 257 -127 -241 450 -58 -451 473 -14
2351 -14 -385 549 -141 -407 520 40 -374 274 91 -239 222 175 -315 -61 484 -243 -216 446 -392 -97 686
2372 686 -405 -268 524 -152 -134 327 -232 -209 281 122 -324 -34 200 -274 134 300 -567 28 469 -473
2392d73N01J88o69O63O4o66K93K94j90p6Q5q7j43M85j26o49O33L6m54O44l85l86
2414d18P84k91k82L57l19Q5L36j65j71o2L46r6k16K91l36J3O51p00k7N14m95L00
2436I9K12o57L43K34l00J03j15J0J07P3K0m23K73K99m94L47M2o19O89N5p33N32
2458I7k7k51M81k04l62K17K47j42j71J69m2k93P02m12n18Q71k99l99O88n09j48
2479c05O74l13k76K72l1o2R2Q8l67L5N77n15j21O05n84J70N62q26J64N49m53J
2501f4K55k61J0K66n2l92J90L47m66J61K92o87M78L81q08K49L66n60M10R5m44
2522b34J33K45j11j60J67K8k71M14n5n52M69O6m34M93j73l44N60p0l70L36j46
2543ij23K24k7j91N5K85k55r8L53l48l7N26n20j06N24l91O3L77m71M2L35k36j43
$$ plain form
2392 -473 28 216 -453 210 274 -392 -99 195 5 -71 14 -73 -216 269 143 -506 127 163 -291 353 -32 -418
2414 -418 366 75 -207 150 -169 -84 252 87 -84 -146 200 104 -112 179 -157 -144 507 -193 -220 294 -201 99
2436 99 311 -346 -3 231 -69 34 -81 -71 36 109 129 -294 -21 278 -216 131 173 -446 243 298 -435 97
2458 97 70 -181 300 96 -266 -49 198 56 -115 54 12 -281 421 9 -509 362 63 -336 352 -157 -305
2479 -305 369 56 -220 52 21 -41 51 139 -228 -193 384 -131 -252 353 -231 -61 501 -325 -161 388 -65 -64
2501 -64 191 -70 -60 206 154 -238 -48 299 -167 -6 286 -401 77 458 -350 -101 265 -295 115 210 -234
2522 -234 -101 144 33 -127 40 68 -203 211 156 -396 73 139 -295 198 25 -319 241 171 -199 137 -9
2543 -9 -132 92 65 -126 -71 214 -41 -139 214 -134 -171 355 -165 -271 253 -138 -75 302 -169 -127 208 -28 -171
2566a71J83O5j88K26M9m02K62K53m82K46K17n60L73K22o06L17K61m69J99K38l97
2587a64k9M52k62k14M80k51l62O28j84m44N92j61m56N96j09n13N69N1m90L34J47
2608B10m14J47K81m39J15M68n22p3O22n06j49O36n23j46N68k26k95M53j26l55
2628b74M39o5m49M50J03n32L47K64n82L22K69n89K86K83m31J46L30m56N4L48l57
2649i4m6M36l70j10M51k10k71M43j19l32M18j28l48N06q0l99M02Q3n09L51J48
2670B22m87K79K55m80J26L80n20J46L93m55j3M81o53J02N46m89qN54l35n33R86
2691D97m10m57N63m5n92O08J4n12L98J51n72M08K73o85L33L40o57K81M90o32J4
2712a92N39n10p1N79l88k91O84l33l79P18k54m94O18n8n42N61P4n50L95J82o46
$$ plain form
2566 -171 12 77 -111 115 164 -238 24 277 -205 41 258 -302 71 293 -313 4 265 -204 -5 233 -164
2587 -164 -193 259 -3 -217 263 12 -350 278 94 -350 242 81 -375 221 112 -401 168 219 -271 63 210
2608 210 -204 -57 224 -215 -100 368 -154 -227 395 -111 -260 376 -147 -293 275 49 -246 207 81 -274
2628 -274 165 100 -349 101 204 -328 19 283 -299 23 292 -297 -11 272 -159 -13 317 -139 -85 263 -94
2649 -94 -140 296 -74 -184 267 57 -214 229 110 -222 196 68 -280 226 146 -253 149 232 -277 74 222
2670 222 -265 14 269 -211 -85 295 -225 -79 314 -141 -154 327 -326 -224 322 -167 -175 379 44 -489 497
2691 497 87 -370 193 148 -444 164 178 -334 64 215 -357 51 324 -361 -28 312 -345 -64 426 -206 -192
2712 -192 347 -163 -234 345 -43 -334 350 17 -362 356 102 -392 226 168 -374 187 261 -289 106 288 -358
2733c58L23L76n88J45M68n87J24N47o52L9M76m63k8M73l49j83N25l01k78M89j33
2754F5l39M59r4m41N57M5o20M94O6o05N41J33o37M01J91m35J74K34m07R7M25m39
2776a35j03N52l23k37O05m40k22P24m72k56O24l14k78N71k87l31M72M8m25K34
2796GL02o26L59L73q38K87O11q55L83M04q37M39M64o50Q8L57m07J5M26l25l91
2817d14O93kp38P22o2p57R44j29q82Q50M9o93O24n8n13M07K81m70j15N13l52j69
2839b71P24o17l29J037o37l06Q58o70q8Q88p34j91N21j12j54J95q7l44L27M45
2859D55p75J13O51q26M48L63j001N43N19q12L40J27m03M11J22l48j56L37J00m09
2879b01L65j25m76R05k34q22Q40j84m32Q97o36l50Q14k23k16J60j26q8J79K99
$$ plain form
2733 -358 -35 341 -247 -102 366 -221 -97 450 -202 -163 313 -150 -178 295 -54 -237 288 -13 -291 198 65
2754 65 -274 185 91 -350 207 252 -368 126 192 -413 128 261 -376 25 216 -219 -45 189 -218 -121 304 -135
2776 -135 -238 314 -9 -246 359 -81 -303 421 -51 -307 317 3 -275 296 9 -322 150 198 -227 7
2796 7 309 -317 42 415 -423 -136 475 -380 3 407 -430 9 473 -177 -89 268 -139 -124 302 -23 -414
2817 -414 279 277 -461 261 199 -558 386 257 -625 225 274 -419 205 147 -366 41 322 -148 -263 250 -102 -271
2839 -271 453 -164 -493 544 -93 -399 459 -211 -299 589 -145 -336 185 73 -81 114 27 -317 10 455
2859 455 -320 -207 444 -382 66 429 -572 -29 490 -322 18 145 -258 153 275 -73 -229 108 208 -201
2879 -201 164 39 -437 468 234 -588 252 68 -364 533 -103 -453 361 138 -78 82 -44 -132 47 346
2899C46n74m4P26n57r3O87r55K63R59j117R6N89o06L48L40o97K4N14j4n02K39
2920b8K38n83O16K16j215Q15M18r89P54l7q61J026J4p38K76K08k08Q9K23l66l11
2941d43R09l02p55R72l50n10J146p47n30J076l79l26N13l59j75N24Nn10K6O19
2961D04n09K3N49r43J90R58j058K29O78r22M48M36n83k56N03o4j57R2j6k10L34
2982A26K02o72K15O87j147P87j22p93R67j01o53N74j28r3L48j11k61m7M28k40
3002c4j96M61l87j04Q64q20k13R22o08j20O73q08K15O85n05k59P12k65l29L28
3022B12k1o29M76M11r10N10L24q73O70L05r70N23L71p00L32K60n89J30N45l86
3042il03N65j75m99Q14l50o44J055l09o41Q54l13n02P89j15o44N12J98n63K64
$$ plain form
2899 346 -228 -272 454 -103 -196 491 -464 -201 758 -359 -263 326 -280 68 408 -289 -265 249 235 -267 -28
2920 -28 210 -373 243 459 -756 59 477 -512 242 205 -656 370 384 -354 -78 130 -78 11 234 -132 -443
2941 -443 466 164 -591 381 31 -479 667 -80 -610 466 87 -239 274 -85 -260 264 269 -241 -215 404
2961 404 -105 -82 467 -476 -286 672 -386 -157 521 -401 47 483 -100 -356 147 83 -74 18 2 -208 126
2982 126 328 -344 -129 558 -589 198 76 -717 250 149 -504 70 -58 -151 197 86 -175 -222 206 -34
3002 -34 -230 231 -156 -260 604 -216 -429 493 -115 -235 438 -370 -155 530 25 -234 478 213 -116 212
3022 212 191 -438 38 449 -461 49 373 -500 170 475 -495 28 399 -301 31 291 -298 -168 377 -9
3042 -9 -312 253 78 -421 393 43 -601 454 145 -496 358 45 -457 332 217 -427 85 283 -280 -16
3062a6L35o01J13O62p57o0P96o89LO34o66m7O98n33j66N30k95k44N18j02m60M74
3084A27J25n64L83J92o57N06K60p19L90J99n88M30K09n38K32L59n12P3L57l66
3104a02o5M95n01q7O37m17l20N91J11o65O51j76l77M15j65l85N98j64l97M46Q0
3125B03n57M08K32o44M28K80o64K54L91o15J62N22o86J40N41n36o8N97n34j40
3145b86O64l57l73O69k69m95P84k07o27O85m7n95O06J61p13M90K31o89L89L54
3165C75o47K03N07o75L8O28n80r2O57n11k16P21m39l17O47j72m90O36j04n76O09
3186B02J2n62M77J56o36L96L07o58K64L52n67K02M02o21J50M19m45K6M39m32j01
3207b18N21l62k16N51k03l26N10j86m01N38k01l60N37j03l96M62l9l50L29J34
$$ plain form
3062 -16 319 -282 -169 493 -264 -324 472 -217 -214 420 -246 -293 405 -128 -294 236 -59 -303 215 113 -347 127
3084 127 252 -312 71 263 -394 112 372 -347 43 242 -346 84 293 -245 -13 346 -166 -93 264 -102
3104 -102 -167 328 -173 -260 377 -40 -360 231 342 -323 328 152 -225 190 25 -360 238 74 -323 123 203
3125 203 -354 54 286 -358 70 350 -314 -60 331 -284 -122 400 -286 -146 395 -141 -209 388 -146 -286
3145 -286 378 21 -352 317 48 -447 337 130 -497 188 141 -454 152 313 -400 90 321 -368 21 375
3165 375 -272 -69 438 -237 -199 429 -151 -243 414 -97 -313 408 -31 -348 299 127 -363 273 169 -407 202
3186 202 214 -348 129 285 -351 45 352 -306 -42 310 -257 -55 347 -274 -124 295 -150 -124 315 -117 -218
3207 -218 303 -59 -275 276 73 -253 257 71 -330 208 7 -353 184 81 -315 147 108 -242 87 221
3227B21l68J17K92m55J40L47n16J61M51o29N9N06n20R1M10m70K4M35l01k41N02
3248B56k17l43N69j69m53O19m6o37O76j02n39O58n1n74M30J71n19K53K89n02O5
3269a66O04n52j53P07n61j86P28n37k52P73m94k31O51l84j94M86j29m33M17J71
3289B65n45K52L80p60L75N58q71K25N20p16L20L99p01K17L58l36o4K72j81k16
3309b49M23l4n34N34J37o23O49j47o23Q22k08n42N50j59j75M05j24l00J61K59
3329B22j99j63L28l12j5N67o51o0O56n21J08L71o69K26M56m37J6J50j39L2J68
3350A34o5l46K64L86p13L31K33o72P48L8r00P16jm37N50k12l73L59J98k36k45
3371b43L85j02k43N75m91l83J008m74l97Q35o93PP11n66k33L97l8j15Q9Q4l63
$$ plain form
3227 221 -147 -30 262 -193 -53 294 -222 -61 390 -239 -180 326 -194 -103 307 -163 -139 296 -5 -246 256
3248 256 39 -304 265 96 -357 262 216 -421 255 153 -386 272 221 -353 77 248 -271 -18 271 -231 -166
3269 -166 438 -114 -267 440 -121 -307 421 -116 -368 405 -89 -320 331 -53 -247 239 110 -323 94 265
3289 265 -280 -28 352 -408 -33 525 -346 -121 399 -317 3 402 -299 -82 276 -60 -124 148 -33 -249
3309 -249 174 140 -394 140 277 -346 303 156 -467 355 147 -395 155 -4 -179 226 102 -198 -37 222
3329 222 23 -140 188 -124 -139 428 -223 -283 373 -148 -40 331 -338 -112 344 -93 -77 73 -66 -34 134
3350 134 69 -277 -13 373 -340 -9 224 -448 300 338 -562 154 153 -284 266 54 -319 40 238 2 -243
3371 -243 142 40 -203 372 -119 -502 506 32 -365 470 -223 -216 495 -71 -304 93 55 -60 29 113 -250
3392b50K11N55p78j4P26p40K79N22r86L38O01p43K85J84m36K36K38k22l12L82
3412G6K09n06L30Q8o54P01J53r24P08K9n31O62l04l51M52j9j59l7O7rp2L35k94
3435e0l25P17l18k74N84o07L0O82o28j0L94l36K14O2k32l6K37O0l03oK94l84K98
3458F3K57p15M66K66o23M23O1n54N07Rl62J78J08j87K18k3k78%M65j78m25N87
3480B63k55k76O72n09k89P47l59j79L85k45j24L32Jm17J67L28l93N3L71n37J64
3501a00N71p12Q5M93n23R0M13n81R9M03j94k00K67l4l52M71M3o42M98J44n67M22
3523I4P4n53N11J38n16K61J35k66J08J75k38k6L52k25k43L95k00j91M70k82j87
3544b14M64k30j51L14j37k73L66q3k49J98J38k81J35J52l56J81K06l56J40K17
$$ plain form
3392 -250 -39 516 -262 -276 450 -290 -11 511 -475 -137 464 -279 6 190 -246 -10 228 6 -306 76
3412 76 285 -221 109 197 -457 244 397 -527 181 210 -321 341 37 -314 138 119 -40 -77 -10 -19 -91 244 -50
3435 -50 -375 342 24 -250 334 -273 -243 439 -189 -199 195 -141 73 135 -97 -133 104 164 -139 -145 149 -235 63
3458 63 320 -395 71 337 -286 137 198 -356 151 160 -202 -24 84 -103 115 92 -186 -186 279 101 -324 263
3480 263 8 -268 404 -105 -394 353 -6 -185 200 -45 -169 163 164 -253 -86 242 -151 -98 273 -264 -100
3501 -100 471 -241 -156 337 -186 -96 317 -264 -165 238 44 -156 111 77 -275 196 239 -403 95 239 -328 94
3523 94 168 -385 126 264 -252 9 144 -122 -14 161 -77 -103 249 24 -219 176 -24 -215 255 -27 -214
3544 -214 250 20 -131 183 46 -227 139 56 -193 5 143 -138 -3 149 -207 -26 180 -176 -36 181
3564A81l48J89J68l57J53J78l20J09J81k34j9K75k01o3K66k08j27M00k31k33M34
3585A93j31l21M21r8l51M02n5l03L06Q1l14K12J44m03J75K23l04P3K72l99O3L50
3607B36l28n1M47l60j95M50j85j55L30j37k41L45k5l73L49P0l79L11J23m45K74
3628F1K22n14K05K48l76J10L10l38q9L49k23j26L72k10k14L98j52k03L33r9k77
3649b13L04J6k93K65O1k57J58J27k89R6J07j80M5J99k49P3K00k05l7K23k43j6
3671a08K74k36lJ44j25j5J54q1j06K07q6j53K18l2j83K01n5j58K16J2k46K03L0
3694G2k04K32Ok15J21J16k01J6J79k04m8K77j74j07L18k62qK49k04j15L09j41
3716A2j67K40p0j83J96N5k58K06R6l13K21Q8l53K26K01k97P8J90l19J26K14k40
$$ plain form
3564 181 -167 22 190 -167 -14 164 -156 -47 134 -100 -119 156 -45 -108 158 -50 -177 223 -8 -241 193
3585 193 62 -259 162 64 -287 115 60 -243 63 144 -170 42 186 -217 -42 181 -123 -50 222 -177 -114 236
3607 236 -92 -143 304 -56 -251 199 14 -141 189 52 -189 156 131 -242 107 177 -202 109 232 -213 61
3628 61 283 -231 -26 222 -154 -44 266 -72 -161 188 -35 -161 211 1 -213 185 33 -170 163 64 -213
3649 -213 91 107 -186 79 140 -117 41 168 -121 -25 82 -98 -53 146 -103 -30 170 -35 -72 151 -92 -108
3671 -108 166 -70 -73 71 -54 -69 85 4 -102 105 19 -134 84 52 -131 70 15 -143 73 85 -161 42 72
3694 72 -132 100 106 -109 12 128 -73 -57 122 -82 -130 147 -27 -134 184 -78 -86 163 -41 -156 153 12
3716 12 -155 85 15 -168 28 83 -175 31 127 -186 35 123 -230 -4 197 -100 -22 168 -151 -25 189 -51
3738e1j19L40j58j29K39j72j37L23l9l43L21jk97L37l1k67K07J10k17N4J04j86
3760a12N0J40j43r4L27j34k26M04k30j11L10k05r4J87k8q4J16o2q6R0J02j75L5
3783b3J24j68R8J09k98J24J72k00P4Q9k18J45L3q8K9L3n2rQ8r4o2J37Rj25J82
3808A09j09j60L06j35j55K65j48m8J54j33JJ14q0l8P7Oo6L1J37k58N1K62k79o
3832a02K25k60J57J65k89L1J32n3q6J28k0r9J65K7k40R5J78k62J10J54l34K21
3854D3J18k74Q2L8n3J15L0j40n9J96kj55R9n1j29L05p2l03K76j9j62K01k6k05
3878a47J75O6j15lQ4r7j4J57j18j20K49p1j97K72j57j03L10j41j89K48p9n0M2
3901BM3r8L6J22j22o4J69j18J1J59j79l0J85j01l6P3j50R6O5n5PL5l8l1K6nq7
$$ plain form
3738 -51 -170 170 12 -117 122 -50 -187 136 97 -246 75 74 -223 114 83 -184 23 133 -84 -30 74 -112
3760 -112 -62 78 -65 -159 168 34 -192 212 -18 -129 181 -24 -118 69 41 -43 73 11 -75 15 117 -58 -23
3783 -23 101 -67 31 140 -158 -34 138 -62 12 101 -117 28 61 -27 2 35 -17 -26 62 -32 -94 43 52 -73 109
3808 109 0 -160 146 11 -144 121 -27 -75 79 -54 -53 61 -19 -57 20 26 -40 -9 128 -130 -79 183 -96 -102
3832 -102 123 -137 20 185 -104 -73 59 6 -80 48 28 -71 94 121 -119 -24 154 -108 2 156 -178 43
3854 43 161 -113 -31 7 -46 69 99 -41 -100 96 94 -61 38 -13 -142 163 91 -212 64 45 -117 84 58 -147
3878 -147 28 94 -21 -24 60 -37 -51 106 -12 -132 117 46 -151 121 -36 -139 171 30 -159 89 10 -40 2
3901 2 45 -53 -17 105 -17 -81 88 -30 -19 140 -39 -69 116 15 -21 52 -98 -2 63 8 15 50 12 -19 7 2 -85
3928h5J19L4j69J34k6j12K35n5k26K16J0j39P5Ln0L5M4m5p9J44q8n2J60j29m5
3953i1K15j33j48K28j63jK13j27q7J45m8o4M2O2j55J53N1k53J30J30k04P7J90
3976A62l58K01J85k75K5J39j19JJ88j45j10J96j1k19K30j6k16K43M4l01K18Q9
3998A51k92J41Q9k04J09K29k73j3J84j75l9K26j42j95L43j60r1K18r1j90L35r8
4020F2k15K68l0j94J98lj60R8J02k21L4J90k30O4J89k27j1L28k79r0K86k10RJ55
4044A13j60j5J64j72m3J55k6j64K49p1k20K79k1k08K26J8k93K38J02k68J26J07
4066A16k47J04K18k72J8K42k60L6K35k82p1L58k38m6K79j76j61L18j04k71L05
4087A01k4k43K30M0k78K37J12l47J94J93l84J22K83l61L7K95l03n8L84l01j37
$$ plain form
3928 -85 34 68 -101 33 7 -105 130 75 -151 65 75 -64 11 14 -36 -1 43 -2 -81 63 -25 -77 83 -46 -91
3953 -91 124 -9 -157 71 -92 -93 120 -7 -94 51 3 -61 -19 43 -112 41 92 -161 -31 99 -105 -28 162
3976 162 -196 5 190 -85 -60 79 -40 -39 149 4 -106 90 79 -140 90 74 -142 101 145 -156 62 151
3998 151 -141 0 89 -115 -6 223 -50 -63 121 -54 -93 133 -9 -204 139 -21 -112 106 15 -175 160 62
4020 62 -153 115 85 -109 89 86 -74 24 126 -95 -61 129 -101 -37 152 -75 -86 242 -37 -127 159 -51 -42 113
4044 113 -47 -62 102 -70 -113 42 16 -148 101 30 -190 89 68 -140 86 104 -189 49 151 -117 9 116
4066 116 -131 -27 191 -81 -63 179 -81 -45 190 -92 -163 195 -43 -89 190 14 -147 171 67 -204 101
4087 101 77 -166 64 104 -174 63 175 -172 22 215 -169 -47 236 -125 -88 207 -96 -154 230 -71 -208
4108b08M13k21j44L72j95k31L03pk55K64L1l01K74J7k93K83M0l49J94J81l08J70
4130C0J64l67J04K24k40k5L34k83q4L96k35j78M03k30j52L02q0k20L26j11k51
4151a73L03k7k81K65O5l61K52J99m67K31J79l25J18K73l82O3K48l28N5L08l10
4172i5l7L84l03j39L78j42k43L95j40k87M18k0m34M27o1l39L62K5l63K55J13k93
4194a39Q5K89m34J06M09m69M0L74m09J2M32l72p8M02k59j15L16j74k03K86J3l87
4216b75M05N7m60L86J13n42M57R5m89L04J41m04K72J68m09R5K69j61j88L63j98
4237ak90N95l13l27O18k19l17M82k99k07N40k37j93K69n6k33K58R2l77J05L83
4258B73m48L2L85m06J56L54o25J59L90m27J97J38l60J22K72j72k27K18Mk33L70
$$ plain form
4108 -208 205 -16 -160 212 17 -214 89 82 -173 91 122 -179 95 112 -181 102 142 -207 -13 168 -140 30
4130 30 194 -173 -69 155 -85 -110 224 -59 -143 253 18 -160 243 13 -139 163 83 -137 189 78 -173
4151 -173 130 103 -178 87 152 -209 43 242 -225 6 185 -140 -22 251 -131 -68 180 -148 -93 215 -95
4172 -95 -132 252 -51 -190 188 46 -197 198 58 -229 189 169 -265 162 101 -238 124 149 -214 41 154 -139
4194 -139 -54 235 -199 -93 316 -153 -113 261 -148 -136 296 -76 -154 248 -11 -126 190 16 -187 99 112 -275
4216 -275 130 187 -273 113 226 -316 141 236 -253 51 192 -212 60 228 -181 -86 183 22 -166 197 -1
4237 -1 -291 304 -9 -336 282 63 -254 228 -71 -278 262 25 -168 101 45 -188 70 162 -215 -110 273
4258 273 -175 -143 242 -164 -8 346 -279 -120 270 -157 40 178 -182 -60 212 40 -187 31 35 -198 172
4279A72q7m82O02O1o50N87j46l86O07j91m11L78J04j98N3J06k88Q4M40m36k42
4300c23O45m15j40O67o20j18P86n64j06L97l63L1L39j99k69K42K05l19P5K54n59
4321c54L81M14q54L59L47o51M46Q7m99L51K34l48RO2l7r6L77j79m74P07l6o09
4343c63N98j78m56Q26k86m61N18j52j51K81j74j54J59K87l61j94M65l10j2N59
4363D41p46L8P61o86R3L92o14L24L23m91O8J73ol3K1ok91L32K19o95M27J72o10
4386c94O71j30o41O45O9m91L74q4j87K57J06k58k16N26k17k88N47l83l11R21n37
4407b1l22O79m32p6N76n39j30N44k02j83N8J92l41K39K90n96J23N75p32K92L41
4428C35p46M50M02p29K39L09l59P3K55l06j15L63J5m53L47L0m93O75j15p01P50
$$ plain form
4279 172 85 -397 205 266 -384 203 57 -329 278 87 -324 54 158 -40 13 119 -169 -85 355 -81 -323
4300 -323 322 -93 -233 434 -186 -304 482 -82 -188 209 -154 -123 216 17 -252 -10 195 -124 -49 205 -354
4321 -354 27 441 -413 -54 293 -358 88 175 -324 27 261 -87 -78 -16 -53 -149 228 49 -425 282 246 -363
4343 -363 235 57 -399 427 141 -320 198 46 -105 176 2 -152 7 294 -67 -261 204 -106 -118 441
4363 441 -305 -267 494 -192 -99 293 -321 3 326 -165 -97 76 70 37 58 52 -239 93 312 -383 44 216 -394
4386 -394 277 147 -494 151 220 -271 103 19 -168 89 195 -63 -279 247 30 -258 289 -94 -405 516 -21
4407 -21 -343 336 -96 -172 404 -135 -265 279 77 -106 -48 144 -197 42 332 -264 -141 434 -298 -6 335
4428 335 -411 39 441 -288 -49 260 -99 -26 229 -77 -192 171 186 -267 80 110 -383 292 177 -524 226
4449B26l5n42N66j16l66M16P2m05J30K58k46m0L18l82m5N34m65p9M93l84q4N12
4471C36m73o3M25k68q4K90k22q7K84ll59L09J28m45L19P2n14M27J51n19L65J19
4493A88m82M06J37n04K06K40l14M5L00k70q3M48l14k53N41l29k41N32k98j89N36
4514C02k74l21M33q8l11M00Ql91L32J50m84K10L12n79K54M15o23J42M44n69N8
4535a80N20m89j9M67l63j76N28k63k87N10j21m46N23m2m77M19O1n03M52P7m78
4556b87L27J95m53K27K15l79P1L84m22n6M71l94j25M32k73j36N00k99k13M24k18
4577ij18K87j12k57L00k2k85L33J5l42K46J25l48J72K11l48J13K80m24J80K41
4598B38m17J66K76l91mL19k84p4L13j78j99M82k24k78M58j39l07M21j40k68M03
$$ plain form
4449 226 191 -351 215 99 -267 149 221 -184 -54 204 -42 -82 236 -146 -191 343 -122 -201 292 -92 -176 336
4471 336 -137 -200 225 -43 -127 163 -59 -146 138 135 -224 85 213 -232 87 159 -355 72 223 -296 69 188
4493 188 -294 112 249 -255 -49 191 -123 -78 222 -48 -131 317 3 -250 291 -38 -279 253 -45 -234 302
4514 302 28 -293 140 52 -259 141 149 -242 90 240 -244 -34 278 -301 -47 368 -255 -113 331 -238 -180
4535 -180 340 -149 -168 299 -64 -240 288 25 -262 248 127 -319 204 162 -315 104 165 -338 114 191 -287
4556 -287 40 235 -218 9 224 -155 -84 300 -122 -178 293 -101 -226 206 -67 -203 297 -2 -215 209 -9
4577 -9 -127 160 48 -209 91 69 -216 117 132 -210 36 161 -187 -15 196 -152 -39 241 -183 -3 238
4598 238 -179 -13 263 -128 -132 187 -97 -171 142 -36 -235 247 23 -255 203 64 -243 178 38 -230 173
4619A73mm47L83J12m79L10J38m23K19L32n53J81K90m09N6M04m59O3L81l66j06
4640b04M98l19j80M16k05k38M21p4m28M58M2n40M06J49n71M13K07n22L21K25n15
4661b40K23K72l98P0L49l35j20M41k36k46M24j64k44M64k75k22M20j31k42K85
4681I5k7l01K56J42m17J05L62m58J94K46l77N0K00j83J21L14o62L65K58m41P0
4702h8LL4r8J34k9L0J75p4o9l10p3J71K73J16o00N43J58o86L38R1m01M00j1l52
4726c25J68N7J19o0N27p28K83K82n44l1N55p39M11L56l90M1K05j60M1J2k12Q8
4748d4J77m1l56J91L00m83M07J22o25M91P1n39K59K44l67L84q2l64K29K9k12j58
4770c67P31l59J5N11l43k10L07k82n44N90q7j77M53l19j93L16j04j1l6J93j90
$$ plain form
4619 173 169 -278 105 217 -262 48 186 -237 -18 314 -239 -58 232 -177 -121 283 -176 -113 268 -98 -204
4640 -204 294 -25 -205 211 6 -232 189 115 -313 145 187 -353 53 202 -369 44 251 -271 50 275 -240
4661 -240 -17 255 -143 -73 276 -59 -179 262 26 -220 204 40 -204 260 -15 -237 183 52 -190 95
4681 95 68 -233 23 165 -252 -147 215 -243 -49 197 -180 -130 70 -113 8 322 -340 25 283 -158 -88
4702 -88 -85 -51 -149 -15 -44 -14 161 87 18 -292 -365 -194 79 195 -405 138 296 -390 -52 39 -362 38 27 -325
4726 -325 -157 -100 19 -41 486 -242 41 323 -221 -252 303 -436 -25 331 -59 -18 187 27 68 80 -132 -44
4748 -44 133 92 -264 -73 227 -256 151 273 -352 139 210 -329 -70 174 -193 191 109 -255 -26 3 -209 -367
4770 -367 364 5 20 531 188 -22 285 3 -541 49 -38 -215 238 -81 -274 42 -62 -73 -109 84 -106
4791a06p2M92n23q3M30l46K56J49m31J9M41k79j19J52p5P7J20J1k81K20J06l22
4813a64L26j48l77N72n1m29M00k61p3L79q2j31J30qj74R5J03l58J93K92m18P5
4835a09K85l72L69R0o14Q4N01l66k0K61o0L4r5j55K3LK98l62L27M2m50M26R9o27
4859c88M56J28l02K12K6l04J57J12l87O9L44j02OJ5j05j38N62m52l01N33Nn28
4881c82L32J61p61Q97j77K8k76l46j14P85k2k87J04N61n14P9k3k50K46J81l69
4902a47N0K64k55J26R8j89oP3O1j24M4Q9k44K26P9l73K68M7k74L08p9k39L11q8
4926B6j35J93q9KL7J1r2k2J84j45k6J73k09K3K37l06N3K57k99J19Q6j81P9J73
4950A49j71k2Q5k1n0J21Kk62J93Q2k45K02L2k71K90k2k49K20Mk29J72L6j15K2
$$ plain form
4791 -106 -178 314 -209 -292 138 -208 48 197 -234 -215 226 -53 -172 -20 -95 -18 102 113 -168 52 158 -164
4813 -164 162 14 -363 209 158 -271 129 -132 -205 174 92 -39 91 83 -91 4 107 -251 -58 234 -184 -109
4835 -109 176 -196 173 263 -351 -267 234 -132 -152 109 49 83 -12 -167 -144 -141 157 -205 122 164 -286 140 239 -388
4859 -388 68 196 -106 106 132 -172 -15 97 -290 -221 123 21 27 42 -63 -201 361 -91 -392 141 146 -382
4881 -382 -50 111 -650 247 70 98 -178 -524 -638 147 125 -162 -58 503 -11 68 45 -205 41 222 -147
4902 -147 -97 167 -88 38 136 -53 -59 14 75 -49 -5 84 -160 66 145 -228 40 87 -187 121 42 -197 114 26
4926 26 -109 84 -5 -3 34 45 -47 -69 115 -30 -56 117 -92 -69 168 -138 -85 172 -127 -8 78 -103 -24 149
4950 149 -22 -44 41 20 -30 91 93 -169 24 106 -139 63 95 -176 114 92 -157 63 67 -162 10 46 -69 -47
4974d7K06j79j01K85j92o6K71k01j77L62j41j69K83j16j80K76m0k35J90L7k12
4995a46J39J49k81Q9J95k64O0J89k39M1J77j75k0J82j18k8J36n7r6J58nj91J34
5018B9Rj54J57l6j49K06K8j74Q3K0o9N9K0r3L6Q4j09O3P2j14k4J48j02l6R4r1
5044d3j3J22p4p0J60n1q9J56j47KJ09n3n8O8j6j10J33m3m8O3O1j60J28Qj43J96
5070H8P2k44J18O2k05J42Q9k15K3K23j96LJ54j43n9K01j37j34K76j26j35K44p7
5093B4j38J30J8j21J69j2j65R3J46j97J00Q2j81K8J76k18M0J17j33k3J17p6o5
5116h9J52k7j28J12K8j51J60j0j35M8Q4j36J35K4j71J14L8r6L4P0o4l9J00j19
5140f6O0O5j13K2Q4p1j4N5n7J7R0p6k5M9j7k6L7rl4K2j1k3N2Q7j22O1o7o5J39
$$ plain form
4974 -47 159 -20 -121 164 -28 -94 177 -24 -201 161 20 -149 134 18 -162 114 74 -161 29 66 -146
4995 -146 -7 142 -139 -50 145 -119 -59 130 -109 -68 109 -66 -86 96 -22 -50 86 29 -67 91 86 -105 29
5018 29 38 -116 41 5 -144 62 90 -84 -1 19 -50 9 29 -64 -28 56 -53 10 82 -32 -56 92 -10 -46 48 -43
5044 -43 -56 66 -8 -78 82 31 -58 98 -49 -47 62 9 -49 19 3 -107 26 -17 -65 -2 59 -101 27 35 -108 88
5070 88 160 -84 34 96 -109 33 122 -93 -70 153 -43 -40 114 -29 -88 113 -24 -158 118 -8 -143 101 24
5093 24 -114 16 34 -87 82 70 -95 -2 144 -53 47 129 -52 -24 152 -66 -26 91 -42 -65 52 -24 -89
5116 -89 63 36 -92 20 48 -103 57 47 -88 -40 44 -92 43 67 -104 10 48 -48 -14 56 -8 -47 53 -66
5140 -66 -6 59 -54 -32 52 -19 -33 22 -35 -18 72 -4 -29 20 3 -23 14 5 -29 -7 -18 -41 11 98 -24 37 -30 -95 44
5169D4k0j06J42n9m1J37p2l6K6M2r6N1N5j20qJ88j57n8J99j05j8J21j30o4J82
5194I7r1j02J06l1l7J85j18p2Q8N0j65P8Q4j68J01R1k00M5J45j60O9N0p2qJ22
5219H7r4p0P4J4j12K09j37j70J79J56k42J2K02m39K73Q4J1J16k87nJ54J29j89
5242d5J4N0j4j10J55qo6R9j16l3J23o9L0O9j6m5m0J6j3PN7l0l3M5r9J19k0j09
5270h2R1J6m9M6n2qO4l3qP0r7O0mm8L0kO1k2r3J14m8j6J00j75LJ14r1M2N5o0J0
5301a2P0l7j5K9L4j32O7P6j55J12N6k03J45M9j68J18M2r4M1l0J6l2L2O7j02J01
5327G5n8j27J20m3kL1l4k2J06ln3J5P8j21P5j7k9l4Q7q4Q3j0n4L3J1k6l6M7L2
5356D0Qn1O8r0j3J25q9m7O0n5N6p5J22r4M0p6N6L0J5P8p2M8k4q3P1J0m9j48J67
$$ plain form
5169 44 24 -82 60 1 -40 97 25 -11 15 57 -39 12 67 -53 -61 127 -30 -88 111 6 -12 109 -21 -85 97
5194 97 6 -96 10 -21 -58 127 9 -63 25 75 -90 -12 72 -96 5 96 -104 -59 86 -74 -5 45 -27 -35 87
5219 87 -7 -77 -3 11 -101 108 -29 -199 -20 136 -106 -94 108 -331 -58 26 37 153 -134 -139 15 144 -45
5242 -45 -31 19 5 -105 50 42 -24 75 -41 -74 49 -20 10 79 63 18 -22 -6 -19 -12 45 15 -18 27 -72 47 27 -82
5270 -82 9 25 -24 22 -30 -38 26 -7 -15 55 -42 18 14 -34 -4 -6 55 33 -60 54 6 -10 90 -85 -82 32 -59 -17 38 -22 -12
5301 -12 58 21 6 35 69 -63 4 80 -75 37 93 -110 35 84 -84 34 76 -18 23 -7 9 -23 9 76 -26 75
5327 75 17 -110 10 -33 -35 -4 -38 -60 46 43 -10 5 83 -38 37 20 -9 -43 44 -40 43 33 -21 12 23 -3 -39 8 40
5356 40 48 -3 65 -25 -38 87 -2 -49 11 -44 12 -63 59 -35 5 -71 -15 15 30 108 36 84 60 -23 48 58 9 -139 28
5385B8O1m7J6l6j07J39j67Q0J91j84J00j05J22j09j5L6j8j1L3M2l6N3m8k4P8j01
5411b9k6J63j87P1M1M3K1j35L2m2J7P7%k2qk7M4k3l8M6J5n6J1N7m4K6l6K7m1M3
5441B0k6J3rJrkM4m4j9L2L0m9L3l9N8p5K1J9N4k9o7M9J9j17M0J74k4j05M1j52
5471a18R3j3R4O3k56N2J7q9K30n1j0q8M6j0R4j25k86K55j33L32j16o1K63l06L4
5496h9J39k53M27k14k26J98q1J21R7j83m8J28J41p6m81M92n7p7j01L16j60p4K49
5519A88k54J58l4k03N42m94J35L9r0K13k16r7o3J13O4k65L77k71J9M6P1J09j19
5542c2J29l5l4Q2j12O9kJ0j11J56j02K9j3rn9M2p7R5J3P3K5j56l8J26P1j35m6
5569d1N2lj35L7J25j02J86k03p0L13r7j20J1k22K34L5J54j35K85k09k07K48j27
$$ plain form
5385 28 89 42 58 22 -85 54 -113 -33 158 -26 74 -31 91 -18 -33 3 -15 -26 7 49 13 66 18 -6 72 -29
5411 -29 -55 108 -79 -8 33 76 97 -38 -6 -48 -31 46 46 24 16 -11 33 10 -28 18 33 -23 -12 45 1 27 -9 18 -23 20
5441 20 -6 7 -2 -1 -10 -12 32 -12 -31 1 31 -18 15 -24 34 -41 -20 -1 53 24 -43 6 25 -92 -52 122 98 -7 34 -118
5471 -118 -25 -38 56 119 -137 -85 -68 -157 73 22 12 -76 -30 -40 54 -71 -357 -102 -235 97 -19 -80 183 -123 -89
5496 -89 50 -203 224 10 -216 -18 -99 22 119 -64 -112 16 157 81 -400 92 35 -42 -143 173 13 -61 188
5519 188 -66 92 58 -145 397 -97 38 77 -13 200 -16 -113 -176 -63 1 -264 113 -158 -139 -93 -22 87 -32
5542 -32 97 62 28 110 -2 67 65 75 -36 120 18 47 34 25 -34 8 -69 26 39 112 137 -19 -57 69 140 5 -41
5569 -41 11 8 -127 -90 35 -67 119 -84 -154 159 62 -58 -47 -269 -35 0 154 19 304 95 -112 136 9
5592IkN4nk1p3P5o9j9L6m9J0P7p8lJ00n0l3J45q3p6J28p4p9J80j30n0N3O1p2P9
5622D1Pj97J61J08j57nJ47k40J44P0p7n7J08q9k0J82j62n5J47n9QJ63j68m9J12
5647F3l0j41J18nl1J9K3q2P0K6j09Q1P4j81J34K2j31P7N7j00N1K7n8j7J01p2p4
5674h8J42kj19J69j12q3J94j53j4J07p4kR5k4p8Q3m1m4M0O4j17Q5L8j25O2O8j58
5701h7R1Q8k03J01J47j51JN1o2oJ13j03n4J36k3j04J52k6k21K62k2k68K12O6j83
5726i3J51p2j30J39M1n7pJ10j27k0J08j46n0L54j69j69K36j78J1J91j33q0J70
5749H0n6l6N8jj50J49N5j77N4R9j56J32O4k01M7J34k07J06K1r7J22M6j32j3J34
5774G5o4q6R9K3j69K38j14j92K69r1j34K97j65j12J80m7n5J16j00o3J12M4n4m4
$$ plain form
5592 9 7 61 56 35 -38 37 -32 -51 -15 -64 -54 23 -55 -58 42 -8 -41 104 21 -55 73 -1 -80 100 -30 -80 -27 34 -38 41
5622 41 48 -149 12 120 -37 -42 105 -135 9 79 2 -55 53 -36 -56 126 -36 -91 56 -3 5 168 0 -49 63
5647 63 33 -108 10 5 -26 -7 16 -66 4 30 -79 2 76 -105 29 51 -80 -3 54 -46 5 32 -26 -43 58 -14 -88
5674 -88 54 52 -67 102 -10 -93 101 -52 -66 41 -33 -35 60 36 -42 41 0 -44 -4 60 -57 28 66 -59 3 71 -87
5701 -87 4 92 -111 -10 137 -14 -13 38 -24 -30 83 -20 -74 62 39 -65 87 61 -160 102 80 -188 24 90 -93
5726 -93 58 -14 -144 -5 36 -21 -28 82 -45 -65 43 -103 -153 201 32 -137 99 -79 -68 123 -10 -90 80
5749 80 24 -12 46 45 -105 44 99 -78 -24 75 -81 51 115 -86 -39 95 -112 -6 15 -82 40 86 -46 -59 75
5774 75 11 -75 24 47 -122 116 2 -190 79 -12 -146 151 -14 -126 54 7 -48 68 -32 -95 17 61 7 -37
5798c7oJ03qJ96l87M9L76l18Q0p3p6k34L22j01l9M53l47Mj19K92l04L62rm74J75
5823a20M32k67l4j48j5J97M3k33J56J48k84J28L7o2r2K39j21q6J65p9q2K59k28
5846d7r8K00m7j16K58k38j0J38K9j69J14J2j09P5O9k02J00J84k30Q1J41k78J75
5869C2J10k44Q5J21j67R6Q0j48m3J73r5j22K02k7j98K47n6k56L44q5k01K36m0
5892D4j62J92l2j46R1P7j51J12P3k28Q4K53k40m9K23k34L7K09k54M5K27k14q1
5915a24K03k3j16J51m3j64K16jk07R9J03k80K04J17l23K08O7k43K00L0j63Q5R4
5938I0j29kJ61j24m1J63j41n4J75j11J07M2k75r7K85m0J9RL43n65K08L1k33K9
5962a50N50j27n36L59l75K76J53l62J19K22k16m8K83k80J04J52j63o5K16j16r2
$$ plain form
5798 -37 -43 60 52 248 -139 -90 286 -32 48 -25 -101 -335 -13 -114 -153 300 -47 -43 -162 130 -174 188 179 -295 -120
5823 -120 312 45 11 -137 -152 45 88 -145 11 159 -125 3 40 -22 -114 125 4 -82 83 4 -78 181 -47
5846 -47 -145 55 8 -108 150 -88 -98 40 69 -100 14 26 -83 -8 61 -141 -41 143 -87 -6 135 -143 32
5869 32 142 -102 -17 104 -63 33 113 -35 -78 95 0 -122 80 53 -145 102 46 -210 134 49 -152 84 44
5892 44 -118 74 42 -104 -13 64 -87 25 98 -130 -46 207 -33 -82 141 -93 -56 153 -101 -56 171 -43 -124
5915 -124 79 56 -60 91 48 -116 100 99 -108 -9 94 -186 18 135 -188 20 87 -156 44 74 -89 -4 90
5938 90 -39 -41 120 -4 -45 118 -23 -77 98 -13 94 136 -139 -236 49 9 28 37 380 -185 23 54 -179 -150
5962 -150 400 273 -263 96 -279 -3 150 -212 -93 129 -87 -135 148 -132 -28 124 -39 -104 112 -4 -96
5983i6K34j75r9K49q6j81K68k3k52K21mk67K68L3k27J57O4j88R8J67k86J32J58
6006A65k81O8J82k11r6K70j48n8K69k09j13K96j27r4J58m4k06K20Nj76J93M8k20
6029a09J66M9k53J70J39k62J19J30k58R2J28k53Q8K41k05q4K24j55r4K47p5j83
6051a38K49p6j53K24o9j56J50N8j94J83m2j92J56J43k39K4J62j97J16J28k07o
6073g6K47k32k0K23j97LJ77j76NJ30q8q7J73o3j44K39n0k61L00j8k51K37o0j82
6097a71K21O8k31J20O9j88J22Q1k10J14J47k32J5K15k37K6L04l10p4K69j79%J94
6120A33j67q6K15r3j49K18J3k17J75M1k48J98J53l48J81N3k39J82J64l42J24J54
6142A15j83J7J91j69o9K86j18k60L39p4k23L03j69j45L11j14j90J99m1j27J61
$$ plain form
5983 -96 138 -37 -136 113 27 -154 114 91 -161 60 56 -211 57 90 -137 20 84 -104 -6 161 -125 7 165
6006 165 -116 -48 134 -77 -173 97 -51 -109 160 -49 -162 134 7 -87 71 27 -179 41 46 -130 63 111 -109
6029 -109 57 106 -147 23 162 -100 19 149 -109 -17 111 -142 -54 187 -18 -102 122 -33 -127 120 45 -138
6051 -138 111 35 -118 106 37 -119 31 89 -105 78 36 -156 0 143 -96 -72 90 -107 9 137 -70 -76
6073 -76 171 -61 -81 142 -55 -52 125 -51 -46 84 -4 -91 82 19 -125 114 64 -197 103 85 -166 71 11 -171
6097 -171 50 118 -113 7 76 -112 10 91 -119 -5 142 -90 -75 140 -97 -71 233 -77 -151 118 -61 -61 133
6120 133 -34 -120 95 2 -147 71 84 -133 42 83 -165 33 186 -162 19 72 -167 15 179 -163 -39 115
6142 115 -68 -51 140 -29 -98 188 70 -190 149 75 -148 155 -14 -159 152 38 -152 47 6 -121 40
6163D0Qj73J09J59k47qK78k82M7L06l79K7K94k17n1K55k81L2K10j54l8O2no5J34
6188F1j5j75K52l8j96J99mk33L29j36k15K54p5j12J31L5j85R0J19j06j8J51j76
6211f3l9K85k90o8L80k48n4K43j84j1L06l29mK13r3r5R8jj54J71R5l24J16K33
6235A83m28K82J11l58K62J28l16J14P9j86J38J35j72j43K63l0k22K22n7k14M17
6256B08j92k63M25j72j50K55j00j21J80L9r3q2J20p8OK01l24M2L08k62n3K62k59
6279a03K1L01k99j0J77j25L4N9n0p9J35K3k32R6J28k06J72K6k41K61L4k49J90
6302F3k8r6J18k4r6Q4K6k8p1J82j66j01L27k07j27L00k20k4K42k78j5K48j20l4
6326d5Q5m8o0J34Rj67N9J44j77J26Q9l55K01K06l47J56J27l10K50R2l09P2J83
$$ plain form
6163 40 48 -125 -16 143 -104 -112 166 -116 -69 237 -142 -115 179 -38 -89 166 -115 -83 127 -27 -65 -3 -8 -73 61
6188 61 46 -129 123 85 -111 88 84 -149 180 44 -171 83 8 -104 27 62 -123 -33 86 -20 -38 113 -63
6211 -63 -102 183 -107 -175 205 -43 -97 146 -38 -49 257 -72 -76 137 44 -51 47 46 -108 63 158 -166 -50 183
6235 183 -245 37 148 -210 52 180 -136 -22 57 -129 9 144 -28 -171 92 62 -160 62 5 -209 208
6256 208 16 -247 178 6 -144 111 11 -110 70 109 16 -66 54 -24 -18 183 -141 -99 209 -53 -106 156 -103
6279 -103 -82 219 -80 -90 87 -38 -4 55 5 -74 61 84 -148 -52 76 -130 42 68 -173 88 122 -127 63
6302 63 35 -61 57 33 -63 21 47 19 -52 130 -36 -137 190 -17 -144 156 -64 -88 154 -124 -139 109 -11 -45
6326 -45 40 -8 -68 66 75 -92 -33 111 -66 60 149 -206 -5 201 -146 10 137 -173 77 169 -140 -68 115
6349A15r3r0J38r1j25L55j74k49L07J0k75L19r9k12L17l1k63J81Kj58J45Q8k19
6372a02L6K53k53OK06k14K1K23l15L7K51k05k5K01j91J7J73j57m7J34M0j80J34
6395D3N7k76J74J77l22J02J68k27J34P8k28J38lq5L3R0j26K4R1q9j3J80j59r5
6419a34K50q7j27K18j61m1K13j58m2J84p6j10J67l4j57J58Qj92J10P1k00Q9J35
6442H4k04J59R8l27J66J57k42N9J53j78J7J95j92m1K06j08o4J71j51j02K80o1
6464G5k22K46p5j90K16M9k30K08l4j94J33J24k04N7J98j69m1J92j29r0K36j74
6486a8j32L38k08j04K74j27j03J90q6j20J28N1k23K10Q2k95J65O6k27J37J07k76
6508a71J38J32j43j4J82j99O2J08j18m1J56r5k8J37r6j03J75r1q0J92j10p5N9
$$ plain form
6349 115 22 -68 70 -21 -146 209 35 -214 93 103 -172 147 48 -164 153 122 -141 40 42 -116 29 117 -102
6372 -102 -66 187 -66 -60 146 -68 -47 176 -139 -102 149 -56 -81 120 -71 -54 119 -38 -85 49 89 -91 43
6395 43 100 -176 -2 175 -147 -45 123 -104 30 108 -120 18 15 -70 -37 53 -73 -49 42 -47 -60 120 -39 -134
6419 -134 116 29 -98 120 -41 -82 131 -27 -69 115 39 -71 96 62 -95 63 71 -121 -11 60 -140 -51 84
6442 84 -120 39 137 -190 -24 133 -109 -50 103 -75 -58 137 -55 -96 110 2 -62 109 -42 -144 136 75
6464 75 -147 99 24 -166 50 99 -131 77 43 -151 -18 106 -98 -41 157 -12 -53 139 10 -80 156 -18
6486 -18 -150 188 -20 -124 150 23 -80 110 24 -96 32 83 -140 70 152 -143 22 88 -139 -2 105 -171
6508 -171 -33 99 -44 -58 124 -75 -13 95 -23 -64 92 -3 -31 106 10 -93 82 -9 -89 103 -7 -82 -23
6531b3N2r5J49o9j41J64j3j09R9N1j72R9J29k33R4R8j69J01J17k00M0J20j17j2
6555d0J59k19PJ95j36j24K58m2k48K99j00j75K98q7k05K00Nj37J62k1j45J14P3
6578I1j69O5J04j82J8K68k48k9K46k19o8K80j83j13K35j20r1J90k6j78J94J7k03
6601a21J34J37k99J56J42k82J62J20l10J78R5j93M4R3j19LJ30p6j09J33jj14J69
6624G2q6j13K57j10j23K53j15j59J90n8QMJ5q2L1J06j44J2J89k04%J42k28J58
6648A5Q6j82N6J42j70O4K8q5N9J2j5j23J76l6j68K01j7j83K71o0k07K10l6k05
6672a67K72q5j54J80M7j44K0P4p5J9J66j87j04L15k25m7K41k70J8K90k69K2J83
6695A20j28l5J21o8j27J88L3k59J21J47k31J86O2l16J89J62k69J65K3k05J40J05
$$ plain form
6531 -23 29 -66 83 14 -127 37 24 -85 14 65 -107 -8 121 -112 -18 80 -89 12 129 -71 -31 89 -28 -40
6555 -40 119 -100 -93 102 -34 -158 100 58 -190 109 9 -166 132 45 -160 40 45 -92 70 49 -96 18 91
6578 91 -78 -13 91 -91 -73 195 -53 -82 164 -55 -123 157 -26 -139 96 -24 -115 75 49 -129 65 82 -121
6601 -121 13 150 -149 7 149 -133 29 149 -161 17 112 -81 -37 56 -63 -60 70 -6 -115 18 17 -97 72
6624 72 -14 -127 130 20 -103 150 35 -124 66 8 16 20 35 -47 -16 90 -54 -42 147 -57 -57 85 -143 15
6648 15 101 -81 -25 117 -53 11 39 -46 13 25 10 -113 63 27 -141 60 43 -140 131 71 -136 74 38 -167
6672 -167 105 20 -134 46 93 -51 -31 43 -32 -13 153 -34 -138 177 -48 -95 146 -124 -106 184 -85 -63 120
6695 120 -8 -43 78 10 -117 71 104 -155 -34 113 -118 68 130 -186 3 165 -104 61 84 -121 19 124
6717A24j40l7J27o2q8J72p4j81K80p9j92J86J2j94L17j35j77K17j1q9N9m0m9K8
6741b6J59j72p3K12j42j8J81k24K7K58k89L9J47j84J19O3j55N1P8Mn6K2K8q8J44
6766A05l3k33K21k1j65J56oj15J93n2j66K27j18n6N5O4j08K8J21j41l6K21j50
6789iq2K85k76J8J83j49mJ93j98k3J41o1j32J63oj22P8R6k68K10J34l57J97J23
6813A34k81K31O6l10J30Q7n4k2J20j82j6K12l3k04J65j4j45K56q4k39K87k8k21
6836a45K23k2j49J29P3j57K0J48j60j3J57k03R3J23j67o2K77k38j2K50k01j6J50
6859I8j06l4R1o4L1J1Jo7P9j4j03J02Q0j95J59L2j79J40Lr3Q1k7j03J27j2o2M4
6886B0O3j67M6Q9p8j3J03m9q2J63p0p9J90j41k3J55j58n9J84q5j15J95o3o2P3
$$ plain form
6717 124 -16 -53 74 12 -76 96 22 -159 121 42 -150 36 48 -146 171 36 -141 76 65 -24 35 -5 -54 -26
6741 -26 133 -39 -112 100 -42 -60 121 -103 -76 182 -107 -68 79 -105 14 77 -78 -27 51 55 -1 21 49 -39 105
6766 105 72 -161 60 39 -126 30 24 -91 102 50 -116 111 -7 -63 -8 56 -52 -24 97 -44 -80 141 -9
6789 -9 -91 194 -82 -64 119 -30 -34 159 -39 -62 79 18 -114 49 43 -79 -1 95 -173 37 171 -186 11 134
6813 134 -147 84 150 -160 -30 57 3 -19 101 -81 -97 115 82 -122 43 29 -116 140 56 -183 104 76 -145
6836 -145 78 56 -93 36 109 -48 -28 120 -40 -53 104 -99 -6 117 -50 -112 165 -73 -85 165 -36 -52 98
6859 98 -8 -42 49 -15 16 27 28 -39 40 26 -77 25 105 -90 69 101 -78 62 65 -28 53 26 -77 50 38 -24 20
6886 20 83 -84 -38 51 -27 -40 63 14 -68 95 25 -54 136 -5 -28 127 -31 -90 94 9 -106 89 26 -36 37
6911C7lj58J09J30k57J25J41k16N0J78k13N6J53j04o8J73j46l8J20l2j17J33K1
6934G4k16K19mk23J54R8k11J70O2j96J39L4j30K0J04r1o7J85j15j6R1q5o4J70
6958A02j25m0J35o7n6J08j8r4R9M7j43L8P3j41O3L0m0N4J2p8P1M0r1L9L3p7L0
6985DP5j15K5N5o2j0Q1p6NR4p8lN8p1m4J32j20k4J20L5j55J33m2p6J29j9j07R9
7013D3Pj58J47J1r9O6O0j71Q4J19j70J7J68j13m1J07q8r6J75m6j24J95p8j37J22
7038@L5r7J13k8r0Q8N2j76J21J7j15N9J21j57Q0R7j30p2J66o7r6J84j11q1J88
7063A01j14n3J27o1n3O9N8j82J37P9j08jO0j50J19P7j53O9L4r2J8R8q6k4R4j00
7089c7J6L7M3l9J3K7j61J06lo2J16k6n3N4l8l6Q5p4LM8J4k8J0M2m0J1K5j27J04
$$ plain form
6911 37 34 -124 -15 115 -142 -17 124 -92 -42 136 -77 -21 132 28 -40 133 -13 -51 69 37 -80 53 74
6934 74 -142 77 73 -150 4 102 -109 61 123 -73 66 100 -30 -10 94 3 -64 121 6 -10 81 -4 -68 102
6958 102 -23 -63 72 5 -51 57 39 -55 44 91 -52 -14 59 -82 -19 11 -29 25 37 -41 30 70 -21 18 51 -26 4
6985 4 79 -36 -11 44 -18 -28 53 -23 -18 76 -2 -5 53 -18 -62 70 -50 -74 46 81 -74 59 17 -59 70 51 -56 43
7013 43 50 -108 39 50 -49 17 77 -94 -10 109 -61 -44 124 11 -30 77 -11 -107 68 22 -102 93 15 -122 0
7038 0 35 -62 51 23 -67 21 73 -103 18 35 -80 -21 100 -57 23 120 -10 -82 84 17 -79 105 -6 -87 101
7063 101 -13 -66 61 0 -53 16 74 -108 29 108 0 -1 59 -91 28 105 -48 21 55 -37 -19 79 -7 -31 63 -37
7089 -37 -21 16 59 20 33 60 -101 5 2 -60 56 30 -23 31 -7 -43 42 -32 -29 19 33 5 15 57 17 28 53 -74 30
7118C0N8j39R9L5j61R2Kn8M6Q6j41L2Rj3kP5p0p3J69l8j54J70r3o4J66pj47J35
7146D4K1o0o6J7J7P5M7j35K8N7Nr3J43j74l7K38j11o5J32o4p9J29p9rO9j9j2n8
7174c9P5r0K7J44j66pJ56j96M1J03q2k2J03q4N8M7j11J5O7k0m4P2j4n0pM5k7N1
7202D5j1j49R5pQ1n7n4QR3m3oJ3Ll5QL6Kn8L7pNL3j6k1K6o8K1K6ML0l5k2M4l0
7236iJ2QJ6j2k7M2l1o6J04l5lJ7k9o7Q9J1J0J0k7m8L5L5m2j1N9m6l7J22o9mQ8
7267I5j10K3M7l6l4J01p1J5LO1p0l2Q2q4k3R4j07P6qr2P5N1p3P2p9nk7O9j0m2
7297c9J8Q2p8J6M9j22J02J2r6L9Lj5O8K5m4lRK7k1p4M5o4N8M1j4K3o3N7n1K5m9
7328c4K9j4ppO9j7j0n6P6r0J8O3jn0M2km6jL0j8M6O2p0j5mPk9M0m1L9L4n6k6K8
$$ plain form
7118 30 88 -51 48 83 -78 14 16 -42 4 90 -51 -19 -10 -23 -25 50 -20 -93 76 38 -116 54 -39 -103 63 56 -91 44
7146 44 65 5 -61 -44 -27 48 95 -40 -12 45 50 -43 100 -74 -111 127 16 -49 83 19 -60 69 -10 -19 50 31 19 -39
7174 -39 36 -54 -27 117 -49 -56 100 -96 -55 48 -34 -56 47 -37 21 68 -43 -28 39 19 -25 47 33 -17 -24 21 -6 45
7202 45 34 -115 -20 -27 54 -3 -57 -49 44 1 -5 8 11 -24 -16 20 22 -36 1 -6 -1 32 16 -5 21 -47 -26 0 4 34 -1 -23 21 -9
7236 -9 3 11 27 15 -12 30 -1 -67 37 2 -1 16 -13 -80 9 20 30 40 13 -35 0 35 -7 -18 41 -5 -42 80 11 7 95
7267 95 -15 8 55 19 -15 86 15 30 33 94 24 -8 74 -10 -33 61 -46 30 22 -70 5 56 -17 55 -24 -29 -56 13 3 -39
7297 -39 -21 61 -17 -1 48 -74 28 40 -56 -17 -14 -29 39 64 20 17 26 53 32 -42 3 -61 -3 38 24 47 -16 41 -10 15 -34
7328 -34 -5 -19 -26 -33 36 19 9 -47 29 -61 -43 20 19 -31 11 9 -37 -38 -8 -26 20 82 12 -3 -7 0 -29 11 -30 9 43 -13 -39 -11
7362a1lRj5L9l0n2P7o2L5N4r6L3N1qp8J06n8k0M0j4K6J4m9pM8k1jjjJPK1k0j1
7396CrP4j24M4%lP1o4K4J5k9j2N4o9j0M5K7n0q2J43n1l9M5k5K1K5J4j6n0O1k4
7427Im7Q2L0q9lO4o9L4N6r4j3J06l5m2Q9q0j4N7p9oP5m0m0M1M8p4O0O4j00M6%
7458C6m8RJ9Rm2R0o7L3pl0n4P3j0l9J05n0q4J68r0p3Q1L0p2L1Nj4J3j2l6j9N1
7489FJ8q6N3l3L7J8j2k7O9no1O5n2J9J%p3R5j5l6O6j7k9j6L0l9N6m4K2J2kk5O0
7522E5k8%lo0O4J2pl4l9O8o9J2J13j07nK7loO5n9m8M3oRO5n6o1J31q9N4J5l5p6
7555e8Q7m3l0J48j08k4o0J53o1k9J19j14j5R6p0nP0jj13P9q2P7Q2j23o6M9Rj01
7583a34R4N3l2K5Lr2L1J26orL5j73L5J52j24J01l6j05K4N1Jk0Q7n9m8O3j1j16
$$ plain form
7362 -11 -14 -5 -20 19 -11 -63 14 -48 -13 41 -55 -22 29 21 -57 49 -9 -29 11 -3 23 37 -12 -19 29 8 7 6 5 6 13 34 14 3
7396 3 -6 68 -56 -12 -12 -15 56 -8 16 31 2 -10 44 -25 -35 10 37 -13 -95 48 -3 -42 3 -22 -1 24 38 22 -28 33 9
7427 9 -38 44 74 -15 -18 46 -23 11 67 -27 -40 66 31 -11 78 -2 -16 41 -38 -44 31 -9 -49 -8 40 -34 26 90 -10 36 36
7458 36 -12 -3 16 25 -17 73 6 39 32 2 -52 21 11 -28 77 27 -57 111 21 -52 29 59 -13 18 23 9 22 10 -26 -45 6
7489 6 24 -62 -9 -42 -5 13 1 -26 43 38 -23 42 -10 9 10 10 -63 32 17 -19 47 30 1 -15 15 -24 32 -12 10 22 20 -5 55
7522 55 27 27 24 -36 28 40 33 -1 -40 28 -41 -29 84 -23 -28 -1 -4 -10 55 -4 -52 -9 -15 -6 59 3 -58 73 -16 38 53 18 -58
7555 -58 29 -14 -44 104 -4 -28 -88 65 4 -25 94 -20 -35 61 -9 -14 56 55 -58 21 -61 16 98 -25 -91 -42 -33 -134
7583 -134 -40 13 -19 6 9 -83 -52 74 68 59 94 -79 -44 108 -16 85 49 -56 -32 19 20 0 87 28 -20 43 32 -84
7611h4J13m7o1J10J5k4pr0R1L3K3j08J2O4%n7L1j1k9O4r7Q2O0j44P2O2q8KQ2o1
7641HM7n7m3NO3m8l0J05J4j14R7o9p2J34Lj50J77q6NP8o3mK2Nn0%L5o3j5J46j62
7672h2N8R2j2j24J56j38k2J89j19N4L1o3n6L2N8j67Q6P1m4M0J5j00M4O2j46N9
7698b6O6j05Q9M1k08J30O7k5l8K2N9j17N7Lp3J04Kj10J16l4o3J05m3j17J74q5
7724ikOL0o4L3J09j38k2J39j66Q3J16j78k0J80j33L6Oj4P2Jj05k8R6Mp2O3KlJ1
7754C3J0j27R9K5r1J20n5r1J26mq8L3P3j32J24kp4k8Q8k3l3R8j41j9J67j30MJ34
7782I6j06l4N4l8n6J27J9p5M3O8p1J7M5j82Q6J01j98R2P7j69N4O5l8LP7l6p8J11
7810E4o2l7N7L6j54J56j6j55J72J1j80J88p9p9P7P8j72J45M0j21J5Q3r8L8N4r3
$$ plain form
7611 -84 29 -18 -79 31 46 22 15 -75 16 49 72 -36 -24 40 40 -17 14 3 -26 38 -59 23 83 -61 11 73 -15 -13 69 8
7641 8 55 -2 -45 -40 23 -25 -55 50 64 -50 47 -22 -94 40 43 -107 70 -16 -11 67 4 0 22 27 -23 -23 12 -51 -66 80 -82
7672 -82 -24 68 56 -68 88 -50 -72 117 -2 52 83 20 -36 -4 54 -113 -27 44 0 40 55 -45 -1 61 -85 -26
7698 -26 40 -65 24 65 -143 -13 54 29 -9 13 72 -45 12 15 -58 46 48 -62 54 20 -43 62 19 -98 76 -9
7724 -9 -11 -5 25 -39 -6 103 -35 -57 82 -84 -1 115 -63 -83 97 -36 0 6 -8 64 65 -40 -68 28 32 -40 23 25 22 33
7754 33 43 -84 15 40 -51 69 14 -77 49 45 -43 -10 63 -69 55 53 -21 -49 39 16 -17 81 -60 -79 88 -42 -38 96
7782 96 -10 -44 10 -28 -84 43 62 -13 30 98 27 44 89 -93 -7 94 -104 -12 65 -104 -50 15 -23 -20 57 21 -57 54
7810 54 -8 -45 12 48 -106 50 34 -121 51 62 -118 70 -9 -88 -11 67 -105 40 80 -41 -26 57 -41 -3 51 -42
7836d2M2N6j21PK28k30L7J17j32j3J21j29K5R7j12%RO1j27J30K8j16J40J5j97
7861a06J29O8j82Q8P1o2k0N2nj9J19j31p2J43o9l1R5n2n8J18j19R0p4qMO1l0j7
7889a7n4K9m2pL2j5R9O5m07J18L56k18P9M5j1o1J04j43J6J09n9l5J25j20o3J38
7915F3p2m3Q1N9j62J52j05q7K13n8j25N5J01j84K13j8j07K5M4p8m5J65j25l0J90
7940A22k24R3J44j81o0K33k55J8K47j05n0Q5qj25o5R3Jl2K22k01l1j04R2p3K07
7965D3n9P8L5k05K4K54k01J73j13m5n5J44j20l6K48j14j92%M07l38K80l73M13
7988B48j52J01o58Q74n78J95pj8j93K21j8qm4j99K33l15P50m45J08J65m26O5M06
8011C05k97M1J06l40R9J74l11K44j89N14l83J43k54O9o8k61K67O6O0k73K36M22
$$ plain form
7836 -42 0 56 -65 -58 170 -60 -23 94 -38 -51 70 -59 -34 63 -49 -49 -40 21 -106 24 52 -64 76 91 -106
7861 -106 23 91 -91 -3 68 6 -14 38 33 14 133 2 -70 73 4 -27 68 16 -42 76 -43 47 -27 -35 -31 30 0 -17
7889 -17 -71 -42 -84 -91 -59 -74 25 90 -317 -199 157 -61 18 63 52 -9 95 -48 -32 77 18 -17 108 -12 -75 63
7915 63 -9 -52 29 88 -74 78 -27 -114 99 41 -84 -29 72 -112 101 83 -24 1 45 -33 -78 87 -38 -68 122
7940 122 -102 -9 135 -46 -106 127 -128 -110 137 32 -18 67 59 -66 -131 -38 -37 -69 153 -48 -79 -183 -91 -164 43
7965 43 -16 62 97 -108 -84 170 -31 142 29 -16 -71 73 -47 -83 165 51 -141 -141 266 -72 208 -165 248
7988 248 96 197 -461 413 -165 30 23 5 -188 33 15 7 -37 -236 -3 -318 432 -13 95 260 -166 -101 305
8011 305 8 49 155 -185 -86 88 -223 21 -168 346 -37 106 -148 -79 -147 -408 -141 -75 -15 -288 -52 370
8033C70o31K44K08l65J92j78J55K96k12j63RL65l61l61N62q7J12j47j87k18L63
8054c4q7J65j10J37m6J63k32l85M37J43l1m5n4j1J06j08l35Q6N59n8m43J31R7
8077D5K03J1m68M31k09q7K0n1J66q5J29Rj88L18l68qK15J09j06k90L72j92oM0
8101A0N4j51K45k66P4Q2n6l7J54k84M23k40r7P1R5q8m0J31j53n7O8J61j86J41
8125E4K7j81J61l2m3J12Qk95J51R5j30P9Np5KJ00J4o0J09j36n6J62j1j47J33K2
8151F8j21L9mq7J05m3km8K34r8J28r0k27J50J16j35k4J77l25L63L3k73k05K79
8175A0j55N5k9pQ7J56k45lJ95l1j41K54l41L44K96l62
$$ plain form
8033 370 -261 -17 191 -174 18 -160 -5 291 79 -84 -75 290 -71 -432 130 43 155 8 -179 -397 -34
8054 -34 -121 44 -66 71 25 188 -44 -429 8 151 120 75 21 10 116 8 -327 -241 318 260 -183 -52 45
8077 45 248 259 -209 222 13 -74 -54 -105 61 -24 105 114 -74 244 -124 -132 83 192 86 -204 168 -24 -30 10
8101 10 64 -87 158 -108 -34 48 -8 -45 109 -175 248 8 -89 -18 77 -11 -51 80 -73 -130 -62 99 -87 54
8125 54 81 -100 61 29 -14 98 106 -189 -38 57 -73 6 11 -64 -62 38 52 -8 101 -35 -91 71 60 -87 46 68
8151 68 -53 -14 -18 -105 0 -43 -45 -93 141 43 171 81 -146 4 120 -15 -39 138 -187 176 209 -64 -269 10
8175 10 -145 -90 -119 -126 -39 117 -128 -131 64 33 -108 146 -195 149 445 83
8191H3
$$ Imaginary data points
##PAGE= N=2
##DATA TABLE= (X++(I..I)), XYDATA
0@%%%%%%%%%qJ6j6J6k1K9l2M0n6P2q8J04j20J41j66J94k31K70l12L61m15M78n47
32b91O21p05P98r01J013j136J274j424J587j766J962k174K406k663K942l243L574
49A874l939M338m778N264n801O404p080P840q707R704j0864J2238j3892J5930
63H531j8511K1900k6579L3504m4954O8446j97517K46575M4205k28538K72316l30818
75a51440J36721K07326k77597M0910K800K2397J72084k42388R3177o732j40178
86a42920L39368j69380j89959K86195k08455R5702J67460l62020J34888J54100
96A04979j34376R4165j28729R693J39248q6332N2333j15406k3418K19541j71398
107c9700L0827Q2001k26526K14714N3280k28316J41446m7641j2351J53334j59854
$$ plain form
0 0 0 0 0 0 0 0 0 0 0 -8 8 -8 8 -13 16 -16 24 -32 40 -48 56 -64 77 -89 105 -126 144 -168 193 -222 256 -291
32 -291 330 -375 423 -478 535 -601 673 -751 836 -930 1032 -1142 1264 -1399 1543 -1700 1874
49 1874 -2065 2273 -2505 2759 -3042 3362 -3718 4122 -4585 5119 -5745 6493 -7399 8531
63 8531 -9980 11920 -14659 18845 -26109 42337 -155180 91395 135600 -92938 179378 -151440
75 -151440 -14719 192607 -84990 -44080 -41280 -18883 153201 -89187 3990 -2742 -142920
86 -142920 196448 27068 -162891 123304 -85151 10551 178011 -184009 -49121 104979
96 104979 -29397 64768 -63961 -54268 84980 -1352 50981 -64425 -87843 131698 -39700
107 -39700 -8873 73128 -153398 61316 114596 -113720 27726 -19915 -32266 121068 -38786
118c8786k2225O2583N921P2644j42463K3263R6091j10753J28567o1597j45733
129a32488K24078p6164p4305J46787j62655L3887J37272j29288K7703N7k5475
140c0591Q5326o0685k497p996k1004J23261j01854m7359J28160j12857N0443Q2430
152H4777j74764Q6005O7038j14419P8143j2976o8383P5766P056k7713k8983J7731
164a0722M6071n5516L4889K278q6869J15654j027j18096J00394r648o2957R2358
176D6809m0420n4587O5786K330k9731N004J6822k6394r6O1054o1074l1284R2939
189D7158n0877k3213P0910p2484K932P7316o4619j3593M8426k5508q248K8374
201A6574j0322l2569L0269K5913n5567K1806L1667o3900M3647L2037q2524M0091
$$ plain form
118 -38786 -61011 1572 7493 80137 -62326 -39063 57028 -53725 74842 13245 -132488
129 -132488 91590 15426 -58879 87908 -74747 -40860 96412 -32876 -5173 -5116 -30591
140 -30591 54735 -5950 -8447 -16443 -37447 85814 -16040 -63399 64761 -48096 2347 84777
152 84777 -89987 -3982 63056 -51363 26780 13804 -54579 21187 28243 530 -28453 -10722
164 -10722 35349 -20167 14722 17000 -69869 45785 44758 -73338 27056 17408 -45549 46809
176 46809 6389 -48198 17588 19918 -9813 -4809 12013 -14381 -14477 46577 -14497 -45781 47158
189 47158 -3719 -26932 43978 -28506 -25574 51742 -12877 -26470 21956 -3552 -11800 16574
201 16574 6252 -26317 3952 29865 -25702 -3896 27771 -36129 7518 39555 -42969 -2878
213b878L7979o2916K9872J9351m8466K6818K4736l6640k273L1246j6496j8331
225a7998L7049j5629l2255M9671r898m0126M8318j3077l3818N1040j5866l5949
237b8538M3673m563l0713K9892j84k7948K4326R642l3090J5867K1251l5986J1886
250d485K7766l9945Q151L3500l8588L299L4175l6562O45L6617l2900q607L9122
263B2188k3431j8650L9185j5697k6406L9929q413l4282L9723p36m0258L7609O342
276A7103m2776L1150J4132m2201K2996K0627m0504J5104K7068l8470N673L4467
288B4369l5645m139L9824l1547j1577M2098k6364j8249M3240k0830k4571M2208
300A8817j2760l0094L7955k689l4812L2635O388l7906K6722J4659l9670J9798
$$ plain form
213 -2878 35101 -27815 2057 21408 -27058 -240 24496 -12144 -14417 16829 333 -17998
225 -17998 19051 3422 -28833 20838 10940 -29186 19132 6055 -27763 23277 7411 -28538
237 -28538 15135 10572 -20141 9751 9567 -18381 5945 15587 -17503 -1636 19615 -16371 -4485
250 -4485 23281 -16664 -8513 24987 -13601 -10302 23873 -12689 -12044 24573 -8327 -16934 22188
263 22188 -1243 -19893 19292 3595 -22811 17118 8705 -25577 14146 13410 -26848 10761 17103
276 17103 -25673 5477 19609 -22592 404 21031 -19473 -4369 22699 -15771 -10098 24369
288 24369 -11276 -15415 24409 -7138 -18715 23383 -2981 -21230 22010 1180 -23391 18817
300 18817 6057 -24037 13918 11229 -23583 9052 15440 -22466 4256 18915 -20755 -957
312i57K2744l9967J2590K8706l7299M609L2021l2203l284L4246k6822j0143L5236
325A9477k0214j7167L4698j3161k2869L3181p271k5809L0089j881k7229K6266
337H110K896k8116K1894P561k7423J6321J2041k6123J1232J6355k6382P063K0498
350A5927k5709K595K3579k4940n19K6145k3749m110K6278j9410p571K5264j5295
363a515j1777K5380r099j7349K2978k320k1581K2717J864k6687K2840O693k8801
376a6657K0476Q549k8894J9356J1081k8337J3142J4528k3040O181J7202k1602
388h015p73K4962j9270j0429K8850j6578j3614L2819j8645j7606L4725j3610j8549
401a5733K8183r829j7250K4798k169k2249J5736J0714k2807Q753J7077k9082Q437
$$ plain form
312 -957 21787 -18180 -5590 23116 -14183 -9574 22447 -9756 -13040 21206 -5616 -15759 19477
325 19477 -737 -17904 16794 3633 -19236 13945 6674 -19135 10954 9073 -18156 8110
337 8110 11006 -17110 4784 12345 -15078 1243 13284 -12839 -1607 14748 -11634 -4571 15927
350 15927 -9782 -7187 16392 -8548 -9067 17078 -6671 -10781 15497 -3913 -11484 13780 -1515
363 -1515 -13292 12088 2989 -14360 8618 6298 -15283 7434 9298 -17389 5451 12144 -16657
376 -16657 3819 12368 -16526 2830 13911 -14426 -1284 13244 -9796 -3615 13587 -8015
388 -8015 -8788 16174 -3096 -13525 15325 -1253 -14867 17952 -693 -18299 16426 2816 -15733
401 -15733 12450 2621 -14629 10169 8000 -14249 1487 12201 -10606 -1853 15224 -13858 -5421
414e421K6885l3380K411K8365k9714M349K5314k9247O18K4913j6820p243J6834
427G864p383j0941J9275j241k4030J9888R048k6919J9250M886k8644K5686O782
440A3521k9273J7142O734j7817J3469M004j7631N519J5108j1448p982J6295r838
453b197o604K3877j7142j3422K8228j1571j0223K0170j5766m950K1799r813j1382
466h996J0738J379p013P471J770j6715J0667J4688k1893M552J2222j9821J4455
479C504R901k6964J0644J3251j5166O069L568j3476O931J2377j0849r382J3714
492D122j573q633J6110j1026j4558K7357m973j9230J8848o419j0256K2382q097
505D054j8126J5770O199j2351M838M018j4193R023J5485k1593l068K0222j3727
$$ plain form
414 -5421 21464 -11916 -9505 18860 -10854 -6505 18809 -10438 -9820 15093 -1727 -8970 7864
427 7864 481 -10460 8815 7574 -16456 3432 12480 -14439 4811 9697 -18947 6739 13521
440 13521 -15752 1390 8124 -9693 3776 7780 -9851 -4332 10776 -672 -8654 7641 -2197
453 -2197 -8801 15076 -2066 -15488 12740 1169 -9054 11116 -4650 -9600 12199 2386 -8996
466 -8996 1742 3121 -3892 3579 5349 -11366 -699 13989 -7904 -3352 8870 -10951 3504
479 3504 13405 -13559 -2915 10336 -4830 1239 4807 -8669 -1738 10639 -210 -9592 4122
492 4122 2549 -6084 10026 -1000 -15558 11799 6826 -12404 6444 25 -10231 12151 4054
505 4054 -14072 1698 7897 -4454 384 4402 -9791 -768 14717 -6876 -9944 10278 -3449
518c449J64J5372k1433k61K3936j3629r667J3930o907l475J5972q842j5434J7162
532C439N830j6186Q621J864j5040J6828O733k3687P832J2518j3624O541N564j7742
546a0509P211J5948j4367n181J1654o932m76J2733j2386q979J8632j808j2285
559f745J0418l717q276J7014k882j7079J1988M857r732P922j632j1294J1033O572
573H447j2287kO646n037K756O075j2049j024J4761p617n353R254r068R57J3660
588A0119j2337n324J2219m819j583O390p541k829J0346j80r866M398M192p584
602d399P400K543j5244R530Q769j4368O102L817j1737J0042M685j2860K854P124
616D258m821p90N074n559l798J2479l895j1223J2599k359q432J3962o594j0152
$$ plain form
518 -3449 -3285 12087 -9346 -9607 14329 700 -8967 4963 -1944 -5419 10553 1711 -13723 3439
532 3439 9269 -6917 1704 3568 -11472 5356 12089 -11598 -3766 8752 -4872 1669 7233 -10509
546 -10509 -3298 12650 -1717 -6898 4756 -2176 -2652 10081 -2305 -11284 7348 5540 -6745
559 -6745 3673 -44 -8320 8694 5812 -11267 721 5578 -4154 3768 2136 -9158 1875 8447
573 8447 -3840 -3842 2804 -2233 523 6598 -5451 -6475 8286 669 -4684 4570 -4498 -3541 10119
588 10119 -2218 -7542 4677 -142 -1725 4665 -2876 -5705 4641 4461 -5405 -1007 3185 -4399
602 -4399 3001 5544 -9700 -170 8599 -5769 333 4150 -7587 2455 7140 -5720 -2866 4258
616 4258 -563 -1353 3721 -1838 -5636 6843 2948 -8275 4324 1965 -6467 7495 901 -9251
630i251J5042k449q668Q289k123n220P042J831q878J528Q848p880j200R765j1316
645d640K61J4153j3211k005J2412j0004J93R278r186j680Q572k598n317M684J421
660B333o837N819L751j1719O334O414j1785O080M142j0528O556M529r515L620
674h06M011n013Q79L632l702k350O817k491n284P709k453n241Q593l693n476Q315
690C447k410m502O066j998l832N292n59m272L188J940m557K123L273o220K045
705i76N106o859J519N106o570J644N178n928K95M644m155r91M719l212k157N411
721B774k207l836N574j218m687N876p58n364N397L45n507N020J033n753L571K596
737B856n932K423L906n803J001N512n754m86O449n525j313O334m292k795O800
$$ plain form
630 -9251 5791 3342 -5326 2963 840 -4380 2662 4493 -4385 -2857 5991 -1889 -3089 6676 -4640
645 -4640 -4379 9774 -3437 -5442 6970 -3034 -2841 6437 -2749 -4429 4143 1545 -3772 912 2333
660 2333 -4504 1315 5066 -6653 -319 6095 -5690 390 4532 -5996 560 5089 -4426 -806
674 -806 3205 -1808 -929 2703 -999 -3349 3468 977 -4307 3402 949 -4292 4301 608 -4868 3447
690 3447 1037 -3465 2601 603 -3229 2063 1504 -2768 420 2360 -2197 -74 3199 -3021 -976
705 -976 4130 -2729 -1210 3896 -2674 -1030 4148 -1780 -1485 3159 -996 -1987 2732 -480 -2637 2774
721 2774 567 -3269 2305 1087 -3600 2276 1518 -3846 1551 1896 -3611 1409 2442 -3311 260 2856
737 2856 -3076 -653 3253 -2550 -1549 3963 -1791 -2277 4172 -1353 -2666 3668 -624 -3419 3381
752C381l162l629N763j307m982N902L01o185N250J625o563M009K618n918K561
767c36L700n787J113M484m839J2M851m206j308N408l316k537N540k394l250N236
783B371j330l727M528n36l900L788N62m327L296J590m672K603K083m491J375L214
799B427l916N38L390l785j5L664l206q85M022k517j693L896j973k104L829j386
815B86k441L461o75k734L142j56k870K661N75l171K221J358l563J898J857l653
831a804J556K358l789J151K634l494O55K792l058j74L207k338j430L650j689k333
847b106M063j163l423M417n44l905M171j83l872L672N79l893K369J693l337J011
863d51K580l341q5L999l439j241M572l245j400M880l390j753M708k400j948L429
$$ plain form
752 3381 219 -3410 2353 1046 -3936 1966 2267 -3918 1332 2957 -3606 403 3021 -2897 -336
767 -336 3364 -2423 -1310 3174 -1665 -1653 3198 -1008 -2316 3092 -224 -2761 2779 385 -2865 2371
783 2371 1041 -2686 1842 1306 -2594 1194 1756 -2571 725 2315 -2357 246 2329 -2162 -787 2427
799 2427 -1489 -951 2439 -1346 -1361 2303 -903 -1788 2234 -283 -1976 1920 -53 -2157 1672 286
815 286 -2155 1306 631 -2103 1039 883 -1987 674 1249 -1922 299 1657 -1906 -8 1849 -1804
831 -1804 -248 2110 -1679 -528 2106 -1388 -733 2059 -999 -1173 2034 -304 -1734 1916 227 -2106
847 -2106 1957 794 -2629 1788 1244 -2661 1510 1327 -2545 1127 1706 -2187 182 1875 -1462 -451
863 -451 2129 -1212 -1297 2702 -737 -1978 2594 -651 -2051 2829 -561 -2314 2394 -6 -1954 1475
879A475j243k091K836K61l317J948K209l962J424K880m865J749L732n262J282
894i44L358m168J212K635l508K22K830j478j617K179p3k548L088M97m614L688
910G59J295m608L681K20m146M174K28l531K311K28j240J065L32j327n96K716r26
927F35k442L230j485j787M794l347k200N150k949p57L334l486J54L005j730r95
943h76O74P61r17L27J595l609J091M139m948Q54L329n187L159K708o056K505K200
960A749l019J711K11j826M86J864k4l442K374J649m089M014k52n714O419k7n307
977c223M951j626k574M895j790k587J858J051m89j415J987j458j763N787l594
992A0l740O929l477j818O026n768p62O057l726q60J931j304K51R64O69l078J76
$$ plain form
879 1475 232 -1859 977 1238 -2079 -131 2078 -1884 -460 2420 -2445 -696 3036 -2226 -944
894 -944 2414 -1754 -542 2093 -1415 -1193 1637 159 -1458 721 648 -1900 1188 1685 -2929 759
910 759 2054 -2554 1127 1347 -2799 1375 1603 -1928 383 611 -629 436 768 -559 -1155 1561 635
927 635 -1807 1423 -62 -1849 2945 -402 -2602 2548 -401 -1158 2176 -1310 -1156 1849 119 -876
943 -876 -202 559 -358 -31 1564 -2045 -954 3185 -1763 -909 2420 -2767 392 3100 -2956 -451 1749
960 1749 -1270 441 652 -1174 -688 1176 1152 -2290 84 1733 -2356 1658 1406 -4308 2111 2084 -3223
977 -3223 1728 102 -2472 2423 633 -1954 -96 955 466 -949 1038 -420 -2183 3604 10
992 10 -3730 3199 -278 -2096 3930 -1838 -2600 3457 -269 -1129 802 -502 -251 713 1382 -1696 -1520
1009a520M902m396m89M473n942K672M698p597K292L345m402L129O6l557K213J218
1025A105k79j968L85K100k801K643M96n904N593J219n703M943j785l304O490k617
1041F13l147L339r90K84N18p43p44m49L733k025l408N133k700j094N672o125m82
1058b615O298m765L95K596m147K073K255k147j091O02J966j834L27J838m790L431
1074C92L379o938L204K266n470N209J00n716M238J068k676J204P3j014j13K848
1090B054j448l941N162n41m213N744k862l854P479k892l821N132k099j642L607
1105A865j406k500J850K211k758o48L565l723J68N137n714k96N698n006M34L889
1121B766m901J008L645l144p50K206m81j534K074J41l558L178J658n000L157J346
$$ plain form
1009 -1520 3382 -1014 -1503 2970 -2972 -300 4398 -3199 -907 2438 -1964 1165 1231 -2326 -113 1105
1025 1105 826 -1142 -757 1343 -1458 1185 1681 -4223 1370 2589 -3114 1829 44 -3260 3230 613
1041 613 -2534 805 -185 99 617 -126 -870 -1319 2414 389 -3019 2114 -586 -1680 3992 -2133 -2615
1058 -2615 3683 -1082 -687 1909 -2238 -165 2090 -57 -1148 -546 1420 -414 -87 1751 -3039 392
1074 392 3771 -3167 37 2303 -3167 2042 2142 -3574 664 1732 -944 260 333 -681 -794 2054
1090 2054 606 -3335 1827 1286 -2927 2817 -45 -3899 3580 688 -3133 1999 -100 -1742 1865
1105 1865 459 -2041 -191 2020 -738 -1386 2179 -1544 -1376 3761 -1953 -2249 3449 -1557 -1123 2766
1121 2766 -2135 -1127 2518 -626 -1376 830 349 -1185 889 1030 -2528 650 2308 -2692 465 1811
1137A811m735M376M62n110M001P25l452K318P13k520R84K256k349r98K954j459
1153b3j580M142k697k247N146k958j669M312k891j309L958k336j651L114o13k176
1169a478K218J26k740K281J367l840J997K102m102K055K239m581K069K767m390
1184a910J285K777l725O37L177l270n76L786k407j904M189j858k805M646j229
1199H13l760M639m19m120M152K25m313L584J225m479K581K165m394J672K961m218
1215a686O30L769l907l29M305l679j029M691l114j884M728k357k551M609j606
1230E90l063M146m97l727L713M72m077L102J368m389K426K304m573J797K917m347
1246a838J039L310l968K90L576l346o65L789k712j382L904j963k157L922j344
$$ plain form
1137 1811 -2924 1452 1914 -3196 805 1530 -1922 396 1109 -1411 -427 1829 -520 -1518 1436 -23
1153 -23 -1603 2539 -158 -2405 2741 -217 -1886 2426 -465 -1774 2184 -152 -1803 1311 698 -1478
1169 -1478 740 866 -1874 407 1774 -2066 -69 2033 -2069 -14 2225 -2356 -287 2480 -1910
1184 -1910 -625 2152 -1573 -936 2241 -1029 -1605 2181 -226 -2130 2059 201 -2604 2042 813
1199 813 -2947 1692 1273 -2847 1305 1530 -2783 801 2026 -2453 128 2293 -2101 -429 2532 -1686
1215 -1686 -1056 2713 -1194 -1523 2782 -897 -1926 2765 -349 -2233 2495 138 -2413 2196 590
1230 590 -2473 1673 1176 -2551 1162 1634 -2443 659 2027 -2362 64 2368 -2205 -408 2509 -1838
1246 -1838 -799 2511 -1457 -1167 2409 -937 -1602 2187 -525 -1907 1997 34 -2123 1799 455
1261D55k724L734p12l082L586k81l209L170L03l327K707Q10l437K287J443l581
1277a858J764K078l723J286K653l794Q01L193l819K87L548l486l64L782k899j209
1293a760L972k194k207M158j418k995M202p04l760M212om200L774O77m352L267
1309F66J391m375K273K373m165J190L177m084K41M205m017p95M775l691j348N089
1325B905l437j910N049k584k493M389j384l035L921q9m098L371J557m745K641
1340E8K522n436K651L368n837J959L586m920J392L219m119K51L489k442j541L369
1356A569j181k567M068q93m074M746j45m316M532q71l777M816o68l619L219J58
1372I97k375J974N13k597R55K746k945q32L760l325j10M546n047j11M995m310
$$ plain form
1261 455 -2269 1465 753 -2329 1257 976 -2233 937 1240 -2087 620 1430 -2007 280 1723 -1858
1277 -1858 -94 1984 -1739 -453 2200 -1594 -793 2400 -1419 -1132 2416 -1070 -1434 2348 -551 -1760
1293 -1760 2212 18 -2189 1969 551 -2444 1758 1054 -2706 1506 1500 -2700 1074 1751 -2601 666
1309 666 2057 -2318 -45 2328 -1837 -647 2530 -1554 -1313 2892 -1125 -1920 2855 -836 -2184 2905
1325 2905 -532 -2442 2607 23 -2470 1919 535 -2500 1421 1332 -2766 605 2162 -2583 58
1340 58 2580 -2856 -205 3163 -2674 -715 2871 -2049 -657 2562 -1557 -1306 2183 -259 -1800 1569
1356 1569 388 -2179 1889 996 -3078 1668 1523 -2793 1739 868 -2909 1907 1239 -2380 839 997
1372 997 -1378 596 1109 -1488 -533 2213 -732 -1564 2196 -1129 -1239 3307 -1740 -1851 3144 -1166
1388a166J67L389m208R90L216k786j018K040Q0j820J889L80m074L647K088n911
1404c097L545J447n157N153R2n669M506Q07l256K268j17k087J395K205k287k296
1420b548M416j473k646N369m045k632P726m150l109N939l906o95M943l633k004
1435b448L387N97k416L63K160l740J687M588p138J005O117o578K103L777p257
1450c793L383M066n276P27J801j363K38J523p38l485L882K165o272L729J220n667
1466c860O651n64o840O131k3l534L991k239j838L073N88j780j668K752k64j997
1482a421M004l718k311P576m235k675N644m932R54N002n719n1L240j367K66j59
1498I8m94p97J501K526n113P03M355m845K870J728o951N212K476n797L338l60
$$ plain form
1388 -1166 -999 2390 -1818 -828 2388 -398 -1416 624 704 -1116 773 1153 -2921 726 2814 -3097
1404 -3097 448 1895 -3262 1891 1983 -3686 820 1627 -1629 639 522 -1565 -170 2035 -252 -2548
1420 -2548 1868 395 -2251 3118 -927 -3559 4167 17 -3092 2847 -1059 -1754 3189 -444 -2448
1435 -2448 939 1536 -880 -517 1643 -2097 -410 4178 -2960 -1955 4162 -2416 -313 3464 -3793
1450 -3793 -410 3656 -1620 -893 908 -455 -217 1306 568 -2917 965 3130 -3142 587 1807 -3860
1466 -3860 2791 2227 -4613 1518 1495 -2039 1952 -287 -2125 948 1536 -244 -1912 840 576 -1421
1482 -1421 2583 -1135 -3446 4130 -105 -2780 2864 -2068 -1114 3888 -1831 -1882 1358 -9 257 98
1498 98 -396 -1193 308 2834 -2279 -1576 2779 -2066 804 2532 -4419 793 3269 -2528 810 450
1514D50k727M129n84k659K38J991L73k317J941r15k697O247k444n146O639k377
1530A42k391O050n000k038O209k353j963J902p95n99J581J257m103K30N441m586
1546a016m72M634o199K042N774p321P70M494m363J634K149l863J40L223l22l222
1562a918J780J534l707L696R61o643N030K236o107M328J15m704N068L48m388K120
1578b51J413j681J88J599k007j243M598k019l571N141k081k452N590l656k554
1593b986N690k460j847L145j962q19K554l46k455J080K075k589M30K488m042J433
1609f11L641m974J143K928m057K112J859m073J664J957k266J97J286j214o04K433
1625A421j054k559L483l99l148M048j314l309M920j191l494M056q49k610L249
$$ plain form
1514 450 -2277 1852 1268 -1391 -1153 838 1211 -1106 835 -80 -2777 3470 1026 -4120 2519 142
1530 142 -2249 3801 -1199 -3237 2972 619 -1344 558 -237 -836 745 2002 -2101 -1871 3570 -1016
1546 -1016 -1488 3146 -3053 -1011 4763 -2558 -1788 2706 -1657 -23 2126 -1737 -1597 1626 1304 -1918
1562 -1918 -138 1396 -2311 1385 2346 -4297 733 2969 -3138 1190 1305 -3399 1669 2017 -2371 -251
1578 -251 1162 -519 -331 1268 -739 -1982 2616 597 -2974 2167 86 -2366 3224 -432 -2986
1593 -2986 2704 244 -1603 1542 -420 -1239 1315 969 -1486 -406 1669 -920 -490 1998 -2044 -611
1609 -611 3030 -1944 -801 2127 -1930 182 2041 -2032 -368 1589 -677 -480 806 -408 -1012 1421
1625 1421 367 -2192 1291 892 -2256 1792 478 -2831 2089 898 -2596 1460 611 -1999 1250
1640A250l23k846K101J465l011P60K562l329L10L780m235j10M456m065k02M032
1656B595l786l87M026k894j352L478j395k158L183k59l383L295Q43m291L046J468
1672B029m597K996J856m670K477K132m116J515K533l533L73L247k989q91L772
1687B134k309j899M252k001k566M356j432k939L968q13k998L347j5l124K648Q40
1703A449l203J830J601l279J306K214l375Q37K498l089L77K700k860L9K717k451
1719f89m37K713j933j022K843j430j570K863r99j958K762n62k362K866l04k570
1735a789K611J76k687K276O19k821J921J113k969J505J700l016R29K338l110N31
1751f73K558k859o7K934k543o40L195k228j176L250j690j781L224j082k357L173
$$ plain form
1640 1250 927 -1919 182 1647 -1364 -604 1958 -1371 -1061 2719 -1516 -1626 2830 -1235 -1437 2595
1656 2595 -1191 -1578 2448 -446 -1798 1680 285 -1873 1310 1051 -2332 963 1806 -2485 561 2029
1672 2029 -2568 428 2284 -2386 91 2223 -1893 -378 2155 -1378 -1005 2242 -747 -1638 2134
1687 2134 -175 -2074 2178 177 -2389 1967 535 -2404 1564 751 -2247 1100 1085 -2039 609 1449
1703 1449 -1754 76 1677 -1602 -296 1918 -1457 -620 1878 -1211 -834 1866 -994 -955 1762 -689
1719 -689 -1126 1587 -346 -1368 1475 45 -1525 1338 339 -1619 1143 581 -1781 1085 781 -1789
1735 -1789 822 998 -1689 587 1206 -1615 306 1419 -1550 -45 1655 -1361 -432 1906 -1204 -673
1751 -673 1885 -974 -1041 1893 -650 -1290 1905 -323 -1499 1751 61 -1720 1504 422 -1935 1238
1767A238l85k925K956L91l429K719J074l674K214J697l772J623K300l630Q68K807
1783B072l234O2L226k788r51L588k109j790L702j564k355L809r64k933L554l51
1799I74l060L089J03k984K434Q97l028J436J719k789P44K267k968K24L039k986
1815h89k00K991k656l41L010k445p20K669j496r31K013q02j508K185K8k406J867
1832C69P88k721K077P70l231K367J070l078J944N76k297J740N94k001O60J260
1848H87j134l37J533j309q22K842j795j516L145j837q75L126k661p34L177j820
1864a30q47J877j118o27J648j18k029J231J617k660R82J782l634K045K395m360
1880a946J556K069l169J764J198k948R60J923j371j015J590l05j683K778n03l542
$$ plain form
1767 1238 853 -2072 884 1275 -2154 565 1639 -2035 179 1876 -1896 -273 2027 -1603 -735 2072
1783 2072 -1162 -1100 2126 -662 -1613 1975 -134 -1924 1778 214 -2141 1668 704 -2229 1325 974
1799 974 -2086 1003 1106 -1878 556 1453 -1575 -139 1580 -1209 -465 1802 -1166 -942 2097 -889
1815 -889 -1089 1902 -754 -1095 1915 -530 -1250 1419 -77 -1008 1005 203 -1305 880 908 -1498 369
1832 369 1157 -1564 513 1283 -1948 419 1489 -1589 355 931 -1366 374 968 -1033 -373 887
1848 887 -247 -584 949 -360 -1182 1660 -135 -1651 1494 -343 -1218 1908 -753 -1487 1690 -130
1864 -130 -977 900 -218 -845 803 685 -1344 -113 1504 -1156 -174 1608 -2026 19 2414 -1946
1880 -1946 -390 1679 -1490 274 1472 -1476 -516 1407 36 -979 611 306 -1377 1401 898 -2644
1896b644L850J88l561L528q42k911M051o03k960K285K17j166Q52M63j625m0K799
1913A881j836j810L328j898j045L960l535j115M279k468o84K213k143J10J983
1928A220q42j440N52J574j441M4J623l045J399K794m011R60K068l023K196Q29
1944A457l340J795J003j107K94k57j17L0J059j99k323K084P81k370K265j033k101
1961b079L927j287k126K536j427j39K123j838o93J185M45m61o86Q71q72J50K363
1978A992l000l59L193k592M57K008l597J579K252k730L75P99q29O03N29o35j370
1995a325J657J095k697J299R54k926L028K46l646K684O19k193K055m70j854J884
2011D10O26j408n64J450l79r95K154j504j767L764j304k154L000j602r88L165
$$ plain form
1896 -2644 1206 1394 -2167 1361 519 -2392 1659 1056 -1904 381 598 -568 284 747 -878 -918 1881
1913 1881 45 -1765 1563 -335 -1380 2580 -955 -2070 2209 -259 -943 1270 -873 -763 1220
1928 1220 378 -1062 -510 1064 -377 -333 1290 -1755 -356 2438 -1573 -613 1455 -1568 628 1457
1944 1457 -1883 -88 915 -192 102 -155 -272 -242 817 618 -1705 379 1160 -1210 1055 22 -2079
1961 -2079 1848 561 -1565 971 -456 -595 1528 -310 -1003 182 627 166 -520 351 -521 -371 1992
1978 1992 -1008 -1367 1826 -766 -309 1699 -1898 -319 1933 -797 -422 377 -452 151 680 45 -1325
1995 -1325 332 1427 -1270 29 983 -1943 1085 1331 -2315 369 988 -1205 850 380 -1474 410
2011 410 1036 -372 -936 514 135 -860 1294 -210 -1977 1787 483 -1671 1329 -273 -1261 1904
2027A904j957j413K220l43p95N53J74j125O29J719k302l41K552k128K02K061k973
2044a363P41K339k357J84J141j295N83P68q59o97J003O00j424P60L90j704J884
2061F94L15k511J783L61j633J773n35j349J629L6r97L78K30m34J51P58r24n45
2079h20J669q36p50J642j427j81J937j595l68J558j171RJ021r87k45J021o8j034
2097f25P43L69j323J110N22j902J209R05j982J114O54j806J208P21j611M45R46
2114F97j029NJ143j109m81J686p29j211J866o27j246J967o71j403J817j25j577
2131a027J369K25j484J065O60j553M96J229j514J66J376j516p0J632j310m64J640
2148I20j086n27J472p48q19J425l34j103J210M3j145R51K93j378R60O19j475O76
$$ plain form
2027 1904 -53 -1466 754 411 -384 169 343 -782 -153 1566 -736 -1077 1475 -653 -451 1610 -1363
2044 -1363 -622 1717 -640 -456 685 -610 -27 741 -118 -815 188 788 -636 124 514 -1190 694
2061 694 1009 -1502 281 642 -991 782 247 -1102 527 563 -434 -56 174 -260 -109 649 -275 -820
2079 -820 849 13 -737 905 -522 -703 1234 -361 -729 829 -342 -333 688 -299 -544 477 409 -625
2097 -625 118 487 -836 274 796 -1106 103 1008 -974 140 794 -1012 196 917 -694 -249 697
2114 697 -332 -327 816 -293 -774 912 183 -1028 838 211 -1035 932 261 -1142 675 550 -1027
2131 -1027 342 567 -917 148 808 -745 -249 980 -534 -368 1008 -508 -578 1054 -256 -720 920
2148 920 -166 -693 779 31 -788 637 303 -800 410 453 -692 259 552 -826 134 753 -722 -46
2166d6P19j250M18Q73j161J92Q92j060N3J025r28j63J014o73l60R59m84n24R47
2185D43l09o41R23k09p68R18o0q15Q08L8q23P01J39p75N32L03q60M85M41q79L20
2206h8N68q79K40P12q79O4Q50r09o5R65p36l56J074o01m65J004l60p56J078k26
2226B35q71R40P5j049Q39L77j208P41M77j131N23O81j108K56Q48j011j6J064q73
2245b11l12J178p34n44J282n69p61J144k69q10J019q3r67P90L05r92N82M98j003
2264d57L07Q06r89R7Q93j009Q8Q70p95j41Q66o22k90Q05m02m17O54m9o77N89J70
2285B97p47N86K13q52O09K74q18N29J99o52M27J34m39R2L59l15n2K81j33k83O76
2306C85m28l19O79l35l70Q27o53p1P51n07k98L27Mk07M12j0m17K56K35m40J93
$$ plain form
2166 -46 673 -577 -159 714 -447 -255 637 -423 -370 655 -273 -436 578 -95 -455 504 20 -504 443
2185 443 134 -507 416 207 -561 357 297 -518 290 328 -495 206 345 -430 102 405 -455 30 471 -408 -88
2206 -88 480 -399 -159 553 -326 -262 588 -321 -386 579 -157 -513 561 -40 -505 499 139 -617 461 235
2226 235 -636 304 379 -670 169 546 -662 79 556 -575 -52 629 -479 -223 625 -386 -402 662 -211
2245 -211 -523 655 -79 -623 659 90 -671 473 204 -606 413 330 -637 153 458 -534 48 546 -457
2264 -457 -150 656 -333 -236 657 -352 -264 606 -189 -330 536 -86 -376 429 27 -390 264 215 -462 127 297
2285 297 -450 136 349 -503 106 380 -438 91 290 -362 65 199 -240 -148 211 -104 -156 125 -8 -291 385
2306 385 -43 -362 317 -18 -388 439 -214 -285 466 -41 -339 -12 -8 -215 197 187 -230 26 261 -179 14
2327A4K88o83L89M49r53M33M94p50M06K32p05L40L61m19m4L10j15k28N12k20n85
2348d74Q15o1p93Q64j94o97R93k26p45P06L8m53L02J43n10J47O13m98l91P77l96
2369d0l28R26p37m04J065n30k79O22m14j56N70j79m09J64L82l49q2M82o47K01
2389a42P20q51k9P08o93L16L73p26J28M61k34j20N9J4r7K65R9o98M61L60o45M16
2411A45M5o99P03J40o55L77Pk21L41r4k46J3L29M3m81K62Rk36N78l53m55P55k92
2434A5k04N42n75L6M85l22o1R3r4J37J8%k93N2N80n30NL33n73L78M10q62L05L94
2458B69n27L56rl87K67J73j04k80K18J66l95M38J2o97P04J30p31O00p2n04O95
2479C22j18m70L60Q4k15j6J54j77j31N51l09m70P10k09m00P31n33k98Q46l68k92
$$ plain form
2327 14 302 -381 8 457 -496 -63 431 -319 87 319 -386 -46 315 -104 -148 162 47 -181 331 111 -474
2348 -474 341 280 -513 351 157 -540 453 227 -518 188 226 -227 75 218 -292 -145 468 -30 -421 356 -40
2369 -40 -368 558 -179 -583 482 -48 -327 295 -119 -275 295 116 -293 -129 253 -96 -178 304 -343 -142
2389 -142 578 -273 -302 406 -287 29 402 -324 -196 265 31 -89 -30 -16 -113 152 251 -447 14 374 -271 145
2411 145 190 -509 194 334 -321 56 63 -158 183 89 -157 -144 185 228 -253 9 18 -218 360 7 -448 307 15
2434 15 -189 353 -222 -186 299 -23 -84 9 -85 52 70 70 -223 -171 409 -121 -116 217 -356 22 432 -430 -125 269
2458 269 -258 98 89 -298 -31 142 38 -242 -24 142 -253 185 197 -500 204 334 -397 203 131 -373 322
2479 322 204 -266 94 178 -37 -53 101 -76 -207 344 35 -435 275 66 -334 397 -136 -434 412 44 -248
2500b48L85k49k4K84j2l60Q4M11k83j45M31n30P0O82p64RN55m46Q1L40m70M9L62
2523B12j54k44J64J17j93Q5K12n62K88L80n83L39J28n52N10J02n31K60R8k04K07
2544G9K6k59Q7K38n0l50M18j30k38M65k61l40N74k00k95M88l21j92N33j46k85
2565a59K35N1k57J37J28l48J16M20m93K2M39m64O7M71o06Q5M25l96j5L03k06j64
2587b09L92j18l04L40N5m15M09K8n63M45J69n86M33J45o01L92K63n62K40L28m78
2608a97O5L61l47j25N50k96l25O19k84l93O27k03m60O39j15m58M43P4m60L26K44
2629B85m81J80L77n10Q2L82n30Q9M68m66j0M75m12r2M55l62j68M81k39k15L86
2650A75j14l69N06j40l64M66j1m59L89J18m64L47J27n07K98K32m77J77L23m63
$$ plain form
2500 -248 137 -112 -136 148 136 -224 -140 271 -12 -157 274 -256 -186 496 -268 -259 296 -150 -69 271 -199 -150 212
2523 212 58 -186 -22 95 -98 -13 199 -363 -75 305 -278 61 189 -363 147 249 -282 -22 76 -128 79
2544 79 105 -154 -67 171 121 -229 189 59 -179 286 25 -315 259 59 -236 252 -69 -261 272 126 -159
2565 -159 76 127 -130 7 135 -213 -97 323 -170 -148 291 -173 -106 365 -241 -156 269 -127 -142 161 -45 -209
2587 -209 183 65 -239 101 156 -259 150 178 -385 60 229 -357 76 221 -380 12 275 -287 -47 281 -197
2608 -197 -132 229 -118 -243 307 11 -314 305 21 -372 255 52 -408 231 116 -342 101 175 -285 41 285
2629 285 -196 -16 361 -149 -67 315 -215 -126 342 -124 -134 341 -71 -163 292 -70 -238 243 4 -211 175
2650 175 61 -308 198 58 -306 160 149 -310 79 197 -267 80 207 -300 -2 230 -247 -70 253 -210
2670b10O6M29m44k6M66m03r6N66l77k55N41l17j22L76k78j10J82K16n03L06j99
2691a92l61O96J27n92L24K42n42K38M11n82J41N00o12R2M56m99p7O61m80k11N53
2712B93k65l89O95j61n38O52p7o40O17P8o32M81K35o97L81K73n82J30M52n38R9
2733a33M91n23o3N61m19k62O73l65l00O66l36l23N72k00l30N18j26m15M51P0m63
2754b56L08J88n46L39K62o55K51M53o68K66M09o31J80M34n37J7M62l26j51N19
2774C18k77l65N66j06n14O41j61n62P23r4n81O33o6m73N27o2m57M18J42m18J12
2795e6L42m63Q9M84o57m9Q36p13r9P53p44mP44o21j08N04k36k50M24j28m81N48
2817A15K47q16M65L69q63N88L62j050O17M59q88M19K35o52L98L32m22k30N27k6
$$ plain form
2670 -210 -144 285 -159 -185 281 -122 -218 348 -29 -284 257 -60 -182 194 -84 -194 -12 204 -299 7 -192
2691 -192 -553 143 270 -322 2 244 -298 -60 351 -231 -90 410 -202 -110 346 -153 -230 431 -49 -260 293
2712 293 28 -361 334 173 -365 287 210 -430 187 265 -367 114 349 -348 33 306 -276 -146 306 -232 -133
2733 -133 358 -165 -228 333 -86 -348 325 -40 -340 326 -10 -333 239 39 -291 227 101 -314 137 207 -256
2754 -256 52 240 -306 33 295 -360 -109 344 -324 -58 351 -280 -100 334 -203 -186 276 -50 -201 318
2774 318 41 -324 242 136 -378 263 102 -460 263 169 -412 221 155 -318 209 147 -310 108 250 -168 -56
2795 -56 286 -177 -88 396 -261 -310 526 -187 -286 467 -277 -281 463 -158 -266 238 2 -248 176 48 -433 115
2817 115 362 -454 11 380 -483 105 467 -583 34 493 -395 24 259 -393 5 337 -85 -315 212 186
2837A86n04O25k46o03R84k10p75Q77k65m75Q44m00n38P54q7l10J28J24k83J44
2857c0M45o35k03Q25m27j64P16r14J50Q56q17n7N53n38K61K95m28j04K78J68m11
2878a81J10L20n84N01K90j024O00L29p59O80j45p41Q87kn48K52k4l7Q8J78l03
2899a13l15P89k46n12P35m00l32J133q63m19J050n79p5N59o04j12N82p7m41Q0
2919a60M23m29J18N64j115M17R56j210K51N92r34O23M93r76K43M40k77r0J66j23
2939b8l35O67M7r88P58K50q77Q49j00j001J081L4p63N76j54l05M50R1n08j4N96
2960C26k18m23O46n74k03J109p30m93J041m60j29N62p35p2N14p5j29j61L53m40
2980b91P7O79q41N4Q55k57n08N53j095P82L93r10M16K98l96K38j4l34K42K96q5
$$ plain form
2837 186 -318 307 61 -542 442 232 -543 334 69 -406 438 38 -500 254 167 -143 -15 109 -174 -30
2857 -30 415 -220 -423 402 -25 -189 527 -387 -237 619 -198 -255 298 -240 21 316 -112 -216 62 230 -181
2878 -181 -71 249 -335 166 456 -568 32 361 -398 282 137 -604 283 281 -267 -15 -39 -76 12 190 -113
2899 -113 -428 361 115 -397 338 -62 -394 739 -124 -543 507 -72 -147 412 -192 -304 278 201 -240 -160
2919 -160 263 -166 -48 516 -599 -182 774 -436 -185 407 -527 96 589 -387 -144 296 19 -71 95 -28
2939 -28 -363 304 351 -637 121 371 -506 343 243 -758 323 357 -406 170 16 -289 161 252 -256 -270 326
2960 326 108 -315 331 -243 -446 663 -67 -560 481 21 -108 454 -281 -353 161 86 -43 -204 149 -291
2980 -291 -214 465 -376 -322 533 276 -232 321 -774 8 401 -509 -93 205 -191 47 33 -301 -59 237 152
3001A52m07M28q4l61O45l68o22J077l04n41Q02m86l89Q69k70o39N75L24o76K65
3021a0K51n69K43N86p23jO36p42J68P09r80J75P79p14M0M95n05k4N10k52m77N60
3043A55Q4o07M94Q7p96Q08K09j015O91K13q16O10J76p63M13M05n42k5N20m15j90
3064c04O98l82m74Q66l64m50Q13l57m27Q15l67l91N21r1l97M60N6m86K85K85n79
3085b70J90M00n66J25N20o58J11N22n44J08M09m79l0M84m63o6M08k20j95M08j78
3106A6k70N10p9l76K37p4l25P66k78n73O57lm70L29J76n55L05K89n34J73L71n07
3128b15J8N63n83rN95n16j71O90n04j62O25l71l00N83j80m74O13q5n22N87J02
3149B84p39N66J58p06M60L72p22K87M70p32K14N33p22N3O60o03j38O92m59k70
$$ plain form
3001 152 -255 173 89 -272 373 5 -617 460 156 -385 417 -69 -458 411 141 -498 77 401 -275 -10
3021 -10 241 -328 -85 501 -222 -223 413 -329 -161 548 -432 -257 522 -192 -152 343 -162 -186 324 72 -405 155
3043 155 239 -368 126 213 -583 225 434 -581 110 323 -493 117 293 -470 -57 348 -194 -219 301 -114 -304
3064 -304 394 12 -462 404 40 -410 403 46 -381 434 67 -324 197 106 -291 169 225 -261 24 309 -270
3085 -270 -80 320 -246 -121 399 -259 -148 374 -170 -62 347 -132 -162 322 -141 -207 201 -19 -214 194 16
3106 16 -254 256 177 -199 38 -36 -361 405 127 -446 211 208 -262 67 243 -312 -7 282 -252 -79 292 -215
3128 -215 -197 366 -217 -226 369 -147 -318 372 -132 -294 331 -40 -340 243 63 -411 202 117 -405 182 284
3149 284 -455 111 269 -437 23 395 -327 -40 430 -302 -88 445 -277 -224 436 -167 -305 387 -72 -342
3169c42O94l49l55P28l05n07O78p5n99N94M8n74M73J51n84L37L10n97J96M58o17
3190b37J10M93n83K0N85n21j40O06m18j78N97l43l35N74j91k96M27j02l64M19
3210A23K7m82M73K7n05M01J79n25L73J54n09K86K17l88J14K66m27N1M02l49q4
3231a76N35m98m1N67n14j51N90l31k74N69k78k75N46j87l44M09Nm49L88J87o53
3252c75M25L03p57M12L47p50L99L73o86J56N23o04R4L80l86j29N79k29m61O33
3272B47q8n60P34j79p06Q53r2o31O22o1m98N30L4m42J90L22m37k8N22m91r8P87
3294E30o83j70P58n61p9N97o15k6N64l24j45K61l8k53K78J46n69K94M26o59L15
3315D7K20o95N38K42p51M32J68l68K91L0l87K33J32o4l14L22k0k60N41l94m21
$$ plain form
3169 -342 352 3 -352 376 71 -436 242 167 -432 162 210 -364 109 260 -324 13 323 -274 -78 380 -237
3190 -237 -127 366 -217 -197 388 -133 -273 333 -85 -263 334 -9 -344 230 39 -257 170 68 -296 123
3210 123 150 -332 141 168 -337 64 243 -282 91 245 -264 22 239 -149 -35 231 -196 -145 257 -92 -176
3231 -176 359 -139 -180 387 -127 -278 312 -19 -293 276 -2 -277 269 82 -262 147 152 -297 91 278 -375
3252 -375 50 353 -404 8 355 -395 4 377 -309 -153 370 -234 -140 240 -146 -275 304 75 -386 247
3272 247 159 -401 333 154 -552 301 209 -422 200 139 -359 171 205 -237 -47 275 -162 -190 332 -159 -257 530
3294 530 -153 -323 435 -126 -205 392 -223 -249 315 -9 -154 107 69 -184 94 240 -329 -35 391 -268 47
3315 47 267 -428 110 352 -399 33 201 -167 124 154 -233 0 132 68 -246 76 56 -204 337 -57 -478
3336d78Q13l32l49P04n47p1P04n01j81L47j42nJ53l8l47J67N18o17m1N09n72L09
3358CN17j032M35N89p35K82R0m69L51K76l35k44L56J31m35M23j01o09Q39j8q46
3379e32P40p1n48Q31l26n59O29J1k30O5K9j21k0N37n19l76R00m55k61P06o47j47
3401c64R79p22j45N20m07O3L39k71k50K79K82n01L2L91n09K38N57r87K84N82p46
3422c56N02M6n76M33K22m16M4O9P7p3J83j14m00N90K6n64N46j73l88P48m26m02
3444d02O34k26q9K59k52o3K64L4k38p2L42k33l0L54m98M0O33o77J54L46n86K79
3466b7K57m90L14R4j78oM3k3k28M97p3n41M43R4n13O27j32n88O88r4n00M73j01
3489C6k85L41R3l64J7L65k35k23N07m36j22P11m90l20P22l93j38M73l84j22M94
$$ plain form
3336 -478 335 3 -346 358 -189 -260 444 -57 -238 109 -33 -38 115 77 -270 -103 415 -202 -243 266 -306 3
3358 3 520 -512 -77 512 -223 59 149 -320 31 307 -28 -272 84 215 -220 203 102 -507 332 314 -532
3379 -532 208 137 -411 420 94 -465 164 175 -55 10 39 -82 -102 435 -84 -460 440 -15 -276 430 -217 -364
3401 -364 615 -107 -252 268 -139 -76 263 -8 -258 21 303 -198 -166 225 -284 -46 511 -476 -192 390 -356
3422 -356 146 192 -384 49 271 -145 -101 -32 45 -28 155 41 -359 231 257 -307 239 66 -322 426 0 -402
3444 -402 232 6 -83 176 -76 -139 125 159 -79 -151 191 -42 -72 282 -216 -176 457 -220 -66 280 -306 -27
3466 -27 230 -260 54 148 -30 -36 7 -16 -244 253 180 -361 82 176 -337 290 158 -430 258 164 -336 137 36
3489 36 -249 92 185 -179 -162 203 -32 -255 252 -184 -306 405 -85 -405 317 -76 -214 259 -125 -247 247
3510B47j51k86K11J05l18K15K71n72K46M26o43J69L71n33K01L85n69J08L74l60
3530a03M6J94k05j34L43q7k71L14Ol47M34p6m23M68Ll78L13l6k75L26ok75J93
3553B4J15k58J08J79k86L1L27l35n0L37k79l8L18l20qL64k88l1K49k26j40L47
3575A40j25j42K55l5k81K80M0l81L14J24m09L07R8l93K48J08l23J67K21l58J04
3596d1K79l55K8L62l97o7L80k24j73M44k52k57M67j38k51L38n9l08L52ql43L03
3618H0J20m45J96K71l79K4M24n11J22L72m03kM03l21j20L71k97r7L72j14k99M07
3640A74r8l28L45K3k95J93J45l53J87J83l65J40J96l09N4K69k90J3K60k02o2K47
3662A27j61q2K56j28r2K22r1j17J74q6j04J81p4j27K01j0j66J23O4j93J10P2j96
$$ plain form
3510 247 96 -190 21 126 -192 23 294 -278 -32 394 -249 -80 291 -242 -41 344 -225 -117 257 -103
3530 -103 -57 137 -68 -202 141 54 -217 97 103 -244 190 114 -309 159 162 -216 97 61 -214 112 106 -169 24
3553 24 139 -119 -11 168 -118 -87 240 -95 -145 192 -87 -125 193 -127 -135 229 -59 -90 159 -67 -207 140
3575 140 15 -127 128 93 -188 92 132 -249 65 189 -220 87 185 -208 40 148 -175 -8 213 -145 -41
3596 -41 238 -117 -89 273 -124 -191 189 -35 -208 236 -16 -273 194 56 -195 143 84 -224 128 120 -223 80
3618 80 200 -245 -49 222 -157 -133 291 -220 -98 274 -129 -131 272 -49 -169 202 -95 -192 180 66 -233 174
3640 174 76 -252 93 116 -179 14 159 -194 -7 176 -189 -49 147 -162 -108 161 -129 -116 144 -58 -120 127
3662 127 -34 -116 140 12 -80 142 51 -66 108 22 -82 99 25 -102 99 89 -77 46 110 -83 27 99 -97
3685i7J18P9k40J55R1k54J31J11j70P2J35k31P7J08j09p1K18j16j90L23j46j23
3707a29K82p7k73L15j17j75K79q8j07J79n8j69J53J37k60M3K60l40Q0K80l32l4
3729a51L69l42l0L36k69n8K93j68j75K87k0k53K48M0k92J99J92l67J62J56l05
3750a48J72J73l60J25J93k04k0J85j25p7J95q5j76K28k4k26K82p0k22L02j20j76
3772a78K71l4j51R1J6j04N3J05j54o7K34q0j56L25k35p8K73j64k1J60j20K2O1
3795F9j28M8L5k2jN9l4o2L2J32j74J8J41j84J24J1j85K18k8j49J31p5pJ07n7n6
3821c7j6P9k5m5J10r5n2K54j47j78L21k34j9K97k55j11L00r9n4K6K4m2KJ09k26
3846a13L0K05j69n5K51k69O2K74l13J4J82k25N8J12p7n9J07K9j25RJ78k32J64
$$ plain form
3685 -97 21 100 -140 15 106 -148 -17 94 -76 -4 131 -100 -23 85 -24 -95 123 7 -183 140 -6 -129
3707 -129 153 76 -197 118 1 -174 105 17 -90 89 31 -138 15 152 -108 -65 195 -145 -65 215 -117 -151
3729 -151 218 -124 -154 182 -87 -145 148 -20 -195 92 72 -181 67 107 -185 14 206 -161 1 157 -148
3750 -148 24 197 -163 -38 155 -49 -69 116 -9 -86 109 24 -152 76 52 -174 108 38 -184 118 -2 -178
3772 -178 93 59 -92 -1 15 -89 -36 69 -85 -152 82 2 -154 171 -64 -142 131 -33 -54 106 -14 8 69
3795 69 -59 -11 24 2 1 60 26 -36 -4 128 -46 -28 113 -71 53 64 -121 97 69 -80 51 -24 -31 76 19 -37
3821 -37 -53 26 1 -44 66 -29 -81 173 26 -152 169 -65 -84 213 -42 -153 147 48 -6 20 44 2 4 113 -113
3846 -113 -83 122 -47 -102 149 -120 -58 216 -97 -83 99 -126 -68 44 -33 -92 15 44 -81 -72 106 -126 38
3869C8J26l75K00J42k35J41N1k70K03J24j45jO5mj20J42l7k08L00Jl30K82J4k89
3893a85K76m8k09K14k2p9N5kq0O7J28j00j38J99j9r3J96j97q9K46q1r6J04j42
3917i5R1J08j14m2K8O6m0k4M9p4K6J17j88P4J07j65Q2P5k06J25J34k25R5P5r2
3942a3mO0n2j17J38J3r9J42n7j68K46J1k37K19q8j16K20j03j72K92k5j19K3N4
3966D8j12P4Q1j96J3K22j74n9K59k22m1K44j54o6K38j61n1J40o3j33J55P7k66
3989a47J70J28k26Q4J48l35J16J97k28M5K03k44N7J55j14o5K03j15j62K17o9j85
4011a67K40N3k78K03L1k81K65M9l10K46O4k25N5J68k22R2J11j80j2K37j53j31
4033a45K74j54m5K22j43j77L14j38j16J97n4j71K19J5j93J46L3j58R1J11k65J01
$$ plain form
3869 38 164 -211 -11 131 -104 37 88 -182 21 145 0 -1 64 60 -60 82 45 -163 137 138 -192 90 104 -185
3893 -185 91 43 -166 48 26 -53 2 0 -80 -13 115 15 -123 76 57 -36 160 -37 -126 120 39 -57 47 -95
3917 -95 -4 104 -10 -52 -24 42 2 -22 27 -47 -21 96 -92 -18 89 -76 6 81 -125 0 134 -91 4 79 -13
3942 -13 -17 43 -9 -126 12 25 -74 68 11 -157 89 100 -137 82 -6 -122 98 -5 -177 115 90 -29 -6 48
3966 48 -64 10 91 -105 -92 130 -44 -103 156 -66 -107 137 -17 -83 155 -6 -57 83 20 -113 42 119 -147
3989 -147 23 151 -75 9 157 -178 -62 135 -93 -48 155 -89 -32 123 9 -56 147 32 -130 87 18 -167
4011 -167 73 126 -152 51 82 -199 66 115 -195 51 115 -110 -55 113 -109 -17 94 -86 -98 139 -14 -145
4033 -145 129 -25 -70 152 9 -168 146 8 -108 89 35 -136 83 98 -95 51 84 -74 17 128 -137 -36
4055c6J74k64J05J83k56J4K35k42K5K14k47qK77k18l8K52j88q5K23j23j55K96
4077A38p3k40K60J4k76K57L8k85K39P5l12J79R4k63J03K32l46Q3K83l37l1L81
4099B13k88j30L77k14j38L85j82j78K78ok99K95j4l03K61J49l74K24J18m05K16
4120a5K13l47J41K62l52M6K67l07k0L14k20j14K89j67j76L62j43k39L42p6l19
4141b59L91l8l16K88Q7l95L05L1k95K11J56l19J15K42l58J08K29l00j1L31k99
4162i6j8L69l58l0L29k38p6L16k30j63L11l0l15K87N4l31L00P6l93L03J05m17
4184b45L04J49m51K82J41m02J71L32l83j7L91l38j07M26k76k27N25k71k64M91
4204B31k17k77M49j12k19K17Q2l92L35M4l73K04K75m51J27L30m86J67L69n11J34
$$ plain form
4055 -36 138 -126 -21 162 -94 -80 155 -87 -62 152 -95 -103 174 -44 -82 170 -18 -103 120 -3 -158 138
4077 138 65 -175 85 99 -177 80 118 -167 72 147 -165 14 108 -155 -52 180 -166 -83 200 -137 -168 213
4099 213 -75 -205 172 -42 -180 205 23 -155 123 117 -182 113 99 -204 57 206 -168 56 174 -231 -15
4120 -15 198 -149 -8 254 -98 -52 215 -92 -112 202 -18 -132 157 -10 -186 176 33 -206 136 60 -259
4141 -259 132 94 -222 66 153 -242 63 94 -201 10 166 -153 -38 204 -154 -46 183 -117 -128 203 -96
4162 -96 -114 255 -103 -133 196 -42 -118 198 -32 -195 116 86 -229 58 112 -219 81 157 -236 67 172 -245
4184 -245 59 208 -243 39 180 -222 -51 281 -102 -119 272 -66 -173 253 -23 -250 275 4 -260 231
4204 231 14 -263 186 74 -145 72 154 -238 97 141 -232 -28 247 -204 -77 253 -233 -66 303 -208 -74
4225g4L10m09O9K84k89m1L71j15l16L22k2l44M21o0m32N50L1n78M44L5m27M59
4247A89j5l98K91J02k88J08J69k74l3L92l11j70M68l03j28N68m97j14O22m12j30
4268a64L25k61JL03j45k78K66J62l69K25J78n72M24L36p31K79L17n91M32J08o25
4289c80L68K37l50P9J56j84n5L50j73m01N47m9m24N52l03m10Q05k94m36N45j38
4310D2j48K66j20k73K66K37m08o2M26l71O8N67o99p5P63o56O9M56o02J55M32m01
4332f8r9K21j5q6J50K1n13M34L75p98L63K16o03O50K1p15N52J07l82K37p0j86
4354a88K25J75j99l01M84j32k62M99l66l31Q23m31m01P50n05K4N18m59j49L53
4374A27p6j12MJ50k74J66L43o16Q7N77o40L21K93q23M98L74o68K39J81l35K49
$$ plain form
4225 -74 236 -173 -104 180 -109 -150 221 106 -210 112 90 -254 167 107 -325 225 256 -322 122 157 -270 189
4247 189 174 -224 67 169 -119 -11 158 -116 -149 243 -68 -238 230 -73 -201 367 -130 -244 378 -34 -164
4268 -164 161 -100 -99 204 59 -219 47 209 -160 65 243 -329 95 431 -300 -21 296 -295 137 245 -380
4289 -380 -12 225 -125 -46 110 -74 -129 221 48 -353 194 145 -279 273 -30 -440 365 71 -365 180 42
4310 42 -106 160 40 -233 33 270 -138 -200 226 -145 -77 490 -209 -284 479 -177 -108 348 -254 -99 333 -68
4332 -68 -167 54 39 -47 103 124 -389 45 420 -378 -15 201 -402 248 269 -446 106 213 -169 68 -2 -188
4354 -188 37 212 13 -288 196 64 -198 301 -65 -396 427 -4 -405 345 -160 -136 382 -77 -226 127
4374 127 51 -61 -57 93 -181 -15 328 -288 -201 376 -264 57 350 -473 25 399 -269 -30 151 -184 65
4395F5J53l02j33M06L7m42L74j17m34P58k02o02O75q9m45O56l39l73N57j0l58
4416a65J71J33k49K4L26m02j37P42m67k49O82o12j1O99o79m5N07l30p9K68k10
4437h3j32L71R4n14K28L53n76L57K20p56M80K87o41L54J79n41L88K07n40J60K46
4458A41j47j45K60j23k58N03j73l69N63j95l74O20k80l21N88k13k64L59q2k53
4478a63K66O6l11Q4K89l78P4L49n57K23L82n49J50L41m48J62K84m47R1K93k74
4499g3p9L42j95k04M31r3m60N33r3m24N05p2m79N20L2n44M83M9m46L54J51m46
4521b08J88K88m36L4M27m40o7N51m46j63O47m07k36N95l39k71M91j78l18M35K1
4542A68m65L85J30n62L52K57n38K17L36n05J12M51n43J20M02m14rL56l42q3M18
$$ plain form
4395 65 218 -84 -217 189 226 -216 158 41 -393 365 163 -439 236 147 -298 358 19 -354 203 193 -165
4416 -165 6 139 -110 -86 240 -162 -299 443 -24 -273 409 -203 -214 485 -194 -239 268 -62 -141 127 -83
4437 -83 -215 156 250 -264 -36 317 -259 98 318 -438 42 329 -312 42 221 -320 68 275 -265 -105 141
4458 141 -6 -151 109 -14 -272 231 58 -311 252 57 -317 303 23 -298 290 77 -187 172 90 -163
4478 -163 103 169 -142 -58 231 -147 -73 276 -281 -58 324 -225 -75 266 -182 -20 264 -183 -92 201 -73
4499 -73 -152 190 -5 -209 222 129 -331 202 109 -315 190 118 -361 159 191 -353 130 179 -267 87 238 -208
4521 -208 -20 268 -168 -134 293 -147 -214 337 -109 -272 375 -32 -268 327 -12 -283 208 30 -288 147 168
4542 168 -297 88 218 -344 8 265 -273 -56 280 -225 -113 338 -205 -85 317 -97 -106 250 -92 -175 243
4563B43k62j59M34k03k97M02q9l24M28o6l76L86j1l98M10M7l84L02Q8l48J44J94
4585A61l73J44L48m04K9L09l36L2K97k97k4L17k63j21L85k54r8L40j92j84L76
4606A92j52k57L94p5l33L33O9l97K79J01m23L38J72n39K99J64l83J58K86l82R7
4627e9K78l08r1M68l91o1M58l69j89M85j67l26M82j53l26M41k4l62L25J20m43
4648b12K21K51n45K62K92m67J32L53n23J08M26m63k0L88l10j27M28j56k87M37
4668A88j06l55M49j8m45M76nm67L97N5l92K46J22l14J66J33l26J33M44m40RL00
4690B50k91q1L51k92P1L07m27p1M11k13l29M51n20K19J78K03k87n8J22l79P81
4711C96o0m28K80Jj07J49K46p98M26r4q2K37J26k46K3k2k39J42K6j19q5O26o97
$$ plain form
4563 243 -19 -178 256 53 -244 158 69 -255 173 107 -269 117 106 -292 118 165 -219 83 171 -177 -33 161
4585 161 -212 -68 280 -124 -95 214 -122 -90 207 -90 -114 203 -60 -181 204 -50 -148 192 0 -184 192
4606 192 40 -217 177 102 -231 102 171 -226 53 154 -269 69 241 -298 1 165 -218 -60 226 -156 -59
4627 -59 219 -89 -180 288 -103 -164 294 -75 -264 221 54 -272 210 57 -269 172 148 -214 111 231 -212
4648 -212 9 260 -285 -23 269 -198 -66 287 -236 -128 298 -165 -185 203 -107 -234 194 38 -249 188
4668 188 82 -273 176 158 -287 189 184 -283 114 169 -223 23 145 -169 -3 130 -196 -63 381 -59 -50 250
4690 250 -41 -122 229 -63 8 315 -112 -183 228 15 -314 137 -383 -164 14 217 -70 -128 -6 -385 396
4711 396 336 -92 188 189 82 231 477 -321 105 11 -71 166 292 46 69 47 -192 -50 -24 -143 -228 398 -299
4734b99K73O2k30Q4L65l59m35Q43l00j46J44r1N0M6J29l20K41K37m89J41L62n19
4756b11J93L76o25J58K66k14R1P1k63N7J17Q7k67M27k05m20O62k56m17P32r3l67
4778a01J13J08m12N52j03k63J10J47q6k98N59m04j20L85q1k89M91l44k72N20l78
4799a66Q3K66k21J0J08j42KN9j6p6q2K93k50J76J19m76K92K05m33K06J0r7J07
4822b3O7k78J80J43l45L0J69J01j00L28l70r6L44k45q8K05j35j64N60l09l4L2
4844b8N5j40M25m22P6R5Q5l43J35L32k18p3K61m61J97K42n13K60K68n80N30O1
4866B44k55k38L08j05k8J70m1m96N49Nm50O71j56m16O83l16n79R37l01k39J3l43
4888c83M02k32O4J33l81M79m8j12K04k38k58N19o5l08L05k9j08K56k95OJ08J04
$$ plain form
4734 -299 -26 36 -194 -110 255 -104 -539 304 4 -142 2 -89 -39 7 136 -184 57 294 -195 -54 308 -211
4756 -211 -18 358 -267 -109 157 -57 34 105 -158 -101 16 103 -164 263 58 -362 300 44 -373 359 266 -101
4778 -101 12 120 -292 260 157 -106 4 151 65 -233 326 -78 -198 187 106 -183 308 -36 -308 212 -166
4799 -166 -83 183 -38 -28 80 -62 -60 -1 -17 -93 -175 118 -132 44 163 -313 -21 184 -249 -43 -33 -130 -23
4822 -23 44 -234 -54 89 -256 -226 -57 44 -56 272 -98 -194 150 -95 -183 22 -113 -277 283 -26 -60 -28
4844 -28 27 -113 312 -110 -34 61 146 -197 -62 270 52 -21 240 -221 -24 218 -295 -35 233 -347 183 244
4866 244 -11 -249 59 -46 -74 96 55 -441 108 113 -337 334 178 -238 445 129 -450 487 186 -53 -40 -383
4888 -383 19 -213 -149 -16 -397 82 34 -78 126 -112 -370 149 84 -224 81 52 -56 200 -95 -89 19 123
4910A23j39n8J86k22R4K17l22R4K44l66J46R3k34J98M9k32J39N1o0J0Ml3q5J26
4934B3J7j99J99lj22K27j39j74K88j45m4J87j85KK28j33j09O8N3j15R6M8j76J03
4958eJ84l37J11J89l26J98J07k44J11J65k23j2J52j12p0K50j19j71K23p5j43K07
4980F0Pk02J88N7l22K74J3k49K37M3k14R2J47j86L0J45k07K9K15j53j30K16l9
5003E1j75K90j91p4K36j15j14J54n0j30J90n0j22R0P1j47J8J94k24Q0R0j45M6
5026b7Q7j52K6J50j40K7O4p5J3O9q4K4N5o7j2J04o3k8O3l5k0M7j0j42J65m2q1
5053h4J33l4m4LJ6q0J50k8q7N7J08j71Q8M0j40N8J00j42K3J45j50j0J65j28p5
5078h7J88j31p5K00o0j12J86k2j69J51J9k21J77J14k89J31K6j60J73M4j55L1J97
$$ plain form
4910 123 -16 -74 112 -110 -16 201 -121 -27 217 -149 -3 90 -144 54 103 -129 10 61 1 11 15 -18 -103 23
4934 23 40 -159 40 37 -85 142 3 -171 117 -28 -72 115 -70 -68 160 27 -82 -14 39 -76 20 68 -108 -5
4958 -5 179 -158 -47 142 -184 14 121 -123 -12 153 -70 -82 70 -42 -112 138 19 -152 71 -4 -147 60
4980 60 67 -135 53 110 -212 62 75 -174 63 106 -108 -16 131 -55 -25 120 -87 -58 157 4 -126 90 51
5003 51 -124 166 -25 -99 137 22 -92 62 12 -118 72 22 -100 -10 61 -86 -68 126 -98 -18 72 -73 -27
5026 -27 60 -92 -66 84 -56 -29 35 -40 -27 42 -42 -18 37 -30 -42 62 -1 -29 34 -1 -21 26 16 -126 39 -3 -84
5053 -84 49 15 -29 -26 -10 -90 60 32 -55 2 110 -61 27 67 -73 -15 85 -57 -34 111 -39 -49 116 -12 -87
5078 -87 101 -30 -105 95 35 -77 109 87 -82 69 88 -133 44 158 -131 0 26 -134 39 83 -72 -41 156
5101A56k57L3J29j17k1J70j58k2J86r1r7J48m8j13J62m4q2J25mj15K0P1j27R0
5125fJ20j34MJ17j37L7N9r3K4N5r4oR2n4n8O0Qm8N2J6p8J26j24%R8n6l3J43q7
5154Ck7J8j4j6M8K1p5O2Q2j57Q0Pj45J44N2j54Q4M5j31N8O0o9OM5n9P2jp0oR1
5184E4o2r1J62q3q7J74r9n7J49l0j16J67m2r9K1R4p0RJ21j17k6J15j13kJ18j47
5210e7J0J74j84M5J32j46qL4Np9R8Q7k34J33M7k9PRj98K46j21Rn3K23j92j02L58
5237B14J26k9m57J14N2M2j6j37J11K2j16J02k6r6J67p2m1L8J5RPm4J1pK5n5QN6
5265B3n0M4K5j37Q4O9j23P0L1j06J18k0p4J19q2j1R3p0j9n1P6K2j05J68j16LJ00
5292H1j40j3J16r6N1M4p5lL5m3o5J03N9j05K7N3q6nJ55j24k2J06n8%N8p8OO3L4
$$ plain form
5101 156 -101 -68 61 -56 -77 93 -65 -87 99 8 -89 59 11 -102 60 16 -66 59 55 -60 -40 31 -96 -6
5125 -6 114 -20 -16 101 -36 1 60 -33 -9 46 -48 -54 38 -16 -74 -14 -6 -54 -2 14 -64 62 -62 -62 36 -20 -53 90 3
5154 3 -24 -6 -20 -36 12 33 -42 20 102 -55 25 32 -113 31 83 -71 13 58 -73 -15 45 -24 -18 27 -32 40 39 -31 -37 54
5184 54 -8 -99 63 -20 -107 67 -32 -89 60 30 -86 81 39 -60 -39 55 -15 -6 115 -2 -28 87 -26 -28 90 -57
5210 -57 -47 127 -57 -12 120 -26 -34 0 5 -74 24 111 -123 10 57 28 35 44 -154 92 -29 -20 -73 150 -42 -144 214
5237 214 340 311 -146 -32 20 62 46 -91 20 42 -74 28 2 -94 73 1 -40 -2 13 22 29 -15 -4 -11 14 -41 -33 23
5265 23 -27 17 42 -95 -11 58 -65 5 36 -70 48 28 -46 73 -9 -20 73 3 -16 -67 9 31 -74 94 -22 -19 81
5292 81 -59 -72 44 -52 -1 43 -32 -35 0 -43 -108 -5 54 -51 -24 29 -57 -62 93 -31 -53 53 -5 -5 53 -25 -19 44 78
5321G8j05L7j0K2j6L8p5n7R6m9N0Mq9J15l0m9M1J2j12N3M3m4N3J6J3j00K4R7j06
5350e0J09qj05J10M1j07M5J9p8j2L3l8Q4j19mM0K1R9j16j8rJ08k7l1n3K07j81
5377d0J04j50P1J10j96J08j4J4j1J72j67j42K52L8q5L4N8k36P8o4M4M1N2j00J52
5402A23p3m9J41j17q1p0JJ30O1o5j11J6J26j07N3m4J68r2r2J45m1p7P8K8n1L7
5428C7l2J3l5l5L2K3lpK4M2q2N7n8L2L7nl0k4J6K0pl9K7l4l6L8Lk7O9l1j7L8p1
$$ plain form
5321 78 -27 10 0 22 6 44 -31 -88 8 -41 9 13 -76 39 9 -40 1 13 -99 -46 -3 -47 6 22 35 -65 -41 56 -50
5350 -50 59 51 -54 56 97 -10 35 54 -24 -36 -3 -41 43 -76 -80 -40 -19 80 -36 -54 -63 45 18 -13 -66 141 -40
5377 -40 64 -86 -15 95 -101 7 -7 7 -4 168 1 -141 111 149 64 98 156 -80 -2 -66 -22 19 71 -29 123
5402 123 50 1 142 25 -56 -126 -125 5 66 1 -110 -94 32 -75 -22 -66 102 10 -82 63 22 -55 23 51 0 37
5428 37 5 18 -17 -52 -20 3 0 -7 17 59 -23 34 -24 8 45 40 10 -14 2 22 15 -24 3 -31 -67 -29 -26 -53 16 -15 -32 6 -65
$$ [...]
8191a78
##END NTUPLES=NMR FID
##END=
