##TITLE=1H_ADP0606A
 CDCl3, 8 sc, 
 6.6.2019
##JCAMPDX= 6.0         $$ Bruker NMR JCAMP-DX V2.0
##DATA TYPE= NMR FID
##DATA CLASS= NTUPLES
##ORIGIN= UXNMR, Bruker Analytische Messtechnik GmbH
##OWNER= root
$$ XWIN-NMR		Version 3.5
$$ Thu Jun  6 16:06:15 2019 Russian Standard Time (UT+4h)  she@DPX200
##.OBSERVE FREQUENCY= 200.13155
##.OBSERVE NUCLEUS= ^1H
##.DELAY= (6, 6)
##.ACQUISITION MODE= SIMULTANEOUS
##.ACQUISITION SCHEME= undefined
##.AVERAGES= 8
##.DIGITISER RES= 18
##SPECTROMETER/DATA SYSTEM= spect
##.PULSE SEQUENCE= zg30
##.SOLVENT NAME= CDCl3
##.SHIFT REFERENCE= (INTERNAL, CDCl3, 0, 15.7039)
##AUDIT TRAIL= $$ (NUMBER, WHEN, WHO, WHERE, WHAT)
$$ ##TITLE= Audit trail, XWIN-NMR		Version 3.5
$$ ##JCAMPDX= 5.01
$$ ##ORIGIN= Bruker BioSpin GmbH
$$ ##OWNER= she
$$ F:/spectra/data/she/nmr/H-F/1/audita.txt
$$ ##AUDIT TRAIL=  $$ (NUMBER, WHEN, WHO, WHERE, WHAT)
(   1,<2019-06-06 16:04:26.46 +0400>,<she>,<DPX200>,
      <created by zg, POWCHK disabled, PULCHK disabled
       configuration hash MD5:
       00 E9 B6 7A A2 85 ED C7 34 08 36 98 17 FE 4E 26
       data hash MD5: 16K
       0D D8 1A 10 84 DF 2F 4D EC CE 63 96 D1 A7 7F DB>)
$$ ##END=
$$ 
$$ hash MD5
$$ CC 35 CA F0 D8 2F 6D A0 1B 5E 3F 6B F5 F7 77 D0
##$RELAX= 
##$RELAX= 
##$RELAX= 
##$RELAX= 
##$RELAX= 
##$RELAX= 
$$ Bruker specific parameters
$$ --------------------------
##$DU= <F:/spectra>
##$EXPNO= 1
##$NAME= <H-F>
##$PROCNO= 1
##$TYPE= <nmr>
##$USER= <she>
##$AMP= (0..31)
100 100 100 100 100 100 100 100 100 100 100 100 100 100 100 100 100 100 
100 100 100 100 100 100 100 100 100 100 100 100 100 100 
##$AQSEQ= 0
##$AQ_mod= 1
##$AUNM= <au_zg>
##$AUTOPOS= <>
##$BF1= 200.13
##$BF2= 200.13
##$BF3= 200.13
##$BF4= 200.13
##$BF5= 200.13
##$BF6= 200.13
##$BF7= 200.13
##$BF8= 200.13
##$BYTORDA= 1
##$CFDGTYP= 0
##$CFRGTYP= 5
##$CHEMSTR= <none>
##$CNST= (0..31)
1 1 145 1 1 1 1 1 1 1 1 1 1 1 1 1 1 1 1 1 1 1 1 1 1 1 1 1 1 1 1 1 
##$CPDPRG= <>
##$CPDPRG1= <>
##$CPDPRG2= <>
##$CPDPRG3= <>
##$CPDPRG4= <mlev>
##$CPDPRG5= <mlev>
##$CPDPRG6= <mlev>
##$CPDPRG7= <mlev>
##$CPDPRG8= <mlev>
##$CPDPRGB= <>
##$CPDPRGT= <>
##$D= (0..31)
0 1.2 0 0 0 0 0 0 0 0 0 0.03 0 0 0 0 0 0 0 0 0 0 0 0 0 0 0 0 0 0 0 0 
##$DATE= 1559822665
##$DBL= (0..7)
120 120 120 120 120 120 120 120 
##$DBP= (0..7)
150 150 150 150 150 150 150 150 
##$DBP07= 0
##$DBPNAM0= <>
##$DBPNAM1= <>
##$DBPNAM2= <>
##$DBPNAM3= <>
##$DBPNAM4= <>
##$DBPNAM5= <>
##$DBPNAM6= <>
##$DBPNAM7= <>
##$DBPOAL= (0..7)
0.5 0.5 0.5 0.5 0.5 0.5 0.5 0.5 
##$DBPOFFS= (0..7)
0 0 0 0 0 0 0 0 
##$DE= 6
##$DECBNUC= <off>
##$DECIM= 24
##$DECNUC= <off>
##$DECSTAT= 4
##$DIGMOD= 1
##$DIGTYP= 9
##$DL= (0..7)
0 120 120 120 120 120 120 120 
##$DP= (0..7)
150 150 150 150 150 150 150 150 
##$DP07= 0
##$DPNAME0= <>
##$DPNAME1= <>
##$DPNAME2= <>
##$DPNAME3= <>
##$DPNAME4= <>
##$DPNAME5= <>
##$DPNAME6= <>
##$DPNAME7= <>
##$DPOAL= (0..7)
0.5 0.5 0.5 0.5 0.5 0.5 0.5 0.5 
##$DPOFFS= (0..7)
0 0 0 0 0 0 0 0 
##$DQDMODE= 0
##$DR= 18
##$DS= 0
##$DSLIST= <SSSSSSSSSSSSSSS>
##$DSPFIRM= 0
$$ [...]
##$SUBNAM2= <"">
##$SUBNAM3= <"">
##$SUBNAM4= <"">
##$SUBNAM5= <"">
##$SUBNAM6= <"">
##$SUBNAM7= <"">
##$SUBNAM8= <"">
##$SUBNAM9= <"">
##$SW= 24.9336996594482
##$SWIBOX= (0..15)
0 0 2 0 0 0 0 0 0 0 0 0 0 0 0 0 
##$SW_h= 4990.01996007984
##$TD= 16384
##$TD0= 1
##$TE= 0
##$TE2= 300
##$TE3= 300
##$TEG= 300
##$TL= (0..7)
0 120 120 120 120 120 120 120 
##$TP= (0..7)
150 150 150 150 150 150 150 150 
##$TP07= 0
##$TPNAME0= <>
##$TPNAME1= <>
##$TPNAME2= <>
##$TPNAME3= <>
##$TPNAME4= <>
##$TPNAME5= <>
##$TPNAME6= <>
##$TPNAME7= <>
##$TPOAL= (0..7)
0.5 0.5 0.5 0.5 0.5 0.5 0.5 0.5 
##$TPOFFS= (0..7)
0 0 0 0 0 0 0 0 
##$TUNHIN= 0
##$TUNHOUT= 0
##$TUNXOUT= 0
##$USERA1= <user>
##$USERA2= <user>
##$USERA3= <user>
##$USERA4= <user>
##$USERA5= <user>
##$V9= 5
##$VALIST= <valist>
##$VCLIST= <CCCCCCCCCCCCCCC>
##$VD= 0
##$VDLIST= <DDDDDDDDDDDDDDD>
##$VPLIST= <PPPPPPPPPPPPPPP>
##$VTLIST= <TTTTTTTTTTTTTTT>
##$WBST= 1024
##$WBSW= 4
##$XGAIN= (0..3)
0 0 0 0 
##$XL= 0
##$YL= 0
##$YMAX_a= 13537
##$YMIN_a= -17578
##$ZGOPTNS= <>
##$ZL1= 120
##$ZL2= 120
##$ZL3= 120
##$ZL4= 120
##$ABSF1= 10
##$ABSF2= 0
##$ABSG= 5
##$ABSL= 3
##$ALPHA= 0
##$AQORDER= 0
##$ASSFAC= 0
##$ASSFACI= 0
##$ASSFACX= 0
##$ASSWID= 0
##$AUNMP= <proc_1d>
##$AZFE= 0.1
##$AZFW= 0.1
##$BCFW= 1
##$BC_mod= 2
##$BYTORDP= 1
##$COROFFS= 0
##$CY= 11.3945322036743
##$DATMOD= 1
##$DC= 2
##$DFILT= <>
##$DTYPP= 0
##$F1P= 18.9103706918063
##$F2P= -1.10871071338519
##$FCOR= 0.5
##$FTSIZE= 0
##$FT_mod= 4
##$GAMMA= 1
##$GB= 0.15
##$INTBC= 1
##$INTSCL= 1
##$ISEN= 128
##$LB= 0.24
##$LEV0= 0
##$LPBIN= 0
##$MAXI= 10000
##$MC2= 0
##$MEAN= 0
##$ME_mod= 0
##$MI= 1.114404
##$NCOEF= 0
##$NC_proc= 0
##$NLEV= 6
##$NOISF1= 3.799351
##$NOISF2= 2.8
##$NSP= 1
##$NTH_PI= 0
##$NZP= 0
##$OFFSET= 15.70392
##$PC= 1
##$PHC0= -8576.136
##$PHC1= 12.80019
##$PH_mod= 1
##$PKNL= yes
##$PPARMOD= 0
##$PSCAL= 0
##$PSIGN= 0
##$REVERSE= no
##$SF= 200.130013532006
##$SI= 16384
##$SIGF1= 3
##$SIGF2= 2
##$SINO= 400
##$SIOLD= 16384
##$SREGLST= <1H.CDCl3>
##$SSB= 0
##$STSI= 0
##$STSR= 0
##$SW_p= 3612.71676300578
##$SYMM= 0
##$S_DEV= 0
##$TDeff= 0
##$TDoff= 0
##$TI= <>
##$TILT= no
##$TM1= 0
##$TM2= 0
##$TOPLEV= 0
##$USERP1= <user>
##$USERP2= <user>
##$USERP3= <user>
##$USERP4= <user>
##$USERP5= <user>
##$WDW= 1
##$XDIM= 8192
##$YMAX_p= 0
##$YMIN_p= 0
$$ End of Bruker specific parameters
$$ ---------------------------------
##NTUPLES= NMR FID
##VAR_NAME=  TIME,          FID/REAL,        FID/IMAG
##SYMBOL=    X,             R,               I
##VAR_TYPE=  INDEPENDENT,   DEPENDENT,       DEPENDENT
##VAR_FORM=  AFFN,          ASDF,            ASDF
##VAR_DIM=   8192,          8192,            8192
##UNITS=     SECONDS,       ARBITRARY UNITS, ARBITRARY UNITS
##FACTOR=    0.0002004,     1,               1
##FIRST=     0,             0,               0
##LAST=      1.6414764,     0,               0
##MIN=       0,             -17578,          0
##MAX=       1.6414764,     13537,           0
$$ Real data points
##PAGE= N=1
##DATA TABLE= (X++(R..R)), XYDATA
0@%%%%%%%%%%%%%%%%%%%%%%%%%JnJ2j6J6j6J6j6J6j6K0k8L2l2L3l7M4m8N1n8O4
46C3p0P9q8R8j11J26j44J66j93K29k80L56m84P53k129N752Q465o388j4322p614
66a5766Q463J3106N472n112r824q601Q01J1812J2295j404j3314j0731J484R826
80a493R660K365p836j2580m624R241J3686M126q274j1974n537N324J2346Q645
94A3075l886j3232r682K900J2068J0041p51j0942j1269r31J0409J1780K437q815
108C202j2104m643P741J3319O022p135j2782o587M553J1254Q822j779j1872j0767
122a2756J689J2079R810q57r168r690k696P793J2445M434q990j2700l571P371
136d807J0258N360l549j0716q734L192J2600Q513l820j0610p377R09Q356R815
$$ plain form
0 0 0 0 0 0 0 0 0 0 0 0 0 0 0 0 0 0 0 0 0 0 0 0 0 0 0 1 -4 8 -8 8 -8 8 -8 8 -8 12 -16 16 -16 17 -20 24 -24 27 -31 33
46 33 -37 42 -46 52 -59 67 -77 89 -104 125 -155 201 -283 470 -1659 4093 12558 6170 -8152 -15766
66 -15766 -7303 5803 11275 6163 -3661 -12262 -11461 351 12646 11242 -2072 -12803 -11319 -1493
80 -1493 8167 10532 2696 -9884 -14508 -5267 8419 12545 4271 -7703 -13240 -7916 4430 13075
94 13075 9189 -4043 -13725 -10825 1243 11284 10533 -409 -11678 -12609 -2200 9580 12017 3202
108 3202 -8902 -13545 -5804 7515 13537 6402 -6380 -12967 -8414 2840 11662 9883 -1989 -12756
122 -12756 -11067 1012 10822 9965 797 -8893 -11589 -3796 8649 13083 4093 -8607 -12178 -4807
136 -4807 5451 10811 7262 -3454 -12188 -8996 3604 12117 8297 -2313 -9690 -8781 -425 9390
150I390J939r515j1736j512R534J0202K208o509r917n392N182J1842O581n603
164F694j1458o146L861R781P723j342j0218r758O55J0319R598K76q541r788k660
179a1004P435J1098M029p127j1026m588N491J0309O284l729j0863p839L013J0664
193B147P996j585r186q826o80Q716J0275J718q521j0082k351O804R634M316n215
208E160j0600n933M916J0714O043l735r395o970J502R127Q666m41r323q871p6
223i216Q046Q616J860o685r641l552O424J0137L994n571r401m975L720R362O668
238I786k692r688p207K021Q838P440l30p887q600j185P781R270J808p020q900
253f565k997N445R244M796m624r812n478M040R230N904k331q460p305P83Q605
$$ plain form
150 9390 11329 1814 -9922 -11434 -1900 8302 10510 4001 -5916 -11308 -6126 5716 12297 6694
164 6694 -4764 -10910 -7049 2732 10455 9113 -1105 -10863 -10208 111 9709 9985 1444 -8344 -11004
179 -11004 -3569 7529 11558 4431 -6595 -11183 -5692 4617 10901 7172 -3691 -11530 -8517 2147
193 2147 10143 8558 -628 -9454 -10134 -1418 8857 10575 2054 -8028 -10379 -3575 6059 10375 5160
208 5160 -5440 -11373 -6457 4257 10300 6565 -2830 -9800 -8298 829 9495 9054 -269 -9140 -9216
223 -9216 -1170 7446 9306 2621 -7020 -10572 -4148 5989 9983 4412 -4989 -9964 -6244 3118 9786
238 9786 7094 -2594 -9801 -7780 1058 8498 8168 281 -8319 -9504 -1723 7547 9355 2335 -6565
253 -6565 -9562 -4117 5127 9923 5299 -4513 -9991 -5951 3279 9183 6852 -1608 -8913 -8130 475
268D75Q259j78q165q100r43O719Q494K810n892r368l835N528R227M285m204q608
284c496n529K596Q686O813j836q663p124R43P726P460O24o897q278j907O477Q666
300F261K661n663q474l684M429Q521M873l444q580n644K531Q221O301j375p722
315g88o998K30P272P534Q19o580p881j941N848Q187K938n077q242l852M069Q155
331C693M820l014q115n682K124P883O230j101p302o811j36O737P456J158o285
346A655p790k003N468P792L068m448p953m142L648Q061M890k809p748n498J650
361f159P310O302n79o971o916l32O460P204J326n669p439k398M917P707L363m147
377C979p737m139L239P540M911k256p331n650J278O996O234l07o540o641o71N910
$$ plain form
268 475 8734 8556 391 -7709 -8652 -1933 6561 9371 3479 -5889 -9724 -4196 5031 9316 5112 -3496
284 -3496 -9025 -6429 2257 9070 7234 -1429 -8553 -7610 116 7576 8200 1303 -6975 -8882 -2405 6261
300 6261 8922 3259 -5215 -8899 -4470 4051 8924 5480 -3100 -8744 -6213 2008 8309 6934 -788
315 -788 -7786 -7556 -284 7250 8069 1489 -6392 -8333 -2485 5702 8640 3563 -4679 -8531 -4462 3693
331 3693 8513 5499 -2616 -8298 -6174 1709 7939 6838 -464 -7275 -7411 -674 6782 7940 1655
346 1655 -6135 -8138 -2670 5122 8190 3742 -4211 -8353 -4705 3356 8246 5437 -2311 -7809 -6159
361 -6159 1151 7453 6874 -97 -7013 -7345 -885 6319 7645 1976 -5463 -7861 -2944 4763 8126 3979
377 3979 -3758 -7897 -4658 2882 7793 5537 -1794 -7444 -6166 830 7064 6757 217 -6424 -7095 -1185
393a185P055J636n272p288k569M498P360L414l676p374m257K817P225M948j889
408E443o938n552R29O572O146J4o128o563r26N529O842J829m824p067k752M103
424c343P175L590l298p098m279K433O898M995j490o654n632O01O288O082K56n735
440G89o437j204N114O754K157m471o923k936L750O934L669k933o825m417J994
455d985O620N089j162o339n613L25N927O028N78n335o314j505M718O611K334m136
471B841o749l038L382O623L755k462o481m550J670O424N142r63o014n422O0N412
487c70N895R09m972o346j707M548O423K282l746o303l180K850O471M054k263o425
503a880m446J565N958M871n44n565n589l43N327N929R04m779n965j740L963O232
$$ plain form
393 -1185 5870 7506 2234 -5054 -7623 -3125 4235 7649 3973 -3401 -7658 -4841 2384 7332 5443
408 5443 -1495 -7047 -6118 454 6600 6614 486 -6077 -7003 -1474 5368 7197 2373 -4694 -7446 -3343
424 -3343 3832 7422 4124 -2974 -7253 -4820 2078 7073 5583 -1071 -6703 -6102 186 6268 6524 789
440 789 -5648 -6852 -1738 5016 7173 2702 -4221 -7157 -3407 3527 7196 4263 -2562 -6979 -4985
455 -4985 1635 6724 5562 -777 -6390 -6065 -138 5890 6468 1133 -5181 -6686 -1968 4643 6977 2841
471 2841 -3908 -6946 -3564 3059 6814 4352 -2129 -6679 -5009 1415 6557 5594 -420 -5842 -5782 -370
487 -370 5525 6434 1462 -4884 -6591 -2043 4380 6662 2916 -3387 -6567 -3717 2754 6808 4545 -1880
503 -1880 -6326 -4761 1197 6068 5524 -41 -5630 -5973 -646 5283 6187 1408 -4557 -6297 -2334 3898
519C898K734l419o417l281K817O190L814j894n944m619J061N861N099m64n450
534a4n313m11M832N796J419m448o163j945L925O023K625l014o006l578K283O182
550B193M133j806n898m386R07N340N077J42n165n674o76M826N667J291l970n725
566c724k371L288O107L051k937o009l365K155N593M091j139n550m830N98N400
581C58M971L8m697n199j086M179N733J746l900n716k101L124N525L017k280n797
597b085l766J967N724L890j279n036m395R2M818N273M07m898n232o04M043N015
613C934J760l125n726k827L166O038K774k759n258l221J266N029M548n92n558
628e51m871O85N016M449L18l862n139j772L819N981J954l856n508k099K547N068
$$ plain form
519 3898 6632 3213 -3204 -6485 -3668 2522 6336 4442 -1502 -6121 -5060 801 5900 5436 -14
534 -14 -5327 -5738 -906 4890 6309 1861 -4302 -6247 -2322 3701 6326 3312 -2694 -6272 -3989 2193
550 2193 6326 4520 -1378 -5764 -4857 483 5560 5702 537 -5137 -5813 -987 4680 5971 2001 -3724
566 -3724 -6095 -2807 3300 6351 3414 -2595 -5960 -3805 1788 5879 4740 -810 -5640 -5042 358
581 358 5329 5367 670 -4529 -5615 -1436 4297 6043 2143 -3573 -5674 -2550 2975 5992 3712 -2085
597 -2085 -5851 -3884 1840 5730 4451 -585 -4980 -4888 -70 5203 5610 712 -4520 -5124 -1081 3934
613 3934 5694 2569 -3157 -5984 -2818 3220 5994 3235 -2023 -5244 -3978 1051 5599 5007 -551
628 -551 -5422 -4737 279 4728 5046 1184 -3955 -5727 -1908 4073 6027 2171 -3337 -5436 -2889 2179
644B179L394j508n586m193J516N525L984q80m595m419l99M274N254R65m301n268
660d058j280L485N118K198k691n382k919K366N307L169j676m927l794Q26M929
675F71M328n29m687m309j99L881M756J281l688n364j579L642N020J711k562m659
691b286k917J658N341L722j884n423l318J355M274L801K55m083n115p02M676N065
707D419M05l778m322j571K387N090K995k588n807k796K629M891K800j081m265
722e92m208R4M923M804l43m664m199l21L343M542J778l088n391k108L199N082
738B851K113k215m545l106J239M885L807j091m786l723N10M046M115M70l832m656
754c918q23L664M541J245k836m581k190K403N016K552k264m679k644J373M184
$$ plain form
644 2179 5573 4065 -1521 -5714 -4198 1327 5311 4431 -164 -4583 -4982 -708 4546 5511 1210 -4058
660 -4058 -5338 -1853 3265 5463 2772 -2610 -5529 -3163 2144 5313 3637 -1290 -5084 -4258 671
675 671 4999 4470 -217 -4526 -4725 -844 3912 5193 1505 -3859 -5438 -1796 3224 4935 2373 -2286
691 -2286 -5203 -3545 1796 5518 3634 -1789 -5107 -3752 522 4323 4578 495 -4620 -5322 -646 4419
707 4419 4824 1046 -3276 -4847 -2460 2630 5625 3037 -2770 -5566 -2937 1954 4754 3673 -592
722 -592 -4800 -4706 217 5021 4678 14 -4185 -4506 -1163 3379 5157 2069 -3322 -5430 -2231 2851
738 2851 4964 2749 -1796 -4902 -3663 1222 5029 3938 -848 -4571 -4061 -15 4100 4570 738 -3918
754 -3918 -4741 -1077 3464 4709 1873 -2708 -4898 -2495 2521 5073 2809 -1870 -4514 -3141 1043
769A043L527n03m511m146N44M426L816o1l389m083j272L120N020J642l418m824
785c069j490K503M181K522j355m704l601J441N049L332j254m063l442j69L570
800e49M572Q69m019m774o78L448M172J484k232m548k713K087N107K763k023m469
816a503k791Q84L942L776r2m235m209J05L923L883N33k976m239j596K817M746
832B968J798k693m395k006J764M117K921j148m442l342J071M203L229m21l502
847A22l770n13L480M337P18l426m130j009K568M050J995k028m568k483K039M455
863A837K478j420l875l098M74L963L838k30m029l782n1L303L833J050k787m424
879b920j633K788M475J745k229m089k365J382M188L153j096m320l247P84L750
$$ plain form
769 1043 4570 4067 -444 -4590 -4046 380 4196 4135 746 -3337 -4609 -1489 3531 5173 1755 -3069
785 -3069 -4559 -2056 2125 4647 3292 -1412 -5013 -3572 1477 4809 3555 -508 -3950 -4119 -549
800 -549 4023 4892 873 -3901 -4579 -1131 3041 4525 2293 -2255 -4968 -2881 2226 4989 2966 -1503
816 -1503 -4294 -3410 532 4308 4216 -19 -4228 -4123 -200 3683 4216 1240 -2999 -4595 -1778 2968
832 2968 4766 2073 -2322 -4328 -2564 1553 4474 3326 -1116 -4458 -3387 816 4045 3624 122
847 122 -3648 -4161 -681 3656 4374 948 -3182 -4191 -1623 2427 4422 2394 -2174 -4657 -2618 1837
863 1837 4315 2895 -980 -4078 -3604 359 4197 3967 -62 -3844 -3895 -592 3241 4291 1504 -2920
879 -2920 -4553 -1765 2710 4455 2226 -1863 -4228 -2846 1342 4495 3399 -921 -4168 -3384 366
894C66L416J36l342m045p20L344M182Q80k857l945j550K109M173K311j901m379
910a822k450J607L920K749p72l661l425J84L794L691o1l416l557n91K739L917
926B846J390k567m272j625K414M021J879j632l817k648J056M030L109r22l859
941e97l105L67L325L451M24l123l935q18L013L959J084k444l859j788J900M045
957A899K329j642m048k564J175L729K942n31l555l403M1L441L596L41l039l702
973b991r58K615L927J474k327l983j822J843L871K307j317l820k757R25L724K994
989C705m57l385l264j57L109L631O28k947l725r82K518L696J523j980l839k056
1005c982J698L866K332j315l635k662O98L434L120k07l376l372j42L096L437O42
$$ plain form
894 366 3782 3918 576 -3469 -4189 -845 3337 4217 1360 -2585 -4135 -2026 2147 4458 2557 -1822
910 -1822 -4272 -2665 1255 4004 3232 -429 -3854 -3670 124 3815 3754 338 -3219 -3810 -1071 2846
926 2846 4236 1669 -2603 -4228 -1814 2207 4086 2454 -1363 -4011 -2955 1075 4184 3262 -597
941 -597 -3702 -3335 -10 3441 3865 742 -3193 -4011 -998 2961 4045 1601 -2258 -4046 -2146 1899
957 1899 4228 2586 -1462 -4026 -2851 878 3820 3289 -266 -3669 -3628 -187 3409 3750 711 -2991
973 -2991 -3949 -1334 2593 4067 1740 -2243 -4065 -2222 1649 3956 2639 -1181 -3938 -3013 711 3705
989 3705 3248 -137 -3401 -3558 -449 3182 3810 863 -2862 -3844 -1326 2370 3893 1913 -1926 -3982
1005 -3982 -2284 1582 3914 2599 -1036 -3698 -3000 434 3554 3347 -29 -3401 -3543 -447 2990 3632
1021C632k641l609j249K323L811J647k041l757j984J505L645K450r88l616k853
1036c725O24L467L074j52l155l287m15K868L549Q73k583l659j282K185L673J755
1052C810j755l664k181J329L605K537q67l470k825L86L255L143O1l035l328n36
1068c535K711L482J008k379l590j443K002L614J839j585l573k227J153L468K574
1083C519p10l333k866K59L124L086K11k851l297o64K565L451J105k235l514j503
1099c653J845L521J912j432l493k279J018L377K608n70l216k897J36L008L110
1114B995L37k737l300p78K423L411J235k100l482j605J692L444K016j270l413
1129a132k366Q59L295K657m38l095k908l5K845L135M98k600l302r02K298L349
$$ plain form
1021 3632 991 -2618 -3867 -1544 2267 3914 1873 -1884 -3868 -2363 1282 3732 2744 -872 -3725
1036 -3725 -3101 366 3440 3288 133 -3154 -3569 -701 2848 3721 1138 -2521 -3803 -1618 2055 3810
1052 3810 2055 -1609 -3790 -2461 1144 3681 2814 -656 -3481 -3095 160 3303 3364 329 -2999 -3535
1068 -3535 -824 2658 3666 1287 -2303 -3746 -1744 1870 3709 2124 -1449 -3676 -2523 945 3519
1083 3519 2809 -524 -3390 -3131 -7 3079 3290 439 -2858 -3522 -957 2494 3599 1364 -2150 -3653
1099 -3653 -1808 1713 3625 2193 -1300 -3579 -2561 816 3424 2854 -362 -3259 -3123 -115 2995
1114 2995 3332 595 -2705 -3483 -1060 2351 3586 1486 -1996 -3601 -1909 1535 3551 2281 -1132
1129 -1132 -3498 -2639 656 3313 2875 -220 -3128 -3163 -318 2817 3315 715 -2587 -3489 -1191 2158
1145B158J312j898l381j727J489L399K117j125l328k375O95L143K671k35k930
1160a5k957k08K767L125N80k435l195j051K091L306J458j764l338j810J393L269
1176A216K118r33l182k455N22L068K716j45k840k915k95K549L106P56k318l240
1192b272j100J966L255J501j586l237j915J202L262K208q69l091k449M02K887
1207A64K776M7k752k986l86K510L048P95k119l147j286J821L262J624j527l199
1223a355j888J082L075K277o28l027k590L14K862K714J07k555k921n80K304L104
1239B295R39k064l115j274J658L077J740j283l162k040R87L062K203n53k790k552
1255b872N2K707K851K36k559k859n52K121K917J119j771l173j510J661L170J622
$$ plain form
1145 2158 3470 1572 -1809 -3536 -2047 1352 3469 2344 -984 -3359 -2664 479 3150 2915 -15
1160 -15 -2972 -3180 -413 2712 3292 857 -2338 -3389 -1298 2008 3466 1702 -1636 -3446 -2053 1216
1176 1216 3334 2401 -781 -3236 -2714 354 3070 2925 85 -2830 -3125 -576 2530 3286 968 -2272
1192 -2272 -3372 -1406 1849 3350 1764 -1473 -3388 -2186 1076 3284 2415 -676 -3125 -2723 164
1207 164 2940 2987 235 -2751 -3137 -627 2421 3216 1097 -2050 -3336 -1515 1747 3371 1844 -1355
1223 -1355 -3243 -2161 914 3191 2563 -464 -3054 -2740 122 2836 2943 388 -2533 -3113 -809 2295
1239 2295 3234 1170 -1945 -3219 -1561 1516 3256 1973 -1189 -3229 -2242 820 3023 2470 -320 -2872
1255 -2872 -2820 -113 2738 2974 415 -2444 -2996 -875 2042 3161 1390 -1783 -3293 -1632 1538 3160
1271C160j250k884k010O49K886K501l82k943k576J85K573K565M22k152k952r43
1287c151K125L162J028j884k917j358J272K901J942r46l076k192Q09K882K222
1302B819l13k531k562k38K453K879M68k337k830p72J877K885J285j565l045j606
1318c133J382K957J790q99k807k191M81K811K456k43k606k504j94K241K753P28
1334C022k127l003r18J944K855J184j364k813j774R98L045K050r54k894j983M59
1350b273K425K376K09k424k874l26K469K710M35j872k580j150J404K991J618j493
1366A645l054j519J196K570J799m30k510k459J73K778K483j80k369k321m16J841
1382g73K730J023j884k993j027J731K699J252j118k613j861Q00K843K071p04k639
$$ plain form
1271 3160 1910 -974 -2984 -2335 551 3052 2670 -273 -2849 -2664 -91 2474 2896 744 -2208 -3151
1287 -3151 -1026 2136 3164 1280 -1637 -2995 -1723 1178 3120 2174 -902 -3094 -2285 597 2819
1302 2819 2506 -25 -2587 -2825 -372 2507 2975 638 -2192 -2964 -1087 1798 3083 1518 -1527 -3133
1318 -3133 -1751 1206 2996 2097 -710 -2901 -2420 391 2847 2604 -2 -2506 -2700 -459 2294 3022
1334 3022 895 -2108 -3026 -1082 1773 2957 1593 -1220 -2994 -1996 1049 3099 2145 -749 -2732 -2273
1350 -2273 152 2528 2737 313 -2561 -2887 -418 2292 2727 855 -1725 -2875 -1471 1520 3138 1645
1366 1645 -1409 -2928 -1732 838 2637 2207 -303 -2762 -2589 189 2672 2492 123 -2198 -2614 -773
1382 -773 1957 2980 1096 -1897 -2924 -1193 1506 2758 1640 -973 -2834 -2034 809 2880 2176 -463
1398d63k093K30K270K448L13k277k728m57K103K603P86j626k684j342J403K907
1414A393J511j263k705j652O98K502K165k79k630k396J68K446K276K47j917k538
1430a974q61J841K896R88j822k677j061J209K474J710p30k778k079P91K719J893
1446B539m11k170k171l05K112K685M57k222k585m82J730K368J102j236k711j583
1462b883J274K829J502j047k390j719L52K300K287j14k487k332N9K141K219M88
1478B479j717k557r72J710K755J014j518k478j283R30K478J838o89k660j959O18
1494b011K399J948p9k053k345m04K104K587M71j940k383p84J380K484J365j182
1510A557k727j534J122K513J552n86k249k028J35K365K306q1k249k177k40J756
$$ plain form
1398 -463 -2556 -2326 -56 2392 2705 428 -2300 -2757 -654 1949 2735 1109 -1575 -2917 -1514 1393
1414 1393 2904 1641 -1064 -2716 -2018 484 2649 2370 -260 -2656 -2488 -42 2234 2481 564 -1974
1430 -1974 -2835 -994 1902 2890 1068 -1609 -2670 -1461 1013 2723 1993 -785 -2864 -2073 646 2539
1446 2539 2128 -42 -2213 -2518 -406 2279 2736 514 -2071 -2553 -823 1545 2647 1411 -1300 -2883
1462 -2883 -1609 1220 2722 1675 -715 -2434 -2082 218 2505 2391 -96 -2428 -2369 -228 1991 2479
1478 2479 762 -1795 -2767 -1057 1698 2712 1194 -1284 -2567 -1637 841 2679 1990 -670 -2629 -2011
1494 -2011 388 2336 2257 204 -2141 -2545 -441 2146 2617 677 -1706 -2490 -1110 1374 2739 1557
1510 1557 -1170 -2704 -1582 931 2483 1897 -352 -2380 -2245 120 2426 2345 96 -2081 -2321 -565
1526e65K308Q37j597k660j017J595K501J105j125k297j576O58K483J908n93k448
1542d83j871L21K050K056K59j951k421m82J970K411N68j562k267j073J163K515
1558A203J438j120k542j454Q49K223J705k79k191k141N8K279K161L7j919k130
1574a823n37J553K429R47j539k553j000J313K307J269p95k299j740N35K447J873
1590B387m83k183j856KJ867K179M38j853k400n55J737K259P89j261k275j261J008
1607a461K464J471r15k342j529N34K109J828j07k094k102m5K008K101L05j668
1623E57k200p23J470K360R76j338k345j128J001K224J462o54k258j747M79K206
1639C42J797j94j938j987k29J819K217M62j721k232o57J397K205J054j110k323
$$ plain form
1526 -565 1743 2580 983 -1677 -2694 -1099 1402 2507 1382 -915 -2491 -1833 650 2558 1965 -483
1542 -483 -2354 -2033 17 2073 2332 381 -2040 -2522 -552 1859 2427 865 -1402 -2475 -1312 1203
1558 1203 2641 1521 -1021 -2475 -1626 597 2302 2023 -168 -2309 -2251 28 2189 2226 307 -1823
1574 -1823 -2360 -807 1622 2569 1030 -1523 -2523 -1210 1097 2366 1571 -728 -2468 -1933 514 2387
1590 2387 1904 -279 -2135 -2133 -266 1913 2351 498 -1902 -2457 -720 1539 2328 1067 -1208 -2469 -1461
1607 -1461 1003 2474 1559 -783 -2312 -1778 331 2159 2052 -42 -2144 -2189 -181 1920 2225 557
1623 557 -1643 -2366 -896 1464 2440 1102 -1243 -2371 -1370 854 2316 1662 -596 -2343 -1864 342
1639 342 2139 1945 7 -1980 -2209 -390 1827 2289 568 -1664 -2321 -924 1281 2335 1225 -1098
1655a098j331R48K310J453o82k103j671K79K021J967lk004k038j77J744K067N42
1672B224j458k216r01J335K315J049j118k181j268P21K138J598m73k128j784K71
1688a876J996J845O0j768k031m03J631K182O07j465k171q51J175K154J176r14
1704A347k208j392P05K131J552m00k010j762J01J900J946J52j753k017m26J527
1720f07K109P30j303k195r79J127K166J189q41k099j449N50K074J650l08j975
1736a61j794N3J794J924K68j637k039n59J474K093P76j228k110j044R70K126J278
1753B184p45k076j479M88J988J635k00j858j819p1J728J928L35j547k004n99J330
1770g82K073Q67j159k059j092R01K061J288o38j998j505L95J926J652j25j789
$$ plain form
1655 -1098 -2429 -1481 829 2282 1600 -503 -2174 -1895 126 2093 2090 86 -1952 -2129 -385 1682 2224
1672 2224 766 -1450 -2351 -1016 1299 2348 1230 -951 -2219 -1498 640 2238 1765 -363 -2147 -1876
1688 -1876 120 1965 2025 257 -1774 -2177 -546 1636 2243 778 -1393 -2244 -1069 1085 2261 1347
1704 1347 -861 -2253 -1548 583 2135 1735 -275 -2037 -1936 -36 1910 2062 309 -1708 -2134 -607
1720 -607 1502 2232 929 -1266 -2245 -1118 1048 2237 1396 -703 -2152 -1602 472 2122 1814 -161
1736 -161 -1955 -1902 -108 1816 2084 447 -1592 -2151 -677 1416 2192 964 -1146 -2190 -1220 906 2184
1753 2184 1439 -637 -2116 -1628 360 1995 1795 -63 -1882 -1953 -225 1703 2038 491 -1513 -2112 -782
1770 -782 1291 2158 999 -1060 -2152 -1251 810 2098 1460 -538 -2043 -1648 278 1930 1805 16
1786A6j807j43J634J933M18j493j995o60J281K042Q91j051k040j143Q17K025J354
1803B079n86j965j520L10J854J687l3j764j816k13J588J918M69j404j967p33J195
1820i01K022R53r77k020j160P32J979J369m81j892j562K15J814J698K4j658j810
1837a655k80J496J909N34j321j952p74J105J986R72q59j965j223O61J917J388
1853A939m17j829j551J51J717J707R9j590j820l36J429J874N89j224j931q37J046
1870i84J944J038q25j918j223N69J839J438l18j796j575R5J677J674J85j515j814
1887a509m01J341J883O57j172j907q53R28J904J115p30j900j268M98J819J426
1903A831k33j700j609k8J615J754J94j466j767m61J225J850P49j062j913r52R20
$$ plain form
1786 16 -1791 -1934 -300 1633 2051 558 -1437 -2097 -816 1226 2117 1066 -974 -2117 -1300 725 2079
1803 2079 1493 -472 -1992 -1682 172 1859 1826 62 -1754 -1967 -379 1539 2008 604 -1363 -2096 -901
1820 -901 1121 2074 1097 -923 -2083 -1351 628 1997 1516 -376 -1938 -1723 91 1789 1813 155 -1655
1837 -1655 -1935 -439 1470 2004 683 -1269 -2043 -938 1048 2020 1161 -804 -2027 -1366 551 1939
1853 1939 1522 -307 -1858 -1707 10 1717 1816 226 -1594 -1930 -501 1373 1962 738 -1193 -2030 -984
1870 -984 960 1998 1173 -745 -1968 -1399 440 1878 1560 -236 -1811 -1716 -39 1635 1820 305 -1509
1887 -1509 -1910 -569 1314 1971 799 -1108 -1961 -1033 871 1986 1256 -644 -1912 -1414 405 1831
1903 1831 1598 -102 -1711 -1739 -124 1630 1824 358 -1409 -1870 -645 1205 1954 892 -1021 -1973 -1053
1920a053J866J072o39j773j322L60J774J506j80j704j572j7J479J641L70j328
1936D80j833n70J253J848O96j012j770r48P21J817J211n64j814j345L95J692J409
1953A666p1j536j631j75J483J737L28j321j733n65J074J785Q45r15j846j003P29
1970a149J784J154m72j706j369K35J678J504o7j542j553k18J351J705M77j255
1986E57j789o22J078J719Q40p75j746j122O22J805J225m77j666j290J70J481J539
2003A549J30j478j699k14J388J605M22j058j666p82Q92J841R42q71j758r62N66
2020a153J582J230k38j605j486J19J612J491mj335j512l86J152J723O22j143j765
2037a096o75R44J623R10o03j666j208M74J727J266l48j540j316qJ390J568K27
$$ plain form
1920 -1053 813 1885 1246 -527 -1849 -1489 285 1791 1611 -93 -1665 -1682 -203 1438 1808 480
1936 480 -1353 -1923 -670 1178 1874 862 -908 -1856 -1135 682 1893 1329 -485 -1830 -1435 257 1666
1953 1666 1595 59 -1572 -1747 -264 1473 1801 480 -1253 -1818 -744 1041 1886 971 -875 -1878 -1149
1970 -1149 635 1789 1317 -389 -1758 -1523 155 1659 1592 50 -1503 -1721 -370 1335 1812 557
1986 557 -1232 -1854 -776 943 1783 1008 -738 -1860 -1238 567 1792 1315 -351 -1641 -1471 10 1549
2003 1549 1679 201 -1498 -1712 -324 1281 1703 645 -1021 -1803 -911 930 1872 1001 -757 -1719 -1153
2020 -1153 429 1659 1421 -184 -1670 -1551 61 1552 1548 213 -1299 -1685 -533 1190 1812 669 -1096
2037 -1096 -1771 -827 796 1706 1103 -563 -1771 -1297 430 1696 1348 -192 -1508 -1516 -126 1442 1669
2054A669j361j660l21J201J587N91r21j686q63Q27J732R60o73j591j100L34J539
2071B64J359j42j565j461P3J382J419K64j148j612n60J112J743N90r99j572p72
2088a625O34J568J125m82j693j215M28J570J166j14j312j427k31J342J641K62
2104A637j289j525l98R60J508P89p64j713r44P64J651R37n05j435j167J48J473
2121A27J447o7j501j403m1J215J401M22j026j651o19J038J654O53q44j481q92
2138a568M85J560J179m02j608j199K98J378J244P3j240j518k79J284J548L18j067
2155D86j454n91P74J571Q96p26j657r23O24J462J029k66j373j307O5J436J409
2172A455j8j289j342k43J034J472N84r92j641o27R30J491P31n80j438j047L63
$$ plain form
2054 1669 308 -1352 -1673 -472 1115 1706 785 -901 -1764 -937 795 1755 1082 -509 -1609 -1275 264
2071 264 1623 1481 -84 -1545 -1472 -90 1329 1593 445 -1167 -1727 -615 1128 1718 719 -853 -1625
2088 -1625 -991 577 1702 1220 -473 -1688 -1260 310 1476 1362 50 -1377 -1608 -266 1375 1637
2104 1637 348 -1177 -1575 -615 893 1682 918 -795 -1739 -975 676 1613 1108 -327 -1494 -1346 127
2121 127 1574 1507 6 -1397 -1438 -223 1178 1600 574 -1077 -1696 -658 996 1649 805 -676 -1568
2138 -1568 -1083 477 1656 1254 -354 -1553 -1255 123 1367 1440 200 -1318 -1597 -313 1235 1553 486
2155 486 -968 -1559 -785 786 1682 956 -701 -1624 -1000 462 1491 1225 -148 -1455 -1390 46 1455
2172 1455 1437 148 -1194 -1437 -403 1069 1653 661 -980 -1607 -677 814 1545 965 -473 -1520 -1157
2189a157J569J178l36j457j157R6J214J337K35j198j540l07J149J441M40q67j434
2206g94p52O75J592R12o55j528r25M10J328J147q1j372j373M7J343J320J13j079
2224C28j361m45R30J545O38r28j546o56P29J389Q54l79j443j161L40J496J145
2241A475k17j275j194j25J129J427L27j152j487l62R86J373N74p06j456q49O12
2258i20J537R04n11j393r90K37J270J215qj319j327m9J193J292K60r56j396n26
2276a487Q66J500O49p94j421p38N37J356R86l47j420j109K59J346J135n9j155
2293A04j270k08J113J422K96j028j372m50P95J377P15o45j480q64N80J426Q90
2310A401l45j274j107R6J260J266Kj224j271j25J020J286M03q68j419n98Q31J421
$$ plain form
2189 -1157 412 1590 1254 -203 -1360 -1264 -50 1287 1522 324 -1216 -1523 -374 1067 1507 640 -794
2206 -794 -1546 -871 721 1633 978 -550 -1475 -1065 263 1410 1329 -43 -1416 -1369 -26 1294 1407 328
2224 328 -1033 -1478 -548 997 1635 707 -839 -1495 -766 623 1477 1098 -345 -1506 -1166 330 1475
2241 1475 1258 -17 -1211 -1336 -207 1220 1547 395 -1092 -1454 -468 905 1479 773 -683 -1532 -920
2258 -920 617 1521 1010 -383 -1373 -1136 134 1349 1341 22 -1305 -1354 -161 1131 1391 435 -961 -1487
2276 -1487 -621 879 1528 734 -687 -1425 -888 468 1454 1107 -313 -1422 -1163 183 1318 1259 104
2293 104 -1166 -1374 -261 1161 1457 429 -943 -1393 -598 779 1494 849 -631 -1495 -915 511 1401
2310 1401 1056 -218 -1325 -1229 31 1297 1299 75 -1196 -1321 -301 985 1388 520 -899 -1497 -666 755
2328G55O66o48j325q35L84J345J052k84j346j111J65J210J156R2j065j312k90
2345a391J035J361L94q98j337n47O74J355P81n42j397q87M35J307R71k17j216
2362a19j137K7J193J240Q3j087j251k88R35J310M77p93j386o19O89J335P57n06
2380H60j311r13L35J298J037j96j229j098J5J090J211J85j012j292l31R29J303
2397H81M77p55j316o59O04J352Q08m68j333q95K96J231J035j02j169j162m9J106
2415a18J209J99r70j256l78Q29J308N59p22j325o68N50J276Q26l78j254r67K27
2433a053J219J043p9j118j138j02J035J206K68r26j246m13P88J268N64o38j272
2450e94p23M96J287Q34l54j225r48J86J148J069j7j079j152j46R98J216K80q67
$$ plain form
2328 755 1421 773 -552 -1387 -1003 342 1394 1110 -236 -1347 -1182 28 1184 1276 211 -1101 -1391
2345 -1391 -356 1005 1399 501 -836 -1383 -709 646 1427 885 -512 -1399 -964 343 1314 1097 -119
2362 -119 -1256 -1229 -36 1204 1287 200 -1051 -1339 -404 906 1383 590 -796 -1415 -726 609 1366 860
2380 860 -451 -1364 -1029 269 1306 1110 -119 -1217 -1202 -112 1099 1284 272 -1020 -1351 -422 881
2397 881 1358 603 -713 -1372 -768 584 1392 924 -409 -1304 -1008 223 1258 1156 -13 -1175 -1224 -118
2415 -118 1091 1290 320 -936 -1314 -485 823 1382 660 -665 -1333 -783 493 1319 941 -313 -1280 -1053
2433 -1053 166 1209 1130 12 -1126 -1228 -193 1013 1281 355 -891 -1304 -516 752 1316 678 -594
2450 -594 -1317 -821 466 1300 946 -279 -1227 -1041 107 1176 1159 80 -1072 -1218 -220 996 1276 409
2468D09j246m52P39J265O12o12j262p31M57J222Q67k90j191r85J48J120J073L0
2486A173j043j143j94R26J215L35q14j236m92O92J239O40n45j248p66M05J210
2503C54Q93k36j155j000Q6J073J086R0r95j146k31Q96J175L84p41j231n39O44
2521e93J222O76m98j209p87L25J165R13j86j093j016L3J029J079J25r41j138k80
2539a174Q33J178M28p25j184n72N65J202P05m31j180q27K93J131R34j52j057j024
2557a057j8J011J084J57r04j134l03P68J164M83o61j203o01N49J162P20l66j150
2575b99q53K29J113R65j08j052j008n7R32J086K30q44j154l75P61J150M92o12
2593E96j140o42M46J160P74l55j122q67K10J055R40j0j002j040j27R24J098K40
$$ plain form
2468 409 -837 -1289 -550 715 1327 715 -547 -1278 -821 401 1268 978 -213 -1198 -1050 70 1143 1173
2486 1173 130 -1013 -1207 -281 934 1269 455 -781 -1273 -581 658 1298 753 -495 -1261 -856 354
2503 354 1247 1011 -144 -1144 -1058 15 1101 1191 196 -950 -1181 -285 890 1274 533 -698 -1237 -593
2521 -593 629 1305 807 -402 -1189 -864 301 1214 1028 -65 -1081 -1048 -19 1060 1185 244 -894 -1174
2539 -1174 -341 837 1265 540 -644 -1216 -651 551 1256 825 -355 -1182 -889 242 1176 1024 -33 -1057
2557 -1057 -1075 -64 1020 1177 273 -861 -1164 -396 768 1251 590 -613 -1214 -665 497 1217 851 -299
2575 -299 -1152 -923 190 1155 1047 -5 -1013 -1070 -138 948 1178 334 -820 -1195 -434 716 1208 596
2593 596 -544 -1186 -740 420 1194 839 -283 -1150 -940 115 1055 1045 43 -997 -1124 -200 898 1138
2611A138q11j114l88O60J152N59n67j161o57M44J104P68k63j076q85J35J032R64
2629A034or45j025j62Q56J084L05p66j128m11O36J114N71m93j129p17L98J099
2647C15P87k54j037q71O1R73J005P1r39j048j70Q30J036L35o74j104m97N71J162
2666E52N99n03j095o61K96J034Q48j54j041r40P8R77R52P5q37j017k70P53J116
2685G62L84p01j108m43N53J021O34l68j080p74L03J068Q10j82r59q81l5R01J004
2704I09J54q60j023k44P20J015M12n79j077n68M99J104O16l81j022p22J96R92
2722A41Q77q6r76r10j4Q67R37J99p47j052l36P14J069M10n99j010n48L96J044
2741C76P27l28j070p63K46R52Q12l8q56r59j32Q61J032J60p57r81l18N81J017
$$ plain form
2611 1138 327 -787 -1175 -515 637 1196 629 -532 -1189 -745 359 1127 864 -212 -1097 -962 70 1034
2629 1034 1028 83 -942 -1104 -248 836 1141 375 -753 -1164 -528 586 1157 664 -465 -1182 -784 315
2647 315 1102 848 -189 -1060 -999 -26 979 1050 111 -937 -1107 -277 759 1094 420 -684 -1181 -610 552
2666 552 1151 648 -447 -1108 -812 222 1070 916 -125 -1065 -987 -10 942 1017 180 -837 -1107 -354 762
2685 762 1146 445 -663 -1106 -553 468 1102 734 -346 -1120 -817 251 1061 879 -80 -961 -996 -95 909
2704 909 1063 203 -820 -1064 -344 671 1083 504 -573 -1141 -642 462 1078 697 -325 -1047 -851 141
2722 141 1018 932 -44 -954 -968 -101 836 1035 288 -764 -1100 -386 683 1093 494 -516 -1064 -668 376
2741 376 1103 775 -295 -1058 -812 140 952 914 58 -901 -1033 -172 860 1020 263 -718 -1036 -455 562
2760E62N31n05j094o03M56J015O40k72r22q05Q3R51R20k7r23q87r0P53R36L10
2780A029o68j060l96O61J015M27m66r53o31L10J023P49k54r94p52J34Q55Q45O8
2799I42q05r72j79Q09R69K19o42r31m35M99J030N82m85j035n90L57R24O82j30
2818H09r17q50N3R20Q71Lp87q53k11O53R87L69o52j018m02N48R32N11l30r56o96
2839a016K56J012P37k06q91p55%P88Q99J68p92r73j92P04R09L26n20r51n07M44
2859e60J037N77m23r51o02K13Q60P72o9q76q70K7Q44Q13J03o57q93l24O21R97
2879F39L82n79r61m31M13Q70O19k53r42p37K36R19P15j03p83p83j05P29R45J88
2899I78p50r10k35O01Q66M11m30r58n66M24R60N79l11q65o56J06Q27Q28l4q37
$$ plain form
2760 562 1093 588 -506 -1109 -653 362 1002 730 -192 -997 -914 37 957 930 7 -880 -970 -217 719 1029
2780 1029 361 -699 -1095 -434 581 1008 542 -411 -1042 -732 291 1040 786 -208 -960 -826 29 874 942
2799 942 137 -835 -1014 -205 764 983 341 -590 -1025 -526 504 1086 601 -434 -1024 -667 257 939 809
2818 809 -108 -958 -905 15 886 889 102 -751 -962 -309 678 1047 395 -623 -1025 -477 455 966 636 -320 -1016
2839 -1016 -760 252 989 783 -108 -863 -863 -75 824 992 200 -773 -965 -261 648 974 454 -497 -1004 -560
2859 -560 477 1054 631 -320 -922 -709 151 923 854 -22 -892 -865 -21 792 895 238 -655 -979 -358 639
2879 639 1021 442 -519 -950 -537 333 952 699 -243 -980 -744 175 890 787 4 -779 -884 -155 790 978
2899 978 228 -682 -917 -316 550 961 531 -427 -993 -569 391 970 659 -206 -862 -756 71 899 865 28
2919B8q40l4P34Q20K10n95r13l70N57R71M00m89q77n11K96Q84O66k05r18p14J50
2940g50Q20P36J8p25q53j49O86R15K25o41q48l31M68Q80M95l88r43n68L59Q69
2960B75O11j85p87p40K3Q23Q11K4p68p95j34O14Q39L23n63r26l88N17Q93M43l90
2981E20q14n91K29Q58O92j79q44p03O8P34P56J02o90q52k07O61Q62K69n41q39
3001e09l98L99Q74N45l59q85n72K59Q05O30q1p62p59j5P59Q11O9o65p93k27N57
3022c17Q61L46m92q92m01M03Q33N20k80q29o17J73Q21O86j10p54o93n3O79P81
3042F65J72o37q33k46N62Q21L24m34q15m77L56Q42N51k92p99n95J51P53O88j4
3062G43p47p60n0O87P65J60n78p91l10N18Q44L87m58q21m41L31P89N47k01p90
$$ plain form
2919 28 -812 -846 -112 708 918 323 -590 -960 -403 568 968 479 -398 -909 -613 271 937 732 -186 -900 -750
2940 -750 70 806 824 99 -754 -903 -217 698 923 282 -566 -897 -429 451 946 558 -385 -953 -594 275
2960 275 886 701 -86 -826 -803 20 831 855 87 -708 -842 -228 611 934 371 -555 -943 -426 467 910 520
2981 520 -294 -885 -656 202 894 715 -129 -832 -764 -30 726 828 138 -714 -921 -260 602 871 330 -509
3001 -509 -907 -508 366 911 552 -333 -905 -646 159 789 708 -54 -813 -828 -69 742 811 146 -647 -874 -317
3022 -317 544 890 398 -494 -895 -492 341 861 581 -248 -865 -692 129 815 705 -49 -742 -795 -116 665
3042 665 837 200 -633 -879 -317 504 828 394 -421 -898 -542 300 851 559 -240 -835 -684 69 757 743
3062 743 -4 -764 -814 -127 638 798 220 -571 -881 -363 481 868 410 -411 -852 -521 268 815 614 -176
3082a76o30J07P79O84k9o98p24j14O33P99K07n69q02l07M84Q04M04l80q24m96
3102h48L02Q07N56k09p56o28Q5P08P03J6o65p36j15N92P65K27n15p99l37M63P94
3123D10M21l66p94m93K72P61N79j62p45o38M9P17O85M1o28p37j52N80P71K27m91
3144C07p89l28M09P72M43l18p92n17K32P57N69j20p03o47J9O71P03O0o17p25j65
3165g79N37P49K74m56p74l67L90P70M54l10p46n31J96P25O16j12o94o53RO40O98
3186F36J00n76p36j87N04P53K87m21p59l86L46P43M65k47p31n39J65O96O10p3
3206F50o52o58m4O11O98J17n38p14k34M78P37L28l95p64m03L34P16M84k23p15
3226a87n48J23O88O13m5o40o49n4N72O88J63n10p18k57M69P16L36l59p40m21K89
$$ plain form
3082 -176 -806 -699 80 764 735 37 -687 -801 -168 631 838 269 -533 -840 -356 448 852 472 -352 -848
3102 -848 -546 261 817 608 -148 -776 -691 17 720 736 71 -665 -780 -188 577 804 289 -510 -847 -384 410
3123 410 831 465 -329 -822 -550 211 790 628 -117 -755 -706 11 696 737 109 -628 -780 -200 571 798 307
3144 307 -482 -810 -401 371 814 496 -296 -813 -581 176 745 625 -78 -725 -706 -35 668 728 111 -614 -779
3165 -779 -242 507 781 325 -449 -816 -426 344 798 488 -258 -789 -593 132 748 636 -58 -711 -702 -62 636
3186 636 736 160 -576 -763 -259 494 781 360 -399 -785 -439 304 769 522 -209 -748 -583 113 723 650
3206 650 -2 -660 -704 -93 605 722 184 -530 -764 -286 451 779 384 -380 -783 -449 267 751 528 -187
3226 -187 -735 -612 76 689 644 4 -645 -699 -127 561 724 214 -504 -761 -292 424 760 401 -339 -760 -471
3247d71P09N11k00o98n63J04O53O10J0o24o54j00N72O88J82m87p13k78M14P20
3267C85L52l33p23m35K57O89N12j61o61n68O9O21O29J9n82o55j29N23O89K20m66
3288B52p01k95L86P11L81l14o98m53K31O84N18j48o36n85N5N95O34N5n73o58j38
3309f97M95O67K38m17o87l52L76O95L94k93o58m53J80O60N32j01o44n94M3N82
3329c4O07P7n17o52j91M84O90K51m30o69l24L15O81M18k42o68m93J71O46N27p3
3350E74n88n92l8N72O32J04n13o39j82M37O51K79l62o64l75L03O56M35k17o42
3370a69m86J20O17N56m3o02n80l4N18O20J41m79o36k38M41O62K74l46o30l87K51
3391d30O47M66k08o44m71J21N81N26On43o13p5N28O32J41m78o04k52L78O49L51
$$ plain form
3247 -471 238 749 549 -149 -712 -608 45 655 665 41 -613 -713 -141 547 729 242 -471 -749 -335 385
3267 385 737 404 -319 -754 -497 192 704 543 -118 -686 -617 4 633 652 70 -585 -714 -191 498 718 252
3288 252 -449 -744 -358 353 734 420 -278 -731 -500 184 702 554 -82 -667 -612 -17 617 672 99 -559 -697
3309 -697 -202 465 703 286 -401 -753 -377 318 712 419 -239 -692 -512 148 680 579 -65 -659 -616 -34
3329 -34 573 650 133 -519 -710 -226 464 715 285 -384 -708 -393 288 706 464 -204 -697 -526 120 647 574
3350 574 -14 -606 -644 -72 560 664 151 -488 -670 -233 418 697 335 -329 -704 -401 255 690 473 -169
3370 -169 -655 -535 82 638 595 -7 -587 -621 -103 517 658 179 -457 -695 -254 408 682 336 -294 -681 -430
3391 -430 217 683 475 -169 -640 -519 62 588 594 51 -562 -637 -109 523 664 186 -418 -670 -292 357 708
3412G08l44o59l82K62O31M31j44n95n30O1O07N64k5n44n58r6M69O14K02m31o61
3433d20k57L82O35K95k62o11m23J97O34M74j55o06m78N0N28N44P7n18o25j10N01
3454a48N90J71l96n94k84L22O42L70l01o18l87J96N60M84r5n61n40K8N52N51L4
3475E76m81n52j70M19O38K30m04o33k63L18N85L52k04n97m62J73O06M70j20n27
3495d6m96k5M81N95J01m99n99j36M27N71K28l18o07l40K79O45L67k35n68m18J14
3516d79N39N20m8n42n55J0M97N34J06m16n93k09M04O17K45l59n69l07K41N59M20
3537F15j66o03m53J27N65M61m3m78n27r6M80N98J03m54n51j69L39N44L12k72o19
3558b87l60K56N94L72j79n04m58M3N28N38nn34n28l4M39N22J80l60o03k46L60
$$ plain form
3412 708 364 -295 -677 -415 216 647 503 -92 -622 -561 46 610 585 41 -517 -613 -144 470 672 241 -420
3433 -420 -677 -295 340 635 373 -238 -661 -464 170 644 489 -117 -595 -545 -17 527 604 86 -539 -649 -148
3454 -148 442 613 217 -377 -661 -339 303 673 372 -246 -633 -437 123 607 512 -49 -589 -561 -9 542 576
3475 576 95 -457 -627 -208 430 660 256 -377 -640 -322 263 615 411 -186 -648 -475 131 601 481 -46
3495 -46 -542 -567 -86 509 610 111 -488 -624 -197 374 602 284 -323 -663 -384 261 628 393 -175 -593 -479
3516 -479 60 580 532 -10 -565 -555 -58 476 582 166 -427 -636 -232 385 630 271 -298 -605 -364 195 615
3537 615 449 -154 -607 -480 85 546 503 25 -502 -598 -118 480 583 129 -422 -591 -252 292 604 332 -287
3558 -287 -647 -391 203 575 396 -108 -566 -523 5 543 538 4 -524 -558 -119 403 583 223 -380 -626 -266
3579b66N98K69k89n35l66J80N73M49j52n65m49O9N03M76N0m50n63j02M37N73J40
3600E80l68n58k33K84N73L30k53n93l59J97N50L83p2n14m89J0N22N14J9m70m91
3621d38j18L76N52K34l72n76k61L22N47L02k02n31l97J30N53M39q6n33m41K0M45
3642c5M83J08m38n43j48M22N26J86l23n20k87K46N66L52k17n48l71J35M96M20
3662E10k7n00n03MM71M97N1m02m91j83L51N51K53l28n53k60K44N16L34j56n26
3683a47m05J02N23M32n1m69m44n1M21N19J23m16n24j58L48N14K35k67n35l13K12
3704c51N56L46j69n07l83Q4M62M45Nm54n03l8M27M69J27l48n24k08L36N32K44
3725E48k81n12k91J89M82L81j20m96m29Q1M87M22pm20m63r3M01N01J37l73n00
$$ plain form
3579 -266 332 601 312 -223 -589 -409 164 613 461 -104 -553 -484 19 495 545 95 -468 -570 -133 440 580
3600 580 212 -346 -579 -295 278 608 355 -238 -597 -400 150 533 461 -53 -542 -532 -10 504 523 53 -438
3621 -438 -556 -180 372 606 234 -342 -603 -281 266 568 366 -165 -562 -432 121 560 474 -59 -500 -480 -35
3642 -35 448 556 118 -425 -573 -151 375 561 238 -282 -569 -323 243 595 378 -170 -541 -406 90 510
3662 510 483 -17 -520 -516 -45 452 503 101 -390 -573 -222 329 582 254 -299 -559 -315 201 535 379 -147
3683 -147 -552 -450 73 505 454 -15 -459 -510 -89 430 553 137 -387 -545 -197 317 552 285 -250 -563 -351
3704 -351 205 551 382 -125 -508 -424 38 483 488 34 -469 -507 -80 389 516 168 -356 -564 -228 304 548
3725 548 267 -245 -536 -347 135 516 396 -100 -529 -448 39 461 454 34 -429 -522 -121 380 517 144 -356
3746c56j85K91N09K68k31n09l24J80M99L73j20m61m23L7M57M55J8m41m53q9L74
3767a31M80J69l20n13k43K89N09K88k36m85l46J59M91L88q3m84m21K9M33M35N0
3788D58l81m87j18L60M97J72l06m84k44K41N08K88j94m80l44J39M73L59n1m30
3808b4m29oM24M43N6l79m60j25L31M74K11k93m95k41K23M96K96j88m52l55J01
3829c92M64L87m9m33m24rL86M51Q6l56m70j49L23M76K01k66m83k45J95M84L05
3850D82j48m63l51P9M52L99k5m30m26m7L97M32J28l42m67j73K95M88K22k44m71
3871b13k82J86M67L23j25m36l81O0M35M16j2m08m27o8L88M29J30l26m67j71K68
3892b14M71K29k27m57k85J62M48L36j02m31l82N1M13L95M1l93m41o5L43M44J33
$$ plain form
3746 -356 -541 -250 259 527 296 -213 -537 -357 142 515 395 -66 -489 -452 5 460 478 37 -416 -505 -131
3767 -131 349 518 198 -315 -558 -269 240 528 292 -193 -539 -380 111 499 416 -68 -489 -460 -27 408 458
3788 458 77 -410 -528 -168 329 501 195 -289 -533 -292 216 504 310 -170 -514 -375 98 457 406 -24
3808 -24 -453 -459 -35 408 464 85 -375 -500 -169 305 516 223 -272 -513 -290 206 502 314 -138 -493 -392
3829 -392 72 459 410 -23 -447 -456 -70 381 467 111 -359 -508 -185 291 492 226 -257 -502 -307 177 482
3850 482 334 -129 -480 -401 51 450 425 -5 -431 -478 -81 351 479 137 -330 -503 -208 280 502 258 -213
3871 -213 -495 -309 158 481 356 -80 -461 -401 34 450 438 30 -397 -465 -77 352 482 156 -311 -482 -214
3892 -214 257 486 259 -198 -483 -321 127 463 361 -70 -452 -401 12 407 448 55 -386 -451 -108 336 469
3913D69l08m53j88K54M60K40k04m57k81J56M31L42q7m27l80J4M22L98L3l59m26
3934c51r2L19M46J56k95m52k04K41M32K77j82m50l04J13M33L45o3m06l75nL83
3955c4M07N0l52m05j28L07M37J73k52m48k29K19M41K72j65m23l18Q7M23L69m3
3976C88l96l90nL70L86Q4l24m32j32K88M45J77k47m28k35J86M29K95j33m31l36
3997d41R5M09L46k6l71l91l8L64L91R3l17m22j38K66M20K10k21m36k46J73M36
4018A56K86j21m04l34O8L84L69ll74l93m9L32L98J16k91m37j40K48M25K15k05
4039B46m19k61J36M33L07j06l97l32L4L67L73Rl41m02p5L27M03J18k58m08j92
4060d38K15M34K33j98m16k60J30M07K96o8l85l53J8L83L58K3l23l62j02K88M14
$$ plain form
3913 469 161 -292 -480 -226 234 474 270 -187 -468 -312 119 461 374 -53 -433 -419 3 401 434 75 -351
3934 -351 -443 -124 322 478 183 -269 -473 -232 200 477 295 -155 -459 -346 87 432 369 -37 -412 -417 -34
3955 -34 373 423 71 -334 -462 -155 282 455 203 -245 -474 -255 186 458 293 -130 -448 -361 62 431 388
3976 388 -8 -398 -403 -33 353 437 113 -319 -451 -163 282 459 212 -216 -451 -265 164 459 326 -105 -441
3997 -441 -346 63 409 383 12 -379 -417 -53 338 431 114 -308 -446 -180 240 450 229 -207 -453 -280 156
4018 156 442 321 -83 -417 -349 35 404 401 27 -366 -415 -83 315 431 140 -297 -437 -189 236 451 246
4039 246 -173 -434 -298 135 442 336 -61 -393 -359 8 381 390 49 -353 -428 -101 302 420 162 -246 -438
4060 -438 -223 211 444 246 -170 -430 -300 107 403 335 -50 -403 -385 -2 356 379 56 -306 -408 -120 294
4081B94J50k72m23j72K19M02K12j41m02k95J08M13L15p3l82l31J2L42L69O5l34
4102G6l95r6L07L80J39k23m08k08J92M19K32j48l93k82Q5L77L33l0l75l58j6L59
4124c3L52O0k89l76j25K57M05J68k48l97j79J71L81K54j11l86l17R9L70L07k7
4145C36l41l27m9L17L79Q5l14l71j18K55L76J81j97m05k34J71L99K41j07l69k94
4166c86M5L58L34j1l47l49j2K98L47R9k50l97j53K40L97J82j95l74k22J20L78
4187A02K86q5l81k98N9L29L24J0k93l75p2L05L83R5k68l47j56K00L67K15j64l95
4209a59k51J44L69K63p9l25l12pL53L41K2l26l31o6K62L51J37k34l92j63K18L71
4231A86J74j40l55k52R1L73K97p3l55k82OL06L27N7k86l72q1K57L66J29k28l43
$$ plain form
4081 294 444 172 -251 -423 -204 198 410 269 -133 -428 -320 93 408 335 -47 -378 -366 -24 345 410 76
4102 76 -319 -415 -108 272 411 188 -220 -428 -236 183 415 267 -126 -408 -323 54 387 357 -18 -376 -392 -33
4124 -33 319 379 90 -286 -411 -154 251 419 171 -226 -405 -234 147 401 290 -96 -413 -314 56 363 336
4145 336 -5 -332 -381 -64 315 400 86 -285 -403 -148 228 409 212 -193 -427 -256 143 384 277 -92 -386
4166 -386 -341 17 351 340 -7 -356 -368 -70 277 376 126 -271 -424 -184 213 395 200 -174 -396 -276 102
4187 102 388 303 -78 -376 -317 12 336 346 53 -322 -394 -89 294 389 121 -226 -382 -182 185 400 236 -159
4209 -159 -410 -266 103 366 287 -38 -350 -357 -4 337 359 33 -298 -364 -102 249 386 152 -240 -403 -185 186
4231 186 360 220 -135 -387 -296 77 374 301 -54 -336 -330 -24 303 360 74 -298 -379 -122 244 373 145 -198
4253a98j84J65L91K15j49l61k47Q7L50K69j7l27l30j3L38L14M6k68l35j17K29
4274a42L69J73k18l93j70J76L43K25j02l52k74O0L59K92l7l30k93k8K74L39Q6
4295C57k59l61j05K27L51J52j79l41k11J33L68K37j17l40k37L1L15K91J3l03l23
4316c01l3K78L31P0k24l46j14J84L57J64j67l54j90J28L32K30p6l29k82M0L37
4337C5K72J0k93l04p1K67L40R8k46l41j22J82L31J87j50l46k18J16L58K37q3l13
4359e4k59MK94L10L8k89l34m7K41L31J11k06l42j57J80L54J78j47l15k07O2L24
4381G0K62k9l32k84K1K92K81L1k48l23q6K43L38J08k11l28j41J46L20K16j07l48
4403a09k38J03L13K29l4k81k85j7K92K92O1k66l05r1K21L15J46k03l21j53J47
$$ plain form
4253 -198 -382 -217 174 389 240 -121 -368 -281 69 338 321 -6 -336 -349 -11 303 349 81 -254 -371 -142
4274 -142 227 400 182 -211 -381 -205 138 363 261 -91 -365 -305 54 346 309 -21 -314 -342 -68 271 357
4295 357 98 -263 -368 -141 210 362 183 -158 -369 -236 132 369 252 -88 -325 -294 21 312 325 22 -301
4316 -301 -334 -56 275 345 121 -225 -339 -155 202 366 199 -155 -345 -217 115 345 269 -60 -342 -302 35
4337 35 307 317 24 -280 -351 -84 256 354 108 -233 -355 -173 158 345 195 -151 -369 -253 105 342 259 -54
4359 -54 -313 -309 -15 295 333 44 -290 -337 -96 235 346 140 -202 -359 -179 175 353 206 -109 -316 -254 70
4381 70 332 303 -29 -313 -292 0 281 312 64 -259 -345 -102 236 344 133 -195 -336 -190 130 346 239 -109
4403 -109 -347 -244 69 298 264 -17 -302 -319 -27 265 326 60 -245 -336 -115 200 346 143 -178 -331 -184
4424a84L22J92j12l02k42N6L15K79l2k97k70k3K61K81P9k31l15j18K15L20J46
4445C40j81l21j66J29L02K34j02l21k23N2K89K47Nk71k94l6K61K96O8k16k97j20
4467c25J77L20J55j54l21j78J08L12K15p9k85k56M6K82K69J3k85k72m3K21L16
4488B36Q7k07l18j17J80L07J51j32l03k03J07K99K26o2l02k42L3K57K71K5k61
4509C2k90m2K24K92Q9j84l09j28J62L09J69j38k96j93Q0K98K22m9k80k53MK61
4531b0K70M4k53k73p4K02L11J01j74l07j40J45K91J77j05k88k08O5K93K27l9k60
4553a5k49KK35K70M3k28k70q5J93K83J17j54k85j61J32K70K07j03k91j99M0K79
4575C1K37j8k54k48k3K43K66M4k14k75q5J76K84J31j54k86j53J19K81J83p3k84
$$ plain form
4424 -184 138 330 218 -84 -326 -270 45 324 292 -5 -275 -298 -37 244 323 92 -223 -341 -126 194 340
4445 340 159 -162 -328 -199 103 337 235 -86 -309 -257 32 279 284 13 -281 -317 -56 240 308 92 -205 -325
4467 -325 -148 172 327 173 -148 -326 -218 94 309 230 -55 -311 -265 17 286 299 14 -258 -301 -80 236
4488 236 323 116 -202 -319 -139 168 319 187 -116 -319 -212 87 313 251 -51 -293 -260 -3 268 293 32
4509 32 -258 -300 -76 216 305 121 -188 -316 -154 155 324 186 -110 -303 -223 75 297 248 -32 -285 -281 -20
4531 -20 250 294 41 -232 -306 -104 207 308 134 -173 -313 -168 123 300 195 -93 -301 -236 57 284 245 -15
4553 -15 -264 -262 -27 243 286 58 -212 -297 -104 179 296 142 -143 -304 -172 98 305 202 -89 -288 -248 31
4575 31 268 250 -4 -252 -275 -32 234 278 64 -211 -296 -120 164 295 141 -145 -298 -179 102 285 212 -72
4597g2k11N5K62K27mk58k43l5K31K61P2k03k68j08J67K95J46j70k79j53R8K81
4619I1J88o1k62k33M1K55K33Qk46k56m2K21K65P4j74k79j20J72K71J39j28k74
4641a17j69P6K88J91n5k55k17J0K49K40Mk18k47n2J99K66P3j67k65j15J38K72
4663A29J62j21k83j74Q4K63K04m9k43k25MK36K39K1j98k68n5J97K63R4j68k81
4685a69j04J31K58J52j01k54j84O6K51K13k7k54k29J3K06K49M4k04k60q0K03K52
4707A72R1j32k83j35J23K57J73q2k60j88N9K29K25k4k32k35j6K20K44N0j91k48
4729a83r1J70K62J03j45k59j32J23K56J47p0k44k07N2K49K02k4k15k21k8J98K59
4751B02N2j81k60q1J54K47J23j17k64j47J05K41J85q4k29j96L4K34K11j8k02k31
$$ plain form
4597 -72 -283 -228 34 261 257 -1 -244 -279 -48 213 285 82 -186 -294 -127 168 314 144 -135 -288 -190 91
4619 91 279 218 -44 -277 -236 19 252 260 14 -242 -284 -63 202 276 102 -177 -297 -125 146 285 157 -117
4641 -117 -286 -210 78 269 214 -41 -258 -248 1 241 245 27 -220 -272 -73 193 266 99 -166 -281 -143 129
4663 129 291 170 -113 -287 -203 60 264 215 -28 -253 -249 -13 226 247 49 -219 -274 -77 186 280 112 -169
4685 -169 -273 -142 116 268 167 -87 -271 -205 46 259 232 -22 -251 -238 -32 217 261 57 -203 -283 -80 172
4707 172 263 131 -152 -287 -164 93 266 184 -76 -264 -205 24 249 225 -7 -242 -258 -38 206 256 65 -183
4729 -183 -274 -104 158 261 116 -143 -275 -152 104 251 181 -63 -270 -218 31 233 209 -6 -227 -255 -57 202
4751 202 254 73 -187 -268 -114 133 256 139 -125 -272 -167 74 259 175 -54 -250 -216 18 229 211 9 -222
4773b22k2J95K40N1j59k48j05J46K55J33j26k58j48Q9K40J89o1k27k02K3K21K04
4795B08K0k14k25n4J90K56P7j70k48r5J26K38J43j00k47j72Q0K45J66k3k38j91
4817b28KK28K20J7k03k19n5J65K33Q7j37k52j11J34K32J38r4k31j59N9K27J80
4839B33l1k26k06J3K02K07M0j84k29p0J65K36Q2j33k24j23R7K43J63j04k33j62
4861b44N2K29J83k0k00k13j5K02K24K6j88k17n2J43K30J12j37k42j24J17K33J40
4883B39p5k19j78L4K31J95k6k11j98j2J93K02P3j68k49q7J62K36J06j28k25j42
4905b47R2K44J43p5k27j55L2K02J96Kj91k18j5J76K19M4j51k21q4J19K43J19j31
4928A16k19j20P4K12J60m3k18j90L2K21J83qj76k05m7J71K23O8j66k17q6J36K21
$$ plain form
4773 -222 -244 -49 191 242 83 -165 -270 -124 131 264 138 -120 -268 -179 61 250 189 -38 -240 -217 4 208
4795 208 228 14 -211 -265 -75 181 258 88 -160 -255 -129 109 252 152 -95 -267 -187 58 224 201 -37 -228
4817 -228 -226 2 222 239 36 -183 -238 -73 160 247 110 -142 -253 -119 113 251 157 -74 -233 -174 53 233
4839 233 202 -24 -230 -217 -15 192 232 48 -181 -251 -86 150 232 99 -125 -248 -151 92 255 151 -82 -244
4861 -244 -192 37 220 200 0 -213 -228 -26 198 224 36 -181 -233 -90 140 252 115 -127 -251 -134 99 239
4883 239 164 -55 -233 -199 32 227 201 -10 -208 -220 -27 175 248 80 -169 -256 -94 142 248 120 -105 -247
4905 -247 -155 89 232 157 -70 -225 -193 9 205 207 16 -202 -217 -41 178 222 71 -150 -234 -115 128 247 116
4928 116 -103 -223 -149 63 223 180 -38 -228 -196 25 208 200 24 -181 -228 -57 166 234 68 -149 -235 -99 122
4951A22R5r5k10j50P8K26J55o2j96j65qJ89K04K8j91k05l8J73K05O9j40k19j05
4974b40J30K25J19j22k03j28O2K03J73k7k11j86jJ97J89L3j76k03n7J52K25O9
4996B23j38j98r8R6K10J35p2k37j49P0K00J69l7j80j84j4J89K01L4j80k14l8J35
5019g7K08R0j20k17j07J04J95J29o3k03j64L5K19J70k0j98j74oJ75J82N5j53k22
5042a62p3J38K19R0j09k16r8Q0J97J61o1k23j49L6J94J66rj66j96l2J78J93L6
5065A94j26k09p0J15J99J23j11k21j15P9J96J44l6k08j56J3K07J73j2j72j81l2
5087b06J50K05N2j23k20q1J38J92J01r5j97j31P2J96J50n4j91j55J8J64J87J1
5109A83j57j95l7J62J97M4j34j81r5J12J91J26j10j90j30O6J98J46l6j89j68J5
$$ plain form
4951 122 217 122 -88 -238 -160 66 221 159 -37 -202 -210 -21 183 211 20 -185 -223 -50 155 224 84 -135 -240
4974 -240 -110 115 234 112 -91 -219 -157 46 219 192 -19 -205 -206 -9 180 213 37 -166 -223 -71 154 223
4996 223 85 -113 -211 -115 95 230 158 -79 -228 -158 42 211 174 -6 -190 -204 -15 186 220 40 -174 -212 -77
5019 -77 131 221 101 -116 -223 -119 76 205 142 -61 -225 -190 29 199 179 -19 -193 -199 -24 158 213 60 -162
5042 -162 -235 -97 122 212 103 -113 -211 -131 66 227 166 -57 -206 -170 24 190 181 15 -181 -213 -35 158 194
5065 194 68 -141 -211 -96 103 226 115 -106 -221 -142 54 198 162 -46 -202 -189 18 191 179 7 -174 -206
5087 -206 -56 149 201 78 -142 -223 -85 107 208 113 -84 -215 -143 53 203 149 -42 -197 -179 -15 172 183
5109 183 26 -169 -206 -44 153 197 63 -118 -213 -101 90 216 106 -84 -214 -148 50 196 160 -29 -197 -182
5131a82J61J86Pj51j87n0J40K00P1j15k02r2R7J93J13p2j87j40N7J78J67l5j72
5154a5j68lJ64J71N5j75j79n1J30J94P3j02k13p6P7K01J06o6j86j35M1J71J67
5177A81j1j76j79LJ58J72K7j39j79o5J28J85R5j13j84j08P5J84J30n4j97j26K4
5200a69J90J51j0j71j65k1J61J67N9j36j93n3J00K01P9q6j91j09P6J89J20n5j75
5223d1j46K7J67J67oj53j78k1J31J79N9j12j88q1R8J98Q3q3j85j19O0J85J32m3
5247A30j65j48J8J64J57K3j66j64n2J45J96L6j11j83q0R5J89Q5o3j82j27O0J73
5270C0J36l1j58j53LJ66J55K1j52j59n2J40J72O0j05j92p9R4J84R9o9j70j24L6
5294a48J74J47k2j74j54NJ46J75J0j23j81n6J33J72N3p8j84q9Q7J75J06n6j70
$$ plain form
5131 -182 -21 165 172 21 -166 -216 -76 124 195 80 -122 -214 -117 76 189 117 -70 -210 -153 25 192 157 -15
5154 -15 -183 -186 -22 149 204 29 -150 -201 -71 123 196 94 -119 -195 -118 83 189 123 -63 -198 -157 14 181
5177 181 170 -6 -185 -182 -24 148 175 36 -143 -208 -80 105 200 87 -97 -205 -130 54 184 130 -67 -193 -169
5200 -169 21 172 162 -9 -174 -195 -34 133 192 56 -137 -190 -90 111 190 104 -87 -196 -120 69 189 134 -41
5223 -41 -187 -160 7 174 168 15 -163 -184 -53 126 185 73 -115 -196 -98 100 183 100 -85 -204 -144 41 173 130
5247 130 -35 -183 -165 -1 156 179 13 -151 -203 -58 138 174 63 -120 -200 -105 84 169 106 -76 -203 -143 30
5270 30 166 135 -23 -176 -173 -7 148 169 17 -142 -194 -54 118 178 73 -119 -198 -104 80 179 110 -60 -184 -148
5294 -148 26 173 151 -23 -177 -172 -26 149 159 36 -145 -201 -68 104 157 79 -105 -194 -107 68 174 118 -52
5317e2j34L9J64J47Kj71j49j7J47J60L4j33j67n6J03J76Q2r9j81o9M7J88R9m8
5341A12j60j40L7J51J59rj54j56k0J38J65M0j11j86m6R6J72Q0q4j71r8O6J71J17
5365A69n5j62j29K4J45J53%j32j59j5J20J49M4r4j86n7R9J72Q0p3j72r2O0J48
5389C7J35m2j60j44K0J45J59mj24j59l0J19J73L6r8j65q7R2J78Q5o7j63j10L8
5413a36J72J19l0j49j27LJ48J47J2j44j49l6J15J67N7q9j86p8Q3J63R8n9j60j05
5437a64K6J56J27j4j47j42jJ27J54K7j06j78l9J06J61O7q2j73p0N9J54J00m1j57
5461e0j14K9J44J34j1j35j45rJ18J46M1j24j48m4R8J48Q9q0j75q0O2J60R4l3j48
5486c3j26K1J38J33Rj42j35k1J21J58L3j09j48p2J07J50P3p6j47j05N4J62J00
$$ plain form
5317 -52 -186 -147 17 164 166 -5 -154 -171 -24 136 170 37 -130 -186 -83 93 175 76 -105 -174 -127 61 160 112
5341 112 -48 -188 -151 0 159 150 -4 -160 -180 -42 123 163 52 -134 -180 -84 88 168 84 -87 -185 -119 52 169
5365 169 114 -48 -177 -153 -8 145 145 13 -146 -161 -41 108 152 58 -128 -185 -86 86 166 93 -79 -171 -111 37
5389 37 172 130 -30 -174 -154 -9 150 146 22 -137 -167 -48 125 161 63 -102 -189 -97 81 166 99 -64 -174 -136
5413 -136 36 155 125 -24 -151 -148 0 147 159 15 -134 -170 -55 112 169 80 -106 -184 -101 62 160 101 -59 -164
5437 -164 -138 18 145 131 -16 -158 -159 -32 122 149 43 -135 -174 -68 93 160 78 -95 -165 -106 48 148 107 -50
5461 -50 -164 -135 9 143 132 -3 -148 -157 -39 107 148 24 -124 -168 -70 78 167 87 -88 -168 -106 54 148 115 -33
5486 -33 -159 -138 0 133 142 0 -135 -156 -35 123 156 47 -101 -173 -66 84 157 81 -66 -171 -117 45 145
5509A45l7j45j15J0J39J28J2j32j43j7J16J40N1r7j52o0P9J46R0p0j60j00N7J39
5533B4J13k7j31j29J2J26J46mj36j19l1R8J62M7r3j53o5Q1J39Q5n3j39r7K2J45
5558B3J20l1j19j34NJ12J46K4j39j43j9J03J39M1p5j47o2O0J42R3m6j51j00M4
5582a14J19J22qj40j26LJ21J30L4j04j39n9R6J58N5q6j45o9N8J35J04l7j39j23
5606a54K8J45J21j9j15j26k3J20J44K1j20j25l1P0J44P1p2j49q3O5J27Q8l6j18
5630b7j14J5J21J30qj17j37J3R3J33K9r3j39n8Q9J47N5o2j27r3M6J36J08l7j29
5655b6j12K1J19J17nr4j33k3J01J30M2q3j41n0O2J34Q6n7j44q9N4J23R2j1j28
5680a5j24J5J09J27J3j18j11m0R7J31M9q1j40o4O9J46P5n8j23r9K8J32J19m1j09
$$ plain form
5509 145 108 -37 -152 -142 -3 125 137 5 -138 -155 -39 101 152 55 -97 -157 -78 68 158 88 -72 -172 -115 24
5533 24 137 110 -21 -150 -138 -12 134 130 -6 -125 -156 -58 104 151 58 -95 -160 -79 60 145 92 -47 -144 -122 23
5558 23 143 112 -7 -141 -136 -24 122 146 7 -136 -155 -52 87 128 53 -94 -156 -96 46 139 93 -58 -158 -114
5582 -114 5 127 119 -21 -147 -144 -23 107 141 37 -102 -161 -65 93 148 62 -83 -152 -94 41 145 108 -31 -154
5606 -154 -126 19 140 121 6 -120 -143 -23 121 142 22 -103 -134 -64 80 151 79 -70 -153 -88 39 127 91 -27
5630 -27 -141 -126 -5 125 117 0 -137 -124 -31 102 131 38 -101 -159 -70 77 132 70 -57 -150 -104 32 140 103 -26
5655 -26 -138 -117 2 119 114 20 -113 -136 -35 95 137 54 -87 -137 -75 59 145 88 -56 -145 -91 32 124 113 -15
5680 -15 -139 -124 -15 112 125 7 -104 -144 -47 84 133 52 -88 -152 -83 63 138 80 -43 -142 -114 18 137 96 -13
5705a3j18J5R2J20L2j12j34k9J06J25M5q2j10q6O0J48O6l5j35r8M7J24R4qj22
5730hj23JJ06J42j0p3j32l7P8J30N9q5j24o0N4J12R0k8j24r9J1J35J15k6j08j09
5756a13qR5J24L0r5j30l1P3J17P0n7j33p9N1J21R0l4j17r2J9J08J08Lj12j15q
5782a15R0J13J9o1j23n5N8J45N5o1j21q0M7J09R6k1j23r5J8R7J23pj03j12l0R6
5808d1J28L1r0j02n1N7J28N1m1j16q4L1J22R2k6j00j02jR9J29or9j15k4Q7J24
5834H1M1p3j12o8O7J16P0m5j16q4K4J29Q0oj15j07NJ01R3L9r7j17k7Q3J17M2p4
5861D7j14o2M3J26Q2n1j20o4J0J19R3j8r6j07rR5J21J6q5j14k9O9J08N3n4j13
5887e4o9M4J20O8k6j12q0J4J01J03Mj13r8rQ4J13K1q6j01n1R0R5O2n4j17o9M4
$$ plain form
5705 -13 -131 -116 -24 96 128 16 -118 -147 -41 84 129 47 -63 -149 -89 59 125 90 -45 -143 -96 28 122 114 -8
5730 -8 -131 -130 -24 118 108 35 -97 -134 -56 74 133 48 -76 -136 -82 30 120 92 -32 -131 -120 15 130 104 -4 -113
5756 -113 -121 -26 98 128 33 -97 -128 -55 62 132 75 -58 -137 -86 35 125 91 -26 -118 -99 9 117 120 8 -107 -115
5782 -115 -25 88 107 46 -77 -132 -74 71 126 65 -56 -136 -89 20 116 95 -28 -123 -105 -8 115 108 5 -107 -137 -41
5808 -41 87 118 28 -74 -125 -68 60 111 70 -46 -130 -99 23 115 89 -11 -113 -114 -15 114 108 9 -106 -130 -43 81
5834 81 122 49 -63 -131 -64 52 122 77 -39 -123 -99 30 110 104 -11 -118 -113 -12 81 120 23 -94 -121 -38 79 121 47
5861 47 -67 -129 -86 40 122 71 -49 -113 -103 16 109 91 -5 -112 -121 -26 95 111 26 -88 -117 -48 60 113 59 -54
5887 -54 -123 -79 41 109 83 -29 -109 -95 6 109 113 0 -98 -107 -23 90 111 25 -76 -127 -37 58 120 66 -51 -120 -76
5914g6J17O6l1j02q9J2J05Q4J8q9j07k4Q2J12K5q4j03m3P1J12N8n5j12o7K9J18
5940B7Q2l9r6q2%J01J00J8j00j15j0P3J17L1o5j18l2N6J07O2m0j13q8M0J09Q4
5966A09j5j12q4PR8Q5J2q5j02j8P4J07L5o3j11n5M3J23O3n2j02n8J1R8J02k3r8
5993a1r0kJ00J01Kp5j04k1O0J17L2n9j20l0L5J13O9n5r8o5K7R7Q4oj01q6%P1R2
6022G7K8p5j12k7O9R6M8n1j02n1K5J25O2m0j00q3K6J00Q3lj00r7oQ7J16Oq3j01
6050h3l8N7J18N3o1j04n1N3P6P8k2j04p9J9R7Q5lr6q7j1P9R9L1p7q6m4M5J06O2
6079A12m7j07p0L7J05O9k6q9q2pJ04Q6K1r7q5l1Q4R2L0n9r6m1N6J00L2k5j05p3
6107a12L3J07P4k4r6q0JR7Q1K0p4r4l2O9R7L9p5r0m4N3R5N9m2j02o6K9R0Q1j7
$$ plain form
5914 -76 41 107 76 -26 -115 -103 2 86 104 15 -92 -116 -34 78 103 19 -84 -127 -56 56 114 59 -53 -120 -91 27
5940 27 109 70 -26 -108 -108 -7 93 111 11 -104 -114 -41 76 107 42 -76 -108 -52 55 117 77 -36 -124 -84 25 109
5966 109 94 -18 -102 -95 3 88 100 15 -87 -105 -31 76 111 48 -63 -118 -75 48 111 59 -43 -101 -90 8 110 87 -11
5993 -11 -101 -103 -3 98 100 25 -79 -100 -40 77 109 50 -70 -100 -65 48 117 62 -36 -101 -74 23 107 101 0 -86 -86 -15 77
6022 77 105 30 -82 -109 -40 56 104 53 -49 -100 -75 50 112 72 -28 -111 -85 15 98 95 -5 -102 -108 -21 95 101 18 -83
6050 -83 -121 -64 54 107 46 -58 -109 -56 20 98 76 -28 -107 -88 9 94 91 -5 -92 -103 -24 75 106 29 -57 -101 -56 50 112
6079 112 65 -42 -112 -75 30 99 73 -16 -98 -105 -1 85 106 9 -76 -107 -23 69 99 40 -56 -97 -41 59 91 66 -39 -112
6107 -112 -79 28 102 78 -18 -98 -97 0 81 101 27 -67 -99 -30 67 106 31 -59 -103 -50 45 104 62 -40 -106 -77 13 94 77
6136G7p8r9LQ9Q6J3p4q6k1O1Q4M0m7j05o0P0Q6N7k5r6p1J3J01Q0j4r1p6rO7J01
6166G6J3o9r5k0O6Q6N0n3j04m7K8J02O1j9j00p5K1P9P2Mp3q6pQ9P2J9p1p7l6M9
6196d5R0M8m2j00n2K9J01O3l1j00o1K2Q2Q9k3o6q1pO5Q8J4n2r6m0O9P8M2l3q2
6225c1p0L9J01N0k6p8q0MJ00P7Jq7p9k1P7Q2L0m7j04l9M6R9M3l1j10l8L4O0P7
6254G9lr5p2J5P7O0K4q1p5k6P1R3K8o3r5k6L7J01M0k3j06n6L1Q6N9op9p7j0P8
6284a4Q8Rp9p0k6O8P9L2m5r2m9M3R6M5k5q5p0J4R4P6k1p9o4MN0R3Qn8r0l4O3R3
6316E4L1m4r2l5K2Q7O1k6q5o6K4P8O0Lq4q0MP2P1L6o0r2k1M9Q1M0m0q5o1L8R0
6347C0M0j2p2p6OR2O8Kq5o3j1N9Q8J5n2q9l4O3Q3L1n2p6n2L2R4M3j2q6o7K4P7
$$ plain form
6136 77 -1 -100 -97 -8 78 91 17 -69 -90 -29 55 95 48 -57 -117 -47 39 96 71 -25 -96 -83 18 98 84 -7 -83 -92 -25 76
6166 76 89 20 -75 -95 -29 57 107 54 -50 -97 -69 33 94 75 -25 -100 -79 0 72 76 3 -83 -90 -1 71 90 19 -58 -94 -45
6196 -45 45 93 51 -49 -101 -72 29 92 61 -39 -100 -78 4 93 70 4 -77 -84 -19 69 83 31 -65 -105 -36 42 84 51 -31
6225 -31 -101 -62 39 89 63 -15 -95 -91 9 86 87 0 -79 -100 -23 59 89 42 -62 -101 -55 44 87 56 -54 -92 -58 2 79
6254 79 76 -19 -91 -76 1 61 85 4 -71 -97 -26 67 95 32 -63 -89 -52 49 89 66 -40 -96 -65 21 80 74 -5 -82 -92 -14
6284 -14 74 83 4 -66 -92 -24 55 87 42 -50 -99 -56 40 85 60 -25 -95 -81 13 89 68 -11 -75 -71 -21 72 80 22 -68 -102 -39 54
6316 54 85 41 -51 -86 -64 23 84 58 -27 -93 -69 9 69 72 -12 -92 -88 -16 55 91 31 -61 -82 -33 48 88 48 -37 -98 -60 30
6347 30 70 58 -14 -90 -84 8 76 78 -7 -70 -81 -22 66 81 29 -60 -94 -31 52 83 31 -45 -97 -65 29 72 60 -26 -93 -69 8
6378HP1Po8q5j9O1P6L5n4r0m2N0R7M2l5q8m0RR0N9j2q1p0JP1P2Nn5q5j4N3P6L0
6411G5n0p9l0L4R4L1j9r0o2K1Q4O3j8o5n4j6N8P9J2n5q7j6O6Q9J1l9p5n5M5Q4
6441C6M7k8p7o3K2P0O0Pq2n5kN4O9K8p2p1l7N0Q6M8n0q0l2J8O8P1l9p9m1JQ1O4
6473G2mo9p3j6P0P5K1n2r1j9N4P4L3l4p4n7L0Q3L7j5n9p1NQ7N4K2q8o4j4O1P0
6504D8K5n6q2j9M6P9L3l9o6n0L2O2N8j0p7n4MP4N4J7p7p1k0O1O9K5m3o7m2L1P6
6535B1N5l1q3n1K2Q5M5jp9n8%O7P7ln2p8l1O0P5L4m0q0m4M5P3M6l2p4n2J2P2P5
6567G5j3p0o6KP0N2K1o7o7k5O4O6K9k9q1n0L8O8N5k7o5n7J4Q3N0qp2n1j7P5O3
6598F0Qn7o1l8N6P8L5m6p2m0K2P3N1j7p8o0L1O2N8J5o3p5j1O1P1Rn0p3k9M4O7
$$ plain form
6378 8 79 86 18 -67 -86 -25 51 86 32 -58 -100 -50 47 89 54 -34 -74 -65 25 84 72 -9 -79 -78 -7 65 70 15 -70 -84 -31 45 75
6411 75 25 -54 -84 -50 44 75 56 -34 -96 -75 9 72 54 -11 -65 -81 -23 56 68 13 -74 -90 -24 65 76 37 -38 -93 -48 36
6441 36 83 55 -22 -85 -63 7 67 74 -8 -63 -65 -11 58 86 14 -57 -94 -44 42 90 40 -40 -72 -54 14 85 46 -33 -74 -73 8 72
6473 72 68 -1 -74 -90 -20 55 76 24 -67 -86 -32 42 75 41 -33 -90 -60 23 60 45 -14 -85 -80 7 61 83 -5 -69 -83 -22 48
6504 48 73 17 -65 -84 -38 41 74 35 -31 -81 -49 13 71 61 -16 -70 -66 8 62 79 2 -69 -89 -28 41 66 23 -44 -86 -55 21
6535 21 76 45 -38 -89 -67 18 63 62 -17 -75 -75 -8 69 66 14 -64 -95 -35 40 74 34 -46 -90 -45 28 74 42 -32 -84 -72 0 75
6567 75 62 -8 -74 -72 -2 50 71 4 -63 -88 -24 42 71 42 -39 -89 -51 17 72 45 -20 -77 -63 20 70 62 -10 -61 -78 -3 60
6598 60 68 11 -50 -88 -32 46 81 35 -37 -77 -55 18 69 52 -26 -86 -55 7 65 80 17 -58 -69 -8 63 72 22 -51 -80 -36 31
6629C1L2j8p5n0L2P4N0j8p0n1nP0O0Lo0q0LN4O5J9m0q5k3M1Q7L2l8q2l7K0P5M6
6661F2j3n6o8MO1O5kn6m9k9N4P5J5l8o4m0N1N3N4l6p6n3K5Q4L9j2o3o0NP8N9%
6693F9o2o5pN2N2M1m4p8l0L5P3M0l1o9m8J1O5P0rp1o8J2N9O0K2o4p3j2M3P3K9
6724G5m2o4m8K6P1M6j9o9n3K3O6M4pn0n4nM7N3K6n2o4j9L6P7J4j8p2m4L5O1M8
6755F8j2p5n3J3N7N8ln4o1j3O1O2J6m9o6j9L2Q1K2k5q0l4K6O2M5no7o3OO5O0Q
6787F3o5n2j5N6O7J3n2m8k7K2O3M2l5o2m2K6N9M6j1o6n1nO5N0J9o0n8k2N8O5K8
6818G1o0o3j6L1P2L5l6n7m9K4N5M8mo2n0kO1N4Rn7o9j1M5O9K0m9l5m1K4P1M4l1
6850D1o2m2K0O0M5No9m2j4N1N3K1n6m1l8L4O6K1l5o0l0L8O2L0ro6m0NO5N0j1o4
$$ plain form
6629 31 63 45 -30 -80 -48 26 76 58 -12 -63 -68 2 62 65 5 -75 -72 -18 47 66 26 -59 -82 -41 46 78 40 -42 -79 -59 16 62
6661 62 49 -7 -75 -71 -10 55 53 -3 -52 -81 -27 48 63 25 -39 -79 -28 25 79 43 -33 -86 -61 23 62 50 -13 -73 -68 10 69 69
6693 69 7 -58 -65 -13 39 80 36 -42 -72 -37 36 76 45 -24 -72 -61 4 74 65 -6 -74 -62 -3 57 79 15 -58 -70 -27 46 75
6724 75 33 -31 -79 -53 18 64 45 -24 -77 -54 12 56 49 -1 -55 -60 -13 40 66 14 -50 -69 -33 44 58 40 -32 -76 -41 20 68
6755 68 56 -19 -72 -59 -2 56 53 -1 -62 -75 -14 48 64 15 -51 -70 -38 43 65 40 -40 -74 -48 14 59 54 -13 -76 -70 -5 55 63
6787 63 -2 -54 -69 -13 54 67 15 -33 -60 -38 25 67 32 -30 -72 -46 13 59 48 -18 -69 -74 -9 41 60 0 -58 -80 -22 43 71
6818 71 11 -52 -68 -37 35 70 34 -23 -72 -48 7 55 51 -11 -61 -63 -2 52 61 4 -65 -76 -31 38 58 9 -26 -67 -43 28 72 41
6850 41 -21 -63 -43 17 62 67 -2 -44 -58 -7 46 67 11 -30 -68 -34 32 53 18 -42 -72 -34 28 58 49 -17 -57 -52 13 63 52 -12
6882a2m8QL0O5K3m3o5j8K0P6L2l6o8l1K8O7L8j5o5m3mO1O2mo3n0rM3O4K2m2n9
6914c6k5L7O7K6m5n2l0OO8M2qo5l7j3N4O4%n2n0j6L8P0K8n2o1l1L0Q3K8k3o2n0
6946f7K5N3M2mo3m6PO6L2Om5n1j7M8O2Ol1p0j8L2M9M9l2n6m0J5O1M1nn7l9j5M8
6979a4N4Om7m2j6M1O2Pk5o2l1K5O8K9k1o1l8J4N8M8qn2m9rM7N8Km5m2j9K3P4K1
7012E6j8m7n3K3O9L2k2m7n0J1O2M2Ln8n0oL0O0K3m4o0j2K6N8L2l1o4j8RO1M6k5
7044C8o7l4J7L8O6j1n5n1kM7N2J9m0n2l2K1Q0K4k9n9k1%O6L8j2m2n2OM3N7j9k3
7076A1n2j2M4N3Rl1o0k1L2N4K9j9n9m2J6N8L5jm1n1j2N2M5J0m6n7j2N0M2K7k7
7107B4o8j2K5M7M8n1k1n5K6O2K8ln4m5LM0M8K2m5m9l0L5O4J7k3n5l5J6O6K3on2
$$ plain form
6882 -12 -60 -52 -22 43 66 23 -42 -60 -40 36 68 32 -36 -67 -39 28 66 51 -14 -57 -61 0 62 58 -5 -55 -64 -21 43 65 23 -36
6914 -36 -61 -24 43 69 24 -28 -58 -52 16 58 50 -15 -52 -65 -11 53 53 1 -49 -65 -27 43 71 19 -42 -73 -43 40 68 45 -17 -67
6946 -67 -42 11 53 49 -14 -60 -53 13 45 51 6 -45 -62 -14 48 54 23 -47 -65 -33 16 65 33 -23 -63 -48 13 54 49 -8 -47 -62 -14
6979 -14 40 46 -1 -43 -59 -18 44 51 26 -36 -67 -42 26 55 34 -27 -65 -51 7 55 47 -5 -54 -63 -16 42 44 -1 -43 -62 -39 35 56
7012 56 38 -9 -62 -39 30 62 40 -7 -57 -46 16 58 61 3 -47 -53 -23 37 60 16 -44 -56 -30 28 60 29 -35 -53 -44 17 63 38
7044 38 -29 -63 -46 -8 58 47 -8 -59 -61 -14 38 57 17 -35 -67 -46 34 58 29 -30 -51 -51 15 53 41 -1 -53 -47 -4 53 34 11
7076 11 -41 -53 -9 44 53 22 -38 -59 -27 27 56 37 -22 -64 -48 10 45 44 3 -48 -60 -8 37 47 1 -56 -68 -18 24 51 24
7107 24 -44 -56 -31 16 64 13 -8 -63 -37 25 53 50 -4 -49 -46 -6 42 64 19 -30 -60 -25 39 56 33 -22 -57 -41 25 48 42 -10
7139a0m3J3M5M3rm9m6J0K9O5Kl1n8k3M6M6K2k5n8k6J7N3L7k2m8l5J5K8O2j6l9
7170el8j3L5O2Pk9o0j4L3N8J0j7m2l8J0M9M1no6j8j2N4L5K5m0o1qL9L7J7l4n0
7202c8k8K9M5L9j2n2k6RM8L6rn0l4qN7L6J1m4m9j3M3M2J8l0n6k4L4N1J7j1n1j5
7234c5j0N2L4km7m4NN0L2Pl4m0j7K6N3L1m2l8l3K5M5M2l2m0k4j5N5L9kn5l4%M6
7267bL3J4m0m3k5L5N8K5m2m5j6J9M1L4po4k6KN9L2nm1l0j2L3O0jl2n5mK3M2L0
7300E0k2n6k9L1M7L0j2m9l4mN1L9Ol7n8OM1L2K0l8m7j6K9N5K0k9n9k5K2L5N1k6
7332B4m3l0MM6K8Lk9l6k2K4O7J1l3n1j2J7M1L7k0n3k2J9M1L5qm9k7lL5N7qm4m1
7365d2j1L8N0Nj7o2j0L3L3L6j7n7k1J7M0L3mm8k8j6K5O1Ml4n0lJ8M8K8k9m2k0
$$ plain form
7139 -10 -53 -40 5 48 39 -10 -56 -46 -17 48 50 19 -39 -62 -16 30 52 27 -31 -57 -40 13 50 28 -20 -55 -40 -12 50 34 -5
7170 -5 -43 -56 -21 41 48 19 -41 -55 -22 36 46 29 -13 -51 -41 8 49 44 -22 -40 -52 2 37 62 22 -39 -47 -8 29 46 12 -38
7202 -38 -66 -37 8 47 35 -17 -43 -34 14 50 41 -9 -43 -51 6 42 53 9 -40 -53 -10 32 50 20 -36 -60 -26 25 42 31 -20 -35
7234 -35 -45 7 41 39 -8 -52 -47 3 35 42 8 -32 -49 -23 30 61 19 -19 -52 -27 18 60 28 -12 -36 -51 4 43 41 -14 -48 -48 -2
7267 -2 31 45 5 -38 -63 -28 30 55 13 -32 -48 -29 12 46 39 -25 -51 -49 10 42 37 -4 -34 -46 -13 47 46 14 -41 -45 -22 20 50
7300 50 28 -28 -57 -26 21 51 39 -10 -44 -48 3 42 48 11 -47 -41 0 32 52 14 -33 -49 -20 35 55 26 -33 -58 -36 -1 50 24
7332 24 -19 -49 -45 1 29 32 3 -33 -55 -31 36 47 14 -37 -49 -32 9 46 26 -27 -49 -30 11 46 38 -11 -38 -41 -6 51 43 -1 -42
7365 -42 -53 -15 35 40 23 -39 -49 -16 17 53 36 -21 -42 -25 15 48 44 -4 -32 -48 -23 38 42 8 -42 -45 -27 21 49 20 -22 -42
7397d2QM9L7k6m4k5J5L3L7Qm3n7j0N1M5Jl2l0k0L8K8K0k6l1k5J0N3K3qm9k8kM9
7430GL1jm0k7j7M8L0K0l2m3j5K7L3J7j5m2k2J1M7K4mn2k9OL3M6Ql5n0lL4K4J8
7463C7k0n0pJ5M0K2j9m4k2J8M4K7Om7m7J3M3L2rl2l6JK9L5J2j4n4nQM5J8j5m9
7496b5j7LN0M3k3m2k6j1M4L5J0m3l6mL5L8Pl1j8l1J7M5K7k9l1k8J6L0L0j9j9k7
7528c0j4M1L0Rk2m5j1K4M9J0k2m4j9J4M4K9j3n0l1J4M3L6j2l3l7j0M7K9Nl1k4
7559b4j4J1N0K7l9m1j8J8L9L9k3k9m8J4L1L2J0l4l4kL7K8Jj8m2j3K2L8L1l1l9
7590b1okL7M0j5l6l3OL5L0ok3m5j1L8M1Pm1k1k3K3M4K4j9l9j6J1L2K6pl5l7RL3
7624@L5jm2k3j2K9M5Nk4m4rJ1M7L1k8m3k2J4K1M3kl4m3NL0M2J3m3l7j0L6K7K7
$$ plain form
7397 -42 -34 15 52 26 -18 -43 -28 5 42 50 7 -50 -60 -9 36 37 5 -25 -45 -7 21 41 15 -16 -41 -31 22 45 37 -12 -40 -42 7
7430 7 38 37 -3 -30 -47 1 31 51 19 -24 -39 -12 21 38 23 -19 -41 -30 17 41 37 -15 -44 -38 -5 41 49 14 -36 -39 -5 19 37
7463 37 17 -33 -40 -25 15 37 18 -26 -48 -30 14 41 47 0 -47 -34 9 41 32 0 -36 -35 -6 29 41 27 -27 -32 -24 21 39 24 -25
7496 -25 -42 -39 11 54 31 -11 -37 -48 -4 31 41 -2 -38 -42 -7 31 38 7 -11 -42 -25 20 47 18 -13 -41 -25 5 35 16 -3 -30
7528 -30 -44 -3 27 36 14 -31 -42 -18 31 41 19 -25 -44 -30 14 43 30 -20 -51 -37 6 42 30 -3 -40 -50 -3 26 31 0 -24
7559 -24 -38 -27 23 50 11 -30 -48 -30 9 48 25 -4 -52 -38 -7 25 35 1 -33 -35 2 30 31 13 -29 -42 -20 18 49 18 -21
7590 -21 -27 -29 8 48 33 -3 -36 -30 5 35 29 6 -39 -50 -12 29 36 -5 -26 -49 -26 18 42 23 -16 -32 -21 11 37 30 -5 -42 -33 0
7624 0 35 34 -8 -31 -43 -14 31 36 12 -32 -41 -30 17 48 20 -23 -45 -31 -10 33 31 -3 -46 -41 -11 31 44 1 -36 -46 -10 17 44
7657D4l2l1k8J5N5J8k0m9k5J3M1K9J0n0l3%M1L7Ql8j9k1K0L6J4qn0j5PM7J0jm0
7690a5k0QL3K7Rl2l7qL7L8%k8m2oL5K6K1l6k2k4J4L5J7lk9l8kM7M0j4k8l3j6M5
7724aK7Nk0l8j2K1M9J5k2l4j0oL2L8j3m4j7jK9L6jl0k5k1K9M5Rk7l2j2J8L4J6
7757C7j7k6j3j7M9K1j9k2j9j3M4K4Ll4k9j7L6L1J1j1n0mJ9K5K7j7m0pnL6L1j0
7789B4l4k3J0K4K9J5l2l9pK8L7J7k5l1l1J2L0L2pm0k8J2L1L0Ll2m0KL9K8jk8k6
7822b1qJ2L3K9k8m4k4K2N2J4j0l6l4J3L5J9J3m8k3%K1L6J1k9l2k0L8K7J6pm7j0
7854c0QL9J3%m4k3J7J5L7Nk7m2nM6K1J6k7m9mRM8J1ml0k6pN3J7j1l7k5LL5L3m
7889C1l9j3j8L1K9J8l9j7oKL7K4j8l8k3J3L6J3j1j8k6LK9L3lk9j9rK1L4J2k6k0
$$ plain form
7657 44 12 -19 -47 -32 23 41 21 -28 -53 -40 1 30 40 -10 -43 -43 -2 35 43 5 -14 -35 -15 21 35 27 -23 -38 -31 16 26 25 -15
7690 -15 -35 -27 6 33 42 10 -27 -35 2 40 40 12 -30 -36 -1 25 46 10 -12 -36 -22 13 30 27 -2 -40 -42 5 45 31 3 -30 -46 -1
7724 -1 26 31 11 -27 -39 -18 31 46 24 -10 -20 -26 6 44 31 -13 -30 -31 -2 34 33 3 -22 -43 -14 31 40 13 -19 -31 -13 21 37
7757 37 20 -6 -19 -36 13 34 15 -7 -26 -39 5 29 32 -2 -31 -48 -12 19 30 19 -31 -35 -16 9 36 19 -21 -28 -33 3 34 24
7789 24 -10 -33 -23 1 30 45 13 -26 -33 -5 32 49 24 -7 -38 -26 4 36 29 -11 -39 -27 4 34 37 5 -35 -33 6 34 33 5 -21
7822 -21 -29 -17 16 45 17 -27 -51 -29 23 37 27 -9 -43 -30 5 24 37 -11 -34 -34 -13 23 34 5 -27 -47 -9 18 34 27 -20 -30
7854 -30 -22 17 30 30 -14 -37 -20 -5 32 37 10 -32 -37 9 30 46 19 -30 -34 -25 23 34 30 0 -26 -33 20 37 26 -11 -36 -33 2 35 31
7889 31 -8 -21 -39 -8 21 39 0 -17 -23 -21 16 40 22 -16 -39 -26 10 23 12 -6 -32 -29 0 33 30 1 -18 -27 -6 28 40 14 -6
7922fj7J5L2J6j0k9l9QM3J3Ol4k6OJ8L0Nk0l7nK9K1Jmm8j6K3L7L0k8k7k1QL1L0
7957C5Kl6k4lJ7L8jk8l1nJ7L9Qrl8j7J8K6K6j6k2k0j0L5K2Ll2j9MJ4J8J7j6m5
7991c3J1J0K8J9k2k7k3J4K9K9j2m2j2LL6J8Ll4j7pK7K0J0j2k8j7J4L0K9k2k4m2
8023d4K7K9J8kl0l9J6K9K6Kl5k1j5L3K1J7k3k6k0K7L1Qrl2j3%K5L6k0k8k1J1K4
8056BL4j6j6k0k1L3J8K1l1k3k3J8M1K0l1k1j9J2K8J7J7m7k0rL6K2Qk6k6j5L2K1
8088A6J4j7k0k5K8J2K8j4k2k9kM0J6Lk6l0j2L9J4J3j7k1j7RM2Mj4k3k3QL9J7j1
8121A9k3j9mK1L6kk6k7j4L2L2nj6j7k2K0K8K1j7m1mPK9J7j5k2j1PJ1K8Nl1j9m
8155b6J7K7J3k2k8j3J3L0J0j6j3k4J7K8K4j3k8j4j0K3L6Jl1k2LJ0J6K0k3l2kJ1
$$ plain form
7922 -6 -23 -8 24 40 30 1 -38 -30 13 26 32 -2 -28 -22 -4 26 31 11 -26 -31 -2 19 20 16 -32 -48 -25 12 42 14 -13 -34 -26 5 35
7957 35 37 1 -23 -26 -9 29 28 0 -31 -36 -19 20 28 19 -19 -36 -18 8 34 18 -4 -24 -34 1 23 26 -6 -25 -21 -7 11 28 12 -33
7991 -33 -22 -12 16 35 13 -14 -37 -23 6 35 23 -19 -31 -28 8 26 29 -5 -22 -29 -2 18 28 16 -12 -29 -15 15 44 22 -2 -44
8023 -44 -17 12 30 28 -2 -41 -25 4 30 32 -3 -24 -39 -6 15 32 9 -17 -37 -10 21 29 20 -12 -25 -25 0 36 16 -12 -33 -22 2
8056 2 36 20 4 -16 -37 -4 14 35 4 -19 -42 -24 17 37 6 -15 -34 -22 6 23 40 -7 -27 -36 0 22 30 4 -22 -37 -5 16
8088 16 30 13 -7 -32 -4 8 36 22 0 -29 -31 9 25 28 2 -28 -40 -1 13 26 9 -12 -29 -20 22 26 12 -11 -34 -26 13 30 19
8121 19 -4 -23 -27 -6 30 28 2 -25 -39 -7 25 20 4 -13 -35 -15 13 34 17 -24 -28 -21 8 25 10 -12 -23 -16 -5 23 28 -3 -22 -26
8155 -26 -9 18 31 9 -19 -32 -19 11 21 5 -8 -32 -15 13 37 24 -4 -18 -28 -5 31 32 1 -21 -18 -8 8 28 5 -27 -29 -18
8187a8L6J0Rm4
$$ plain form
8187 -18 18 28 37 -7
8191g
$$ Imaginary data points
##PAGE= N=2
##DATA TABLE= (X++(I..I)), XYDATA
0@%%%%%%%%%%%%%%%%%%qJ6j6J6j6J6j6J7k5L2l2L3m1M8m9N7o5P3q1Q9j00J09j22
41f5J37j53J70j86K05k26K51k82L14l54M03m60N32o24P49r24J198j691K838j0345
61h513p157J7109P538m59j0428j0595m288J0628J4776M026j2011j3070k894Q207
75g131J0893O676m716j3455r845N588J4727Q951m418j1550r148M94J0369J2010
89I445J545j0968j2364j502R638J1271L164p500j1900n222O916J2608O339n527
103E943j1930p542L872J1995Q905k791j1307q958J117R756J0022J241r672j1607
117a0956j593J0048J1170K175p501j0473n196N527J2602P447o082j3018o505M947
131g408J0376P497j045r990j0781OJ1886J1133p00j0110r490k005O936J1322N597
$$ plain form
0 0 0 0 0 0 0 0 0 0 0 0 0 0 0 0 0 0 0 0 -8 8 -8 8 -8 8 -8 9 -16 16 -16 17 -24 24 -25 32 -33 40 -41 48 -52 57 -65
41 -65 72 -81 89 -97 108 -118 133 -149 165 -189 214 -246 286 -338 411 -513 685 -1006 1832 -8513
61 -8513 -15670 1439 8977 8518 -1910 -12505 -16793 -6165 8611 12637 626 -12444 -15338 -7131
75 -7131 3762 10438 5722 -7733 -17578 -11990 2737 11688 7270 -4280 -13428 -12934 -2565 9445
89 9445 10990 22 -12342 -13844 -4206 7065 10229 2729 -9171 -14393 -7477 5131 11470 5943
103 5943 -5987 -13529 -9657 2338 11243 8452 -2855 -11813 -10696 -940 9082 10323 651 -10956
117 -10956 -12549 -2501 8669 10844 3343 -7130 -12326 -6799 5803 13250 7168 -5850 -12355 -7408
131 -7408 2968 10465 9420 -570 -11351 -11345 541 11674 10974 864 -8626 -10631 -3695 7627 13224
146A3224p202j3338n439P314J1406N391l945j0011q400J690J1574R983k058j1240
160a051q953N55Q627R709K558q041j1676l565Q119J1117L769o064j0155n798M182
175f667J0979P362l790j0916p399K447R523Q330l23r262r779o62R025R662J542
190A0072p369r630l530O291J0703M738o057j0565n054M542R620O552k605j0030
204b322q244J950J0105Q217j034q589q502j184P664R996K589p753j0248k942O490
219c807R544M472m604j0057o380L887J0483O784l078r366p251J052Q632Q735M33
234I479q643r270j037P709R001K554o174r608m303N541J0134M917m700r392n655
249i447K892R017P188j620r207p824J042Q412P803M81p171q648k223O802R430
$$ plain form
146 13224 6022 -7316 -12755 -5441 5965 11356 7411 -2600 -11000 -9310 2264 12247 10189 -1051
160 -1051 -10004 -9449 -822 8887 11445 3404 -8272 -11837 -3718 7399 11168 5104 -5051 -10849 -6667
175 -6667 4312 11674 7884 -3032 -10431 -7984 1539 9869 9546 284 -9495 -10157 -1132 8530 10072
190 10072 2703 -6927 -10457 -4166 6537 11275 5218 -5347 -10401 -5859 3761 10313 7708 -2322
204 -2322 -10566 -8616 1489 9706 8672 83 -8419 -9603 -1939 8057 10646 2893 -7355 -10297 -3807
219 -3807 5737 10209 5605 -4452 -10832 -6945 3538 10322 7244 -2122 -9373 -8321 311 9046 9479
234 9479 836 -8434 -9471 -1762 7239 9793 3619 -5989 -10292 -4751 5383 10300 5600 -3792 -9447
249 -9447 -6555 2462 9650 8030 -1177 -9001 -7959 453 8256 8737 1566 -7082 -9305 -2503 6927
264F927K847o260q996l622M626Q742N297l413r288o271K940Q963O384j707p936
279g67p220o0P576Q358R44p418q442j649O250Q329L110n043q838m418M437R052
295D201M988l552q489n757K094Q131O836r40p985p469N7P336P738J152o475q183
311f317k386N729Q493L343m881q491m333L847Q413N238k836q227o001J730P787
326A108O693n62p373p338m68O833P659J458n986p886k634N096Q198L632m393q232
342d195m364L419P903N208k229p670o095J275P489O641l91o885o962p32O125P417
358E954J881n554p790k724M853P785L552l833p690m495K872P673N317k007p440
373a646n867J034O921O418Oo416o953j035N866P296J918n144p441k845M335P537
$$ plain form
264 6927 9774 3514 -5482 -9104 -4478 4264 9561 6148 -3140 -9411 -6471 2492 8876 7169 -767
279 -767 -7987 -8047 -471 7887 8831 1413 -7029 -8678 -2428 5901 9011 3968 -4870 -9288 -4851 4201
295 4201 9189 5637 -2852 -8609 -6515 1616 8452 7512 -473 -7942 -7885 -549 7189 8341 1866 -6317
311 -6317 -8703 -2974 5519 8862 3981 -4510 -8843 -4996 3417 8655 5819 -2408 -8409 -6679 1108
326 1108 7801 7239 -134 -7472 -7940 -1107 6552 8010 2024 -5862 -8496 -3400 4798 8430 4037 -4195
342 -4195 -8559 -5140 2763 7971 5742 -1928 -8023 -6748 741 7382 6991 106 -6856 -7588 -1463 5954
358 5954 7835 2281 -5509 -8233 -3380 4405 7957 4124 -3566 -8061 -5189 2484 7801 5794 -1646
373 -1646 -7513 -6479 442 6860 6866 450 -6503 -7538 -1672 5624 7542 2398 -5043 -7888 -3553 3984
389C984L765l485p513m571K590P311N257j647p016n900O62O612O415L30o063o800
405f069j264N434P110K229m718p284l078L922P260L897l039p170m686K136P014
420A694N347j230o638n854K88O143O344O91n622o736j604M999O925K395m262o978
436d098l267L431P008M086k639o890m731J803O621N261q97o205n850o6N776O273
452E616R10n257o548j720M628O703K579l846o749l396L107O770M114k364o628
467b081m702J505O283N249n62n881n808k92N549O226J041m954o321j876M180O499
483D055K829l533o734l556K922O575M043k036o201m747J052O048N464l27n784
498G0n711l62N116N901J368m460o348k296L995O550K826l342o279l514K364O225
$$ plain form
389 3984 7749 4264 -3249 -7820 -5230 2081 7338 5691 -1325 -7225 -6563 49 6464 6794 731 -6069
405 -6069 -7333 -1899 5211 7440 2722 -4562 -7640 -3718 3542 7439 4400 -2770 -7456 -5320 1694
420 1694 7041 5811 -827 -6681 -6393 -250 6094 6785 1163 -5573 -7177 -2178 4747 7142 2880 -4098
436 -4098 -7365 -3934 3074 7160 4521 -2369 -7100 -5297 1324 6585 5688 -517 -6367 -6433 -657 5616
452 5616 6526 1269 -5279 -6999 -2371 4332 6911 3065 -3684 -7080 -3973 2797 6911 4547 -2081
467 -2081 -6783 -5278 1005 6254 5692 -189 -5997 -6289 -740 5486 6527 1573 -4748 -6624 -2444 4055
483 4055 6884 3351 -3383 -6939 -4017 2558 6601 4565 -1636 -6383 -5331 717 6181 5854 70
498 70 -5641 -6003 -887 5014 6382 1922 -4426 -6722 -2727 3823 6649 3307 -2972 -6486 -4122 2103
514B103M383j574o188m847R84N755N143m3n198n711r04M865O081J507m317o058
530d019k239L476O165L189k811o301l720K246N971M160j337n626m891M38N504
545B05N367P5n109n428q90M297N777J928l844o171k486L438N974K902k562n721
561b248l823J684N860M481j260n708m631N37N032N079N44m656n700j191M416N733
577D149J667l666n650k605K874N957L367k502n915l676J759N479M320p13n342
592d97n072J62N168N123M06m377n293j526L774N911K239l665n885k428K835N382
608B257L349j671n618m390J338N792M336j003m857m409l76M190N427J285m465
623A185n731j157L954N078J916k544n280l365K176N963L595k253n360l367J071
$$ plain form
514 2103 6486 4912 -1276 -6123 -5139 616 5759 5716 518 -5193 -6097 -1232 4849 6356 2039 -4019
530 -4019 -6258 -2782 3383 6572 3761 -2540 -6260 -4014 1957 6117 4780 -846 -5737 -5299 205
545 205 5572 5647 538 -4890 -5780 -1483 4294 6222 2378 -3793 -6279 -2841 3133 6035 3473 -2248
561 -2248 -6071 -4387 1473 5954 4694 -1014 -5645 -5108 -76 5003 5547 891 -4809 -6000 -1584 4149
577 4149 5816 2150 -3500 -6105 -3231 2726 6093 3591 -2324 -6000 -4241 1238 5558 4845 -497
592 -497 -5569 -5407 -239 4884 5290 913 -4380 -5906 -2132 3779 6018 2353 -3532 -5960 -3125 2257
608 2257 5606 3935 -1683 -6073 -4735 1057 5393 4390 -467 -4876 -5252 -1062 4365 5650 1185
623 1185 -4546 -5703 -1749 3329 5245 2701 -2579 -5944 -3768 2195 5790 3537 -1823 -5190 -4119
638d119M512M378J42m766n204j36M824M823N08l680m843j882L062N599K555l090
654B683n580k587K352N022L323j293n094m160R37N131M315m26m534m654n71M155
670i81N203J155l895n195j686L051N191K684k452n561l159K248N281L246j312
685C818m600m146J58M831M977o4m812m595l21L575M573J815k899n547k480L292
701b425N502K086k550m481k887R71M718M295q27n382m132J024M377L697L49l309
717A026m775j555L769N416J198l674m584j510K215M455L010j673n312l428J934
732c488N010L104j077m072l848j45M185M705L07m257m498o17L376M528J713k827
748B099n079k292K721N004K509j914m654l318J135M820L879q62m570l875J56L821
$$ plain form
638 -4119 393 4771 4913 147 -5057 -5193 -369 4454 4962 1282 -3561 -5443 -2381 3218 5773 2683
654 2683 -2897 -5484 -3132 1890 5213 3920 -1174 -5334 -4397 734 5049 4623 89 -4565 -5136 -981
670 -981 4222 5377 1482 -3713 -5399 -2348 2843 5527 3075 -2486 -5645 -3397 1884 5130 3818
685 3818 -782 -4928 -4770 61 5038 4974 162 -4433 -4754 -1179 3394 5209 2310 -3237 -5717 -2425
701 -2425 3077 5163 2613 -1868 -4755 -3784 934 5229 4402 -980 -5112 -4088 289 3986 4335 1026
717 1026 -3749 -5304 -1535 3881 5079 1405 -3179 -4689 -2474 1981 4991 3318 -1994 -5422 -3488
732 -3488 1522 4626 3549 -523 -4371 -4516 -331 4374 4681 424 -4074 -4691 -1315 3213 4926 2099
748 2099 -2980 -5272 -2551 2453 4962 3048 -1606 -4924 -3789 1031 4910 4048 -522 -4397 -4241 -420
764d20M379R28l724n009j135L596M656J468k520m466k680J822N116L206j940m927
780a650k934J208L941L600J21l999m624k81M333M303K53l284l927j504K386M780
796B722K382k685n012k073K318M162K507r93m088l703O32M624L813p58m029l489
812c670k24L171M235J238l337m757j217L183M297J567k138m255k687J648M783
827A837L030j639m438l012P79L826L739J18l953m303k70L759M090P46k874m256
843b821j823K512M773K193k443m503k310J553M086L150p56m315l710O37M170L585
859C978j28l368l857r35L090M507J305l099m346j432K341M028K254j574m337k927
875d500J480M382K886j065l757l223J04L559L926K99l657l953m75L041L833J264
$$ plain form
764 -420 3959 4887 1163 -3846 -4981 -1385 3271 4739 2219 -2247 -4927 -3105 2011 5217 3277 -1650
780 -1650 -4584 -3376 565 4165 4286 287 -4337 -4618 -285 4018 4271 987 -2940 -4444 -2058 2722
796 2722 5104 2419 -2593 -4666 -2348 1814 4321 3328 -760 -4463 -3831 793 4606 3848 -181 -3670
812 -3670 -3894 -723 3512 4750 1413 -3344 -4561 -1378 2919 4486 2348 -1907 -4594 -2946 1837
827 1837 4867 3228 -1210 -4222 -3443 383 4122 4240 287 -4016 -4286 -527 3563 4309 1435 -2821
843 -2821 -4644 -2132 2641 4834 2391 -2112 -4422 -2869 1217 4367 3611 -704 -4414 -3777 393 3978
859 3978 3850 482 -3375 -4310 -1220 3287 4592 1493 -2853 -4285 -1944 2084 4338 2764 -1573 -4500
875 -4500 -3020 1362 4248 3183 -574 -3797 -3693 -134 3792 4091 434 -3519 -3994 -953 2880 4144
891D144k425m224j939K311M401K043j959l962k505J089L937L248p02m070l418
906d031M89L586L468L23l077l982j018L053M263J174k725l959j678J902M042K526
922D356j508m333k789J351L958K907n61l497l500j99L531L925L71l291l801q19
938c899K589L868J661k170m228k108K046M103K265j440l766k790O99L763L308
953C901m11l679l385%L188L549O91k819l905j188K653L966J508k178l856k021
969c986J612L904K524j271l844k785Q17L571L112j91l376l484k51L189L633O69
985C843k781l716j245K342L907J740k063l928k047J597L735K505j010l674k977
1000c772N75L610L203k18l250l359m23K864L670R74k667l845j298K307L745J745
$$ plain form
891 4144 1719 -2505 -4444 -2133 2268 4311 2352 -1610 -4115 -3026 911 4159 3457 -613 -4031
906 -4031 -3542 44 3512 3835 758 -3224 -4242 -1189 3074 4248 1523 -2436 -4114 -2212 1830 4356
922 4356 2848 -1485 -4274 -2923 1035 3942 3381 -116 -3616 -3815 -284 3641 4012 721 -3080 -3899
938 -3899 -1310 2558 4219 2049 -2179 -4287 -2241 1862 4127 2687 -1079 -3869 -3170 593 3901
953 3901 3490 -189 -3574 -3574 -386 3163 3854 1035 -2870 -4058 -1405 2561 4069 1891 -1965 -3986
969 -3986 -2374 1530 4054 2783 -1061 -3846 -3029 542 3654 3463 87 -3397 -3648 -459 3174 3843
985 3843 1062 -2654 -3899 -1557 2350 4090 2027 -1901 -3948 -2351 1384 3889 2879 -795 -3772
1000 -3772 -3197 413 3616 3398 148 -3211 -3634 -770 2900 3874 1207 -2638 -3936 -1629 2116 3861
1016C861j753l722k295J322L771K648r81l584k865M37L278L213J37l079l504n52
1032c668K857L588R74k423l614j509J995L732J953j672l688k283J214L540K635
1047C631p00l405k974K57L213L213J87k927l383o97K612L550J155k297l640j551
1063c756J885L611J995j472l585k379J050L491K683n90l299k968R7L086L225L61
1079C435k827l405q03K495L506J273k132l561j688J725L579K097j309l521k428
1094c564Q71L361K749m11l165l017o1K941L229N13k667l375r44K321L465J380
1110C626j946l499j795J547L472K156j147l372k490P07L214K766k42l045l020
1125c068j98K818L199O18k509l299j065K148L413J486j800l451j847J429L382
$$ plain form
1016 3861 2108 -1614 -3909 -2587 1184 3832 2851 -733 -3598 -3161 117 3330 3467 388 -3116 -3668
1032 -3668 -811 2777 3751 1328 -2286 -3795 -1800 1932 3885 2213 -1475 -3758 -2544 996 3631
1047 3631 2931 -474 -3448 -3191 22 3235 3422 495 -2888 -3585 -973 2577 3732 1435 -2205 -3756
1063 -3756 -1871 1740 3735 2263 -1322 -3701 -2651 840 3523 2933 -366 -3334 -3237 -151 3074 3435
1079 3435 608 -2797 -3600 -1105 2401 3674 1542 -2019 -3707 -1982 1597 3694 2385 -1136 -3564
1094 -3564 -2693 668 3417 3006 -159 -3176 -3237 -296 2933 3446 779 -2596 -3540 -1219 2246 3626
1110 3626 1680 -1819 -3614 -2067 1405 3561 2414 -958 -3448 -2741 473 3239 2997 -48 -3068
1125 -3068 -3266 -448 2751 3369 860 -2439 -3504 -1356 2057 3543 1743 -1708 -3555 -2126 1256
1140A256K177r73l261k519N17L155K817j33k952l001k70K631L172P59k334l317
1156b276j208K067L369J555j678l336j927J225L294K308q45l212k589M35L020
1171B02K797K6k750l062m79K534L203Q59k214l255j283J831L288J723j494l314
1187a388k023J129L182K321o46l050k642K26K923K857J37k648k990n83K327L156
1203B288J054k076l267j360J765L205J686j300l156k111R21L136K409o00k981
1218c87k572J46K706K820L32k509l077o71K302L089J015j903l121j499J552L213
1234A436J832j266l125k093Q42K968K397l44k895k694M6K701K796L38k317k967
1250b345q56K072L177J208j890l115j437J409L003J936r66l086k289P56L015K352
$$ plain form
1140 1256 3433 2460 -801 -3320 -2803 352 3169 3036 84 -2917 -3187 -556 2616 3375 1041 -2276
1156 -2276 -3484 -1417 1952 3507 1829 -1507 -3434 -2209 1085 3393 2548 -664 -3253 -2818 202
1171 202 2999 3025 275 -2787 -3266 -732 2471 3330 1116 -2139 -3422 -1591 1697 3420 1926 -1388
1187 -1388 -3411 -2282 900 3221 2575 -475 -3117 -2891 32 2889 3026 378 -2612 -3195 -868 2288
1203 2288 3342 1266 -2001 -3361 -1596 1609 3295 1995 -1161 -3272 -2351 785 3194 2594 -387
1218 -387 -2959 -2813 -107 2713 3045 536 -2541 -3212 -910 2179 3194 1291 -1830 -3329 -1777 1436
1234 1436 3268 2002 -1123 -3216 -2374 594 2991 2647 -248 -2942 -2896 -195 2601 2939 622 -2345
1250 -2345 -3201 -1129 2048 3256 1366 -1749 -3186 -1777 1226 3162 2196 -890 -3179 -2423 592 2944
1266B944l73k628k575k39K440K974N81k404l023p50K013K872J259j484l060j803
1282c256J319L212J893j100k875k065M47K668K581j6k743k800j19K508K702N51
1298B907j990k875j157J789L147J403j645l005j555J141K820K046o86k893k348
1313b901M65K784K413n4k429k652m48K283K893P19k077k854j040J629K881J543
1329C155j339l029j775J144K833J915o15k603k355J34K688K631m1k524k520l33
1345b634J985K676J020j808l098j210J812K925J242j249k616j828O60K841K332
1360C050o27k928k202M20K378K284L58k096k880p33K270K945O75j895k598j167
1376b746J210K792J839j107l047j873J012K681J900l58k356k459j41K501K706
$$ plain form
1266 2944 2571 -57 -2632 -2871 -431 2543 3124 720 -2303 -3053 -1040 1832 3091 1607 -1453 -3256
1282 -3256 -1937 1275 3168 2068 -807 -2872 -2425 243 2824 2808 65 -2735 -2854 -346 2356 2907
1298 2907 917 -1958 -3115 -1326 1821 3224 1579 -1426 -2981 -1840 980 3026 2340 -553 -2901
1313 -2901 -2436 348 2761 2707 278 -2374 -2822 -539 2354 3073 996 -1858 -2898 -1269 1612 3155
1329 3155 1816 -1213 -2988 -1844 989 2904 2289 -314 -2669 -2535 153 2784 2743 219 -2301 -2634
1345 -2634 -649 2027 3047 1239 -1859 -3069 -1257 1668 2910 1661 -955 -2783 -2123 718 3050
1360 3050 2423 -505 -2707 -2287 91 2375 2733 637 -2243 -2976 -706 2239 2914 1019 -1579 -2746
1376 -2746 -1536 1256 3095 1988 -1059 -2932 -1920 761 2661 2303 -53 -2512 -2653 -152 2554
1391B554J91k312k515n98J756K670J185j572k931j379J465K723J506r16k574k007
1407b754N25K700K232m06k501k193n8K092K509N94k080k761o72J912K568R67j348
1424A326k612j547J110K880J740j079k656j714N39K290K181M9k404k590o4K388
1440a63K368K85j795k409j004J519K860J290j624k783j242J172K408J694n13k562
1456d99k224M19K690K145l06k185k157l88J884K641P87k011k734p62J678K445
1472A423J177j053k584j755R44K770J774q08k413j837J95K190K315J73k288k476
1488b253k15K044K296O55j545k514j189J437K752J258j321k465j419P49K337J937
1504B544m14k531k117L59K320K030O3j887k331o30J859K635P27j792k434r03J248
$$ plain form
1391 2554 2745 433 -2082 -2680 -924 1746 2931 1359 -1572 -2951 -1486 1237 2743 1827 -747 -2754
1407 -2754 -2229 471 2703 2297 -204 -2397 -2455 -363 2146 2740 660 -2101 -2773 -861 1707 2674 1326
1424 1326 -1286 -2833 -1723 1157 2897 1818 -838 -2552 -2013 277 2458 2507 103 -2487 -2551 -163
1440 -163 2205 2490 695 -1714 -2718 -1199 1661 2951 1327 -1456 -2698 -1526 882 2576 2063 -499
1456 -499 -2723 -2304 386 2531 2225 40 -2117 -2505 -621 2020 2807 796 -1938 -2700 -1022 1423
1472 1423 2600 1547 -1037 -2792 -1848 922 2696 1888 -525 -2362 -2167 23 2338 2511 223 -2253
1488 -2253 -2468 -424 1872 2527 982 -1532 -2721 -1284 1468 2726 1405 -1060 -2479 -1730 607 2544
1504 2544 2130 -401 -2518 -2159 161 2191 2254 367 -1964 -2594 -735 1900 2627 835 -1599 -2502 -1254
1521a254K374J456r08k631j751R22K521J677m90k147k024q2K177K403K03k148
1537B98k306l81J674K303R46j357k616j251J362K573J280j002k273j642M63K340
1553D11K050l26k370k047J33J994K091M27j748k444p38J751K485P84j433k274
1569a254j183R33K413J643q51k515j645O62K190J764j18k001k178k21K082K309
1585B030K60j830k161o34J382K327J135j252k535j236J133K351J371o78k178j794
1601b309L27K264K028k20k140j993j17J788K168N80j635k418p82J538K345R63
1617B387j175k250j364Q29K374J610o85k293j696L67K040J927M4j962k159k65
1633b271J851K165N17j540k219q85J289K344J165j150k322j279Q28K161J580m38
$$ plain form
1521 -1254 1120 2576 1668 -963 -2714 -1792 729 2406 1916 -231 -2255 -2337 -160 2243 2446 298
1537 298 -2008 -2389 -715 1588 2534 1177 -1439 -2690 -1328 1245 2525 1523 -750 -2392 -1929 411
1553 411 2461 2135 -235 -2282 -2149 -155 1936 2363 615 -1829 -2567 -816 1669 2453 1020 -1254
1569 -1254 -2437 -1504 909 2552 1701 -814 -2459 -1797 393 2157 2039 38 -2140 -2361 -279 2030
1585 2030 2290 460 -1701 -2335 -953 1374 2509 1257 -1278 -2514 -1381 970 2341 1663 -515 -2309
1601 -2309 -1982 282 2310 2090 -50 -2043 -2160 -372 1796 2376 741 -1677 -2459 -921 1424 2387
1617 2387 1212 -1038 -2402 -1573 801 2411 1726 -567 -2263 -1896 144 2071 2115 153 -2006 -2271
1633 -2271 -420 1745 2262 722 -1497 -2382 -1093 1251 2416 1266 -1056 -2335 -1507 654 2234 1796
1649A796k165j864K52K119J924j8j834k006m06J628K245O81j538k287q29J287
1665a015K163J146q99k229j491P08K269J600n12k060j728R3J882K013K10j834
1681C16k150l88J631K128O94j326k181j057J114K268J254r11k194j430N93K079
1697D40J687k72k030j877M1J908J946K43j657k066n74J482K175Q20j282k184j038
1714b238J009K144J322p51k119j546N20K036J686k19j890j855r0J766J992L48
1730B115j612k072o01J391K096Q91j149k152j127R36K114J325o65k037j541L55
1746a733J981J743j20j861j878j42J702J967M26j489k069p04J303K118R42j077
1762A109k105j170Q13K077J406n59k032j581L09J901J736j3j751j896k51J610
$$ plain form
1649 1796 -369 -2233 -1981 138 2062 2044 210 -1796 -2202 -574 1671 2352 814 -1473 -2302 -1015
1665 -1015 1148 2294 1395 -834 -2325 -1617 652 2252 1740 -320 -2048 -1955 -73 1940 2150 316
1681 316 -1834 -2222 -591 1537 2231 905 -1276 -2333 -1219 1049 2303 1392 -802 -2232 -1639 440
1697 440 2127 1855 -175 -2052 -2011 -103 1843 2086 429 -1637 -2211 -729 1446 2266 984 -1200 -2238
1714 -2238 -1229 915 2237 1486 -633 -2179 -1659 377 2063 1844 -46 -1901 -1991 -225 1767 2115
1730 2115 503 -1569 -2170 -779 1317 2208 1059 -1093 -2220 -1284 830 2155 1490 -547 -2088 -1733
1746 -1733 248 1991 1871 10 -1868 -2010 -308 1659 2085 596 -1473 -2177 -874 1244 2186 1109
1762 1109 -996 -2166 -1353 724 2130 1571 -461 -2042 -1733 168 1904 1891 140 -1756 -2007 -397
1778c97J997M88j427k038p59J201K073J007r85k067j226P34K012J433m71j932
1794c57j619J96J836J759N5j703j862l18J519J956N69j317k027q02J121K036J029
1811B071q87k014j253O47J966J445l90j877j630J65J762J753J13j606j871l79
1827a985J467J954O05j270j981q53J052J988J089q37j960j292N80J917J460l18
1843A616j836j628P4J700J761J77j551j844m52J373J933O84j191j963r08R82J950
1860H77J114p14j921j333M72J875J501k48j762j625j6J610J781K69j468j868m93
1877a949J307J893P28j067j931r67Q68J928J158o47j869j341M08J774J521j55
1893A659j705j643q0J555J749L10j353j836n94J230J889P75j033j883r82P74J848
$$ plain form
1778 -397 1600 2088 661 -1377 -2136 -935 1138 2145 1160 -907 -2133 -1399 613 2046 1575 -357
1794 -357 -1976 -1780 56 1815 1870 167 -1695 -2013 -494 1462 2031 714 -1313 -2115 -994 1042 2071
1811 2071 1184 -830 -2083 -1436 530 1975 1585 -292 -1922 -1757 5 1758 1871 265 -1606 -1985
1827 -1985 -518 1436 2041 771 -1210 -2063 -1011 977 2066 1229 -731 -2023 -1443 474 1934 1616
1843 1616 -220 -1848 -1774 -74 1687 1864 313 -1531 -1983 -610 1323 2007 816 -1147 -2055 -1073 877
1860 877 1991 1277 -644 -1977 -1505 370 1871 1623 -139 -1764 -1780 -170 1611 1880 412 -1456 -1949
1877 -1949 -642 1251 1979 912 -1019 -1986 -1118 810 1968 1321 -548 -1889 -1481 293 1814 1659
1893 1659 -46 -1689 -1769 -214 1535 1845 492 -1344 -1938 -708 1181 1956 923 -960 -1942 -1168 680
1910F80J238n55j856j390L71J751J480r0j585j659j86J487J812L68j371j803n72
1927a880J121J804Q64q73j891j101P75J862J203n38j723j367J90J661J612Mj620
1944A03j673j75J431J681M61j181j801p54J070J884Q71r11j796j037N93J747J297
1961A810l83j735j448K02J625J515N0j451j661l13J349J758M87j195j741p10R45
1978h96J781R69p78j812j105O09J710J239k93j634j470R3J605J567O3j448j575
1995a375l19J197J701O40j099j841p42R79J729Q90o60j650j215M13J755J374l50
2012A427j668j362R8J388J525L00j337j756m33J319J692N11j009j619q45P25J768
2029G24J111o73j777j131M88J554J274j15j475j551p0J506J604J52j287j535m74
$$ plain form
1910 680 1918 1363 -493 -1883 -1512 239 1719 1629 44 -1615 -1801 -314 1498 1866 495 -1308 -1880
1927 -1880 -759 1045 1909 1036 -855 -1956 -1181 681 1884 1346 -377 -1744 -1554 107 1719 1723 103
1944 103 -1570 -1745 -314 1367 1828 647 -1154 -1908 -838 1046 1917 1006 -790 -1827 -1234 513 1810
1961 1810 1427 -308 -1756 -1554 71 1586 1636 185 -1476 -1789 -440 1318 1805 610 -1131 -1841 -896
1978 -896 885 1854 1076 -736 -1841 -1232 478 1717 1424 -210 -1680 -1587 18 1585 1648 200 -1375
1995 -1375 -1694 -497 1204 1844 745 -1096 -1838 -859 870 1760 1100 -550 -1765 -1352 403 1777 1427
2012 1427 -241 -1603 -1505 -117 1408 1708 371 -1385 -1818 -499 1193 1704 695 -924 -1769 -1044 724
2029 724 1835 1162 -615 -1746 -1258 296 1570 1455 -20 -1571 -1641 -135 1469 1621 334 -1201 -1675
2046a675J036J684P54r53j774q30Q09J635R97m95j594j278L16J633J359j78j458
2063a2j410j11J269J585L87j262j673m72J084J594O85p82j640j018O71J749J063
2080A707n69j571j138K26J413J434L2j495j541p6J356J456L36j042j564p09R54
2097g91J767P80r23j624q22N73J477J174k76j620j358K50J565J291n6j251j414
2114a258l31J164J670M62j193j604n10Q82J484Q47o02j644j077N70J654J082m16
2131A180j422j190L0J342J486J08j393j495j92J158J433N11q94j616p66Q95J659
2148H34P79p28j477r50L79J466J269k46j549j297J76J341J282J57j120j500m47
2165a631J152J606M73j013j484o43O66J517R90n51j638j058M89J474J067j65j286
$$ plain form
2046 -1675 -639 1045 1799 846 -928 -1758 -949 686 1683 1188 -406 -1684 -1368 265 1624 1446 -12
2063 -12 -1422 -1533 -264 1321 1708 446 -1227 -1699 -615 979 1664 882 -758 -1776 -1105 644 1707
2080 1707 1138 -433 -1571 -1345 68 1502 1534 39 -1502 -1578 -222 1234 1570 528 -1036 -1745 -791
2097 -791 976 1756 833 -791 -1613 -1040 437 1611 1335 -285 -1643 -1393 172 1463 1407 156 -1258
2114 -1258 -1589 -425 1245 1707 514 -1090 -1600 -718 766 1613 1011 -633 -1710 -1140 514 1596 1180
2131 1180 -242 -1432 -1402 -60 1426 1534 141 -1354 -1546 -388 1045 1556 662 -954 -1720 -825 834
2148 834 1613 885 -592 -1542 -1163 303 1572 1326 -223 -1520 -1344 -3 1279 1436 316 -1184 -1631
2165 -1631 -479 1127 1600 587 -897 -1540 -874 643 1633 1082 -556 -1614 -1125 349 1416 1251 -35
2182c5j341j04J329J489J45j243j393l35R27J461O88q35j615p90P83J526Q34m87
2200A004j400j101K29J465J292j84j405j238j5J147J332L68j063j534m76J045
2216e34J498N39p72j403q32N23J526J047n00j506j028L11J300J158L2j237j419
2233a297j63J273J410K06j031j335n29P94J503P60p79j552p85O44J376R10k98
2250A107j352j187J43J435J251j04j256j235j66J042J392M35j003j512m99R17
2266e92J398O59o22j412r08M70J483J035m09j372j068J46J230J241J10j216j371
2283a198j95J122J336L60q76j382o45P72J495P34o76j406q41M25J313J069k29
2300A178j343j208J33J283J189M7j066j288l42R97J441M38r29j408n30P10J331
$$ plain form
2182 -35 -1376 -1480 -151 1338 1483 240 -1153 -1488 -561 900 1588 753 -862 -1652 -869 657 1491 1004
2200 1004 -396 -1497 -1268 197 1489 1305 -100 -1338 -1353 -206 1126 1494 431 -1103 -1579 -534
2216 -534 964 1503 731 -672 -1504 -981 545 1592 1092 -414 -1442 -1131 169 1327 1359 122 -1297
2233 -1297 -1460 -187 1223 1429 398 -937 -1466 -672 831 1591 812 -740 -1525 -881 495 1405 1107
2250 1107 -245 -1432 -1289 146 1397 1293 37 -1198 -1364 -322 1070 1505 502 -1010 -1509 -592
2266 -592 806 1465 843 -569 -1477 -1007 476 1511 1102 -270 -1338 -1192 38 1279 1389 173 -1198
2283 -1198 -1393 -271 1065 1425 549 -833 -1478 -706 789 1523 847 -559 -1400 -975 338 1407 1178
2300 1178 -165 -1373 -1240 43 1232 1279 213 -1075 -1417 -420 1021 1459 530 -878 -1408 -698 633
2317F33P87m90j416r77M39J392J002k76j230j096kJ155J291J67j155j316k51R68
2335c75J307M73p59j400p08O96J439P72n63j325q94L20J270J075j44j289j171
2352a276M3J163J204J78j007j315l81R11J378N13q05j352o51O09J332Q51m55j351
2370d11r69L05J304J043j19j171j170r4J109J276K19r98j285l89Q52J298N79o85
2388F94j365p28N96J325Q17l88j265r80K15J228J117q7j175j132j09J045J210
2405A018L04r30j306m51Q15J327N68o63j297p34M86J290R06l65j264r80K05J170
2423I9J081j3j103j178j53J018J240K97q89j257m70P44J301O29o14j296p69M78
2441h55J256Q90k95j208j018J28J163J101K6j071j167j98R54J232L62q50j258
$$ plain form
2317 633 1420 930 -486 -1463 -1024 368 1370 1094 -136 -1232 -1234 -79 1212 1379 224 -1092 -1343 -375
2335 -375 932 1405 646 -754 -1462 -766 673 1445 882 -443 -1337 -1017 253 1328 1184 -105 -1276
2352 -1276 -1233 -70 1134 1312 305 -1010 -1391 -480 898 1411 606 -746 -1397 -788 544 1395 940 -411
2370 -411 -1380 -1075 229 1272 1153 -18 -1188 -1282 -173 1103 1322 324 -961 -1350 -498 800 1379 694
2388 694 -671 -1399 -803 522 1339 951 -314 -1294 -1079 149 1266 1179 4 -1128 -1237 -192 1018
2405 1018 1322 392 -914 -1365 -550 777 1345 682 -615 -1349 -863 427 1333 968 -296 -1276 -1071 99
2423 99 1180 1167 64 -1114 -1267 -249 991 1288 399 -858 -1328 -584 717 1346 732 -564 -1333 -855
2441 -855 401 1291 996 -212 -1230 -1102 61 1162 1188 117 -1050 -1248 -294 938 1300 450 -808
2458h08n37P26J284O47n51j265q01L96J240R15k44j187j012P9J104J110Q6j020
2476A62j172k48R01J225L97p75j228n75O35J264O96n08j230q11L42J191R52j90
2494A028j139j041L5J063J114J29r64j177k87Q60J201M55p29j241n84N99J225
2511E47P21m48j205q51L08J166R45j37j102j046j9J022J109J81r15j173l22P92
2529d27J200M81o67j234o23N47J227P41l96j179q68K40J129R62q0j060j050o8
2547a125R64J121K36q56j172l64P37J181N25o24j174o49M62J166P99l28j146q95
2565a142J91J086R65k5j003j064j24R31J117K63q23j147m11O90J167N61n61j189
2583e18o85M46J157P75k94j075q97J13J045J009J0j001j043j42Q75J099L05p50
$$ plain form
2458 -808 -1345 -619 665 1312 761 -504 -1305 -909 331 1246 1002 -185 -1197 -1118 -14 1096 1182 162
2476 162 -1010 -1258 -357 868 1265 490 -738 -1313 -678 586 1282 774 -456 -1267 -925 266 1218 1028
2494 1028 -111 -1152 -1117 -54 1060 1189 225 -952 -1239 -379 822 1277 548 -693 -1277 -678 547
2511 547 1268 820 -385 -1236 -928 238 1183 1046 -56 -1102 -1121 -99 1010 1191 276 -897 -1219 -427
2529 -427 773 1254 587 -647 -1270 -723 504 1245 849 -330 -1198 -958 171 1133 1053 -7 -1057 -1125
2547 -1125 -161 960 1196 340 -832 -1196 -459 722 1247 623 -551 -1200 -738 428 1227 899 -247 -1142
2565 -1142 -951 135 1100 1075 72 -992 -1116 -185 932 1195 372 -775 -1186 -496 671 1232 671 -518
2583 -518 -1203 -757 400 1175 881 -194 -1091 -978 67 1076 1086 85 -958 -1100 -225 874 1179 429
2601D29j158m67O69J188N53n30j134o89L54J122Q42k36j109r16J12J012R87O1
2619A090r10j067k33Q59J105L34p22j123m93N90J141O34m79j139p31L39J086Q36
2637A117j85j038r41L6R88J006R4q92j022k71P49J126M08o90j140n06N81J084
2655E04O20l66j102p83K66J095Q72j69j022q94J1Q71J011J98q61j094k63P90J044
2674G28M10o24j062n78M72J135O88m16j082p55K66R88Q45o0r55r98l2R26R96J44
2694A036p83j004l54O57J103M87o19j105n40M75J035O93k95j047q26J98J024Q74
2712A009p7r12r33j20Q41J023K61p84j052l41O59J037M76m82j063o48M06J084
2730C84O85k82r85p77Q7R27R40J3r29r63q4P95R61K73o68j041m57O12J096N04
$$ plain form
2601 429 -729 -1196 -527 661 1214 684 -450 -1139 -785 337 1179 943 -166 -1082 -970 42 1029 1090
2619 1090 180 -887 -1120 -261 844 1178 456 -667 -1160 -570 571 1205 726 -413 -1144 -805 281 1117
2637 1117 932 -106 -1047 -1011 -23 983 1077 185 -837 -1108 -359 767 1175 485 -655 -1161 -580 504
2655 504 1124 758 -344 -1127 -861 234 1106 937 -85 -979 -968 -97 914 1112 251 -843 -1106 -316 728
2674 728 1138 514 -548 -1126 -654 481 1169 753 -329 -1084 -818 170 1015 955 0 -998 -1030 -104 892 1036
2694 1036 253 -751 -1105 -448 655 1142 523 -582 -1122 -647 388 1081 786 -261 -1087 -889 135 1009
2712 1009 932 20 -913 -1033 -192 831 1092 308 -744 -1085 -426 611 1087 605 -458 -1106 -700 384
2730 384 1069 787 -198 -975 -888 39 979 992 63 -900 -984 -189 772 1045 377 -664 -1121 -509 587 1091
2750A091n37j010n78L17R77P74j94j038q35J41R47Q46J7p92r65k18P66J074K69
2769A052p21r98l51N15R74N95m08j064o85L68J025O93k01q88q34%Q80R72N6q61
2789A19r33j55P00R47L61n87j033m94N62J015N34m15r34o71K12R63Q09j53r66
2808a19q11N6Q19Q64J59p41r95k74P26J017L01n91r36m84M09R90O65l69j011o67
2828i92K80Q91P39q2q35q75n5Q49R38R0p60q75k65N89R66M54n54j022m96M78R53
2849D16N53k89q93p37J56R46Q11j33q63p97m1P02R12K31o93j003k77O50R31L62
2869I44m62r02n93L54J007O53l29r37o49J53Q22P87L6q15r19q3Q00Q72J60o13
2889B86q82l74N15R95M89n05r66n02L58Q66O45j77q94p88J32Q95P83m8p50q07
$$ plain form
2750 1091 554 -456 -1034 -717 260 1034 840 -198 -1033 -892 55 901 918 126 -839 -1057 -291 783 1052
2769 1052 331 -667 -1018 -503 471 1066 658 -406 -1091 -723 302 995 794 -94 -928 -928 -48 924 980 119
2789 119 -814 -969 -269 678 1039 452 -581 -1075 -513 502 1036 621 -313 -984 -772 191 1000 847 -119
2808 -119 -930 -874 -55 809 968 227 -768 -1042 -316 701 1002 411 -525 -1009 -600 390 1055 686 -325 -992
2828 -992 -712 179 918 836 1 -874 -929 -80 858 948 188 -687 -952 -363 603 1057 503 -519 -1015 -537 416
2849 416 969 680 -213 -950 -794 152 963 830 -33 -830 -871 -169 743 974 281 -722 -999 -349 582 944
2869 944 482 -420 -1013 -659 348 1001 672 -265 -914 -761 61 848 884 69 -850 -933 -133 739 899 286
2889 286 -596 -970 -455 540 1029 524 -442 -944 -586 280 925 748 -146 -934 -802 93 876 828 78 -729
$$ [...]
8191C9
##END NTUPLES=NMR FID
##END=
