##TITLE=1H_ADM5
 CDCl3, 8 sc, 
 5.7.2019
##JCAMPDX= 6.0         $$ Bruker NMR JCAMP-DX V2.0
##DATA TYPE= NMR FID
##DATA CLASS= NTUPLES
##ORIGIN= UXNMR, Bruker Analytische Messtechnik GmbH
##OWNER= root
$$ XWIN-NMR		Version 3.5
$$ Fri Jul  5 16:16:48 2019 Russian Standard Time (UT+4h)  she@DPX200
##.OBSERVE FREQUENCY= 200.13155
##.OBSERVE NUCLEUS= ^1H
##.DELAY= (6, 6)
##.ACQUISITION MODE= SIMULTANEOUS
##.ACQUISITION SCHEME= undefined
##.AVERAGES= 8
##.DIGITISER RES= 18
##SPECTROMETER/DATA SYSTEM= spect
##.PULSE SEQUENCE= zg30
##.SOLVENT NAME= CDCl3
##.SHIFT REFERENCE= (INTERNAL, CDCl3, 0, 15.7039)
##AUDIT TRAIL= $$ (NUMBER, WHEN, WHO, WHERE, WHAT)
$$ ##TITLE= Audit trail, XWIN-NMR		Version 3.5
$$ ##JCAMPDX= 5.01
$$ ##ORIGIN= Bruker BioSpin GmbH
$$ ##OWNER= she
$$ F:/spectra/data/she/nmr/H-F/1/audita.txt
$$ ##AUDIT TRAIL=  $$ (NUMBER, WHEN, WHO, WHERE, WHAT)
(   1,<2019-07-05 16:15:47.17 +0400>,<she>,<DPX200>,
      <created by zg, POWCHK disabled, PULCHK disabled
       configuration hash MD5:
       00 E9 B6 7A A2 85 ED C7 34 08 36 98 17 FE 4E 26
       data hash MD5: 16K
       1C E5 46 B6 09 DD 11 8B D7 12 28 5F 8C 59 39 DE>)
$$ ##END=
$$ 
$$ hash MD5
$$ 38 74 54 99 A9 41 94 CA 2A 7B 14 54 F7 87 C9 07
##$RELAX= 
##$RELAX= 
##$RELAX= 
##$RELAX= 
##$RELAX= 
##$RELAX= 
$$ Bruker specific parameters
$$ --------------------------
##$DU= <F:/spectra>
##$EXPNO= 1
##$NAME= <H-F>
##$PROCNO= 1
##$TYPE= <nmr>
##$USER= <she>
##$AMP= (0..31)
100 100 100 100 100 100 100 100 100 100 100 100 100 100 100 100 100 100 
100 100 100 100 100 100 100 100 100 100 100 100 100 100 
##$AQSEQ= 0
##$AQ_mod= 1
##$AUNM= <au_zg>
##$AUTOPOS= <>
##$BF1= 200.13
##$BF2= 200.13
##$BF3= 200.13
##$BF4= 200.13
##$BF5= 200.13
##$BF6= 200.13
##$BF7= 200.13
##$BF8= 200.13
##$BYTORDA= 1
##$CFDGTYP= 0
##$CFRGTYP= 5
##$CHEMSTR= <none>
##$CNST= (0..31)
1 1 145 1 1 1 1 1 1 1 1 1 1 1 1 1 1 1 1 1 1 1 1 1 1 1 1 1 1 1 1 1 
##$CPDPRG= <>
##$CPDPRG1= <>
##$CPDPRG2= <>
##$CPDPRG3= <>
##$CPDPRG4= <mlev>
##$CPDPRG5= <mlev>
##$CPDPRG6= <mlev>
##$CPDPRG7= <mlev>
##$CPDPRG8= <mlev>
##$CPDPRGB= <>
##$CPDPRGT= <>
##$D= (0..31)
0 1.2 0 0 0 0 0 0 0 0 0 0.03 0 0 0 0 0 0 0 0 0 0 0 0 0 0 0 0 0 0 0 0 
##$DATE= 1562328946
##$DBL= (0..7)
120 120 120 120 120 120 120 120 
##$DBP= (0..7)
150 150 150 150 150 150 150 150 
##$DBP07= 0
##$DBPNAM0= <>
##$DBPNAM1= <>
##$DBPNAM2= <>
##$DBPNAM3= <>
##$DBPNAM4= <>
##$DBPNAM5= <>
##$DBPNAM6= <>
##$DBPNAM7= <>
##$DBPOAL= (0..7)
0.5 0.5 0.5 0.5 0.5 0.5 0.5 0.5 
##$DBPOFFS= (0..7)
0 0 0 0 0 0 0 0 
##$DE= 6
##$DECBNUC= <off>
##$DECIM= 24
##$DECNUC= <off>
##$DECSTAT= 4
##$DIGMOD= 1
##$DIGTYP= 9
##$DL= (0..7)
0 120 120 120 120 120 120 120 
##$DP= (0..7)
150 150 150 150 150 150 150 150 
##$DP07= 0
##$DPNAME0= <>
##$DPNAME1= <>
##$DPNAME2= <>
##$DPNAME3= <>
##$DPNAME4= <>
##$DPNAME5= <>
##$DPNAME6= <>
##$DPNAME7= <>
##$DPOAL= (0..7)
0.5 0.5 0.5 0.5 0.5 0.5 0.5 0.5 
##$DPOFFS= (0..7)
0 0 0 0 0 0 0 0 
##$DQDMODE= 0
##$DR= 18
##$DS= 0
##$DSLIST= <SSSSSSSSSSSSSSS>
##$DSPFIRM= 0
$$ [...]
##$SUBNAM2= <"">
##$SUBNAM3= <"">
##$SUBNAM4= <"">
##$SUBNAM5= <"">
##$SUBNAM6= <"">
##$SUBNAM7= <"">
##$SUBNAM8= <"">
##$SUBNAM9= <"">
##$SW= 24.9336996594482
##$SWIBOX= (0..15)
0 0 2 0 0 0 0 0 0 0 0 0 0 0 0 0 
##$SW_h= 4990.01996007984
##$TD= 16384
##$TD0= 1
##$TE= 0
##$TE2= 300
##$TE3= 300
##$TEG= 300
##$TL= (0..7)
0 120 120 120 120 120 120 120 
##$TP= (0..7)
150 150 150 150 150 150 150 150 
##$TP07= 0
##$TPNAME0= <>
##$TPNAME1= <>
##$TPNAME2= <>
##$TPNAME3= <>
##$TPNAME4= <>
##$TPNAME5= <>
##$TPNAME6= <>
##$TPNAME7= <>
##$TPOAL= (0..7)
0.5 0.5 0.5 0.5 0.5 0.5 0.5 0.5 
##$TPOFFS= (0..7)
0 0 0 0 0 0 0 0 
##$TUNHIN= 0
##$TUNHOUT= 0
##$TUNXOUT= 0
##$USERA1= <user>
##$USERA2= <user>
##$USERA3= <user>
##$USERA4= <user>
##$USERA5= <user>
##$V9= 5
##$VALIST= <valist>
##$VCLIST= <CCCCCCCCCCCCCCC>
##$VD= 0
##$VDLIST= <DDDDDDDDDDDDDDD>
##$VPLIST= <PPPPPPPPPPPPPPP>
##$VTLIST= <TTTTTTTTTTTTTTT>
##$WBST= 1024
##$WBSW= 4
##$XGAIN= (0..3)
0 0 0 0 
##$XL= 0
##$YL= 0
##$YMAX_a= 431862
##$YMIN_a= -669053
##$ZGOPTNS= <>
##$ZL1= 120
##$ZL2= 120
##$ZL3= 120
##$ZL4= 120
##$ABSF1= 10
##$ABSF2= 0
##$ABSG= 5
##$ABSL= 3
##$ALPHA= 0
##$AQORDER= 0
##$ASSFAC= 0
##$ASSFACI= 0
##$ASSFACX= 0
##$ASSWID= 0
##$AUNMP= <proc_1d>
##$AZFE= 0.1
##$AZFW= 0.1
##$BCFW= 1
##$BC_mod= 2
##$BYTORDP= 1
##$COROFFS= 0
##$CY= 11.3945322036743
##$DATMOD= 1
##$DC= 2
##$DFILT= <>
##$DTYPP= 0
##$F1P= 18.9103706918063
##$F2P= -1.10871071338519
##$FCOR= 0.5
##$FTSIZE= 0
##$FT_mod= 4
##$GAMMA= 1
##$GB= 0.15
##$INTBC= 1
##$INTSCL= 1
##$ISEN= 128
##$LB= 0.24
##$LEV0= 0
##$LPBIN= 0
##$MAXI= 10000
##$MC2= 0
##$MEAN= 0
##$ME_mod= 0
##$MI= 1.114404
##$NCOEF= 0
##$NC_proc= 0
##$NLEV= 6
##$NOISF1= 3.799351
##$NOISF2= 2.8
##$NSP= 1
##$NTH_PI= 0
##$NZP= 0
##$OFFSET= 15.70392
##$PC= 1
##$PHC0= -8851.415
##$PHC1= 4.000959
##$PH_mod= 1
##$PKNL= yes
##$PPARMOD= 0
##$PSCAL= 0
##$PSIGN= 0
##$REVERSE= no
##$SF= 200.130013532006
##$SI= 16384
##$SIGF1= 3
##$SIGF2= 2
##$SINO= 400
##$SIOLD= 16384
##$SREGLST= <1H.CDCl3>
##$SSB= 0
##$STSI= 0
##$STSR= 0
##$SW_p= 3612.71676300578
##$SYMM= 0
##$S_DEV= 0
##$TDeff= 0
##$TDoff= 0
##$TI= <>
##$TILT= no
##$TM1= 0
##$TM2= 0
##$TOPLEV= 0
##$USERP1= <user>
##$USERP2= <user>
##$USERP3= <user>
##$USERP4= <user>
##$USERP5= <user>
##$WDW= 1
##$XDIM= 8192
##$YMAX_p= 0
##$YMIN_p= 0
$$ End of Bruker specific parameters
$$ ---------------------------------
##NTUPLES= NMR FID
##VAR_NAME=  TIME,          FID/REAL,        FID/IMAG
##SYMBOL=    X,             R,               I
##VAR_TYPE=  INDEPENDENT,   DEPENDENT,       DEPENDENT
##VAR_FORM=  AFFN,          ASDF,            ASDF
##VAR_DIM=   8192,          8192,            8192
##UNITS=     SECONDS,       ARBITRARY UNITS, ARBITRARY UNITS
##FACTOR=    0.0002004,     1,               1
##FIRST=     0,             0,               0
##LAST=      1.6414764,     0,               0
##MIN=       0,             -669053,         0
##MAX=       1.6414764,     431862,          0
$$ Real data points
##PAGE= N=1
##DATA TABLE= (X++(R..R)), XYDATA
$$ [...]
$$ plain form
2719 -1526 659 -519 -1782 378 2410 -114 -3691 -2543 738 1706 -97 -1472 -1231 -1480 -1213 678
2735 678 1044 -78 -1028 -528 -967 -824 620 2277 368 -2070 -1571 1297 2265 846 -238 -397 -218
2752 -218 -38 1174 1774 915 -449 -564 27 1264 1846 1422 -227 -1582 -558 1389 2284 1278 -815
2769 -815 -1639 -1262 650 1388 610 -123 -831 -1460 -1565 367 2403 1082 -2611 -3717 -1190 1448 1404 351
2787 351 -1064 -2155 -2157 85 1764 934 -578 -1186 -1949 -1945 690 3311 1747 -2720 -4125 369 2885
2804 2885 1602 -122 278 -572 -2038 -363 3361 3627 -157 -2760 -1300 597 1872 3289 2027 -1467
2820 -1467 -3921 -209 3661 2740 -194 -969 -1066 -2042 -1352 2700 3746 -396 -3899 -2692 484 1427 1306
2837 1306 1000 -1975 -4166 -1762 2402 2348 -789 -2001 -1080 -1245 -1336 1209 3042 432 -3724 -2961 1238
$$ packed form
2719a526K185j178j263K160K032k524l577J148L281R68j803j375K41k49K67J891
2735F78L66j122r50N00m39J43J444J657j909k438M99K868R68j419j084j59J79
2752b18J80J212O00q59j364j15N91J237N82m24j649j355J024J947Q95j006k093
2769h15q24L77J912P38p78p33p08o29j05J932K036j321l693j106K527K638m4j053
2787C51j415j091kK242J679q30j512o08p63MK635K621j564m467j405M494K516
2804B885j283j724M00q50j466J675L724K66l784k603J460J897J275J417j262l494
2820a467k454L712L870r21k934p75r7r76O90M052J046m142l503J207L176R43j21
2837A306l06k975k191K404M164n4l137j212R21j65r1K545J833k610m156P63M199
$$ plain form
2854 1238 2890 1302 -714 -2214 -1993 379 2594 2549 -385 -2148 -806 215 701 2823 3298 -372
2870 -372 -4569 -2426 3131 5139 1890 -1753 -2620 -1438 421 2485 3182 418 -2730 -3025 -1033 1598
2886 1598 3213 2620 -1471 -5023 -2958 2103 3835 1058 -2242 -3015 -2539 -641 1606 2643 177 -2640
2902 -2640 -3396 -1334 859 2305 1632 -1552 -4098 -2364 2439 3407 423 -1580 -1579 -464 657 2171
2918 2171 2288 405 -1541 -1473 373 2001 2457 1706 -1341 -2834 -484 3834 3725 -481 -2389 -955
2934 -955 643 909 1550 1811 0 -3018 -2455 530 3205 2099 -681 -2713 -3029 -666 2801 2629 -660
2951 -660 -3254 -2122 -549 185 823 1568 9 -3385 -3328 174 3258 1919 -959 -2290 -1865 -758 1636
2968 1636 2541 636 -1911 -1876 85 1596 1292 1541 473 -1070 -2168 298 3481 2494 -65 -2086
$$ packed form
2854A238J652j588k016j500K21K372K215m5k934j763J342J021M86K122M75l670
2870c72m197K143N557K008l249l643q67J182J859K064O97k764l148k95J992K631
2886A598J615n93m091l552K065N061J732k777l300p73M76J898K247J037k466k817
2902b640p56K062K193J446o73l184k546J734M803R68k984k003JJ115J121J514
2918B171J17j883j946O8J846J628M56p51l047j493K350M318j09m206j908J434
2934i55J598K66O41K61j811l018N63K985K675j106k780k032l16K363L467j72l289
2951f60k594J132J573P34O38P45j559l394N7L502L084j339k878j331M25J107K394
2968A636R05j905k547L5J961J511l04K49j068j543j098K466L183r87k559k021
$$ plain form
2984 -2086 -763 1473 2328 1572 178 -810 -864 302 1057 1240 855 -317 -1653 -1773 319 2666 1540
3001 1540 -1648 -3105 -1067 1395 1140 -103 -977 -579 -967 -1321 330 1700 793 -1751 -2650 -1209 893
3018 893 1314 112 -1679 -1742 -494 942 1548 710 -201 -880 -944 -183 485 1848 957 -787 -1687 220
3036 220 2396 1879 455 -392 -328 227 644 1409 871 -45 -781 24 183 691 1107 898 -706 -2283 -577
3055 -577 1901 1607 -781 -1761 -921 415 -346 -511 -325 52 -1027 -1659 -693 141 893 190 -1612 -1769
3073 -1769 -224 1369 795 -1121 -1276 577 492 -466 -430 870 793 -457 -1231 502 1721 1006 -350 -656
3091 -656 229 522 1627 554 -12 159 405 432 448 231 859 542 -246 -589 340 1119 524 -343 -1030 49
3111 49 70 361 -44 -890 -646 -297 -217 -882 -648 235 392 -918 -1564 -707 835 390 -999 -1559 -89 503
$$ packed form
2984b086J323K236Q55p56j394r88n4J166P55J83l85j172j336j20K092K347j126
3001A540l188j457K038K462k55j243q74L98l88l54J651J370r07k544q99J441K102
3018H93M21j202j791o3J248J436O06q38r11o79o4P61O68J363q91j744r00J907
3036B20K176n17j424q47O4N55M17P65n38r16p36Q05J59N08M16k09j604j577J706
3055e77K478k94k388r80Q40J336p61j65J86L77j079o32R66Q34P52p03j802j57
3073a769J545J593n74j916j55J853q5r58L6J300p7j250p74J733J219p15j356l06
3091f56Q85K93J105j073n66J71K46K7J6k17O28l17p88l43R29P79n95q67o87J079
3111D9K1K91m05q46K44L49Q0o65K34Q83J57j310o46Q57J542m45j389n60J470N92
$$ plain form
3131 503 -196 -980 -758 132 942 -186 -1140 -301 1267 949 -433 -912 808 1537 572 -701 -207 1419
3149 1419 1463 -423 -614 848 1389 329 -542 -270 761 1405 470 -461 -208 584 527 -106 -319 446 593
3168 593 -11 -1086 -1008 235 907 -10 -1358 -1274 -380 359 77 -582 -1085 -704 -99 -289 -300 197 362 -480
3188 -480 -1440 -1214 933 1450 218 -1243 -1424 354 1569 687 -53 -367 317 463 439 556 1625 1492
3206 1492 -524 -1588 -45 2307 2032 -261 -1475 -746 1136 1289 312 -176 -83 -320 -401 -245 967 1507
3224 1507 -277 -1923 -1958 -102 1538 693 -733 -1936 -1062 143 545 122 -476 -1112 -1264 -751 -55 929
3242 929 1036 -601 -2252 -1660 522 2154 677 -1219 -1784 -534 982 1378 875 139 -494 -625 -89
3259 -89 1119 1703 1307 -3 -1727 -1333 1857 3331 1066 -1661 -1718 600 1561 712 343 243 -837 -1574
$$ packed form
3131E03o99p84K22Q90Q10j128r54Q39J568l18j382m79J720P29r65j273M94J626
3149A419M4j886j91J462N41j060q71K72J031O44r35r31K53P92n7o33k13P65J47
3168E93o04j075P8J243O72r17j348Q4Q94P39k82o59n03L81O05j90j1M97J65q42
3188d80r60K26K147N17j232j461j81J778J215q82p40l14O84J46k4J17J069j33
3206A492k016j064J543K352k75k293j214P29J882J53r77m88R3k37q1J56J212N40
3224A507j784j646l5J856J640q45j426j203Q74J205M02m23n98o36j52N13O96R84
3242I29J07j637j651N92K182J632j477j896n65J250J516L96n03p36o33j31N36
3259h9J208N84l96j310j724L94L190J474k265k727n7K318R61q49l69j00j080p37
$$ plain form
3277 -1574 -1073 1406 1994 -174 -1900 -2303 -744 1348 1828 204 -2497 -2234 -136 771 60 -349 60
3294 60 -1050 -3025 -1158 2080 2411 -590 -2701 -1689 505 1311 1380 416 -785 -1828 -777 1465 1607
3311 1607 292 -219 -453 -916 -327 2121 3143 308 -2682 -1613 1348 2578 1345 -168 -738 -1256
3327 -1256 -262 1776 2187 601 -1084 -1111 -696 -454 1395 2549 -77 -3509 -2782 1307 2744 501 -1725
3344 -1725 -1463 -951 -1279 -300 1706 1182 -1233 -2854 -1606 728 1708 1571 -1083 -2969 -2056 813 2561
3361 2561 623 -1136 -835 -71 -746 102 2083 2331 -669 -2888 -952 2412 2947 264 -968 -1090 -723
3378 -723 880 2315 1581 -197 -1051 -143 335 623 1260 1249 -948 -2689 -898 2235 2514 33 -2259
3395 -2259 -2318 -315 810 1590 515 -991 -1855 -1240 -104 912 1345 473 -1848 -3379 -1308 2165 3194
$$ packed form
3277a574N01K479N88k168j726m03J559K092M80j624k701K63K098R07p11m09M09
3294F0j110j975J867L238L31l001k111J012K194Q06O9r64j201j043J051K242J42
3311A607j315n11k34m63N89K448J022k835k990J069K961J230j233j513n70n18
3327a256R94K038M11j586j685k7M15K42J849J154k626l432P27M089J437k243k226
3344a725K62N12l28R79K006n24k415j621J248K334R80j37k654j886R13K869J748
3361B561j938j759L01P64o75Q48J981K48l000k219J936L364N35k683j232j22L67
3378g23J603J435p34j778q54R08M78K88O37j1k197j741J791L133K79k481k292
3395b259n9K003J125P80j075j506q64O15J136J016M33q72k321j531K071L473J029
$$ plain form
3412 3194 117 -3065 -2030 292 1403 1122 510 230 -957 -1852 -826 2160 2756 910 -1800 -2011
3428 -2011 122 2784 2674 446 -1596 -965 451 1026 1103 1205 794 -903 -1608 -378 1670 2446 -96
3445 -96 -1888 -1441 450 1140 968 -309 -1561 -1236 -241 831 663 -47 -670 -1339 -1333 -594 1378 1177 -957
3464 -957 -2582 -1934 796 1833 731 -931 -2100 -1235 773 1088 942 -30 -438 -1061 -1185 212 2316
3481 2316 2288 -696 -2535 -1261 2064 2836 852 -874 -806 -91 309 667 1620 1020 -67 -1123 -1285 468
3499 468 2354 2056 -1056 -2734 -686 1615 1039 -658 -815 -588 -997 -1220 454 1261 70 -1874 -1457
3516 -1457 -911 167 838 944 -857 -2331 -1114 1492 1434 -564 -695 318 -50 -1191 -396 1584 790
3533 790 -1050 -842 -67 895 443 512 450 -719 -627 1860 2096 -877 -1424 1263 2302 -583 -1271 1190
$$ packed form
3412C194l077l182J035K322J111k81o12k80j187q95J026K986N96j846k710k11
3428b011K133K662j10k228k042O31J416N75P7J02m11j697p05J230K048P76k542
3445i6j792M47J891O90j72j277j252L25R95J072j68p10o23o69OP39J972k01k134
3464i57j625O48K730J037j102j662j169Q65K008L15j46r72m08o23j24J397K104
3481B316k8k984j839J274L325P72j984j726O8P15M00L58R53o00j087j056j62J753
3499D68J886k98l112j678K048K301n76j697j57K27m09k23J674Q07j191j944M17
3516a457N46J078O71J06j801j474J217K606n8j998j31J013l68j141P95J980p94
3533G90j840K08P75R62m52O9o2j169R2K487K36k973n47K687J039k885o88K461
$$ plain form
3551 1190 1569 -1479 -1551 1006 2645 -1 -1592 -603 100 194 641 840 -572 -1571 -743 877 -465 -646
3569 -646 1079 699 -2171 -3122 688 2738 172 -1833 -824 175 -1030 -919 1358 1273 -908 -1469 -521
3586 -521 214 -500 825 2215 197 -2171 -1044 1618 985 -363 501 1669 -132 -1663 -186 1982
3602 1982 1186 69 228 40 -619 -466 1569 1173 -723 -976 721 194 -1655 -204 2199 1324 -1940
3619 -1940 -1997 596 1098 -459 -985 27 210 -1050 -739 -248 -402 71 642 -517 -1961 -515 1103
3636 1103 115 -1517 -832 1538 671 -1632 -1338 818 1368 -206 -343 -122 276 -102 136 1042 857 706
3654 706 403 -534 -900 463 2585 1511 -497 -1189 36 668 689 1172 710 -270 -1161 -677 523 417
3672 417 906 867 -1055 -2330 -1014 1950 1981 -746 -2161 -850 -104 -538 -290 901 169 -1342 -1851 -347
$$ packed form
3551A190L79l048p2K557J639k646j591R89P03R4M47J99j412r99Q28J620j342j81
3569f46J725l80k870r51L810K050k566k005J009R99j205J11K277q5k181n61R48
3586e21P35p14J325J390k018k368J127K662o33j348Q64J168j801j531J477K168
3602A982p96j117J59j88o59J53K035l96j896k53J697n27j849J451K403q75l264
3619a940n7K593N02j557n26J012J83j260L11M91j54M73N71j159j444J446J618
3636A103r88j632O85K370q67k303K94K156N50j574j37K21L98l78K38R06j85j51
3654G06l03r37l66J363K122j074k008o92J225O32K1M83m62r80q91M84J200j06
3672D17M89l9j922j275J316K964L1k727j415J311P46m34K48J191p32j511n09J504
$$ plain form
3690 -347 339 1095 527 -1054 -2387 -493 1599 1558 -574 -1459 491 598 -419 -124 1965 1256 -1479
3707 -1479 -1600 708 1926 835 -272 -949 -831 136 1658 1604 -33 -1257 58 495 203 628 1255
3724 1255 387 -2027 -1834 903 2550 696 -1222 -1642 -854 -162 1322 1610 -129 -2278 -1785 83 636
3741 636 306 628 -156 -1917 -2696 -257 2663 1813 -1438 -2517 -905 676 1300 1059 -178 -1303 -1457
3758 -1457 -450 937 2207 1522 -20 -2374 -2225 901 3927 1987 -1563 -2481 -356 1497 1652 1388
3774 1388 426 -698 -2000 -542 1236 2523 1590 -1238 -2645 -1211 1403 2689 1159 -1504 -2149 -1245
3790 -1245 362 1011 1169 -52 -1883 -2719 -1210 1907 2500 540 -2026 -2656 -1418 1138 2409 875
3806 875 -1557 -2755 -1346 1161 1994 1096 16 -1550 -2214 -448 2193 3272 908 -2053 -2409 -161
$$ packed form
3690c47O86P56n68j581j333J894K092m1k132q85J950J07j017K95K089p09k735
3707a479j21K308J218j091j107o77J18R67J522n4j637j224J315M37k92M25O27
3724A255q68k414J93K737J647j854j918m20P88O92J484K88j739k149M93J868N53
3741F36l30L22p84j761p79K439K920q50l251j079J612J581O24k41j237j125j54
3758a457J007J387J270o85j542k354J49L126L026j940l550r18K125J853J55k64
3774A388r62j124j302J458J778J287r33k828j407J434K614J286j530k663o45R04
3790a245J607O49J58j221j831q36J509L117N93j960k566o30J238K556J271j534
3806H75k432j198J409K507Q33q98j080j566o64J766K641J079k364k961l56K248
$$ plain form
3822 -161 2695 3132 1346 -1672 -2195 -410 1864 2208 1478 121 -1421 -2224 -369 2722 3549 505 -3342
3839 -3342 -2827 471 2402 1836 129 -1791 -2197 -1138 629 2214 1614 -765 -2821 -2351 -106 2493
3855 2493 2641 -677 -3188 -2693 155 2164 1837 -112 -1749 -1869 -930 738 2604 1736 -876 -2992
3871 -2992 -1686 1423 2902 2047 76 -2238 -2222 589 3005 2476 -152 -1528 -1519 96 1767 2188 1857
3888 1857 -553 -2535 -1706 1316 3083 1491 -1323 -2514 -1326 608 2375 1431 -692 -1606 -1572 -530
3904 -530 548 1478 1230 -858 -3548 -2287 1422 3373 564 -2403 -2509 -281 504 705 1226 282 -1557
3921 -1557 -2508 -504 1856 2312 220 -1422 -2047 -836 1381 2523 928 -1394 -2109 445 1290 1346 1169
3938 1169 893 -772 -1674 -442 2513 2335 74 -1614 -1252 -254 957 1841 1266 -1180 -2388 -322 1389
$$ packed form
3822a61K856M37j786l018n23J785K274L44p30j357j542q03J855L091Q27l044l847
3839c342N15L298J931n66j707j920m06J059J767J585o00k379k056M70K245K599
3855B493J48l318k511M95K848K009l27j949j637j20R39J668J866q68k612k116
3871b992J306L109J479q55j971k314J6K811K416n29k628j376RJ615J671M21l31
3888A857k410j982Q29L022J767j592k814j191J188J934J767r44k123r14L4J042
3904e30J078R30k48k088k690J261L709J951k809k967j06K228P85K01N21r44j839
3921a557r51K004K360M56k092j642o25J211K217J142j595k322p15K554Q45N6j77
3938A169k76j665r02J232K955j78k261j688L62R98J211Q84n75k446j208K066J711
$$ plain form
3955 1389 899 -231 -547 -712 -1201 -1416 997 1986 -192 -2477 -1853 -66 1159 768 26 -962 -1754 -753
3973 -753 873 997 -127 -621 -460 -1030 -978 1143 2328 285 -2169 -1713 1191 1991 538 -354 -30 -10
3991 -10 -392 18 1652 1610 -56 -1122 -575 542 1162 1083 389 -1225 -1176 790 1615 859 -326 -595 -338
4010 -338 36 99 705 794 -403 -1152 -843 126 779 655 -250 -1199 -912 15 760 557 -736 -1248 -408 2
4030 2 -32 -296 570 343 -1032 -1395 -215 1521 987 -736 -1249 279 1153 597 -307 687 620 -96 -280 196
4050 196 1026 939 235 -348 -593 392 1246 605 -399 -187 320 727 -478 -1012 399 1156 -615 -1395 109
4069 109 557 -130 -979 -108 253 -341 -1028 125 170 -348 -416 340 71 -1227 -836 520 248 -1122 -739
4088 -739 693 284 -594 -370 472 132 128 151 -116 -106 -375 99 633 -274 279 1154 323 -977 -522 1441
$$ packed form
3955A389m90j130l16j65m89k15K413R89k178k285O24J787J225l91p42r88p92J001
3973g53J626J24j124m94J61n70N2K121J185k043k454M56K904Q00j453q92L24K0
3991a0l82M10J634m2j666j066N47J117O20p9o94j614M9J966Q25p56j185k69K57
4010c38L74O3O06Q9j197p49L09R69O53j24r05r49K87R27P45k03j293n12Q40M10
4030Bl4k64Q66k27j375l63J180J736n34j723n13J528Q74n56r04R94o7p16j84M76
4050A96Q30q7p04n83k45R85Q54o41j004K12N07M07j205n34J411P57j771p80J504
4069A09M48o87q49Q71L61n94o87J153M5n18o8P56k69j298L91J356k72j370L83
4088g39J432m09q78K24Q42l40mK3k67J0k69M74N34r07N53Q75q31j300M55J963
$$ plain form
4108 1441 1636 -51 -829 44 516 88 -45 1240 1141 -373 -1397 -908 140 1142 864 -198 -1704
4125 -1704 -1296 593 774 340 320 18 -1008 -1402 -412 1450 1251 -616 -1943 -1388 -103 714 1009 -262
4143 -262 -1087 -1476 -571 559 763 717 121 -936 -1272 11 1465 1277 -420 -936 -92 210 739 1685 263
4162 263 -1505 -737 977 1925 97 -699 392 -28 -719 -53 2276 1643 -1813 -2164 33 2269 1246
4179 1246 477 -10 -1583 -1705 789 2343 806 -1376 -1214 -1360 -1579 -14 2709 2068 -2533 -4478 -482
4196 -482 2888 1010 -392 -357 -1080 -2442 -1057 2778 3356 -414 -2695 -960 39 493 2093 2498 -866
4213 -866 -3656 -1107 3151 2395 -306 -592 -112 -974 -1162 1967 3779 221 -3137 -1406 1852 1470 699
4230 699 1729 -185 -3432 -2084 2653 3697 -70 -2920 -1099 -141 -697 255 2818 896 -3678 -3218
$$ packed form
4108A441J95j687p78Q73M72m28j33J285r9j514j024M89J048J002k78j062j506
4125a704M08J889J81m34k0l02j026l94R90J862j99j867j327N55J285Q17K95j271
4143b62q25l89R05J130K04m6n96j057l36J283J454j88j697n16Q44L02N29R46j422
4162B63j768P68J714R48j828p96J091m20o91O66K329o33l456l51K197K236j023
4179A246p69m87j573j22K494J554j537k182J62j46k19J565K723o41m601j945L996
4196d82L370j878j402L5p23j362J385L835N78l770k281J735R99M54J600M05l364
4213h66k790K549M258p56k701k86M80q62j88L129J812l558l358J731L258l82p71
4230F99J030j914l247J348M737J044l767k850J821R58n56R52K563j922m574M60
$$ plain form
4246 -3218 1071 2680 672 -602 -933 -2094 -1907 1394 3069 415 -2660 -1703 -153 210 338 1842
4262 1842 1022 -2885 -3226 1119 3980 1550 -1453 -1372 -207 -347 1180 2691 1379 -1951 -2635 -198
4278 -198 2119 2287 1183 -152 -2541 -2736 1172 3953 2038 -1030 -2412 -1322 -8 1383 2702 1259
4294 1259 -1907 -3540 -1033 1660 2154 1103 -656 -2500 -2656 -312 2906 2494 -927 -2608 -2177 -441
4310 -441 1121 1465 1028 -784 -2527 -1701 550 2459 1425 -410 -1879 -1689 738 2234 1353 -211
4326 -211 -1115 -724 397 1031 1441 1014 -787 -1698 -580 2253 2346 582 -1287 -2120 -606 1652 2191 1039
4344 1039 -1129 -2152 -1287 346 1673 1888 247 -2441 -2741 -617 2405 2494 236 -1868 -2360 -1312
4360 -1312 563 2497 1776 -489 -3164 -2254 43 1902 2036 483 -1738 -2766 -1028 1382 2655 1215
$$ packed form
4246c218M289J609k008j274l31j161J87L301J675k654l075R57J550L63J28J504
4262A842q20l907l41M345K861k430l003Q1J165j40J527J511j312l330o84K437
4278a98K317J68j104j335k389j95L908K781j915l068j382J090J314J391J319j443
4294A259l166j633K507K693M94j051j759j844j56K344L218m12l421j681M31J736
4310d41J562L44m37j812j743Q26K251J909j034j835j469J90K427J496q81j564
4326b11r04L91J121O34M10m27j801r11J118K833R3j764j869q33J514K258N39j152
4344A039k168j023Q65J633J327K15j641k688l00K124L022Q9k258k104m92J048
4360a312J875J934p21k265k675R10K297J859J34j553k221j028J738K410J273j440
$$ plain form
4376 1215 -1355 -2321 -1263 671 2111 1572 20 -1593 -1051 -27 1255 1888 1178 -1232 -1849 -587
4392 -587 1835 2088 353 -1426 -1468 -97 1381 1128 557 -520 -1463 -1453 241 1837 1729 -89 -2278
4409 -2278 -1893 127 1423 1483 -154 -1941 -1749 -273 893 930 681 -849 -2045 -1930 300 2010 1730
4426 1730 -889 -1971 -1595 136 1559 1603 259 -1257 -1442 -797 1220 1630 794 -815 -1159 -483 532
4443 532 1532 1622 127 -1647 -1365 815 1826 1312 -120 -915 -993 -354 721 1087 383 -551 -1511 -784
4461 -784 297 1155 1368 -381 -1693 -1044 459 1333 518 -699 -989 -511 -713 9 668 601 -595 -1763
4479 -1763 -897 559 1211 24 -458 -1190 -408 578 694 539 150 -245 -643 -553 712 1301 330 -530 -717
4498 -717 78 548 762 670 -45 -484 -428 543 1059 862 136 -276 -448 -92 300 763 634 -268 -583 -59 162
$$ packed form
4376A215k570r66J058J934J440n39j552j613N42J024J282O33p10k410o17J262
4392e87K422K53j735j779m2J371J478k53n71j077r43J0J694J596j08j818k189
4409b278L85K020J296O0j637j787J92J476J166L7k49j530j196J15K230J710k80
4426A730k619j082L76J731J423M4j344j516j85O45K017M10q36j609l44O76J015
4443E32J000R0j495j774K82K180J011n14j432p95p8O39J075L66p04r34r60P27
4461g84J081Q58K13j749j312O49J503Q74q15j217k90M78k02P22O59o7j196j168
4479a763Q66J456O52j187m82p32P82R86J16j55l89l95l98R0J265N89r71q60j87
4498g17P95M70K14r2p15m39N6R71N16j97p26m12j72L56L92M63j29r02l15N24K21
$$ plain form
4519 162 474 666 62 -883 -1141 113 577 -144 -354 -78 -446 -900 -547 854 1247 -695 -1392 -601 545
4538 545 423 -169 202 -54 -551 -543 516 471 662 169 -344 -513 -32 765 1175 336 -682 -208 840 422
4558 422 417 457 579 -511 -802 -99 1382 499 -336 -152 -349 -157 96 649 134 -822 -986 -362 590 339
4578 339 298 -230 -395 -961 -737 450 842 -636 -959 -868 -80 101 477 500 -503 -695 -720 479 109 165
4598 165 304 124 -798 -602 927 1426 148 -1297 -588 376 868 477 539 125 -542 -998 46 1410 1199
4617 1199 8 -909 -732 190 1005 1008 351 -857 -1095 -185 289 351 506 75 -764 -1333 -46 921 883 -307
4637 -307 -1089 -732 -817 754 416 212 -815 -1336 -748 348 1047 704 -513 -1227 -1166 -196 771 912 -118
4656 -118 -1011 -1075 -210 769 1293 683 -548 -1051 -632 474 1383 800 498 -725 -1445 215 1330 1247 225
$$ packed form
4519A62L12J92o04r45k58J254M64p21k10K76l68m54L53J401L93j942o97P91J146
4538E45j22n92L71k56m97QJ059m5J91m93n13j69M81P97M10q39j018M74J048m18
4558D22nM0J22j090k91P03J481q83q35J84j97J92K53N53n15r56j64O24R52k51
4578C39m1n28j65n66K24J187L92j478l23R1P88J81L76K3j003j92k5J199l70N6
4598A65J39j80r22J96J529M99j278j445P09R64M92l91O2m14o67m56J044J364k11
4617A199j191r17J77R22Q15Lo57j208k38R10M74O2J55m31q39n69J287R67l8j190
4637c07p82L57q5J571l38k04j027n21N88J096O99l43j217p14O1R70R67J41j030
4656a18q93o4Q65R79N24o10j231n03M19J106R09n83l02j223p20J660J115q3j022
$$ plain form
4675 225 -1238 -1134 -129 901 1352 577 -746 -1220 -830 317 1260 717 -36 -973 -1885 -353 1571 1391
4693 1391 -544 -1757 -1305 -501 575 1086 831 -737 -1639 -1126 652 1374 532 -543 -1625 -1216 -698
4710 -698 1674 2044 -135 -1814 -1380 -230 667 852 1086 -73 -1980 -1194 1354 2530 1203 -461 -1263
4727 -1263 -861 63 1579 2404 501 -2114 -1697 309 1356 1033 672 -466 -1620 -1580 678 2729 1190
4744 1190 -1358 -2094 -944 393 999 1355 56 -2127 -2275 -7 1469 1194 -119 -800 -1774 -1775 388
4761 388 2564 1406 -1392 -2446 -1015 1016 1306 1028 270 -840 -1921 -689 1941 2405 793 -1394
4777 -1394 -1762 -280 799 1944 1424 -569 -1856 -1094 1247 2172 968 -140 -991 -1130 -401 1639 2249
4794 2249 179 -1637 -1789 73 1262 1308 450 -946 -1971 -1139 942 2066 739 -1312 -1616 -1131 64
$$ packed form
4675B25j463J04J005J030M51p75j323m74L90J147R43n43p53r37r12J532J924j80
4693A391j935j213M52Q04J076N11k55j568r02N13J778P22q42j075j082M09N18
4710f98K372L70k179j679M34J150Q97J85K34j159j907P86K548J176j327j664q02
4727a263M02R24J516Q25j903k615M17K006J047l23l61j138j154M0K258K051j539
4744A190k548p36J150J337O06L56j299k183j48K268J476k75j313o81r74jK163
4761C88K176j158k798j054J431K031K90k78p58j110j081J232K630M64j612k187
4777a394l68J482J079J145n20j993j287P62K341R25j204j108q51j39P29K040O10
4794B249k070j816j52J862J189M6q58j396j025Q32K081J124j327k051l04M85J195
$$ plain form
4811 64 1228 1510 261 -2148 -2271 -74 2262 1702 223 -1612 -1841 -633 1120 1866 1124 -935 -1849
4828 -1849 -1110 164 1535 1949 744 -1618 -2100 -410 2051 1768 40 -515 -878 -426 174 1665 1432
4845 1432 202 -1619 -1215 428 1573 1016 -45 -578 -1165 -16 989 901 -405 -1114 -846 104 165 973
4863 973 395 -526 -1866 -920 828 1276 365 -1024 -1623 -1009 531 1211 958 -640 -1704 -920 232 1052
4881 1052 1348 434 -396 -1531 -617 526 1996 1260 -670 -1264 -989 766 1554 1368 315 -612 -569 -323
4899 -323 325 799 1418 2 -989 -509 775 1111 648 -210 -282 -599 -188 730 720 32 -750 -194 -135 -77 296
4920 296 362 -515 -1175 -295 395 504 -445 -863 -52 -469 -539 666 1089 -271 -1562 -430 804 777 68
4939 68 283 123 -960 -1068 1142 1779 290 -619 -364 54 -103 238 1080 309 -722 -425 314 720 -237
$$ packed form
4811F4J164K82j249k409j23K197K336n60j479j835k29J208J753P46p42k059r14
4828a849P39J274J371M14j205k362m82J690K461k83j728n55l63M52O00J491k33
4845A432j230j821M04J643J145n57j061n33n87J149J005q8j306p09K68R50O1Q08
4863I73n78r21j340R46J748M48r11j389n99O14J540O80k53j598j064P84J152Q20
4881A052K96r14q30j135R14J143J470p36j930n94K75J755P88j86j053r27M3K46
4899c23O48M74O19j416r91M80J284L36m63q58p2l17M11R18j0o88p82N56N9N8L73
4920B96O6q77o60Q80O90J09r49m18Q11m17p0J205M23j360j291J132J234k7p09
4939F8K15j60j083j08K210O37j489r09K55M18j57L41Q42p71j031K97P39M06r57
$$ plain form
4958 -237 333 857 -360 -952 432 1119 209 -1207 -446 741 327 -805 220 849 -314 -1198 -195
4975 -195 1067 169 -1153 -404 146 -227 141 571 393 -1180 -1116 17 200 -164 457 629 -272 -1453 -564
4994 -564 1141 768 -478 -420 178 69 -349 440 1304 208 -662 -472 424 278 405 863 518 -896 -456
5013 -456 242 644 330 -360 26 -16 -433 -305 541 18 -145 -147 -247 -300 -10 201 -246 -454 -428 307 -199 -715
5035 -715 -412 301 202 -476 -713 62 284 -507 -495 194 178 7 -145 -333 -564 428 379 -21 -535 -93 381
5056 381 -34 -181 -37 1152 772 -649 -1017 284 521 453 325 620 -344 -684 -94 547 643 366 63 -401
5076 -401 -924 -368 983 1336 -277 -1059 -787 -152 491 433 403 -655 -1244 -659 284 523 170 -59 -546 -1110
5096 -1110 -1223 639 981 -332 -1185 -769 456 308 34 103 305 -453 -721 98 954 612 -287 -661 -395
$$ packed form
4958b37N70N24j217n92J384O87r10j416P61J187m14j132J025O29j163q84J003
4975a95J262q98j322P49N50l73L68M30j78j573O4J133J83l64O21J72r01j181Q89
4994e64J705l73j246N8N98j09m18P89Q64j096q70J90Q96j46J27M58l45j414M40
5013d56O98M02l14o90L86m2m17J28Q46n23j63kj00n3K90K11m47k08K6P35n06n16
5035g15L03P13r9o78k37P75K22p91J2O89j6j71j52j88k31R92m9m00n14M42M74
5056C81m15j47J44J189l80j421l68J301K37o8j28K95r64l40N90O41R6k77l03m64
5076d01n23N56J351L53j613p82K72O35O43n8l0j058n89N85R43K39l53k29m87n64
5096a110j13J862L42j313q53M16J225j48k74O9K02p58k68Q19Q56l42q99l74K66
$$ plain form
5115 -395 92 857 1123 -141 -1361 -514 837 832 439 80 -20 -993 -646 441 1684 700 -886 -1396 -576
5134 -576 715 1049 522 -741 -1459 -1133 185 923 602 -398 -641 -1221 -841 128 1236 826 -824 -1417
5152 -1417 -724 542 861 811 -692 -1217 -1069 243 1068 566 115 -627 -865 -306 912 1487 753 -688
5170 -688 -1341 -250 847 1583 624 -386 -941 -766 799 1022 869 65 -874 -1211 -258 1271 1434 751
5188 751 -1210 -935 -258 866 1192 437 -839 -1045 -1021 432 837 847 -176 -1216 -1104 63 898 1262
5206 1262 419 -1524 -1150 -283 1014 886 129 -519 -988 -946 323 1059 826 -165 -1146 -867 313 891 1066
5225 1066 405 -1072 -1156 -50 1236 1165 312 -379 -591 26 472 763 1236 161 -991 -827 319 1194
5243 1194 1260 276 -1068 -625 -121 680 812 -35 -544 -974 -781 -45 824 395 -249 -1320 -1092 -100 1231
$$ packed form
5115c95M87P65K66j264j220Q47J351nl93l59j00r73L47J087J243r84j586n10Q20
5134e76J291L34n27j263p18L26J318P38l21j000k43n80L80R69J108m10j650n93
5152a417O93J266L19n0j503n25J48J312Q25n02m51p42k38N59J218N75p34j441
5170f88o53J091J097P36r59j010n55J75J565K23j53q04r39l37R53J529J63o83
5188G51j961K75O77J124L26p55j276k06K4J453M05J0j023j040J12J167Q35L64
5206A262q43j943L74Q67J297j28p57o48m69M2J269P36k33r91r81K79J180N78J75
5225A066o61j477q4J106J286p1q53o91k12O17M46K91M73j075j152J64J146Q75
5243A194O6r84j344M43N04Q01J32q47n09m30J93P36Q69m29o44j071K28R92J331
$$ plain form
5262 1231 914 -275 -970 -605 143 119 570 285 -396 -640 -976 26 729 716 -403 -1085 -876 423 1097
5281 1097 962 -277 -609 -524 158 647 1103 611 171 -651 -498 574 1168 966 -52 -662 -774 15 701
5300 701 945 -64 -768 -999 93 430 399 273 -306 -835 -900 -84 1148 917 -672 -1188 -600 407 641
5319 641 417 39 -453 -283 -352 133 699 170 -119 -1045 -265 183 906 679 -783 -1080 -209 568 416 113
5339 113 173 276 -520 -327 390 1092 911 -557 -789 -177 361 635 639 20 -774 -658 533 901 419 -144
5359 -144 -466 -615 -273 -229 1034 575 -373 -1104 -480 655 691 -112 -627 -743 -235 189 318 418 -466 -647
5379 -647 -192 -443 -155 444 373 -448 -1293 -229 1011 721 -534 -800 -486 184 -72 -4 406 389 -474 -405
5399 -405 -120 612 514 119 -23 -686 -383 755 965 101 -640 107 423 -361 -45 547 411 -536 -847 -17
$$ packed form
5262A231l17j189o95L65P48k4M51k85o81k44l36J002P03j3j119o82K09J299O74
5281A097j35j239l32Q5O82M89M56m92m40q22J53J072N94k02j018o10j12P89O86
5300G01K44j009p04k31J092L37l1j26n79n29o5Q16J232k31j589n16N88J007K34
5319F41k24l78m92J70o9M85N66n29k89r26P80M48P23k27j462k97Q71P77j52l03
5339A13O0J03p96J93P17P02j81j468k32O12N38K74Mo19p94J16J191L68m82n63
5359a44l22j49L42M4J263m59r48p31O24J135L6q03n15j16N08M24J29J00q84j81
5379f47M55k51K88N99p1q21q45J064J240k90j255k66L14O70k56O8M10j7q63O9
5399d05K85P32r8l95j42o63L03J138K10q64p41P47L16p84L16N92j36r47l11Q30
$$ plain form
5419 -17 852 387 -436 -510 -177 -338 158 473 141 -136 -601 36 174 -328 -197 332 -20 -621 -439 465 787
5440 787 -263 -537 -394 362 93 107 215 258 -234 -377 553 276 -127 443 248 -297 -512 514 1205 109
5460 109 -906 -399 565 288 -64 215 827 -66 -931 -164 952 674 246 -246 -69 -403 -381 439 752 -215
5480 -215 -579 15 43 -318 7 352 153 -734 -806 350 309 -314 -304 -134 -161 -25 497 366 -415 -675 71
5501 71 -4 278 -221 272 262 -392 -424 574 1097 268 -710 -30 369 496 239 220 -352 -357 114 422 615 114
5523 114 347 -78 -723 -430 916 979 -10 -771 -142 -100 162 557 249 84 -406 -1012 -55 549 229 406
5543 406 -633 -923 -520 505 746 -110 -644 18 82 -456 -139 274 437 -289 -284 134 366 211 -193 -22
5563 -22 -297 -155 523 615 2 -330 10 458 462 -547 357 574 -217 -554 -60 758 411 -332 -249 -228 -57 421
$$ packed form
5419a7Q69m65q23p4L33j61M96L15l32k77m65O37J38n02J31N29l52o01J82R04L22
5440G87j050k74J43P56k69J4J08M3m92j43R30k77m03N70j95n45k15J026O91j096
5460A09j015N07R64k77l52K79O12q93q65P67J116k78m28m92J77l34K2Q20L13r67
5480b15l64N94K8l61L25L45j99q87p2J156m1o23J0J70k7J36N22j31p81k60P46
5501G1p5K82m99M93j0o54l2R98N23q29r78O80L99J27k57j9n72nM71L08J93n01
5523A14K33m25o45K93J346O3r89p61O29M2K62L95l08j65m90o06R57O04l20J77
5543D06j039k90M03J025K41q56n34O62O4n38L17M13J63p26NM18K32j55m04J71
5563b2k75J42O78R2o13l32L40M48Mj009R04K17p91l37M94Q18l47p43Q3K1J71M78
$$ plain form
5585 421 777 -97 -653 117 277 -49 -250 -125 255 -500 -1226 -125 1407 390 -627 -1040 -185 177 -247
5604 -247 129 263 -293 -485 -229 337 -57 82 543 302 -548 -80 807 838 -193 -667 75 504 29 29 335
5625 335 585 -248 -191 539 559 180 85 158 -441 -239 446 690 -211 -694 -34 268 261 -32 -69 407 -93 -725
5647 -725 -333 510 348 -173 -491 -652 -371 388 443 50 -722 -326 79 -45 -305 89 910 -167 -1307 -634
5667 -634 1052 684 -135 -514 -231 441 -118 -177 237 264 -19 194 233 172 302 305 218 -278 82 685 746 -223
5689 -223 -809 -70 430 370 -25 -173 -159 -41 -220 508 697 76 -434 -608 -649 311 450 666 39 -1012 -597
5710 -597 93 582 420 13 -44 -266 -746 -62 848 1069 -11 -910 -7 329 582 635 -60 -378 -655 298
5730 298 372 314 114 323 -99 -384 -352 520 954 -27 -791 -107 525 426 -529 -174 -239 -102 196 40 16 16 -110
$$ packed form
5585D21L56q74n56P70J60l26k01J25L80p55p26J101J532j017j017m13Q55L62m24
5604b47L76J34n56j92K56N66l94J39M61k41q50M68Q87L1j031m74P42M29m75%L06
5625C35K50q33N7P30K0l79r5P3n99K02O85K44r01m83O60L02pk93l7M76n00o32
5647g25L92Q43j62n21l18j61K81P59N5l93p72L96M05j24k60L94Q21j077j140O73
5667f34J686l68q19l79K83O72n59n9M14K7k83K13L9o1J30Lq7m96L60O03O1r69
5689b23n86P39N00o0l95j48J4J18j79P28J89o21n10j74m1R60J39K16o27j051M15
5710e97O90M89j62m07n7k22m80O84R10K21j080q99R03L36K53N3o95l18k77R53
5730B98P4n8k00K09m22k85L2Q72M34r81p64O84O32r9r55L55o5J37K98j56k4%j26
$$ plain form
5753 -110 83 -167 89 583 203 -391 -668 -142 643 26 3 -290 -445 -169 266 280 181 -48 -330 -235 -299 329
5775 329 197 -40 -429 -1005 -169 599 502 -266 -358 -234 -240 25 142 536 138 -114 -343 33 237 634 503
5796 503 -180 -269 97 700 527 -32 -214 -114 -58 -752 -86 235 301 -176 -442 -116 209 51 -21 -312 -6
5817 -6 -8 335 -298 -303 246 -39 -263 -274 129 -88 -106 -237 -412 93 206 84 -110 -279 -131 136 -119 163 -445
5840 -445 -25 42 24 32 33 384 225 -221 -113 187 362 84 -132 183 63 300 156 -78 -219 -119 -140 46
5862 46 -100 240 617 372 -397 -637 189 347 -75 -281 1 206 -156 1 138 175 -25 -181 -76 -213 9
5883 9 243 34 -347 -232 112 179 -127 -268 -110 431 117 -313 213 319 -81 -14 -106 -18 101 397 166 -139
5905 -139 115 91 512 193 -84 356 285 -98 43 201 321 253 -52 -257 20 232 161 231 -117 -227 282 150
$$ packed form
5753a10J93k50K56M94l80n94k77N26P85o17k3k93j55K76M35J4r9k29k82R5o4O28
5775C29j32k37l89n76Q36P68r7p68r2J24oK65J17L94l98k52k29L76K04L97j31
5796E03o83q9L66O03j73n59j82J00N6o94O66L21O6m77k66L26L25j58p2k91L06
5817fkL43o33nN49k85k24j1M03k17j8j31j75N05J13j22j94j69J48K67k55K82o08
5840d45M20O7j8QJL51j59m46J08L00J75k78k16L15j20K37j44k34j41J00k1J86
5862D6j46L40L77k45p69k40Q26J58m22k06K82K05l62J57J37L7k00j56J05j37K22
5883IK34k09l81J15L44O7l06j41J58N41l14m30N26J06m00O7r2Q8J19K96k31l05
5905a39K54k4M21l19k77M40p1l83J41J58J20o8l05k05K77K12p1P0l48j10N09j32
$$ plain form
5927 150 -87 -318 -249 254 -279 -515 -303 130 97 -794 -417 121 549 -93 -539 -600 16 -253 -116 -149 -54 49
5949 49 180 -27 -96 62 297 -135 -383 20 496 454 -186 -251 383 379 -16 -155 -65 404 -105 -441 -200 298
5971 298 57 123 -156 -20 -284 -211 336 58 -68 199 113 153 -230 -409 -142 210 -74 -419 -333 -228 103 -103
5993 -103 -312 -352 203 27 -411 -453 -80 213 151 -204 73 542 222 -439 21 110 380 224 -375 -79 203
6014 203 157 -212 182 521 262 168 71 -135 156 445 67 -117 -385 -6 366 -90 -274 -53 86 219 -356
6035 -356 -45 321 -380 -723 -240 154 250 142 36 -350 -438 -90 179 280 -97 -320 -65 -92 -108 191 72
6056 72 42 -390 -252 170 487 284 -86 -304 94 367 194 313 -189 -28 309 151 -1 199 426 174 -285
6077 -285 -265 329 757 357 -196 -611 78 393 262 30 -145 26 -136 -74 286 171 256 -276 -441 -240 63
$$ packed form
5927A50k37k31O9N03n33k36K12M33l3q91L77N38M28o42m46o1O16k69J37l3R5J03
5949D9J31k07o9J58K35m32k48M03M76m2o40o5O34ml95j39R0M69n09l36K41M98
5971B98k41O6k79J36k64P3N47k78j26K67q6M0l83j79K67L52k84l45Q6J05L31k06
5993a03k09m0N55j76m38m2L73K93o2l55K77M69l20o61M60Q9K70j56n99K96K82
6014B03m6l69L94L39k59r4r7k06K91K89l78j84k68L79L72m56j84K21J39J33n75
6035c56L11L66p01l43M83L94R6j08j06l86q8L48K69J01l77k23K55k7j6K99j19
6056G2l0m32J38M22L17k03l70k18L98K73j73J19n02J61L37j58j52K00K27k52m59
6077b85K0N94M28m00n53m15O89L15j31k32j75J71j62O2L60j15Q5n32j65K01L03
$$ plain form
6098 63 353 151 -579 -260 11 -139 248 145 -8 -66 -378 -141 168 45 -254 -221 -547 -191 319 509 -141
6119 -141 -317 -365 116 127 318 27 -92 20 75 -135 130 -29 285 -244 -420 361 518 706 -11 -262 52
6140 52 197 210 -59 -217 -85 -267 -221 -219 -261 477 -75 -138 -621 -44 584 355 -158 -253 97 64 -63 -7 26 -370
6164 -370 -341 -629 -234 353 348 -222 -270 -379 216 369 -320 5 36 93 -4 -45 168 187 178 -12 -129 -55 293 468
6188 468 -10 -209 -249 60 -12 490 -196 275 60 175 289 -102 -222 -115 -147 -425 -108 232 448 -62 -617
6209 -617 97 395 -20 -249 -745 71 559 -162 -47 -64 81 172 -273 -116 148 336 54 -348 -573 15 467
6230 467 94 138 -288 -94 376 -163 -152 204 278 -19 -359 -44 140 170 93 112 -161 -197 27 157 206 22 -31
6253 -31 -2 28 -91 333 263 -66 48 166 -185 -164 -34 168 -382 -186 -212 -332 -55 -50 317 16 -173 -235 -116
$$ packed form
6098F3K90k02p30L19K71j50L87j03j53n8l12K37L09j23k99L3l26L56N10J90o50
6119a41j76m8M81J1J91k91j19J12N5k10K65j59L14n29j76P81J57J88p17k51L14
6140E2J45J3k69j58J32j82M6Km2P38n52o3m83N77O28k29n13r5L50l3j27N6L3l96
6164c70K9k88L95N87nn70m8j09N95J53o89L25L1N7r7m1K13J9rj90j17P4L48J75
6188D68m78j99m0L09p2N02o86M71k15J15J14l91j20J07l2k78L17L40K16n10n55
6209f17P14K98m15k29m96Q16M88p21J15j7J45R1m45J57K64J88k82m02k25N88M52
6230D67l73M4m26J94M70n39J1L56P4k97l40L15J84L0p7J9k73l6K24J30M9j84n3
6253c1K9L0j19M24p0l29J14J18l51K1J30K02n50J96k6j20K77NL67l01j89o2J19
$$ plain form
6276 -116 66 15 -280 149 -112 232 -52 -414 -390 152 201 -12 -41 17 311 -236 -164 181 419 199 -426 -408
6298 -408 402 406 -219 236 -4 8 -316 485 215 58 207 204 -43 -415 230 333 292 -191 144 244 134 -229
6320 -229 71 520 -281 -362 -102 460 86 -223 -54 41 -330 -323 288 100 -300 -426 219 113 -355 -328 640 347
6342 347 -312 -405 380 334 -37 165 143 -189 67 114 336 -88 -326 573 378 -277 -65 657 366 -205 -690
6363 -690 351 646 77 -518 185 346 18 -103 292 79 38 109 73 -286 -444 173 287 -322 -429 382 769
6384 769 -306 -737 -1 507 -253 -356 262 29 -489 -484 125 157 -90 -57 77 -308 -222 -116 440 183 -664
6405 -664 81 207 345 -124 112 105 -297 -496 75 600 534 284 263 44 -434 250 1023 238 -597 -352 224
6426 224 210 -91 116 534 142 -622 -269 256 126 55 -251 -9 -134 -90 244 -41 -434 162 483 -178 -389
$$ packed form
6276a16J82n1k95M29k61L44k84l62K4N42M9k13k9N8K94n47P2L45K38k20o25J8
6298d08Q10Mo25M55k40J2l24Q01k70j57J49lk47l72O45J03m1m83L35J00j10l63
6320b29L00M49q01q1K60N62l74l09J69R5l71PO11j88m00j26O45j06m68K7R68k93
6342C47o59r3P85m6l71K02k2l32K56M7K22m24k38Q99j95o55K12P22k91n71m85
6363f90J041K95n69n95P03J61l28j21L95k13m1P1l6l59j58O17J14o09j07Q11L87
6384G69j075m31P36N08p60j03O18k33n18NO09L2k47L3J34l85Q6J06N56k57q47
6405f64P45J26J38m69K36pm02j99N71N25o6k50k1k19m78O84P73p85q35K45N76
6426B24j4l01K07M18l92p64L53N25j30p1l06K42j25M4L34k85l93N96L21o61k11
$$ plain form
6447 -389 -536 259 -56 -280 -173 367 359 -426 -213 202 140 -194 164 68 -554 -315 235 434 -342 -217 104
6468 104 -100 -61 14 384 333 299 -493 111 96 412 97 3 -241 -340 376 52 -122 -169 311 -240 -107 -224 619
6491 619 691 -67 -786 -259 39 211 55 -74 -148 -34 -144 -68 288 -134 -126 -44 -216 -77 269 242 -59 -523
6513 -523 -57 211 36 -369 -75 7 55 -135 170 414 24 -141 -28 321 312 166 218 -257 -170 190 492 265
6535 265 299 35 59 -117 54 410 131 -135 -652 -153 -90 314 431 166 -396 -409 -134 206 451 -90 -446
6556 -446 -84 -79 -22 154 116 90 -287 -575 94 168 311 52 -264 -193 308 148 317 -74 -48 99 92 -44 345
6579 345 396 96 -341 -125 573 225 55 15 165 116 28 212 73 -55 16 -371 -137 -130 236 174 95 -268 75
6602 75 185 230 202 -136 340 -139 120 64 41 -156 141 -273 -110 50 130 4 -119 -425 -295 480 255 -8
$$ packed form
6447c89j47P95l15k24J07N40qp85K13M15o2l34L58r6o22K39N50J99p76J25L21
6468A04k04L9P5L70n1l4p92O04j5L16l15r4k44r9P16l24j74m7M80n51J33j17Q43
6491F19P2p58p19N27K98J72j56j29p4J14j10P6L56m22QQ2j72J39L46k7l01m64
6513e23M66K68j75m05K94Q2M8j90L05K44l90j65J13L49rj46N2m75Q7L60L02k27
6535B65L4k64K4j76J71L56k79k66n17M99O3M04J17k65n62j3K75L40K45n41l56
6556d46L62NN7J76l8k6l77k88O69P4J43k59l16P1N01j60J69l91K6J47pj36L89
6579C45N1l00m37K16O98l48j70m0J50m9q8J84j39j28P1l87K34PL66o2p9l63L43
6602G5J10M5k8l38M76m79K59n6k3j97K97m14J63J60Q0j26j23l06J30P75k25k63
$$ plain form
6624 -8 -63 -358 95 250 7 100 117 -374 -159 141 113 300 88 -126 -66 -432 178 -93 -101 -272 220 118 137
6647 137 -293 42 334 86 -275 -315 151 -113 160 -441 -183 62 -136 -28 -103 -203 -153 134 -304 -74 -177
6668 -177 263 71 -196 -300 284 271 169 -207 -163 353 39 -254 -174 -24 -125 512 70 -372 7 201 155
6689 155 -122 -205 17 310 260 -295 -186 29 348 -156 -372 23 453 -216 -231 398 47 441 -196 -302 -33
6710 -33 226 157 -303 20 -82 247 -15 -129 -250 87 -177 -280 -441 -22 87 -123 -375 157 62 -104 -316
6731 -316 -469 13 173 42 -237 -107 -165 120 -4 86 -7 465 136 -24 183 -105 72 334 52 -65 -48
6752 -48 562 183 -211 -166 -4 142 -41 -100 298 124 215 -253 67 -155 -65 230 -180 -98 -240 181 215 51
6774 51 -441 161 21 206 -164 -94 244 167 -93 -225 284 124 -165 -84 -261 -33 78 -41 -21 4 63 90 -8
$$ packed form
6624hn5k95M53J55k43R3J7m91K15L00k8J87k12k14O0l66O10k71qj71M92j02J9
6647A37m30L35K92k48l61m0M66k64K73o01K58K45j98J08p5j00N0K87m38K30j03
6668a77M40j92k67j04N84j3j02l76M4N16l14k93Q0J50j01O37m42m42L79J94m6
6689A55k77q3K22K93n0n55J09K15L19n04k16L95M30o69j5O29l51L94o37j06K69
6710c3K59o9m60L23j02L29k62j14j21L37k64j03j61M19J09k10k52N32r5j66k12
6731c16j53M82J60j31k79J30n8K85j24R0r3M72l29j60K07k88J77K62k82j17J7
6752d8O10l79l94M5J62J46j83n9L98j74R1m68L20k22R0K95m10Q2j42M21L4j64
6774E1m92O02j40J85l70P0L38p7k60j32N09j60k89Q1j77K28J11j19K0K5N9K7r8
$$ plain form
6797 -8 118 -185 -211 138 76 18 291 -108 -208 -472 -185 109 93 -159 -105 134 10 -174 -31 462 311 9
6819 9 -142 394 -165 -261 100 25 -354 -322 274 184 -370 -868 -134 174 22 -159 -151 357 -242 -304 -60 41 -434
6842 -434 -321 73 244 -86 -136 259 -434 -342 55 217 144 -235 -40 490 86 -388 243 259 66 -483 -251
6863 -251 658 173 50 74 171 -153 58 58 -116 -125 -214 233 -242 -163 -159 393 -138 -589 -222 94 187 -141 75 48
6887 48 -94 10 -81 240 -65 -215 -106 -257 -89 -463 256 37 -428 -382 18 128 -238 -319 209 -89 172
6908 172 -248 159 -150 119 169 159 -77 -28 305 56 -651 -226 382 461 -106 -583 66 438 233 63 -26 112
6930 112 -34 -396 19 438 95 -80 -61 -177 -185 265 161 28 -252 -367 34 -58 -9 389 316 -70 -236 -28
6952 -28 228 392 71 134 -404 -504 -88 140 -220 -151 -27 -75 -123 -321 305 405 139 -332 54 -74 -135 -8
$$ packed form
6797hJ26l03k6L49o2n8K73l99j00k64K87K94j6k52N4K39j24j84J43M93j51l02
6819Ij51N36n59r6L61p5l79L2N96r0n54m98P34L08j52j81QN08n99o2K44J01m75
6842d34J13L94J71l30n0L95o93R2L97J62p3l79J95N30m04m74O31J6j93n49K32
6863b51R09m85j23K4R7l24K11%j74rq9M47m75P9MN52n31m51L67L16R3l28K16k7
6887D8j42J04r1L21l05j50J09j51J68l74P19k19m65M6M00J10l66q1N28k98K61
6908A72m20M07l09K69N0j0k36M9L33k49p07M25O08P9n67m77O49L72k05j70q9J38
6930A12j46l62M15M19l43j75J9j16qM50j04j33k80j15M01r2M9L98p3l86j66K08
6952b8K56J64l21O3n38j00M16K28l60O9J24m8m8j98O26J00k66m71L86j28o1J27
$$ plain form
6974 -8 129 -6 -44 382 418 -307 -376 370 382 -149 -376 42 483 -21 -452 237 541 148 -483 -279 111 57
6996 57 278 91 -180 -481 -90 399 -172 -230 204 1 -457 -664 206 630 114 -273 -342 -144 -442 180 339
7017 339 362 -356 -138 20 179 -99 365 257 -167 -326 45 497 467 108 -319 -205 64 -337 265 423 192
7038 192 -144 -57 89 68 -196 167 19 -530 123 329 156 -315 -530 259 34 -299 -52 55 -244 -388 -339
7059 -339 292 322 -179 -355 219 103 -19 392 46 -34 -536 -151 81 -111 -53 62 66 -534 -147 299 319 -64
7081 -64 -131 -380 88 427 174 -103 -47 -295 -75 443 70 266 -224 -31 -113 -33 192 264 -138 -250 -421 186
7103 186 271 339 121 -89 -203 -236 221 81 167 -103 -127 -479 -67 224 347 -217 -543 -371 -193 224 248 -112
7125 -112 -101 64 21 -95 -76 302 52 -103 -403 375 86 -78 -84 -128 304 307 78 127 56 129 250 385 -173 59
$$ packed form
6974hJ37j35l8M26L6p25o9P46J2n31k27M18M41n04m31O89L04l93o31K04L90n4
6996E7K21j87k71l01L91M89n71n8M34k03m58k07Q70M24n16l87o9J98k98O22J59
7017C39K3p18K18J58J59k78M64j08m24j59L71M52l0l59m27J14K69m01O02J58k31
7038A92l36Q7J46k1k64L63j48n49O53K06j73m71k15P89k25l33K47J07k99j44M9
7059c39O31L0n01j76N74j16j22M11l46q0n02L85K32j92N8J15Mo00L87M46K0l83
7081f4o7k49M68L39k53k77N6k48K20N18l73J96m90J93q2Q0K25P2m02j12j71O07
7103A86Q5O8k18k10j14l3M57j40Q6k70k4l52M12K91J23n64l26J72J78M17K4l60
7125a12J1J65m3j16J9L78k50j55l00P78k89j64om4M32Lk29M9p1P3J21J35n58K32
$$ plain form
7149 59 193 -226 -475 57 341 153 18 -551 91 509 315 89 45 -337 -137 101 121 -132 106 257 -257
7170 -257 -404 -368 250 345 -71 -759 -7 223 225 -283 103 -41 117 -169 259 49 -134 133 185 -24 -432 -75
7192 -75 127 -38 -260 35 305 -57 -528 -73 -53 146 65 195 111 -29 62 447 537 130 16 228 -359 -211
7214 -211 160 727 234 -592 -465 35 273 -145 -70 -36 -298 -400 7 355 127 180 -200 -222 -538 189 263 -21
7236 -21 -222 -338 238 376 95 -220 214 285 -335 -6 318 339 47 50 174 -229 -24 10 137 -199 -104 324
7258 324 370 300 156 -96 225 198 -233 -8 459 -78 -375 164 233 416 280 20 -311 -434 -213 212 142 -328
7280 -328 -94 -397 96 -550 93 197 -203 -625 -150 -302 307 152 -136 -151 -305 224 363 201 -22 -90 -279
7301 -279 60 222 439 168 339 44 -77 121 335 -41 118 -146 -232 9 291 239 94 -180 9 174 -67
$$ packed form
7149E9J34m19k49N32K84j88j35n69O42M18j94k26m4l82K00K38K0k53K38J51n14
7170b57j47L6O18R5m16o88P52K30Kn08L86j44J58k86M28k10j83K67N2k09m08L57
7192g5K02j65k22K95K70l62m71M55K0J99q1J30q4j40R1L85R0m07j14K12n87J48
7214b11L71N67m93q26J27N00K38m18P5L4k62j02M07L48k28N3l80k2l16P27P4k84
7236b1k01j16N76J38k81l15M34P1o20L29L24K1k92LJ24m03K05L4J27l36R5M28
7258C24M6p0j44k52L21k7m31K25M67n37k97N39O9J83j36k60l31j23K21M25p0m70
7280c28K34l03M93o46O43J04m00m22M75j52O09j55k88j5j54N29J39j62k23o8j89
7301b79L39J62K17k71J71k95j21J98K14l76J59k64q6K41K82n2j45k74J89J65k41
$$ plain form
7322 -67 32 45 -22 -327 -170 347 407 116 -117 -330 299 315 204 456 -43 -54 -311 -23 53 41 62 -193 -263 -113
7346 -113 -164 138 -266 7 -200 -76 125 -115 292 148 -95 -349 223 73 25 -373 -309 -249 33 63 370 121
7368 121 40 -217 -147 302 151 246 -159 -113 -148 234 311 229 -398 22 -346 90 222 298 -125 -301 68 182 215
7391 215 83 50 -229 -137 -282 142 257 -316 -166 -317 75 129 184 -154 -566 -132 -78 25 62 -83 -33 -174
7413 -174 -78 -112 338 317 -31 -308 -186 220 156 98 -277 44 129 -2 -58 370 217 -108 -491 -159 437 783
7435 783 -16 -436 -149 20 -81 482 140 120 -208 -106 -161 317 0 -150 69 -319 -210 308 318 -19 -267
7456 -267 -330 -100 358 112 73 -139 -462 -116 21 155 297 37 6 -316 -399 346 535 113 -493 -496 153 647
7478 647 208 -111 -283 -33 214 179 325 648 111 -522 -124 -159 223 189 225 -84 -336 159 324 472 -445
$$ packed form
7322f7R9J3o7l05J57N17O0k91k33k13O29J6j11K52m99j1k57K88P6j2K1k55p0J50
7346a13n1L02m04K73k07J24K01k40M07j44k43k54N72j50m8l98O4O0K82L0L07k49
7368A21q1k57P0M49j51R5m05M6l5L82P7q2o27M20l68M36J32P6m23j76L69J14L3
7391B15j32l3k79R2j45M24J15n73J50j51L92N4N5l38m12M34N4J03L7j45N0j41
7413a74R6l4M50k1l48k77J22M06o4n8l75L21Q5j31n6M28j53l25l83L32N96L46
7435G83p99m20K87J69j01N63l42k0l28J02n5M78l17j50K19l88J09N18J0l37k48
7456b67o3K30M58k46l9k12l23L46J37J34J42k60l1l22q3P45J89m22o06lO49M94
7478F47m39l19j72K50K47l5J46L23n37o33L98l5L82l4L6l09k52M95J65J48r17
$$ plain form
7499 -445 -433 319 -26 21 281 423 -383 -425 -38 157 106 230 -160 29 -168 51 312 286 141 -291 -19 181
7521 181 -90 -58 97 -116 -141 -307 29 419 42 -164 -281 47 316 91 262 -304 -79 402 177 330 -83
7542 -83 328 152 -245 -255 49 212 -34 -284 -400 153 151 107 -107 7 -437 86 -109 174 124 -47 41 -154
7564 -154 -131 269 -50 105 -128 -197 219 10 154 -104 -49 -572 -234 205 -73 -76 22 -161 -240 269 438 127
7586 127 35 -274 -180 -85 49 212 4 42 -59 104 106 112 103 42 -33 22 222 193 285 -217 -313 -56 194 348 139
7611 139 9 -113 -630 203 181 301 116 -575 -428 -259 358 333 357 -129 -298 25 244 211 40 165 -163
7632 -163 -199 -231 146 25 -136 -218 -74 -111 120 -16 4 -217 -35 410 -141 -48 319 352 17 -120 35 -39 -115
7655 -115 -175 -51 113 224 310 56 -283 -434 37 -34 249 177 -49 -61 -284 -88 125 66 10 -183 -635 -93
$$ packed form
7499d45J2P52l45M7K60J42q06m2L87J95n1J24l90J89j97K19K61k6j45m32K72K00
7521A81k71L2J55k13k5j66L36L90l77k06j17L28K69k25J71n66K25M81k25J53m13
7542h3M11j76l97j0L04J63k46k50j16N53km4k14J14m44N23j95K83n0j71Q8j95
7564a54K3M00l19J55k33o9M16k09J44k58N5n23L38M39k78lR8j83p9N09J69l11
7586A27r2l09R4R5J34J63k08L8j01J63KOro1p5N5K00k9R2n02r6K57K50J54k09
7611A39j30j22n17Q33k2J20j85o91J47J69O17k5K4m86j69L23K19l3j71J25l28
7632a63l6l2L77j21j61q2J44l7K31j36K0k21J82M45n51R3L67L3l35j37J55p4p6
7655a15o0J24J64J11Q6k54l39j51M71p1K83p2k26j2k23J96K13n9n6j93m52N42
$$ plain form
7677 -93 181 197 383 -306 -564 -227 -75 388 347 88 -178 -286 -560 274 808 330 -479 -440 36 -113 -16 123
7699 123 555 -91 -401 155 -51 -8 -64 472 -13 -598 -36 280 498 -220 -171 412 208 -151 -96 267 -42
7720 -42 -554 217 494 -80 -517 -147 409 -63 -262 151 -17 -435 -419 45 493 71 -86 -374 -78 69 -87
7741 -87 287 89 -188 -193 238 110 22 152 215 -362 -774 -195 315 225 -227 -273 2 -15 -116 142 45 -13 -69 -140
7765 -140 331 163 -31 527 -165 -709 134 310 -38 -376 171 538 273 -221 382 156 83 -256 2 205
7785 205 4 -165 46 149 -289 139 172 106 -320 -104 67 446 -418 -45 187 5 -348 255 302 -53 -297
7806 -297 -24 375 -139 -85 269 214 -398 -236 148 338 -240 -357 -131 -104 11 -3 159 187 -286 -115 399 225
7828 225 -24 85 320 -354 -351 381 221 145 -16 193 453 -140 150 378 360 -575 -233 149 71 -67 -148 84
$$ packed form
7677i3K74J6J86o89k58L37J52M63m1k59k66j08k74Q34N34m78q09L9M76j49R7J39
7699A23M32o46l10N56k06M3n6N36m85n85N62L16K18p18M9N83k04l59N5L63l09
7720d2n12P71K77n74m37L70N56m72j99M13j68m18J6M64M48m22j57k88K96J47j56
7741h7L74j98k77nM31j28q8J30O3n77m12N79N10r0m52m6K75j7j01K58r7n8n6p1
7765a40M71j68j94N58o92n44Q43J76l48l38N47L67k65m94O03k26p3l39K58K03
7785B05k01j69K11J03m38M28L3o6m26K16J71L79q64L73K32j82l53O03M7l55k44
7806b97K73L99n14N4L54n5o12J62L84J90n78j17K26K7J15j4J62K8m73J71N14j74
7828B25k49J09K35o74LP32j60p6j61K09K60n93K90K28j8r35L42L82p8j38q1K32
$$ plain form
7850 84 -76 -284 -31 363 97 -309 5 337 -262 -358 -33 309 -55 54 263 195 -57 -278 60 163 -201
7871 -201 111 233 104 -478 -24 729 237 -170 90 170 -70 -226 210 665 -127 -716 -327 249 14 47 400
7892 400 211 -59 -460 83 190 454 28 -495 -272 -374 -24 417 96 -594 -265 105 76 -177 198 223 -265
7913 -265 -551 236 291 -33 -350 -244 37 -184 -146 -214 -69 -339 -279 67 180 353 13 158 -9 -117 92
7934 92 180 142 -275 -71 434 167 382 209 111 -81 -235 135 508 68 -25 -116 -244 44 37 359 242 -426 -475
7957 -475 -219 250 248 -32 12 -203 -470 34 93 223 -135 16 -381 -204 22 457 3 -197 -290 439 299 327
7979 327 238 177 88 21 -117 317 525 -5 -24 -631 107 176 150 133 -168 -462 142 166 383 480 256 -114 -26 -78
8003 -78 298 26 121 -446 -503 134 94 347 -159 -301 -113 -59 -46 163 -388 -345 -151 56 359 375 198 129 -334
$$ packed form
7850H4j60k08K53L94k66m06L14L32n99r6L25L42l64J09K09o8k52k21L38J03l64
7871b01L12J22j29n82M54P53m92m07K60Q0k40j56M36M55p92n89L89N76k35L3L53
7892D00j89k70m01N43J07K64m26n23K23j02L50M41l21o90L29L70k9k53L75K5m88
7913b65k86P87N5l24l17J06K81k21L8o8J45k70O0L46J13J73l40J45j67j08K09
7934I2Q8l8m17K04N05k67K15j73r8j92j54L70L73m40r3r1j28K88pL22j17o68m9
7957d75K56M69kk80M4k15k67N04N9J30l58J51l97J77K26M35m54k00r3P29j40K8
7979C27q9o1q9o7j38M34K08n30j9o07P38O9k6j7l01k94O04K4K17R7k24l70Q8n2
8003g8L76k72R5n67n7O37m0K53n06j42J88N4J3K09n51M3J94K07L03J6j77o9m63
$$ plain form
8026 -334 -146 260 211 147 -176 -350 -426 -351 361 398 469 -368 -169 94 -40 -43 272 290 -142 -90 74 779 296
8049 296 -77 -244 -110 75 -57 201 466 -98 -397 -93 340 215 131 -292 2 -381 48 583 231 -149
8069 -149 -624 -164 -69 108 -300 -11 -243 -258 71 483 268 12 -480 -391 -155 41 496 130 -279 -260 -9
8090 -9 26 -164 78 -264 -314 -187 239 336 151 24 -137 -239 12 409 -135 -139 -64 -295 -413 432 380 -100 -122
8113 -122 -259 77 150 455 271 -177 -549 -5 245 231 167 10 46 -451 -164 166 216 -24 -112 -299 174 163
8135 163 226 -138 -158 -256 75 383 517 214 15 -230 -379 250 379 408 267 -389 1 89 185 94 201 119 -28
8158 -28 147 399 245 114 -112 -366 -78 203 63 308 -174 -468 -138 55 606 460 -159 -145 30 291 48
8179 48 495 -23 -47 -219 85 266 381 26 -348 -205 -60 151
$$ packed form
8026c34J88M06m9o4l23j74p6P5P12L7P1q37J99K63j34lL15J8m32N2J64P05m83
8049B96l73j67J34J85j32K58K65n64k99L04M33j25q4m23K94l83M29N35l52l80
8069a49m75M60R5J77m08K89k32j5L29M12k15k56m92Q9K36J96M55l66m09J9K51
8090iL5j90K42l42n0J27M26R7j85j27j61j02K51L97n44mP5k31j18Q45n2m80k2
8113a22j37L36P3L05j84m48l72N44K50j4o4j57L6m97K87L30N0k40q8j87M73j1
8135A63O3l64k0r8L31L08J34l03j99k45j49O29J29K9j41o56L90Q8R6r1J07q2j47
8158b8J75K52j54j31k26k54K88K81j40K45m82k94L30J93N51j46o19J4J75K61k43
8179D8M47n18k4j72L04J81J15l55l74J43J45K11
8191A51
$$ Imaginary data points
##PAGE= N=2
##DATA TABLE= (X++(I..I)), XYDATA
$$ plain form
0 0 0 0 0 5 -8 0 -8 8 -8 16 -16 24 -25 32 -36 48 -56 64 -73 88 -104 121 -134 158 -182 206 -234 268 -302
29 -302 341 -381 428 -482 537 -596 665 -740 821 -908 1006 -1115 1234 -1366 1512 -1677 1865
46 1865 -2072 2312 -2591 2914 -3300 3771 -4356 5107 -6106 7513 -9638 13205 -20301 39837
60 39837 -202528 -669053 -147944 274198 149925 25273 194094 34837 -368145 -269859
70 -269859 275062 354230 -53359 -209396 -40688 -76153 -141754 162305 409494 52755 -373467
81 -373467 -200202 165120 91107 -87584 66378 172436 -93762 -224395 75870 247014
91 247014 -29629 -213103 -7718 123893 -25458 -44986 122288 47143 -200421 -104836 222234
102 222234 192096 -136142 -197525 3670 41634 -24399 103504 204045 -32212 -281744 -141084
$$ packed form
0@%%%Nj3QqJ6j6K4l2M0m9N7o8Q4j04J20j37J61j92K25k55K92l40L88m40N02n70
29c02O43p22Q09r10J019j133J261j405J561j729J914k121K349k600K878l189L542
46A865l937M384m903N505o214P071q127R463j1213J3619j7151K2843l3506O0138
60C9837k42365m66525N21109M22142j24273j24652J68821j59257m02982R8286
70b69859N44921P9168m07589j56037J68708l5465o5601L04059K47189l56739m26222
81c73467J73265L65322p4013j78691J53962J06058k66198j30633L00265J71144
91B47014k76643j83474K05385J31611j49351j9528J67274p5145k47564R5585L27070
102B22234l0138l28238o1383K01195L7964o6033J27903J00541k36257k49532J40660
$$ plain form
113 -141084 137012 159313 51721 16931 -79127 -227001 -109157 225360 289277 -6757 -209213
124 -209213 -135167 -50874 -23714 118620 239930 62662 -230042 -227545 23782 165725 119665
135 119665 32637 -72254 -173319 -111808 102400 199594 73487 -70336 -102124 -98175 -57163
146 -57163 83958 180551 59944 -128624 -124127 18187 79314 51395 31519 -15708 -97252
157 -97252 -73834 69665 128085 26246 -57897 -37348 -18865 -23543 35082 90295 8807 -106077
169 -106077 -62376 67355 83475 9312 -22948 -36772 -73855 -35396 86251 103978 -29695
180 -29695 -106092 -35070 24477 9455 35344 74533 -19503 -151958 -90291 97714 135191 9833
192 9833 -62758 -46194 -49212 -36849 61178 116105 14270 -101756 -76064 9030 41628 62160
$$ packed form
113a41084K78096K2301j07592l4790r6058j47874J17844L34517O3917k96034k02456
124b09213P4046Q4293K7160J42334J21310j77268k92704K497K51327J41943m6060
135A19665q7028j04891j01065O1511K14208R7194j26107j43823l1788L949M1012
146e7163J41121R6593j20607j88568M497J42314O1127k7919j9876m7227q1544
157i7252K3418J43499N8420j01839q4143K0549J8483m678N8625N5213q1488j14884
169a06077M3701J29731J6120p4163l2260j3824l7083L8459J21647J7727j33673
180b9695p6397P1022N9547j5022K5889L9189r4036j32455O1667J88005L7477j25358
192I833p2591J6564l018J2363R8027N4927j01835j16026K5692Q5094L2598K0532
$$ plain form
204 62160 76046 -8294 -128551 -91710 72258 124351 23318 -38852 -13531 -22585 -52635 14148
216 14148 106991 58829 -71133 -89644 138 52227 40441 29478 2797 -55183 -62612 12973
228 12973 62569 23224 -20543 -14798 -14679 -30646 236 49123 26214 -44625 -53646 -487 26957
241 26957 15464 6150 -7470 -35252 -28370 21449 36693 -6202 -30330 -4716 8382 -8433
253 -8433 770 30784 15339 -32241 -34540 10872 37104 23599 -835 -22608 -27408 5749 43574
266 43574 25462 -21957 -19474 15691 6962 -22508 5644 51769 19886 -48350 -40774 25251 41681
279 41681 2564 -16124 -7367 -8289 -7223 12842 13967 -10832 -10708 13080 -1245 -36655 -12967
292 -12967 40773 23346 -40436 -35651 23917 24257 -27157 -24830 22054 18124 -22530 -19091 9854
$$ packed form
204F2160J3886q4340j20257L6841J63968N2093j01033o2170K5321r054l0050O6783
216A4148R2843m8162j29962j8511Q9782N2089j1786j0963k6681n7980p429P5585
228A2973M9596l9345m3767N745J19j5967L0882M8887k2909p0839r021N3159K7444
241B6957j1493r314j3620k7782O882M9819J5244m2895k4128K5614J3098j6815
253h433R203L0014j5445m7580k299M5412K6232j3505k4434k1773m800L3157L7825
266D3574j8112m7419K483L5165q729k9470K8152M6125l1883o8236P576O6025J6430
279D1681l9117j8688Q757r22J066K0065J125k4799J24K3788j4325l5410K3688
292a2967N3740j7427o3782M785N9568L40n1414K327M6884l930m0654L439K8945
$$ plain form
305 9854 1225 -12741 14995 26215 -20100 -42230 9778 44642 1959 -30850 7097 30422
317 30422 -13597 -36893 15324 52965 11431 -36273 -22301 11428 19679 18683 14573 -12471 -31868
330 -31868 -2418 33651 17217 -14905 -3040 14230 -15238 -36328 11931 59450 17474 -57078
342 -57078 -50585 18756 46135 11683 -19040 -19396 -15960 -11496 7398 23584 13811 -11299 -28780
355 -28780 -28428 -5468 31845 41794 -2474 -54068 -43473 15533 48282 26178 -11827 -28887 -26448
368 -26448 -8170 22320 40553 20812 -20144 -39795 -21707 16914 46085 39692 -6030 -51020
380 -51020 -42918 15799 61517 44362 -11894 -46407 -33509 5474 36617 39486 13537 -23961
392 -23961 -45569 -29692 19114 59100 43081 -24188 -73538 -45662 29600 66043 30604 -27235
$$ packed form
305I854q629j3966K7736J1220m6315k2130N2008L4864m2683l2809L7947K3325
317C0422m4019k3296N2217L7641m1534m7704J3972L3729Q251r96m110k7044j9397
330c1868K9450L6069j6434l2122J1865J7270k9468k1090M8259M7519m1976p4552
342e7078O493O9341K7379l4452l0723l56L436M464J8894J6186r773k5110j7481
355b8780L52K2960L7313R949m4268n1594J0595N9006L2749k2104l8005j7060K439
368b6448J8278L0490J8233j9741m0956j9651J8088L8621K9171o393m5722m4990
380e1020Q102N8717M5718j7155n6256l4513J2898L8983L1143K869k5949l7498
392b3961k1608J5877M8806L9986j6019o7269m9350K7876P5262L6443l5439n7839
$$ plain form
404 -27235 -51032 -34601 -823 32551 44763 15674 -38911 -65221 -29455 37771 69143 29265
416 29265 -42800 -73455 -30719 37559 61576 27915 -21681 -47192 -39156 -570 49536 62539
428 62539 12263 -56539 -66006 -5549 56947 64203 19437 -37474 -62187 -29284 37886 73328
440 73328 36950 -30069 -60190 -35486 15179 56313 56759 3953 -61853 -68067 -3524 62835 62935
453 62935 7649 -49585 -66643 -27592 40410 72908 29212 -44608 -70415 -33678 19590 52661
465 52661 49110 77 -67046 -76729 -2245 76787 67641 -9375 -66202 -57751 -7326 42138 60812
478 60812 29204 -32468 -67876 -40781 24887 71719 56625 -13395 -75703 -60985 21184 80261
490 80261 56160 -12842 -54214 -46549 -8280 40615 67112 35362 -37128 -74264 -35017 37077
$$ packed form
404b7235k3797J6431L3778L3374J2212k9089n4585k6310L5766O7226L1372l9878
416B9265p2065l0655M2736O8278K4017l3661m9596k5511Q036L8586N0106J3003
428F2539n0276o8802r467O0457O2496P256m4766n6911k4713L2903O7170L5442
440G3328l6378o7019l0121K4704N0665M1134M46n2806o5806o214O4543O6359J00
453F2935n5286n7234j7058L9051O8002L2498m3696p3820k5807L6737N3268L3071
465E2661l551m9033o7123r683P4484P9032r146p7016n6827Q451N0425M9464J8674
478F0812l1608o1672l5408K7095O5668M6832j5094p0020o2308J4718Q2169N9077
490H0261k4101o9002m1372P665L8269M8895K6497l1750p2490l7136L9247P2094
$$ plain form
502 37077 73624 44884 -24665 -75240 -53273 24517 74404 45736 -18570 -53933 -48831 -15032
514 -15032 38221 69218 27865 -54657 -81108 -23285 44211 59310 29678 -22040 -69916 -61004
526 -61004 19530 84568 50004 -35018 -64823 -32237 3204 30241 54620 33844 -41205 -82244
538 -82244 -25587 58233 71988 20847 -32877 -58766 -40720 25839 80145 47683 -35303 -63280
550 -63280 -21174 17740 29548 44352 33958 -35004 -86885 -30212 73008 84882 3448 -58728
562 -58728 -52029 -16649 22455 56963 44940 -21968 -70736 -43736 16972 47853 42360 11952
574 11952 -43326 -78265 -31205 59689 81274 9123 -60813 -58999 -15887 23698 47729 39163
586 39163 -12411 -60964 -47783 11384 51456 43797 5417 -37509 -55082 -19972 44710 67246
$$ packed form
502C7077L6547k8740o9549n0575K1967P7790M9887k8668o4306l5363N102L3799
514a5032N3253L0997m1353q2522k6451N7823O7496J5099k9632n1718m7876Q912
526f1004Q0534O5038l4564q5022k9805L2586L5441K7037K4379k0776p5049m1039
538h2244N6657Q3820J3755n1141n3724k5889J8046O6559N4306l2462q2986k7977
550f3280M2106L8914J1808J4804j0394o8962n1881N6673J03220J1874q1434o2176
562e8728O699L5380L9104L4508j2023o6908m8768K7000O0708L0881n493l0408
574A1952n5278l4939M7060R0894K1585p2151o9936J814M3112L9585K4031q566
586C9163n1574m8553J3181N9167M0072p659l8380m2926j7573L5110O4682K2536
$$ plain form
598 67246 17580 -46589 -53684 -5773 40129 44224 12836 -20350 -31535 -20048 6272 37065
610 37065 44552 5246 -51138 -53870 11051 63826 41147 -17287 -45683 -34091 -2558 34774
622 34774 48703 12283 -42209 -50534 -12032 21462 34668 35485 1489 -62077 -69599 13450 81060
635 81060 41211 -35675 -47049 -20050 -12527 7854 53424 45415 -36684 -76686 -16925 42398
647 42398 31845 11673 11758 -20437 -61549 -19100 67259 60617 -25544 -49957 -817 13758 -7833
660 -7833 16875 46539 -2929 -60201 -18821 49085 30295 -18822 -6084 10791 -23866 -24842 43357
673 43357 55232 -32052 -68878 7300 53643 1695 -25279 16781 11944 -50232 -35754 52783
685 52783 59293 -27492 -56146 -5603 10402 -8710 19143 46082 -12237 -72776 -24615 48825
$$ packed form
598F7246m9666o4169p095M7911M5902M095l1388l3186j1185J1487K6320L0793
610C7065P487l9306n6384k732O4921N2775k2679n8434k8396J1592L1533L7332
622C4774J3929l6420n4492q325L8502L3494J3206Q17l3996o3566p522Q3049O7610
635H1060l9849p6886j1374K6999P523K0381M5570q009q2099m0002N9761N9323
647D2398j0553k0172Q5l2195m1112M2449Q6359o642q6161k4413M9140J4575k1591
660g833K4708K9664m9468n7272M1380O7906j8790m9117J2738J6875l4657r76O8199
673D3357J1875q7284l6826P6178M6343n1948k6974M2060m837o2176J4478Q8537
685E2783O510q6785k8654N0543J6005j9112K7853K6939n8319o0539M8161P3440
$$ plain form
697 48825 29192 -16140 3147 13377 -39818 -49489 35080 74787 -1459 -58541 -13439 23463
709 23463 -6849 -8868 40181 31193 -40020 -45129 23475 39583 -6522 -11063 21263 2532 -36314
722 -36314 -5380 44827 17335 -33768 -12755 28232 6991 -25331 890 25447 -5157 -26498
734 -26498 8710 26397 -9923 -27008 4585 16607 -8893 -9534 15854 4156 -30804 -17467
746 -17467 25461 21698 -15997 -18567 5028 1115 -14274 182 20206 6704 -15607 -13753 -1410
759 -1410 3203 9179 13322 -2394 -17396 -4001 13016 3359 -7934 7223 17256 -4137 -19201
772 -19201 -190 18018 7210 -4142 3105 3644 -7205 -3740 9291 6199 -2573 6347 8753 -12912
786 -12912 -20296 9362 26698 834 -19259 -3154 7435 -8735 -8979 16345 14833 -16851 -21673
$$ packed form
697D8825j9633m5332J9287J0230n3195r671Q4569L9707p6246n7082M5102L6902
709B3463l0312k019M9049q988p1213n109O8604J6108m6105m541L2326j8731l8846
722c6314L0934N0207k7492n1103K1013M0987k1241l2322K6221K4557l0604k1341
734b6498L5208J7687l6320j7085L1593J2022k5500o41K5388j1698l4960J3337
746a7467M2928l763l7695k570K3595l913j5389J4456K0024j3502k2311J854J2343
759a410M613N976M143j5716j5002J3395J7017r657j1293J5157J0033k1393j5064
772a9201J9011J8208j0808j1352P247N39j0849L465J3031l092q772Q920K406k1665
786a2912p384K9658J7336k5864k0093J6105J0589j6170k44K5324j512l1684m822
$$ plain form
799 -21673 4032 8432 -5968 2202 15231 -9125 -33689 -4839 32269 13372 -23459 -14580 9660
812 9660 -277 -11984 9690 21611 -6717 -25275 -3296 14993 5783 3908 11104 -6943 -28725
825 -28725 -2792 37870 22339 -22839 -19919 13209 9775 -10918 5101 27866 3237 -31871
837 -31871 -16320 22098 23379 995 -6729 -8977 -14668 -1338 24502 18216 -15239 -22686 -386
850 -386 6906 -2338 6036 15896 -7287 -32202 -13476 22456 22801 -3138 -16118 -16237 -12693 4636
864 4636 26942 16465 -19179 -29450 -6201 11514 11153 13227 10008 -15956 -33496 -7794 30034
877 30034 31102 3720 -16771 -24392 -16891 13872 41098 22677 -22303 -31855 -3978 10973 10355
890 10355 20962 21848 -16248 -46625 -13649 39284 37848 -2370 -21416 -18070 -14459 2515 32415
$$ packed form
799b1673K5705M400j4400Q170J3029k4356k4564K8850L7108j8897l6831Q879K4240
812I660r937j1707K1674J1921k8328j8558K1979J8289r210j875P196j8047k1782
825b8725K5933M0662j5531m5178K920L3128l434k0693J6019K2765k4629l5108
837c1871J5551L8418J281k2384p724k248n691J3330K5840o286l3455p447K2300
850c86P292r244Q374R860k3183k4915J8726L5932L45k5939j2980j19L544J7329
864D636K2306j0477l5644j0271K3249J7715l61K074l219k5964j7540K5702L7828
877C0034J068k7382k0491p621P501L0763K7226j8421m4980r552K7877J4951o18
890A0355J0607Q86l8096l0377L2976N2933j436m0218j9046L346L611J6974K9900
$$ plain form
903 32415 27729 -16841 -37996 -10831 12334 9558 12150 16033 -14819 -47043 -16547 40854 37366
916 37366 -15374 -32878 -10161 -1938 -2117 21668 30532 -13247 -49551 -17909 30823 28046 1494
929 1494 -3979 -11438 -31274 -14199 39701 48825 -7601 -46268 -21156 12413 17986 22352 23863
942 23863 -9724 -47483 -24205 33293 44965 8803 -15111 -18674 -24916 -11101 35460 52074
954 52074 413 -52092 -34187 14203 27412 16787 11761 -5933 -39194 -34924 18721 50058
966 50058 18015 -25821 -33801 -18317 662 25221 34714 1299 -42459 -37146 7478 30868 19683
979 19683 3173 -12791 -32465 -26579 18252 49253 19875 -30802 -38744 -8224 17856 25868 22818
992 22818 529 -31209 -33783 4833 39451 32139 -1053 -26388 -28805 -8134 24861 40819 16608
$$ packed form
903C2415m686m4570k1155K7165K3165k776K592L883l0852l2224L0496N7401l488
916C7366n2740j7504K2717Q223j79K3785Q864m3779l6304L1642M8732k777k6552
929A494n473p459j9836J7075N3900R124n6426l8667K5112L3569N573M366J511
942B3863l3587l7759K3278N7498J1672l6162k3914l563o242J3815M6561J6614
954E2074n1661n2505J7905M8390J3209j0625n026j7694l3261M270N3645L1337
966E0058l2043m3836p980J5484J8979K4559R493l3415m3758N313M4624K3390j1185
979A9683j6510j5964j9674N886M4831L1001k9378n0677p942L0520K6080Q012l050
992B2818k2289l1738k574L8616L4618p312l3192k5335k417K0671L2995J5958k4211
$$ plain form
1005 16608 -25383 -38719 -12328 22314 34039 18901 -10044 -32731 -27043 5328 33829 29328
1017 29328 -2562 -30977 -32825 -6763 25815 35117 8666 -28435 -38063 -11974 20819 30833
1029 30833 12767 -15207 -31054 -22095 5786 28738 25336 -1804 -30286 -32022 -2834 30521
1041 30521 33491 2399 -29561 -29085 -1942 22035 25398 11654 -10205 -25719 -18993 9247 33529
1054 33529 26340 -6226 -30698 -23413 6535 30888 26860 -618 -25403 -24141 -222 21297 24681
1067 24681 8427 -14159 -25935 -15557 10868 28643 18594 -11187 -30266 -20866 6585 25638
1079 25638 20067 -4907 -26032 -23741 -959 19824 19725 1692 -16871 -21714 -10599 9067 22621
1092 22621 15384 -9231 -27387 -18714 8994 27631 17106 -8447 -22711 -14080 5507 17167
$$ packed form
1005A6608m1991j3336K6391L4642J1725j5138k8945k2687N688L2371K8501m501
1017B9328l1890k8415j848K6062L2578R302k6451l7101r628K6089L2793J0014
1029C0833j8066k7974j5847Q959K7881K2952l402k7140k8482j736K9188L3355
1041C0521K970l1092l1960M76K7143K3977L363j3744k1859j5514O726K8240K4282
1054C3529p189l2566k4472P285K9948K4353m028k7478k4785J262K3919K1519L384
1067B4681j6254k2586j1776J0378K6425J7775j0049k9781j9079R400K7451J9053
1079B5638n571k4974k1125K291K2782K0783r9j8033j8563m843J1115J9666J3554
1092B2621p237k4615j8156Q673K7708J8637j0525k5553j4264Q631J9587J1660
$$ plain form
1104 17167 15174 3903 -9564 -16643 -9004 11186 24813 14914 -10665 -24177 -10528 14194 23737
1117 23737 10780 -8327 -16431 -9165 4296 13640 13286 3000 -10913 -17281 -7806 11832 20707
1130 20707 7255 -15011 -21173 -6675 10442 14784 5383 -7833 -15182 -11412 1644 12749 10000
1143 10000 -2770 -12951 -12546 -3696 7875 13769 6239 -11072 -18059 -5400 11955 14215 2901
1156 2901 -7460 -9489 -5213 3238 11444 9787 -515 -8888 -7079 281 7861 12374 6997 -6661
1170 -6661 -14298 -2519 14209 12903 -1439 -7819 -2614 -351 -1030 4689 10283 2089 -11416 -10353
1184 -10353 3209 9936 4232 -2370 -5388 -7541 -3715 5173 8135 -635 -8978 -6191 -107 -108 949
1199 949 4377 903 -9498 -10317 2885 9676 1917 -5922 -3220 -672 -2457 302 7252 5495 -5296
$$ packed form
1104A7167j993j1271j3467p079P639K0190J3627r899k5579j3512J3649K4722R543
1117B3737j2957j9107q104P266J3461R344l54j0286j3913o368R475J9638Q875
1130B0707j3452k2266o162J4498J7117M342r401j3216p349L770J3056J1105k749
1143A0000j2770j0181M05Q850J1571N894p530j7311o987J2659J7355K260j1314
1156B901j0361k029M276Q451Q206j657j0302q373J809P360P580M513n377j3658
1170f661p637J1779J6728j306j4342o380N205K263o79N719N594q194j3505J063
1184a0353J3562O727n704o602l018k153L826Q888K962q770q343K787O084jJ057
1199I49L428l474j0401q19J3202O791p759p839K702K548j785K759O950j757j0791
$$ plain form
1214 -5296 -8016 1706 7078 1821 -466 2970 1448 -4847 -2601 7119 8507 -1111 -5427 1540 4399
1229 4399 -35 -1183 3995 4077 -2505 -3321 2040 3009 -1459 -1063 3232 1062 -4605 -2169 3080 251
1245 251 -5063 -182 5591 -1935 -10621 -2848 8736 2627 -8760 -4727 5796 33 -9652 -1805
1259 -1805 9869 2483 -11143 -6092 6662 3800 -4644 -433 4801 -2708 -6638 4725 9366 -2650
1273 -2650 -7952 4024 8670 -3493 -5179 8769 8242 -9392 -9040 11968 14492 -5713 -11637 4588
1287 4588 7920 -4505 -1132 12070 3250 -15763 -8433 13457 10557 -6664 -3929 5277 -5142
1300 -5142 -14835 4387 21567 2788 -21669 -11808 7948 4596 -3131 5051 5889 -13107 -18221 4668
1314 4668 17339 2537 -8492 -1864 -3140 -12312 -253 21716 11739 -18247 -19007 6583 13605
$$ packed form
1214e296k720R722N372n257k287L436j522o295K246R720J388r618m316O967K859
1229D399m434j148N178Q2o582q16N361R69m468L96M295k170n667K436N249k829
1245B51n314M881N773p526q686P773J1584o109j1387M033J0523n763r685P847
1259a805J1674p386j3626N051J2754k862q444M211N234p509l930J1363M641j2016
1273b650n302J1976M646j2163j686J3948n27j7634L52K1008K524k0205n924J6225
1287D588L332j2425L373J3202q820j9013P330K1890k900j7221K735R206j0419
1300e142r693J9222J7180j8779k4457R861J9756l352p727Q182Q38j8996n114K2889
1314D668J2671j4802j1029O628j276r172J2059K1969r977k9986p60K5590P022
$$ plain form
1327 13605 -4 -297 7817 -2301 -15910 -2501 18844 13007 -6430 -8921 -1128 -352 2706 13351
1341 13351 9708 -11238 -15583 3843 14798 4464 -3004 61 -3023 -10460 -538 15935 10149
1354 10149 -10211 -14784 -3271 3431 5257 8712 2623 -14728 -18173 1916 16504 7053 -6285
1367 -6285 -7646 -7330 -8889 2295 16046 9606 -10965 -17438 -5509 5448 10009 11443 1558 -17111
1381 -17111 -17215 6187 19988 8381 -5564 -5061 -5244 -8616 3594 21897 14386 -13028 -20333 -1988
1395 -1988 12043 11900 8905 1886 -14148 -17719 4384 21752 11230 -6777 -8316 -6500 -8747 1968
1409 1968 20972 14577 -15333 -24630 -2914 13297 7665 2854 2041 -10153 -20038 -3383 20007
1422 20007 13791 -9799 -13546 -3133 -2494 -1937 11498 13751 -9182 -22900 -3680 16642 9828
$$ packed form
1327A3605j3609k93Q114j0118j3609J3409K1345n837j9437k491P793P76L058J0645
1341A3351l643k0946m345J9426J0955j0334p468L065l084p437R922J6473n786
1354A0149k0360m573J1513O702J826L455o089j7351l445K0089J4588r451j3338
1367f285j361L16j559J1184J3751o440k0571o473J1929J0957M561J434r885j8669
1381a7111j04K3402J3801j1607j3945N03j83l372J2210J8303p511k7414p305J8345
1395a988J4031j43k995p019j6034l571K2103J7368j0522j8007j539J816k247J0715
1409A968J9004o395k9910r297K1716J6211n632m811q13j2194r885J6655K3390
1422B0007o216k3590l747J0413O39N57J3435K253k2933j3718J9220K0322o814
$$ plain form
1435 9828 -3755 -3066 -3047 -9762 -1726 17669 14693 -10322 -16995 8 9274 5130 7188 8213 -7826
1450 -7826 -21380 -2481 24157 18512 -6178 -13457 -5479 -3023 1435 16479 17856 -6552 -24912
1463 -24912 -11593 10686 14879 8512 1803 -10243 -21040 -8794 16502 20572 281 -14706 -12396
1476 -12396 -7273 -1036 11896 16264 -1330 -21045 -15803 5124 13365 7387 386 -6002 -12336 -7626
1490 -7626 7838 15255 4553 -9077 -10092 -2680 4270 9407 8463 -1467 -10765 -6978 6023 12323
1504 12323 6928 -2411 -8266 -6830 2468 11563 10326 -575 -9306 -8264 -464 8543 12299 5177
1518 5177 -8650 -14575 -5207 8886 13522 5947 -5994 -14336 -10614 3143 13582 9050 -4053
1531 -4053 -11142 -11116 -5477 6008 15537 8147 -12684 -20219 -5238 11278 11222 2512 -3099 -8721 -11720
$$ packed form
1435I828j3583O89J9o715Q036J9395k976k5015o673J7003R266m144K058J025j6039
1450g826j3554J8899K6638n645k4690p279P978K456M458J5044J377k4408j8360
1463b4912J3319K2279M193o367o709j2046j0797J2246K5296M070k0291j4987K310
1476a2396N123O237J2932M368j7594j9715N242K0927Q241n978p001o388o334M710
1490g626J5464P417j0702j3630j015P412O950N137r44r930r298L787J3001O300
1504A2323n395r339n855J436R298R095j237j0901q731J042P800R007L756p122
1518E177j3827n925R368J4093M636p575j1941q342L722J3757J0439m532j3103
1531d053p089K6N639J1485R529p390k0831p535J4981J6516n6q710n611n622k999
$$ plain form
1546 -11720 -2415 13258 13485 -1741 -11273 -7778 -1379 5186 12105 9521 -6254 -15939 -3574 12581
1560 12581 11081 697 -2270 -1868 -6050 -2637 10646 13516 -1260 -12089 -5334 4771 5480 4379
1574 4379 4145 -3674 -12873 -5221 11556 11317 -3359 -9802 -3922 -829 -958 4637 8382 -1909 -14223
1589 -14223 -9446 5146 9353 3561 -1757 -6742 -10280 -3999 9546 11155 -2254 -10967 -5507 854
1603 854 1111 4059 8076 1096 -11304 -9515 5070 12831 5642 -3139 -5519 -3620 151 6932 8813
1618 8813 2000 -5691 -4694 773 4074 4779 5138 7 -7398 -6265 4009 9452 3703 -4241 -5748
1633 -5748 -2876 322 3984 4880 -184 -6014 -5469 -483 2385 2424 1140 -2664 -6289 -5306 1460 5877
1649 5877 2155 -4648 -6426 -2718 1633 3656 1507 -1987 -3402 -2241 -97 1288 2983 3008 -1025
$$ packed form
1546a1720R305J5673K27j5226r532L495O399O565O919k584j5775r685J2365J6155
1560A2581j500j0384k967M02m182L413J3283K870j4776j0829O755J0105P09j101
1574D379k34p819r199P652J6777k39j4676o443N880L093j29N595L745j0291j2314
1589a4223M777J4592M207n792n318m985l538O281J3545J609j3409q713N460O361
1603H54K57K948M017o980j2400J789J4585P761p189q781k380J899L771O781J881
1618H813o813p691R97N467L301P05L59n131p405J133J0274N443n749p944j507
1633e748K872L198L662Q96n064n830N45M986K868L9j284l804l625R83O766M417
1649E877l722o803j778L708M351K023k149l494j415J161K144J385J695K5m033
$$ plain form
1664 -1025 -4796 -2426 4666 6040 929 -2942 -1997 1258 2596 2738 1921 -101 -1018 -140 667 1950
1680 1950 3355 2062 -1076 -3780 -102 4554 2978 -1850 -2832 -155 884 -949 94 2039 -393
1695 -393 -3002 -2683 292 1054 -453 -976 -1261 -2326 -2397 -136 1143 -1071 -2473 -1483 -157 -883 -1259
1712 -1259 299 883 -617 -1276 -47 527 -90 125 1211 141 -721 599 1363 967 408 1698 1901
1729 1901 -61 -1451 1197 3356 2494 -86 -643 808 1400 1010 933 1162 688 -563 -1674 -156 2079
1746 2079 2332 -434 -3431 -2409 686 2174 15 -1501 -1681 -1617 -1905 -847 1293 1189 -1913 -4448
1762 -4448 -2760 473 2435 1221 -1903 -3605 -2637 440 2628 1686 -553 -1842 -2080 -1147 1633 4221
1778 4221 2854 -1056 -3673 -1114 2777 4694 2915 -325 -2659 -2170 2033 5001 4081 -32 -2442
$$ packed form
1664a025l771K370P092J374n111l871R45L255J338J42q17k022r17Q78Q07J283
1680A950J405j293l138k704L678M656j576m828r82K677J039j833J043J945k432
1695c93k609L19K975P62j507n23k85j065p1K261J279k214j402R90J326p26l76
1712a259J558N84j500o59J229N74o17K15J086j070q62J320P64l96n59J290K03
1729A901j962j390K648K159q62k580n57J451N92l90p7K29m74j251j111J518K235
1746B079K53k766k997J022L095J488k159j516j80O4k88J058K140j04l102k535
1762d448J688L233J962j214l124j702R68L077K188r42k239j289k38R33K780K588
1778D221j367l910k617K559L891J917j779l240k334M89M203K968r20m113k410
$$ plain form
1793 -2442 -1479 418 2269 3815 3186 -1361 -5448 -3400 3221 6417 1894 -4263 -5259 -2238 1566 2883
1809 2883 2039 -1187 -4455 -4685 -1846 2141 3903 1509 -4532 -7619 -3666 4071 6763 738 -6010
1824 -6010 -5622 -711 2101 2650 3083 1020 -4068 -6358 -487 6530 6874 818 -4801 -4723 -655 5090
1840 5090 7427 3586 -3755 -5834 -992 4619 5463 3166 307 -3670 -5396 -197 7226 7589 -61
1855 -61 -6839 -5865 -118 4965 6157 1938 -5205 -8163 -3003 4430 5945 1086 -3771 -5642 -5545 -2030
1871 -2030 5290 7411 -680 -10413 -9289 1005 7924 5059 -1560 -5501 -6165 -2533 3398 7311 3694
1886 3694 -3485 -7337 -4477 2084 7897 7789 -314 -8506 -7051 3134 10099 6586 -1215 -4827 -3856
1901 -3856 -800 4136 8367 5465 -3825 -9341 -3761 5684 8365 4170 -2173 -7154 -6734 1235 9044
$$ packed form
1793b442R63J897J851J546o29m547m087K048O621L196m523o157r96L021L804J317
1809B883q44l226l268k30K839L987J762k394o041l087L953P737K692o025o748
1824f010L88M911K812N49M33k063n088k290N871P017L44o056n619P8M068N745
1840E090K337l841p341k079M842N611Q44k297k859l977j726N199P423L63p650
1855f1o778R74N747N083J192m219p143k958N160P433J515m859m857j871R7L515
1871b030P320K121q091r733J124J0294O919k865o619l941o64L632N931L913l617
1886C694p179l852K860O561N813j08q103q192J455J0185O965l513p801l612R71
1901c856L056M936M231k902r290n516N580R445K681m195o343m981M20P969P809
$$ plain form
1916 9044 7263 -2729 -8853 -5829 -202 4043 5442 2673 -5364 -10565 -5535 5332 9210 2879 -5696
1931 -5696 -8823 -5631 1599 8532 6395 -3253 -9889 -6095 2052 5768 5461 2550 -3873 -9459 -5092
1946 -5092 7594 12091 3390 -6981 -7553 -1130 4190 7158 6415 -387 -7296 -5931 2847 8424 6341
1961 6341 871 -4912 -6871 -2296 6974 9983 1991 -7915 -7417 -199 4523 4968 3452 -1637 -8511
1976 -8511 -7433 1650 8646 4803 -3411 -8004 -6303 -1051 5402 7248 631 -7892 -8790 -1707 5383
1991 5383 5958 2102 -3698 -7745 -5333 2823 7790 5001 -2023 -6548 -5442 740 7253 7752 574
2006 574 -7070 -5432 1429 5961 5467 2695 -2271 -5590 -3555 4146 8599 4758 -2593 -5793 -3406
2021 -3406 1677 6356 5636 -1227 -6870 -4640 1560 3859 2888 1494 -2074 -7052 -5295 3787 8314
$$ packed form
1916I044j781r992o124L024N627M245J399k769q037n201N030J0867L878o331q575
1931e696l127L192P230O933k137r648o636L794Q147L716l07k911o423n586M367
1946e092J2686M497q701j0371n72O423N320K968p43o802o909J365Q778N577k083
1961F341n470n783j959M575R270L009p992r906M98P218M722M45j516n089o874
1976h511J078R083O996l843q214m593J701N252O453J846o617q523q98P083P090
1991E383N75l856n800m047K412Q156M967k789p024m525J106O182O513M99p178
2006E74p644J638O861M532m94k772m966l319K035P701M453l841p351l200K387
2021c406N083M679p20o863n643K230O200K299r71j394l568m978J757R082M527
$$ plain form
2036 8314 1641 -6748 -6500 -1864 1363 2661 3447 -726 -6814 -5970 993 5092 2739 -849 -2255 -4691
2052 -4691 -3796 3059 8120 2829 -6114 -5765 1062 3841 2755 2742 1451 -3551 -4750 1618 6910 3980
2068 3980 -1289 -1818 -1006 -1557 1894 6728 3774 -4262 -6396 1073 5690 2379 -1227 -709 -803 -3183
2084 -3183 -942 4070 3743 -1840 -5297 -2866 221 1929 2923 636 -4681 -5926 -623 4482 2148
2099 2148 -2201 -2502 -1431 -2205 -2081 2635 4671 -190 -5777 -4302 1652 4437 2504 -587 -1780 -1666
2115 -1666 -871 1430 3998 2679 -817 -1686 -730 837 1791 3209 2464 -1241 -2738 286 4091 2644
2131 2644 -1189 -1181 1040 1480 -803 49 1507 163 -1737 -246 1591 352 -1931 -588 229 -1342
2147 -1342 -1482 2076 2128 -3793 -5654 588 4091 -145 -3667 -780 826 -2575 -3554 1918 4233 -562
$$ packed form
2036H314o673q389K48M636L227J298P86m173o088Q44O963M099k353l588j406k436
2052d691Q95O855N061n291q943L49O827K779j086j3j291n002j199O368N292k930
2068C980n269n29Q12n51L451M834k954q036k134P469M617l311l606N18r4k380
2084c183K241N012l27n583l457K431L087J708R94k287n317j245N303N105k334
2099B148m349l01J071p74J24M716K036m861n587J475N954K785j933l091j193J14
2115a666P95K301K568j319l496q69R56J567R54J418p45l705j497L024L805j447
2131B644l833QK221M40k283Q52J458j344j900J491J837j239k283J343Q17j571
2147a342j40L558N2n921j861O242L503m236l522K887J606l401r79N472K315m795
$$ plain form
2163 -562 -4152 -1760 924 345 987 3290 334 -3664 -1864 3450 2096 -1471 863 3839 109 -4765
2179 -4765 29 5869 3234 -2291 -507 2992 235 -2558 1657 4550 312 -2453 307 1953 -2019
2194 -2019 -1723 3719 3237 -3417 -3924 1434 1976 -2345 -1595 3100 948 -4818 -3851 2073 1985 -2225 -1177
2211 -1177 919 -2130 -3817 1082 3872 -1678 -4277 36 2657 -1721 -2763 2374 3283 -2465 -3800
2226 -3800 1980 4133 -660 -2681 1287 2395 -67 279 2671 588 -1918 195 3453 1895 -766
2241 -766 766 1432 -1939 -1862 3558 4672 -1266 -4597 -623 2179 521 0 2026 -60 -4347 -3119
2257 -3119 2455 3091 -614 -2068 -1800 -2924 -2175 2481 3845 -1481 -5526 -2521 1311 823 438 1341
2273 1341 -814 -4797 -2897 3289 4086 366 -2351 -1184 -1898 -1125 3338 5682 -29 -5588 -2342 3515
$$ packed form
2163e62l590K392K684n79O42K303k956l998J800N314j354l567K334K976l730m874
2179d765M794N840k635n525J784L499k757k793M215K893m238k765K760J646l972
2194b019K96N442m82o654n07N358N42m321P50M695k152n766R67N924q8m210J048
2211a177K096l049j687M899K790n550k599M313K621m378j042N137R09n748j335
2226c800N780K153m793k021L968J108k462L46K392k083k506K113L258j558k661
2241g66J532O66l371P7N420J114n938l331L974K802j658n21K026k086m287J228
2257c119N574O36l705j454K68j124P49M656J364n326m045L005L832m88l85R03
2273A341k155l983J900O186P97l720k717J167p14P73M463K344n711n559L246N857
$$ plain form
2289 3515 3619 977 1045 510 -2344 -2755 3059 6265 2035 -2646 -2573 -666 986 3572 4424 -295 -5416
2306 -5416 -3062 3318 3559 194 -767 -226 -3393 -4122 1678 5977 1126 -5861 -5401 -207 2292 1745
2322 1745 992 -1494 -4802 -3894 1516 4174 1365 -2154 -2730 -2915 -1774 2553 5453 1516 -5203 -5118
2338 -5118 890 4485 3444 1010 -1175 -3555 -2224 3035 5767 2975 -1643 -2995 -1677 399 3471
2353 3471 6121 2099 -4872 -5359 754 5802 4423 -384 -3013 -3559 -1939 2082 4482 2799 -1477
2368 -1477 -4631 -4143 -772 3832 4444 -148 -6035 -5782 -169 4672 2989 -1380 -3459 -3776 -2143 364
2384 364 3436 2757 -1561 -5254 -4078 1522 4304 3521 -1471 -4769 -3371 1077 4476 3735 456 -2334
2400 -2334 -2766 -891 3060 5077 3078 -1797 -3959 -2135 2517 5522 3944 -910 -4789 -3422 2257
$$ packed form
2289C515J04k642O8n35k854m11N814L206m230m681P3J907J652K586Q52m719n121
2306e416K354O380K41l365r61N41l167p29N800M299m851o987M60N194K499n47
2322A745p53k486l308R08N410K658k809l519n76j85J141M327K900l937o719Q5
2338e118O008L595j041k434k185k380J331N259K732k792m618j352J318K076L072
2353C471K650m022o971m87O113N048j379m807k629n46J620M021K400j683m276
2368a477l154M88L371M604O12m592n887K53N613M841j683m369k079l17J633K507
2384C64L072o79m318l693J176N600K782p83m992l298J398M448L399p41l279k790
2400b334m32J875L951K017j999m875k162J824M652L005j578m854l879J367N679
$$ plain form
2415 2257 5319 3519 -923 -3116 -3376 -631 2362 3883 1744 -2927 -5172 -3140 1929 4357 2780
2430 2780 -2669 -6150 -4094 1358 4114 2057 -1915 -3726 -3195 -1595 1270 3791 1991 -3042 -5935
2445 -5935 -2543 3537 5236 1822 -2715 -3978 -2095 2012 3931 3177 121 -2737 -2605 103 3836
2460 3836 4688 2014 -2631 -4182 -873 4127 5155 1747 -2368 -3316 -1337 1672 3497 2955 -342 -3779
2476 -3779 -3509 212 3304 3210 109 -3289 -4400 -1501 2195 3698 895 -3750 -4626 -1595 1461 2637
2492 2637 1365 -1280 -3559 -3882 -379 3779 3317 -571 -4028 -3749 -288 3258 3827 770 -2662 -3278
2508 -3278 -811 2290 3308 2059 -515 -2208 -2509 889 4488 4443 -321 -3969 -2075 1791 3373 2275
2524 2275 511 -1233 -2365 -1399 2113 4104 1852 -1804 -3166 -1610 1008 2880 2019 -1371 -4159
$$ packed form
2415B257L062j800m442k193k60K745K993J521k139m671k245K032N069K428j577
2430B780n449l481K056N452K756k057l972j811N31J600K865K521j800n033k893
2445e935L392O080J699l414m537j263J883M107J919p54l056k858J32K708L733
2460C836Q52k674m645j551L309N000J028l408m115r48J979L009J825n42l297l437
2476c779K70L721L092r4l101l398j111K899L696J503k803m645q76L031L056J176
2492B637j272k645k279l23L503M158m62l888l457K79L461L546N69l057l432o16
2508c278K467L101J018j249k574j693l01L398L599m5m764l648J894L866J582j098
2524B275j764j744j132R66L512J991k252l656j362J556K618J872q61l390k788
$$ plain form
2539 -4159 -2653 536 2579 1467 -919 -2611 -2860 -1530 868 2480 943 -2628 -3812 -1521 1588
2554 1588 2324 853 -1322 -3100 -2068 740 2636 1542 -827 -1624 -1140 282 1393 2492 1597 -790
2570 -790 -2669 -1134 2447 3752 1375 -1378 -1908 184 1919 2022 897 77 -293 -1444 -394 1273
2586 1273 2715 1031 -1858 -2914 -44 2220 1648 -427 -2110 -1959 -462 694 285 -746 -613 -965
2602 -965 -2102 -1173 609 1984 -78 -2910 -2450 509 1470 324 -662 -828 -689 -1014 321 1341 501
2619 501 -713 -505 385 -64 844 2061 1388 -1292 -1736 1296 2863 1077 -837 51 1132 -56 -133
2636 -133 1301 1631 216 -429 261 -30 -247 1219 1678 -688 -1984 39 2022 -35 -2516 -511 1694
2653 1694 -88 -2780 -1233 1543 241 -2032 -1673 528 -51 -1161 -346 128 -869 -744 717 -123 -1688
$$ packed form
2539d159J506L189K043j112k386j692k49J330K398J612j537l571j184K291L109
2554A588P36j471k175j778J032K808J896j094k369p97M84J422J111J099q95k387
2570g90j879J535L581J305k377k753n30K092J735J03j125q20l70j151J050J667
2586A273J442j684k889j056K870K264n72k075j683J51J497J156m09j031J33l52
2602i65j137R29J782J375k062k832M60K959R61j146r86j66J39l25J335J020q40
2619E01j214K08Q90m49R08J217o73k680m44L032J567j786j914Q88J081j188p7
2636a33J434L30j415o45O90k91k17J466M59k366j296K023J983k057k481K005K205
2653A694j782k692J547K776j302k273L59K201n79j110Q15M74r97J25J461q40j565
$$ plain form
2670 -1688 -658 1960 1264 -2032 -1402 2010 1730 -1577 -886 2045 1616 -937 -318 1769 1261 -801 -75
2687 -75 1814 583 -847 699 1625 -505 -1437 1512 2950 -327 -2294 -127 2001 437 -1260 488
2703 488 1114 -1225 -2192 -4 1484 -27 -883 -619 -1596 -2227 269 2437 116 -3129 -1866 1002 -91
2720 -91 -1065 481 2011 -563 -3286 -1593 2402 2223 -302 -1481 -751 -529 142 1667 1703 -25 -865
2737 -865 -159 389 831 1706 1732 229 -1912 -691 2376 2541 315 -1015 -299 575 585 1324 1198 415 -1320
2756 -1320 -692 321 1673 873 -214 -1516 -1590 -522 1264 1247 -538 -2190 -2391 -531 1058 950 -254
2773 -254 -1307 -1487 -1308 -809 1146 2018 -204 -3080 -3129 221 2556 1448 -330 -1412 -1645 -406 1645
2790 1645 2576 1245 -900 -1324 -580 504 2274 3081 713 -3152 -2823 1975 4280 1428 -1131 -304
$$ packed form
2670a688J030K618o96l296O30L412k80l307O91K931m29k553O19K087n08k062P26
2687g5J889j231j430J546R26k130r32K949J438l277j967K167K128j564j697J748
2703D88O26k339r67K188J488j511q56K64r77o31K496K168k321l245J263K868j093
2720i1r74J546J530k574k723J693L995j79k525j179P30K22O71J525L6j728q40
2737h65P06N48M42Q75K6j503k141J221L067J65k226j330P16Q74J0P39j26p83j735
2756a320O28J013J352q00j087j302p4J068J786j7j785j652k01J860J589j08j204
2773b54j053j80J79M99J955Q72k222k876m9L350K335j108j778j082k33J239K051
2790A645R31j331k145m24P44J084J770Q07k368l865L29M798K305k852k559Q27
$$ plain form
2806 -304 22 -875 755 3514 2299 -2116 -3353 -896 1688 1819 1491 -206 -3013 -3647 476 3640
2822 3640 1443 -2197 -2565 -1208 -1179 -260 2203 2114 -2304 -4864 -1677 2139 2253 501 -934 -2458 -3164
2839 -3164 -74 3699 2434 -1612 -2967 -92 732 519 1653 2370 -431 -3500 -1199 3580 3944 507
2855 507 -1350 -1201 -391 1695 3185 1667 -1440 -2320 -386 1523 1277 1716 1499 -2023 -4251 -908 4370
2872 4370 3982 -965 -3938 -2714 -96 1591 2338 1160 -2205 -4180 -2332 652 2115 2052 11 -3281
2888 -3281 -4479 -1169 3941 3740 -697 -3680 -2633 -751 1409 2297 1923 -1026 -3137 -1624 840 2685
2904 2685 2530 757 -1860 -2702 -215 3763 3711 233 -2601 -1446 811 1765 1818 1241 -254 -1910 -1008
2921 -1008 1065 2317 1668 -138 -2420 -2513 922 3691 2043 -2434 -3493 -1034 1091 1074 553 249 -1438
$$ packed form
2806c04L26q97J630K759j215m415j237K457K584J31l28j697k807o34M123L164
2822C640k197l640l68J357K9R19K463q9m418k560L187L816J14j752j435j524p06
2839c164L090L773j265m046j355K875Q24k13J134P17k801l069K301M779L64l437
2855E07j857J49Q10K086J490j518l107q80J934J909k46M39k17l522k228L343N278
2872D370l88m947k973J224K618J687P47j178l365j975J848K984J463o3k041l292
2888c281j198L310N110k01m437k983J047J882K160Q88l74k949k111J513K464J845
2904B685j55j773k617q42K487L978n2l478k834J155K257R54N3n77j495j656R02
2921a008K073J252o49j806k282r3L435K769j648m477j059K459K125j7n21l04j687
$$ plain form
2938 -1438 -3325 -1741 1607 2844 263 -2740 -3208 -1704 818 3102 1647 -2040 -3797 -1438 1205
2953 1205 1705 1302 607 -912 -2886 -1492 2379 3941 1362 -2028 -2488 -168 1408 3031 2206 -162
2969 -162 -2180 -1275 1234 2194 1205 380 224 -1219 -853 1085 3178 1366 -1865 -2757 -285 1726 1536
2986 1536 -344 -1178 -1450 -996 433 868 557 -389 -1461 -1963 -1027 810 2084 -172 -2491 -2654 70
3003 70 2072 998 -793 -1476 -617 -563 -331 1029 1465 447 -1759 -1457 623 2328 1822 -402 -1480
3020 -1480 -656 764 1911 1628 -83 -515 -183 380 585 1257 1595 412 -1042 -1293 807 2451 1141
3037 1141 -939 -1334 -657 350 1047 774 -26 -1362 -1245 -600 220 449 -293 -177 -1528 -2470 -118 1661
3055 1661 788 -1674 -2319 -576 762 306 -262 368 95 -965 -801 470 1349 954 -168 -1195 -690
$$ packed form
2938a438j887J584L348J237k581l003m68J504K522K284j455l687j757K359K643
2953A205N00m03o95j519j974J394L871J562k579l390m60K320J576J623q25k368
2969a62k018R05K509R60r89q25j56j443L66J938K093j812l231q92K472K011j90
2986A536j880q34k72M54J429M35l11r46j072n02R36J837J274k256k319j63K724
3003G0K002j074j791o83Q59N4K32J360M36j018k206L02K080J705n06k224j078
3020a480Q24J420J147k83j711m32L32N63K05O72L38j183j454k51K100J644j310
3037A141k080l95O77J007O97k73q00j336J17O45Q20K29p42J16j351r42K352J779
3055A661q73k462o45J743J338m56n68O30k73j060J64J271Q79l95j122j027N05
$$ plain form
3072 -690 880 1978 881 -983 -944 926 1137 384 68 1100 1228 -292 -779 658 1900 890 -784
3089 -784 -460 242 885 736 99 -674 -581 151 534 -244 -435 -44 -73 -993 -1000 -311 711 -319 -1508 -1344
3109 -1344 -458 486 -263 -744 -920 -56 -46 -199 -340 -481 361 611 -202 -840 450 1042 544 -603 -531 616
3129 616 991 460 -555 -198 1095 969 168 -354 469 1496 859 -419 -750 954 1589 462 -779 25
3147 25 1204 801 -734 -553 882 1078 -3 -1478 -972 175 794 -272 -797 -932 -63 -198 -609 -1040
3165 -1040 -222 138 -663 -1559 -834 878 735 -428 -1360 -594 298 648 196 -660 -716 1 527 261 -37
3184 -37 547 619 -178 -640 177 1498 1453 59 -1462 -146 1322 1884 686 -562 -233 515 628 254 246
3203 246 1087 534 -1203 -1629 322 1977 1082 -1690 -2269 -586 1472 895 -598 -1358 -707 -484 -611 -196
$$ packed form
3072f90J570J098j097j864L9J870K11p53l16J032J28j520m87J437J242j010j674
3089g84L24P02O43j49o37p73R3P32L83p78j91L91k9r20pO89J022j030j189J64
3109a344Q86R44p49m81j76Q64J0j53j41j41Q42K50q13o38J290N92m98j147P2J147
3129F16L75n31j015L57J293j26q01n22Q23J027o37j278l31J704O35j127j241Q04
3147B5J179m03j535J81J435J96j081j475N06J147O19j066n25j35Q69j35m11m31
3165a040Q18L60q01q96P25J712j43j163r32P66Q92L50m52q56n6P17N26k66k98
3184c7N84P2p97m62Q17J321m5j394j521J316J468N62j198j248L29P48J13l74q
3203B46Q41n53j737m26J951J655q95k772n79J683K058n77j493p60O51K23j27M15
$$ plain form
3221 -196 239 467 -1203 -2276 -1157 1106 1668 137 -1997 -1567 -130 1143 1242 81 -742 -1000 -136
3238 -136 269 1192 1216 536 -790 -1332 128 1894 2409 95 -1624 -1051 938 1819 1508 448 -368 -1181
3256 -1181 -133 775 1404 1310 -20 -945 -1582 -498 1851 2296 -214 -2866 -1713 1080 1649 -135 -827
3273 -827 -725 -959 -1569 -574 1876 1465 -1209 -2682 -2023 97 2332 1294 -886 -2341 -1319 801 1617
3290 1617 440 -512 -413 -597 -1293 -188 3148 2131 -1168 -2602 -513 2101 2040 1044 -34 -1053 -1189
3307 -1189 348 2408 1802 -68 -1149 -478 245 454 1926 1763 -590 -2902 -1298 2223 2116 -189
3323 -189 -1355 -1608 -901 31 1571 1163 -985 -2242 -1433 -517 113 1096 1079 -1225 -3572 -1777 2419 2776
3341 2776 -712 -2556 -1036 519 81 600 1721 814 -1778 -2402 65 2657 2319 561 -1248 -2210
$$ packed form
3221a96M35K28j670j073J119K263N62j531k134M30J437J273R9j161q23k58Q64
3238a36M05R23K4o80j326n42J460J766N15k314j719N73J989Q81l11j060q16q13
3256a181J048R08O29r4j330r25o37J084K349M45k510k652J153K793N69j784o92
3273h27J02k34o10R95K450m11k674j473O59K120K235j038k180j455J022K120Q16
3290A617j177r52R9j84o96J105L336j017l299j434K089K614o1r96j078j019j36
3307a189J537K060o06j870j081O71P23K09J472j63k353k312J604L521j07k305
3323a89j166k53P07R32J540m08k148j257Q09R16O30R83j7k304k347J795M196L57
3341B776l488j844J520J555m38N19J121r07k592o24K467K592l38j758j809r62
$$ plain form
3357 -2210 -586 2298 2758 334 -1717 -884 696 578 556 1836 1260 -1341 -2708 570 3129 2110
3373 2110 -645 -1593 -1194 81 934 1628 303 -2034 -1915 -427 658 495 612 -399 -1547 -2484 -534
3390 -534 2181 1911 -1256 -3111 -1923 743 1699 795 -338 -1634 -1309 -249 964 1455 847 -60 -1511
3407 -1511 -1885 278 3343 2901 -812 -3041 -777 1980 2489 902 -41 -226 -958 -609 561 2522 2285
3424 2285 -586 -2378 -1598 1152 2677 1733 -751 -2188 -1202 826 1157 603 -378 -801 -1374 -1787 58
3441 58 1689 1081 -1437 -2748 -1087 963 1522 156 -1506 -1598 -1171 309 1023 416 -666 -904 -886 -406
3459 -406 620 1338 699 -849 -2177 -453 2053 2305 231 -1578 -1600 53 1843 1822 788 -235 -536
3476 -536 -613 13 1023 2281 1158 -1583 -2665 82 2838 2188 -486 -1813 -822 63 574 803 910
$$ packed form
3357b210J624K884M60k424k051Q33J580j18k2J280n76k601j367L278K559j019
3373B110k755r48L99J275Q53O94j325k337J19J488J085j63J17j011j148r37J950
3390e34K715k70l167j855J188K666R56r04j133j296L25J060J213M91o08r07j451
3407a511l74K163L065m42l713k229K264K757N09j587r43j85p32L49J170J961k37
3424B285k871j792P80K750J525r44k484j437R86K028L31n54r81m23n73m13J845
3441E8J631o08k518j311J661K050N59j366j662r2M27J480P14o07j082k38J8M80
3459d06J026P18o39j548j328J724K506K52k074j809k2J653J790k1j034j023l01
3476e36p7O26J010J258j123k741j082K747K756o50k674j327R91Q85N11K29J07
$$ plain form
3493 910 -408 -1290 -1477 -906 996 1919 179 -2357 -2679 -115 1919 878 -1129 -1506 -499 -366 -608
3510 -608 809 1274 -251 -1832 -1123 453 1108 957 525 -835 -1589 148 2314 1757 -971 -1157 643
3527 643 799 -524 301 1772 959 -1343 -725 1152 1323 409 168 21 -795 -251 1411 1044 -1031 -1432
3545 -1432 960 1588 -956 -1545 651 832 -1676 -2014 840 1925 -1031 -2514 -875 492 64 60 434
3562 434 -952 -1850 -423 1146 247 -845 872 465 -2323 -1991 1469 3108 120 -2125 -550 1053
3578 1053 249 -212 1352 1397 -565 -1481 461 1148 448 1001 1458 -361 -1955 -2 2470 1370 -338
3595 -338 -1 951 -393 -1542 331 1937 1029 -1146 -763 -73 -478 -228 1669 566 -1425 -1253 627
3612 627 -13 -1363 -418 1729 449 -2474 -1751 825 1301 -987 -968 128 223 -544 -398 161 248 339 512
$$ packed form
3493I10j318q82j87N71J902R23j740k536l22K564K034j041k007l77J007J33k42
3510f08J417M65j525j581P09J576O55j51m32j360p54J737K166n57k728j86J800
3527F43J56j323Q25J471q13k302O18J877J71r14k41j47q16N44J662l67k075m01
3545a432K392O28k544n89K196J81k508l38K854J085k956j483J639J367m28mL74
3562D34j386q98J427J569q99j092J717m07k788L32L460J639k988k245J575J603
3578A053q04m61J564M5j962r16J942O87p00N53M57j819j594J953K472j100j708
3595c38L37R52j344j149J873J606r08k175L83O90m05K50J897j103j991J72J880
3612F27o40j350R45K147j280k923P23K576M76k288J9J096R5p67J46N59Q7R1J73
$$ plain form
3631 512 -96 -1225 -155 1517 765 -1023 -411 1703 843 -1416 -757 1426 1791 -326 -918 524 394
3648 394 165 443 618 571 -69 -135 -442 -660 808 1885 378 -1648 -1708 145 926 310 80 -280 -1227
3667 -1227 -1573 -759 511 458 99 -783 -1547 -1897 -40 2281 1359 -1409 -2298 -513 729 215 255 648
3685 648 156 -1028 -1114 643 1326 1348 295 -894 -1313 326 2473 1652 -1298 -1308 753 1455 -10 -70
3703 -70 1626 837 -1427 -1246 1304 2328 490 -1256 -910 -29 836 1318 860 -833 -1623 -135 993
3720 993 591 -79 513 -493 -2282 -1764 1881 2235 -144 -2190 -1354 -420 360 997 950 -953 -2427 -1306
3738 -1306 983 1570 151 -366 -390 -1294 -1488 1559 3146 1311 -2057 -2255 342 2290 1755 865 -377
3755 -377 -1200 -781 1197 1827 1493 803 -1004 -1879 -916 2107 3289 639 -2725 -2501 25 2098 1296
$$ packed form
3631E12o08j129J070J672p52j788O12K114q60k259O59K183L65k117n92J442j30
3648C94k29K78J75m7o40o6l07k18J468J077j507k026o0J853P81o16k30l60r47
3667a227l46Q14J270n3l59q82p64l50J857K321r22k768q89J785J242n14M0L93
3685F48m92j184q6J757O83K2j053j189m19J639K147q21k950j0K061P02j465o0
3703g0J696p89k264J81K550J024j838j746L46Q81Q65M82m58j693p90J488J128
3720I93m02o70N92j006j789N18L645L54k379k046Q36R34P80O37m7j903j474J121
3738a306K289N87j419n17k4r04j94L047J587j835l368j98K597J948n35q90j242
3755c77q23M19J978O30l34o90j807q75R63L023J182k650l364K24K526K073q02
$$ plain form
3772 1296 11 -837 -1374 -1449 -194 1897 2177 -92 -2605 -2728 -207 2266 2167 -429 -2774 -2408 -332
3789 -332 1800 1490 422 -879 -1900 -1620 738 2915 2124 -575 -2339 -1768 485 2536 2468 -131 -2290
3806 -2290 -2028 637 2527 1893 441 -905 -1596 -1005 1062 2725 1994 -790 -2751 -2090 1245 3214
3822 3214 2366 -734 -2800 -2003 637 2346 1793 -245 -1252 -2039 -1406 609 2377 2035 -1922 -3490
3838 -3490 -2237 1460 3085 629 -1432 -2382 -1781 65 1381 1837 438 -1659 -2636 -939 1486 2924
3854 2924 1014 -1800 -3168 -1261 2204 3106 1250 -1092 -1918 -1023 412 2296 2565 956 -1839 -2576
3870 -2576 93 2368 2682 492 -1568 -2071 -749 1675 3041 1339 -1756 -2574 -600 1039 1472 1145
3886 1145 -124 -1823 -2708 -804 2063 2796 10 -2776 -2997 -632 1939 2055 159 -1918 -1992 -780
$$ packed form
3772A296j285q48n37p5J255K091K80k269k513j23K521K473r9k596k345L66K076
3789c32K132l10j068j301j021K80K358K177p91k699j764N71K253K051o8k599k159
3806b290K62K665J890o34j452j346o91N91K067J663p31k784j961O61L335J969
3822C214q48l100k066P97K640J709n53k038j007p87O33K015J768l42l957j568
3838c490J253L697J625k456k061r50O01J846J316M56j399k097r77J697K425J438
3854B924j910k814j368J907L465R02j856k342q26Q95J435J884K69j609k795p37
3870b576K669K275L14k190k060n03J322K424J366j702l095q18J974J639M33l27
3886A145j269j699q85J904K867P33k786k786k21K365K571J16j896k077p4J212
$$ plain form
3902 -780 433 1148 989 59 -1649 -2568 -854 2580 3179 -420 -3040 -1648 1178 1786 1125 556 -607
3919 -607 -1298 -1178 634 2473 1584 -575 -1776 -1204 474 2302 2281 -453 -2235 -1495 869 1674 1124
3936 1124 270 -618 -967 -1544 539 2194 1429 -1525 -2372 -990 269 1036 1123 -226 -1950 -2203 354
3953 354 1953 636 -997 -1167 -35 -536 3 1442 1591 -748 -2675 -1429 1542 1914 543 -773
3969 -773 -1251 -851 501 1505 1077 -342 -786 -394 -268 -72 1453 1925 -315 -2397 -659 2025 2320
3986 2320 -250 -1141 -413 185 -94 326 1193 408 -953 -1355 -17 847 1060 493 -852 -1883 -823 747
4004 747 1309 -398 -1460 -1114 -373 67 -30 591 -57 -802 -1157 -671 539 908 -40 -904 -1325 -489 845
4023 845 1200 410 -646 -764 379 784 547 335 562 90 -763 -999 736 2037 917 -1201 -1146 685
$$ packed form
3902g80J213P15j59r30j708r19J714L434N99l599k620J392K826O08o61n69j163
3919f07o91J20J812J839q89k159j201N72J678J828k1k734j782P40K364Q05n50
3936A124q54q88l49n77K083J655p65k954q47J382J259P67Q7j349j724k53K557
3953C54J599j317j633j70J132n01N39J439J49k339j927J246K971L72j371j316
3969g73m78M00J352J004m28j419m44L92J26J96J525M72k240k082J738K684K95
3986B320k570q91P28N98k79M20Q67p85j361m02J338Q64K13n67j345j031J060J570
4004G47N62j707j062L46P41M40r7O21o48p45l55M86J210L69r48q64m21Q36J334
4023H45L55p90j056j18J143M05k37k12K27m72q53k36J735J301j120k118N5J831
$$ plain form
4041 685 1428 473 -34 -169 321 -442 -370 402 876 509 -260 -969 -691 349 820 166 -1173 -861 332
4060 332 365 -827 -1126 317 655 -689 -1056 -18 809 -643 -1026 -282 270 -295 -784 34 289 -189 67
4079 67 475 233 -727 -66 950 428 -524 -395 723 784 -518 -72 623 623 -356 214 348 243 120 348
4099 348 480 -98 282 623 196 -863 -470 1372 1400 -937 -1282 -248 654 -460 -210 321 70 -1195
4117 -1195 -1420 -290 811 947 110 -1266 -1918 -902 1120 1315 193 -459 -464 -585 -793 320 1810 1065
4135 1065 -1221 -2056 -543 1314 1286 861 -264 -963 -716 246 1399 1001 330 -127 -487 -713 1062 1966
4153 1966 1081 -957 -1025 -91 742 721 971 -162 -1318 -936 1092 1632 -158 -1052 -239 -307 -735 296 1872
4172 1872 480 -2656 -2489 614 2216 635 -1163 -1423 -1456 -930 951 2341 316 -2010 -1172 -589 -32
$$ packed form
4041F85P43r55n07j35M90p63P2P72M74l67p69p09K78J040M71o54j339L12J193
4060C32L3j192k99J443L38j344l67J038Q27j452l83P44N52n65m89Q18K55m78K56
4079F7M08k42r60O61J016n22r52J29J118O1j302M46O95%r79N70J34j05j23K28
4099C48J32n78L80L41m27j059L93J842K8k337l45J034R02j114K50N31k51j265
4117a195k25J130J101J36q37j376o52J016K022J95j122o52nj21k08J113J490p45
4135A065k286q35J513J857k8m25j125o99K47R62J153l98o71m57l60k26J775R04
4153A966q85k038o8R34Q33k1K50j133j156L82K028N40j790q94Q13o8m28J031J576
4172A872j392l136J67L103J602j581j798k60l3N26J881J390k025k326Q38N83N57
$$ plain form
4189 -32 973 2706 472 -3117 -3431 1411 4253 1347 -1414 -564 -21 -1168 66 3339 2792 -1691
4205 -1691 -3182 -342 1617 1424 1366 1189 -1764 -3139 273 3654 2062 -1489 -1548 50 -35 -402 2321
4222 2321 2371 -1552 -4076 -1066 2436 1424 -493 -555 -860 -2562 -955 3013 3052 -1836 -3887 -990 1356
4239 1356 279 471 1682 -252 -3558 -2330 2338 3425 85 -1868 -1503 -930 -98 2142 2846 -462
4255 -462 -2916 -1415 1358 2036 466 1385 76 -2372 -1935 2204 4266 447 -2976 -1412 719 978
4271 978 1296 1674 255 -2909 -2449 1110 2993 1132 -608 -1684 -2410 -1273 1969 3406 726 -3018
4287 -3018 -3143 -155 1248 1874 1354 -414 -3029 -2977 326 2915 2242 -536 -1862 -2516 -1562 1508 3359
4304 3359 1861 -1816 -3095 -1090 1331 1816 1365 185 -1298 -2390 -291 2022 2786 573 -1305 -2150
$$ packed form
4189c2J005J733k234l589l14M842K842k906k761Q50N43j147J234L273n47m483
4205a691j491K840J959j93n8j77k953j375L412L381j592l551n9J598q5l67K723
4222B321N0l923k524L010L502j012j917o2l05j702J607L968L9m888k051K897K346
4239A356j077J92J211j934l306J228M668J087l340j953L65N73Q32K240P04l308
4255d62k454J501K773O78j570R19j309k448M37M139K062l819l423J564K131K59
4271I78L18L78j419l164M60L559J883j861j740j076p26J137L242J437k680l744
4287c018j25K988J403O26n20j768k615N2L303K589o73k778j326o54R54L070J851
4304C359j498l677j279K005K421M85m51j180j483j092K099K313P64k213j878q45
$$ plain form
4320 -2150 -296 1649 2639 499 -1547 -1258 -21 1283 1151 675 -36 -1324 -1568 -54 2374 1462 -778
4337 -778 -2244 -1684 538 2154 1300 -844 -2210 -2240 -419 1095 1799 609 -995 -3123 -1806 1074
4353 1074 2962 1409 -1270 -2811 -1616 215 1821 2308 408 -2018 -2823 -630 2013 2929 1180 -924
4369 -924 -1912 -1877 586 2646 2546 93 -1976 -1923 381 1825 2248 784 -1071 -1493 -606 974 1746 1307
4387 1307 -325 -1632 -1397 309 1628 1462 -719 -2202 -1402 674 1583 723 -560 -1336 -1507 -700 857
4404 857 1472 597 -1188 -2207 -1115 1281 2174 396 -1272 -1778 -986 830 1486 1252 -61 -1415 -1440
4421 -1440 -430 1510 1929 757 -1411 -2130 -595 1428 2026 857 -675 -1191 -649 688 1802 1903
4437 1903 -136 -1242 -1124 -194 1128 1599 1053 -888 -1813 -827 1175 1647 298 -1267 -1335 -1089 268
$$ packed form
4320b150J854J945R90k140k046K89J237J304j32m76p11j288k44J514K428r12k240
4337g78j466N60K222J616q54k144j366l0J821J514P04j190j604k128J317K880
4353A074J888j553k679j541J195J831J606M87j900k426q05K193K643R16j749k104
4369i24r88L5K463K060j00k453k069N3K304J444M23j464j855m22Q87J580P72m39
4387A307j632j307K35J706J319j66k181j483Q00K076R09q60j283p76j71Q07J557
4404H57O15q75j785j019J092K396Q93j778j668n06P92J816O56k34j313j354k5
4421a440J010J940M19j172k168p19J535K023N98j169j532n16N42J337J114J01
4437A903k039j106J18R30J322M71n46j941r25R86K002M72j349j565o8K46J357
$$ [...]
8191C82
##END NTUPLES=NMR FID
##END=
