##TITLE=1H_ADM40207
 CDCl3, 8 sc, 
 3.7.2019
##JCAMPDX= 6.0         $$ Bruker NMR JCAMP-DX V2.0
##DATA TYPE= NMR FID
##DATA CLASS= NTUPLES
##ORIGIN= UXNMR, Bruker Analytische Messtechnik GmbH
##OWNER= root
$$ XWIN-NMR		Version 3.5
$$ Wed Jul  3 13:50:22 2019 Russian Standard Time (UT+4h)  she@DPX200
##.OBSERVE FREQUENCY= 200.13155
##.OBSERVE NUCLEUS= ^1H
##.DELAY= (6, 6)
##.ACQUISITION MODE= SIMULTANEOUS
##.ACQUISITION SCHEME= undefined
##.AVERAGES= 8
##.DIGITISER RES= 18
##SPECTROMETER/DATA SYSTEM= spect
##.PULSE SEQUENCE= zg30
##.SOLVENT NAME= THF
##.SHIFT REFERENCE= (INTERNAL, THF, 0, 15.7039)
##AUDIT TRAIL= $$ (NUMBER, WHEN, WHO, WHERE, WHAT)
$$ ##TITLE= Audit trail, XWIN-NMR		Version 3.5
$$ ##JCAMPDX= 5.01
$$ ##ORIGIN= Bruker BioSpin GmbH
$$ ##OWNER= she
$$ F:/spectra/data/she/nmr/H-F/1/audita.txt
$$ ##AUDIT TRAIL=  $$ (NUMBER, WHEN, WHO, WHERE, WHAT)
(   1,<2019-07-03 13:48:45.20 +0400>,<she>,<DPX200>,
      <created by zg, POWCHK disabled, PULCHK disabled
       configuration hash MD5:
       00 E9 B6 7A A2 85 ED C7 34 08 36 98 17 FE 4E 26
       data hash MD5: 16K
       50 E1 7A 9F 43 44 74 B6 1B E3 36 50 78 B3 DD 04>)
$$ ##END=
$$ 
$$ hash MD5
$$ F2 FE B5 C0 90 BB 2F 92 4E D1 2E 80 C7 8F EC 61
##$RELAX= 
##$RELAX= 
##$RELAX= 
##$RELAX= 
##$RELAX= 
##$RELAX= 
$$ Bruker specific parameters
$$ --------------------------
##$DU= <F:/spectra>
##$EXPNO= 1
##$NAME= <H-F>
##$PROCNO= 1
##$TYPE= <nmr>
##$USER= <she>
##$AMP= (0..31)
100 100 100 100 100 100 100 100 100 100 100 100 100 100 100 100 100 100 
100 100 100 100 100 100 100 100 100 100 100 100 100 100 
##$AQSEQ= 0
##$AQ_mod= 1
##$AUNM= <au_zg>
##$AUTOPOS= <>
##$BF1= 200.13
##$BF2= 200.13
##$BF3= 200.13
##$BF4= 200.13
##$BF5= 200.13
##$BF6= 200.13
##$BF7= 200.13
##$BF8= 200.13
##$BYTORDA= 1
##$CFDGTYP= 0
##$CFRGTYP= 5
##$CHEMSTR= <none>
##$CNST= (0..31)
1 1 145 1 1 1 1 1 1 1 1 1 1 1 1 1 1 1 1 1 1 1 1 1 1 1 1 1 1 1 1 1 
##$CPDPRG= <>
##$CPDPRG1= <>
##$CPDPRG2= <>
##$CPDPRG3= <>
##$CPDPRG4= <mlev>
##$CPDPRG5= <mlev>
##$CPDPRG6= <mlev>
##$CPDPRG7= <mlev>
##$CPDPRG8= <mlev>
##$CPDPRGB= <>
##$CPDPRGT= <>
##$D= (0..31)
0 1.2 0 0 0 0 0 0 0 0 0 0.03 0 0 0 0 0 0 0 0 0 0 0 0 0 0 0 0 0 0 0 0 
##$DATE= 1562147324
##$DBL= (0..7)
120 120 120 120 120 120 120 120 
##$DBP= (0..7)
150 150 150 150 150 150 150 150 
##$DBP07= 0
##$DBPNAM0= <>
##$DBPNAM1= <>
##$DBPNAM2= <>
##$DBPNAM3= <>
##$DBPNAM4= <>
##$DBPNAM5= <>
##$DBPNAM6= <>
##$DBPNAM7= <>
##$DBPOAL= (0..7)
0.5 0.5 0.5 0.5 0.5 0.5 0.5 0.5 
##$DBPOFFS= (0..7)
0 0 0 0 0 0 0 0 
##$DE= 6
##$DECBNUC= <off>
##$DECIM= 24
##$DECNUC= <off>
##$DECSTAT= 4
##$DIGMOD= 1
##$DIGTYP= 9
##$DL= (0..7)
0 120 120 120 120 120 120 120 
##$DP= (0..7)
150 150 150 150 150 150 150 150 
##$DP07= 0
##$DPNAME0= <>
##$DPNAME1= <>
##$DPNAME2= <>
##$DPNAME3= <>
##$DPNAME4= <>
##$DPNAME5= <>
##$DPNAME6= <>
##$DPNAME7= <>
##$DPOAL= (0..7)
0.5 0.5 0.5 0.5 0.5 0.5 0.5 0.5 
##$DPOFFS= (0..7)
0 0 0 0 0 0 0 0 
##$DQDMODE= 0
##$DR= 18
##$DS= 0
##$DSLIST= <SSSSSSSSSSSSSSS>
##$DSPFIRM= 0
$$ [...]
##$SUBNAM2= <"">
##$SUBNAM3= <"">
##$SUBNAM4= <"">
##$SUBNAM5= <"">
##$SUBNAM6= <"">
##$SUBNAM7= <"">
##$SUBNAM8= <"">
##$SUBNAM9= <"">
##$SW= 24.9336996594482
##$SWIBOX= (0..15)
0 0 2 0 0 0 0 0 0 0 0 0 0 0 0 0 
##$SW_h= 4990.01996007984
##$TD= 16384
##$TD0= 1
##$TE= 0
##$TE2= 300
##$TE3= 300
##$TEG= 300
##$TL= (0..7)
0 120 120 120 120 120 120 120 
##$TP= (0..7)
150 150 150 150 150 150 150 150 
##$TP07= 0
##$TPNAME0= <>
##$TPNAME1= <>
##$TPNAME2= <>
##$TPNAME3= <>
##$TPNAME4= <>
##$TPNAME5= <>
##$TPNAME6= <>
##$TPNAME7= <>
##$TPOAL= (0..7)
0.5 0.5 0.5 0.5 0.5 0.5 0.5 0.5 
##$TPOFFS= (0..7)
0 0 0 0 0 0 0 0 
##$TUNHIN= 0
##$TUNHOUT= 0
##$TUNXOUT= 0
##$USERA1= <user>
##$USERA2= <user>
##$USERA3= <user>
##$USERA4= <user>
##$USERA5= <user>
##$V9= 5
##$VALIST= <valist>
##$VCLIST= <CCCCCCCCCCCCCCC>
##$VD= 0
##$VDLIST= <DDDDDDDDDDDDDDD>
##$VPLIST= <PPPPPPPPPPPPPPP>
##$VTLIST= <TTTTTTTTTTTTTTT>
##$WBST= 1024
##$WBSW= 4
##$XGAIN= (0..3)
0 0 0 0 
##$XL= 0
##$YL= 0
##$YMAX_a= 560574
##$YMIN_a= -890650
##$ZGOPTNS= <>
##$ZL1= 120
##$ZL2= 120
##$ZL3= 120
##$ZL4= 120
##$ABSF1= 10
##$ABSF2= 0
##$ABSG= 5
##$ABSL= 3
##$ALPHA= 0
##$AQORDER= 0
##$ASSFAC= 0
##$ASSFACI= 0
##$ASSFACX= 0
##$ASSWID= 0
##$AUNMP= <proc_1d>
##$AZFE= 0.1
##$AZFW= 0.1
##$BCFW= 1
##$BC_mod= 2
##$BYTORDP= 1
##$COROFFS= 0
##$CY= 11.3945322036743
##$DATMOD= 1
##$DC= 2
##$DFILT= <>
##$DTYPP= 0
##$F1P= 18.9103706918063
##$F2P= -1.10871071338519
##$FCOR= 0.5
##$FTSIZE= 0
##$FT_mod= 4
##$GAMMA= 1
##$GB= 0.15
##$INTBC= 1
##$INTSCL= 1
##$ISEN= 128
##$LB= 0.24
##$LEV0= 0
##$LPBIN= 0
##$MAXI= 10000
##$MC2= 0
##$MEAN= 0
##$ME_mod= 0
##$MI= 1.114404
##$NCOEF= 0
##$NC_proc= 0
##$NLEV= 6
##$NOISF1= 3.799351
##$NOISF2= 2.8
##$NSP= 1
##$NTH_PI= 0
##$NZP= 0
##$OFFSET= 15.70392
##$PC= 1
##$PHC0= -8498.987
##$PHC1= 10.40097
##$PH_mod= 1
##$PKNL= yes
##$PPARMOD= 0
##$PSCAL= 0
##$PSIGN= 0
##$REVERSE= no
##$SF= 200.130013532006
##$SI= 16384
##$SIGF1= 3
##$SIGF2= 2
##$SINO= 400
##$SIOLD= 16384
##$SREGLST= <1H.CDCl3>
##$SSB= 0
##$STSI= 0
##$STSR= 0
##$SW_p= 3612.71676300578
##$SYMM= 0
##$S_DEV= 0
##$TDeff= 0
##$TDoff= 0
##$TI= <>
##$TILT= no
##$TM1= 0
##$TM2= 0
##$TOPLEV= 0
##$USERP1= <user>
##$USERP2= <user>
##$USERP3= <user>
##$USERP4= <user>
##$USERP5= <user>
##$WDW= 1
##$XDIM= 8192
##$YMAX_p= 0
##$YMIN_p= 0
$$ End of Bruker specific parameters
$$ ---------------------------------
##NTUPLES= NMR FID
##VAR_NAME=  TIME,          FID/REAL,        FID/IMAG
##SYMBOL=    X,             R,               I
##VAR_TYPE=  INDEPENDENT,   DEPENDENT,       DEPENDENT
##VAR_FORM=  AFFN,          ASDF,            ASDF
##VAR_DIM=   8192,          8192,            8192
##UNITS=     SECONDS,       ARBITRARY UNITS, ARBITRARY UNITS
##FACTOR=    0.0002004,     1,               1
##FIRST=     0,             0,               0
##LAST=      1.6414764,     0,               0
##MIN=       0,             -890650,         0
##MAX=       1.6414764,     560574,          0
$$ Real data points
##PAGE= N=1
##DATA TABLE= (X++(R..R)), XYDATA
$$ [...]
2815H248m696k624l416n249L064J1119M144q280p583J47O41K339Q680N542j0079
2830A997j5656J483J5604O306n556m979j790m264r78J0108Q714n658j1335k319
2844h323M331L463M888L993n612j2241j496J3482Q116o421p479q60J689O98M465
2859B693N446l592r913k758O639P061K157k518p779p703L536J3922N715r137j0570
2874f801q09N031L878M535L067n388j2446l797J0346J2210J343q547j0185m418
2888a1981N852J2013N670o499j0223m088K712N952O977L169o893j1790k848R145
2902b832J0994J367p205q485l116N206Q799M508m844q262k961L190N097M570P04
2917F730n809p997RQ485P268j522p683o363N37O835P059O0p336o739M89N804M269
$$ y = [8248, 3552, 928, -2488, -7737, -4673, 6446, 10590, 2310, -5273, -5126, -4485, -2146, 6534, 12076, 1997, -13659, -12176, 3428, 9734, 4178, -801, -2591, -6855, -7833, 2275, 10989, 5331, -6004, -8323, -3992, -529, 4359, 8352, 2740, -9501, -10997, 2485, 10601, 4180, -3299, -4159, -2470, -1772, 2693, 8139, 4547, -5366, -8124, -1485, 5576, 7733, 5215, -2564, -10267, -6731, 7191, 12906, 3769, -6801, -7610, -2579, 1299, 5834, 8901, 3513, -8933, -12730, -2384, 9826, 11169, 2622, -7563, -11981, -6129, 5884, 11554, 5055, -5168, -9256, -6544, -592, 6385, 9554, 2661, -9129, -11977, -2832, 8162, 9529, 2324, -6161, -9277, -4071, 4728, 9236, 4392, -3870, -6831, -3641, 1456, 6026, 6730, 921, -7076, -7067, 1418, 8686, 7164, -519, -6882, -6345, 490, 7549, 7609, 273, -6466, -5977, -173, 4096]
2934D096K287j532p506p247K360J1480P473n904j0956m098M225O462N312J56o079
2949E29p830k024O735Q030K474m327q097n151L175R767P025m641j0020l675M177
2964c853N469K698Q38k984o103m042N667Q827J592o539o144k98L365M946K643
2979F082j590p064l838L805P012J088l216l173k136j151L079O434J966o963p957
2994g622J126P790M431j529l468m356k447K930N822L063l642n213j907R99K691
3009a332N207K708o255q341P82R275M268m162l897N3j4j503L314N236j087o377
3025b125l338L327M043J941k44l216m314N59N734L144l620m043J009J430j420
3040a133J174M627l61o700l575N025N533q75l461k297o50J23L460L553j723n430
$$ y = [4096, 6383, 4851, -2655, -9902, -7542, 3938, 11411, 5507, -5449, -9547, -5322, 1140, 6452, 6608, 529, -7301, -9325, -2590, 5440, 7914, 3587, -4510, -9661, -6486, 3281, 10306, 5665, -4355, -8030, -3853, 1616, 4314, 5152, 2168, -3935, -7977, -2310, 6517, 8109, 1570, -4574, -4872, -1507, 3439, 6082, 4492, -2572, -6410, -2605, 4407, 5495, 2279, -894, -3030, -4181, -1102, 5332, 7298, 335, -7622, -6496, 1294, 5725, 4196, 728, -3628, -6075, -3145, 2677, 5740, 2098, -3115, -5022, -4023, -1332, 3875, 6583, 328, -8013, -7231, 2044, 6312, 2150, -1747, -1694, -1708, -3211, 103, 5339, 4252, -2125, -5463, -2136, 1907, 3848, 3604, 388, -3926, -3367, 2367, 5511, 1891, -2152, -1143, 287, -1133, 41, 4668, 4307, -2393, -5968, -943, 4590, 3715, 254, -2043, -2693, -2570, 890, 4443, 2720, -2710]
3056b710j082K603J042R4K195N24m761m182L570O249R23m905l078J114J045J744
3072C85J397m85k132j034Q73M99N78K091N72l670l616L142N838m59n191j641L238
3089C85J910j638n46J023j05j468o23J003K030o7q21k755j070L064K929j282m260
3106b291q9L169P03j918n68J432m09j665j34J619J022q87p11r92j23J650J852
3123A660j397k123k41K477P17j909m62J593R88j447j146P52J329J11o05q20J14
3140d09J229N73j068j513J547K008o22l072m22K889J678k022k254R32J825m21
3156H78j252L07J245j12k251n64J869J833j78k531k254J297K824O16j711j718
3172a702J3J194R9K09P58J00j840j500P64L004J430j604k903j075K106L081K88
$$ y = [-2710, -3792, -1189, -147, -53, 2142, 2666, -2095, -6277, -2707, 3542, 4465, -440, -3518, -2404, -1359, 385, 1782, 1297, -835, -1869, -996, -497, 81, 2172, 2744, -926, -4542, -1400, 4438, 3979, -1212, -2853, 385, 2295, 657, 111, 1134, 1029, -439, -1062, -59, 1971, 1904, 1083, -1672, -2742, 322, 3251, 1969, -2291, -2380, 789, 1492, -426, -994, 438, 29, -1636, -1770, -151, 871, -16, -727, -1719, -1842, -192, 1660, 263, -1860, -2101, 376, 1093, -816, -1278, 315, 1303, -144, -1290, -538, 791, 902, 297, -523, -409, 820, 1393, 325, -1188, 359, 2367, 1745, -1327, -1749, 1140, 2818, 796, -1458, -526, 1299, 878, -374, -67, 1178, 1066, -1185, -1749, 120, 1953, 1775, -756, -3010, -1713, 1111, 1727, 16, -1702, -1689, -495, -396, -187, 571, 671, -1169, -2669, -1905, 1099, 2529, 925, -1978, -3053, -947, 2134, 2422]
3189B422j759k107OO31J717J179K75j507k488q55K216L480N59k546l422r52K900
3206b51L867O4k985k893K43J457J754J301l28k261l120n21L809L990n41m340m017
3223d772Q01M553L162j745l158j599J01J005K355K787n40n199l735K530N907K601
3239E054l176m635j641J498L692L082j24m219l404O28L143L238J117j616n009
3254b372l641L608O922J968m979m969o1K253K914K472J62m211n076J058N487L623
3270E158j297l447l498k412K844P110K560o180o983P08N437L189o83p69k800l931
3286d994q13O490N390k106o160l215R32L737N173J437n178p564Q65O811L892j985
3302B712j807r22l688j435N592P788k147r393l625M572N659J169n84k997m271
$$ y = [2422, 663, -1444, -1438, -807, 910, 2089, 2364, 857, -1631, -2486, -270, 3210, 3769, 1223, -2199, -3151, -251, 3616, 3680, 695, -2198, -1955, -498, 1256, 2557, 2229, -32, -3152, -3673, 136, 4126, 3585, -755, -4772, -3971, 582, 3744, 1999, -1159, -2758, -2657, -1652, 703, 3490, 2950, -2249, -5984, -3454, 2453, 5054, 1878, -2757, -4398, -2900, 792, 3874, 3750, -469, -3873, -3245, -102, 3136, 4253, 2637, -2372, -6013, -2405, 4517, 6485, 1506, -3463, -3524, -1271, 1643, 4115, 4277, 66, -5010, -3952, 1535, 5158, 3861, 414, -3084, -5496, -2652, 4458, 7018, 838, -6145, -5437, 0, 3189, 2506, 1737, -1063, -4994, -5807, 683, 6073, 3967, -2193, -5408, -4476, -739, 4434, 5871, 693, -6871, -6006, 805, 4697, 2712, 905, -17, -3705, -5140, 452, 8240, 6093, -3300, -6925, -2353, 3306, 4475, 3891, 894, -3377]
3317c377j919N331O133q87n207k762n93P83L555N679q32r341n061N616Q024J57
3333E299m310k579k277q83L598O288Q16o773n218J434L517L050K687r29o715o551
3349i546N161R926J421o594m340P57Q90J304M161L493m811p764M4O283M290L69
3365E044k758m683l882L365P674K591n579n588J010K428M95K336L046k998p629
3380e128j767P855N976k490n941k252L00J774M035L277l557o327j495M591L340
3395B191P02j60k530n549j119O738O618k072p404l450K657K894L423J754k427
3410B266o422k181M500N385J024k077l072l859j134O302P004j883p891l962L527
3425b473M248J733K49j041m621l317K446O319K125l300m095k763J216M967L931
$$ y = [-3377, -5296, 35, 6168, 5281, 74, -2688, -3281, -2498, 1057, 6736, 5904, -3437, -8498, -2882, 5142, 5299, 989, -1590, -3867, -4750, -1152, 5136, 5952, -821, -6039, -4605, -1088, 1962, 4649, 3720, -2995, -9546, -4385, 5541, 6962, 368, -3972, -3215, -2325, -1021, 3140, 6633, 1822, -5942, -5898, 385, 4675, 5044, 2286, -2397, -6279, -2914, 4760, 7351, 1772, -3816, -2806, -378, 117, 2453, 5499, 2501, -5128, -6895, 960, 6936, 4446, -1495, -3747, -3447, -1673, 2362, 5639, 2082, -4245, -5740, -1149, 2191, 2893, 2733, 203, -5346, -6465, 273, 6891, 4819, -2585, -6035, -3378, -484, 2939, 4693, 2266, -4156, -6337, -1837, 3548, 4572, 2495, -577, -4436, -5570, 732, 7736, 5853, -2038, -6000, -2473, 1775, 3508, 3757, 2716, -1905, -5222, -2776, 3543, 5668, 2368, -1727, -4490, -3274, 1693, 5624]
3440E624j577o516l169L727L767K47j00q59l254l502K946O642J236n711m347N82
3456d264L371K668J957j143n311l409L344N538J129k280k321k061j997L178O309
3471D708J346o293m750J591M027J870Q58l95m531l678L089N854M96k974j818l71
3487i71j930J370N398J961n742n101K526M912L95j902n14j253k139J074M319J054
3503C457l712k392Q12K67J337K835J464n882n047M187O830o57m230o69O55k413
3519c158j66N468L758m974n886J165L555J325J268J501l070n569J202N716J942
3534D077l447q70J757k337k846L947M784k268n487P24L599p66j598J657J038l028
3550a064j075L378J271l994j217L682J392l790n31L487j010l757N51N023Q86m432
$$ y = [5624, 4047, -2469, -5638, -1911, 1856, 2103, 2003, 1144, -2110, -5612, -2666, 3976, 5212, -499, -4846, -4264, -893, 1775, 3732, 2589, -2722, -6131, -2787, 2751, 3880, 1600, -721, -2782, -4779, -1601, 4708, 6054, -239, -4989, -3398, 629, 2499, 3357, 2962, -1569, -5247, -2158, 3696, 4192, 1218, -600, -971, -2901, -1531, 3867, 5828, 86, -5015, -2489, 2423, 2818, 916, 402, -851, -2990, -1916, 2403, 3457, -255, -2647, -1835, -1568, -231, 2604, 4068, -1814, -6861, -2674, 4156, 3499, -731, -1400, -745, -3158, -3324, 2144, 5902, 928, -4958, -3793, -238, 1087, 2355, 3856, 786, -4783, -3581, 2135, 4077, 630, -240, 1517, -820, -3666, 281, 5065, 2797, -2690, -1966, 1633, 867, -731, 926, 1964, -1064, -2139, 1239, 2510, -1484, -2701, 981, 2373, -1417, -1948, 1539, 529, -3228, -2677, 2346, 3232, -1200]
3566a200j937J727M52J67K552P01l178k901K163K316j207O62K501j317n326n72
3582d397N839K890l465k297J527K92k245J153L379L1k787q54M76p91J113K873
3598B737K59l354j948K152J506j787n1K717j22l711j167K849J586r66o23N61j389
3615g51j559J950J960j402j316J255o8j562n01K585J698k785j959J709J513j094
3631c27m07R73j76n73M59M67j049o00K006N19k087l76K045J032l002p75L393J327
3649B849j983k114J117R08n84O86J011j342j625M37P49J90K91J584j052l581o50
3666c109M285J925k416k090M98O59j295J119K755r37k894j384K238Q58q0J109
3682A241j7l236j638L160L757j950l103O54Q46p55J79K560R51l185k352K169K317
$$ y = [-1200, -3137, -1410, -958, -791, 1761, 2462, -716, -3617, -1454, 862, -345, 317, 2818, 1501, -3825, -4397, 1442, 4332, 867, -1430, 97, 389, -1856, -703, 2676, 2707, -80, -934, -458, -1249, -136, 2737, 2996, -358, -2306, -154, 1352, -435, -486, 2231, 2109, -1602, -2769, 80, 1666, 700, 77, 638, -751, -2310, -360, 1600, 198, -1118, 137, 69, -1493, -1994, 591, 2289, -496, -2455, -746, 767, -327, -734, 239, 63, -510, -51, 416, -633, -1233, 773, 1292, -795, -1171, 874, 1906, -1096, -1871, 1522, 2849, 866, -1248, -131, 777, 193, 879, 1890, 548, -1077, -640, 109, 299, 590, 2174, 1122, -2459, -3109, 1176, 3101, 685, -1405, -907, -248, -1543, -424, 2331, 1394, -1500, -2884, -646, 212, 132, 1241, 1224, -2012, -3650, -490, 3267, 1317, -1786, -1132, -286, -1041, -862, 1698, 2649, -536, -2888, -719, 1598]
3699A598L2l42j39j898j830K576L515j113l565l09J939k38j84K224P87l369l703
3716d019K466M415M86k593j993p74M13J603K509Q7l388k014O29J601J198J278
3732A904L15l344l634K136M977J167l217k246l89Q06J026J928J172k345l437l10
3748c491L436K202J58j335k738j755K014L994J632k867l499n58K215K303J217
3763B928m97k199k813j14L189L065r6k861l661o58L336L758J022l726l819l59
3779c505K120K970J708j108l112l115N3M306L630O5m953l530K61L856L730o3l352
3796c9k765r12K302L173J552p47m091k986J013M814L420j400m831k861J969L694
3812A305K481j98l075l476l00K983L404J251k253m400j767K072M672K653k527
$$ y = [1598, 1630, 1288, 1149, -749, -2579, -3, 3512, 2399, -1166, -1475, 464, 226, 42, 2266, 3053, -316, -4019, -1553, 2862, 3348, 755, -1238, -2012, -1599, 4, 2513, 2600, -788, -2802, -2173, -572, 626, 1904, 2219, -1125, -4759, -2623, 2354, 3521, 304, -1942, -2331, -1525, -499, 1429, 2601, 256, -3181, -3491, -55, 2147, 2305, 970, -1768, -3523, -1509, 2485, 4117, 1250, -2249, -2807, -592, 1711, 2928, 2431, 232, -2581, -2695, 494, 3559, 3463, 602, -3059, -3717, -381, 3377, 4399, 673, -3146, -3505, -1385, 1585, 3293, 2185, -927, -4042, -3989, 317, 3947, 4012, -941, -4471, -4210, -354, 3376, 3313, -39, -2804, -3716, -1414, 1759, 3311, 2564, -1527, -4513, -3500, 1314, 4734, 3334, -1497, -4358, -2389, 1305, 3786, 3588, 513, -2963, -3263, -280, 3124, 4375, 2122, -2278, -4045, -1973, 2699, 5352, 2825]
3827B825m924k336K218M543J912j562l261k814j59L245L951J64l276l832j200
3842d506K686M414K035k981n035k063L276M691J850l156l200j413M08K661L359
3857C026P68l360m735n48M780M011O6l541m003k72K993L799O67j830l720j278
3873c177J438K833K789l63l426m168K42N035L781j623m029k438O88K095K508J474
3889C659k111m045j230K136L686J242j881k609k824Q70M092K573j133m438j812
3904c825J519K428J685M77k021l000q76K364L624N28j896k652j325P45L656K677
3920D108j888m138j350K161K636M48k2q54k224j675K113L867P05k902l135Q8J983
3937g9K154M26q90k662j545J499K361Q48p84j264j758m24J368L203M80l116l032
$$ y = [2825, -2099, -4435, -2217, 2326, 4238, 2676, -585, -3399, -3558, -313, 3638, 3802, 526, -3306, -4506, -1820, 2594, 4629, 1648, -3387, -5450, -2174, 2517, 4367, 1211, -1989, -3402, -2994, -333, 3026, 3794, 434, -4301, -4849, -69, 3942, 4008, 467, -3536, -3808, -815, 2984, 3651, 1821, -1899, -3177, -1739, 1094, 3883, 3520, 94, -4074, -3832, 1203, 4984, 3361, -668, -3106, -2418, -323, 2185, 3659, 1548, -2497, -3727, -1591, 2095, 3337, 1456, -1153, -3977, -3107, 985, 3558, 2425, -2013, -3825, -2306, 122, 1807, 2284, 263, -2737, -3613, -1249, 2375, 2903, 1007, -1645, -2970, -2225, 1431, 4108, 2220, -1918, -3268, -1107, 1529, 1977, 1955, 1101, -1123, -2798, -685, 3182, 3887, 985, -2150, -2062, -79, 2075, 2501, 1611, -1051, -2596, -1097, 1264, 2112, 1328, 64, -1694, -2118, -750, 2453, 2933, -183, -3215]
3954c215J004K485R79l51o01j265j438L52K604J272j179j863q70P58J021J915
3970A608N25k018k309j0L004J189n18j600o33k64K77J628Q73j89k057q23N04J437
3988F24J286l08j617j528P35J813J054r21j562l74M05L04K44J369L29k330j890
4005b367R98K431M06j415j560N50P01J92O46J12j021r12J5R47M93L09l24o60r71
4024a430L85K070P6j547j248J052J377q63R0J152j96j935j71J786J259j284p64
4041a91p3k3L75J052P96j284j395P3J569J65j319M06J034j024j410J015J595k09
4059A152j986R3P35J00l01mK29o29J1Q72k23j289N83J521n48j446r3J572J24j621
4079a148k9J829J22j740k28R21J196o87k38q8J1j25M27K39o86J07P20k18o04K28
$$ y = [-3215, -2211, 274, 1253, 902, 301, -964, -2402, -2050, 554, 1826, 647, -1216, -2086, -1328, -307, 1608, 2133, 115, -2194, -2204, 800, 1989, 1471, -129, -762, -1026, -749, 879, 1752, 1563, -494, -1317, -813, 624, 1910, 1602, -15, -1543, -808, 1005, 2059, 1138, -424, -798, -393, -89, 155, 1524, 1853, -477, -2367, -1369, 1062, 1468, 53, -1507, -957, -256, -64, 582, 694, -327, -1239, -1224, -277, 216, 525, 201, -459, -1430, -1045, 1025, 1101, -446, -1694, -642, 735, -128, -38, 1114, 918, -1017, -1188, 598, 1857, 573, -191, -264, -287, 88, 1140, 1936, 652, -743, -670, 899, 1064, -255, 151, 1185, 161, -1249, -234, 1361, 1152, -834, -741, -6, 94, -207, -211, 18, -611, -600, 272, 49, -1240, -657, 864, 316, -1130, -1223, 349, 473, -1148, -1177, 652, 774, -966, -1194, -273, 923, 236, -2, -90, -79, -204, 223, 462, -224, -117, 603, 385, -219, 9]
4099IR41M8j300j24J182M21j038k79M97L01j57J25p3r41l20J059N06p97j67J91
4119H4k34j212L29J912L15j273j276j58Q90P67P55l9j869p50R81R64N4J09N26
4138H75j290j997J112L014M22k424j307P71J325k0J16O90j433j230O85J747J43
4155A199p95N9o21j077R13K581K41k983j970J743K163o32m44O49j138j953N24
4172a541L324L15k055j728R94j41O87J823L63k593k955J381L508L36j654k98m48
4189f82j494K1L109K307k593l197J21K059J043O20O79j917l243R25L797J271k289
4206E37j268M26j33r32K249K548k010l911k67L695J777j507j337l97o07k46K864
4223A481J516j834k831n51J761J050Q65P99j751l741m21M210K946j640l068p02
$$ y = [9, 950, 998, -302, -426, 756, 1177, 139, -140, 357, 658, 501, 626, 553, -388, -708, 351, 857, 60, -107, 84, -150, -1362, -1033, 879, 1194, -79, -1355, -1513, -623, 144, 899, 860, -1009, -1759, -778, 186, 240, 349, 875, -415, -2412, -1300, 1714, 2136, -288, -1595, -824, 501, 481, 597, 1287, -146, -1376, -691, 1056, 1199, 404, 463, -158, -1235, -322, 2259, 2500, -483, -2453, -710, 1453, 821, 377, 1026, -112, -2065, -1541, 1783, 2098, 43, -1685, -691, -832, -145, 1678, 2041, -552, -3507, -2126, 1382, 1718, 64, -234, -682, -2176, -2155, 954, 3261, 668, -2529, -2408, -349, 694, 1314, 1993, 76, -3167, -2242, 1555, 2826, 537, -731, -305, -438, -1370, 879, 3427, 1417, -2494, -2761, 934, 2711, 1204, -133, -530, -1137, -1383, 1481, 2997, 1163, -1668, -2219, -458, 592, 1457, 2256, 505, -3236, -3657, 553, 3499, 1859, -1209, -1911]
4239a911L0M28J953K543r25l851k041K419K529Q93m17j545k238j057K522L574
4255B906j89l163j527P15P04J158J217L69k473j909R19K837J000j634j473o01
4271a144L1J494K221p96k936r39J543J444M8r0k07j698j708J789L100R18k972
4288I8k914L13J826K017R01j040k629j382Q07K730J061p5j934j901j187K164L339
4305B194J261k641l263m21K053J925Q52K04k201k335P5K359K123J4j662j807o76
4322a946J292K424J183j973k007o16J679J019M00k31r84j376r5J989J180o90j738
4339d90j271R5J873J484o1k249j829Q17K019J016n42p99j106j183K00K656J835
4356B465j305k330j755Q19K691J542j16k341k102M87K169J253J05p99j172j693
$$ y = [-1911, -1881, -1453, 500, 3043, 2118, -1733, -3774, -1355, 1174, 2067, 1650, 105, -2133, -3190, -668, 2906, 2717, -446, -1973, -1258, -554, 604, 1821, 2190, -283, -2192, -1273, 1564, 2564, 930, -543, -1144, -1113, 381, 2602, 1806, -1130, -2069, -526, 918, 966, 876, 669, -1029, -2737, -948, 2152, 3070, 98, -2816, -2503, -677, 1340, 2241, 1201, -1428, -2810, -2003, 727, 1788, 1713, -221, -2122, -3309, -1145, 2194, 3455, 814, -2449, -2870, -817, 1108, 1960, 2164, -37, -2372, -2297, 62, 2185, 2199, 537, -1270, -1946, -654, 1770, 2953, 980, -1027, -1643, 36, 1055, 1455, 1224, 240, -1136, -1231, 758, 1938, 1248, -490, -1761, -1666, 207, 1691, 1630, -619, -2448, -1631, 388, 1404, 862, 63, -1043, -2226, -2026, 630, 2465, 1160, -1170, -2925, -2106, 585, 2127, 2011, -330, -2432, -1945, 224, 1477, 1582, 783, -389, -2082]
4372b082L84K492K066j044k872q86J367J527M81N6r86j725k13J640J365Nr93j240
4390f58o16K79J866J462j407k695k72J249K036K1m63j272r70j54J397J854o53
4407A004j466j073j71P46K041J088j620k505l90K210J350k57r91k46q86m23J489
4424a00J707J83k085j273L13J198J217O45r72k179j59J842J149o55n01J39p35
4441b66n08M77K220l36j936j309J257J206N12q04l55j197r1J232Q96m57j280j32
4459h71J74j92O91J530m40j949j045R91J535N86r08n63n71L10N36P81M6r01m87
4478g47L20Q3M82J025j63j213j174J182J140J71j003l07n2J55K24N29n2l35l36
4497g1J49r5L45O83j06r81q42J226Q57q04r79L6Q38n62j17J8J172n22q73r9L51
$$ y = [-2082, -1698, 794, 2860, 1816, -1056, -1942, -575, 952, 1433, 1489, 503, -1222, -1435, 205, 1570, 1575, 582, -658, -1274, -995, 871, 2333, 926, -1769, -2041, -792, 1244, 1265, 802, -470, -1440, -1594, -197, 1657, 1004, -462, -1535, -1706, -960, 1081, 2169, 549, -1956, -2346, -136, 1214, 957, -34, -280, -1166, -1589, -100, 1607, 1790, -295, -1568, -1255, -57, 1160, 1805, 833, -1346, -1505, 337, 1486, 831, 330, 469, -266, -774, -297, 1923, 1587, -349, -1658, -401, 805, 1317, 513, 158, -1039, -1130, 102, 998, 541, -739, -871, -697, -889, -198, 1332, 892, -1057, -2102, -1111, 424, 1010, 102, -461, -1032, -722, -186, 595, 641, -260, -747, -427, -344, 138, 1163, 1000, -213, -1387, -205, 935, 1106, 103, -204, -256, -101, 123, 652, 600, 265, -71, 78, -17, 328, 1011, 905, -76, -918, 308, 1165, 361, -618, -582, 256, -306, -423, -405, 767, 245, -628, -727, -376]
4518c76K24M37P4r75k18N82N90m62n83K44P05n67l12P99O20n81q37j03P02N39
4538E02j39j08j53l51k57Q84j8J05k54J6J2l43J29R32l1j086k89N81P62l61n24
4559IQ5J10j03n00M71O0M53m26l27n09O2J196m7j024r07J067O63k51o10L33l6
4580b31k5q11K79J534j21j043l00J95O02M36j71n70k67N88l5J13K03j77J64j92
4600A71j058J058O62Q8j105n97O71P34K90k38p04r3k0J48N47j84K5m30l13j88
4620e36L98R29rj547p9M30N99O8l31l04J99k59K43L57M9%o18n28j05J240M81j84
4642D93j049o68J189N31k39l64J37j43j93k65P16Q27j23j170o64L79J161J072
4660A627j481q80J69P42L61m9o6p7n73l96M86J074K71o31j223l13N82J199L1p04
$$ y = [-376, -152, 285, 359, -616, -834, -252, 338, -124, -707, -463, 242, -325, -637, 162, 782, 201, -636, -739, -37, 502, 363, 255, 102, -249, -506, 378, 360, 465, 211, 227, 239, -104, 25, 957, 926, -160, -449, 132, 894, 533, 9, 94, 204, 101, -399, 72, 132, 585, 159, -168, -677, -615, 581, 534, -490, -1397, -330, 333, 82, -528, -195, -231, -256, -1067, -788, 746, 625, -418, -718, -523, 79, 515, 344, -226, -493, 95, 60, 173, 376, 199, 363, 171, -887, 171, 833, 921, -184, -781, -110, 624, 914, 676, -28, -121, -141, 7, 554, 370, 395, -35, -348, -536, -138, 791, 782, -765, -844, -414, 185, 253, -78, -382, -183, -442, -199, 158, 207, 207, -411, -939, -1044, 196, 677, 493, -556, -1224, -35, 496, 257, -107, 30, -113, -306, -571, 145, 972, 849, -321, -985, -606, 555, 1627, 146, -734, -565, 177, 538, 489, 423, 346, -227, -623, -137, 937, 1208, 577, -646, -959, -377, 822, 853, 149]
4680A49j038n8N26N90J27j64K72j365r0L16J442K54o94j457k08R85J069J31j168
4699c81o23J28N15P29M61k64l95o43o81N63J960K79j448j582N52J102Q92k7p66
4718C71l72l92j00R26O28K98j004j208k84J227J149N04j782j342N00J147Q92o89
4736D69n90k24n24k9J126J033j54j646j022N50J066R16j75j331j175L18J922N89
4754A119l85j265j62k08J78Q69J180l67j581j476J251J753P16p08j384o77R19
4771b28Q66N63k11p79q28N3K47O63J483l42k122j372J445K362R0j868j017L27
4789f68K62L90Q17J10j266n46m55J108J208L92q35j756o76J696J459k96j344o30
4807a030k04R85P18K22K07j376r58M43J501O62j11j108j238M0J515J594n02j656
$$ y = [149, -889, -947, -421, 169, 296, 132, 404, -961, -1051, -735, 707, 961, 267, -1190, -1398, -413, 656, 787, -381, -1004, -876, -361, 368, 829, 565, 170, -473, -1154, -591, 1369, 1648, 200, -1382, -830, 272, 1164, 1137, 371, -1, -393, -493, 433, 1061, 1359, 355, -853, -1137, 90, 1239, 1743, -39, -1381, -881, 266, 1158, 469, -121, -345, -869, -898, 228, 1261, 1107, -539, -1561, -1011, 55, 971, 796, -535, -1710, -1392, 530, 1119, 734, -531, -693, -901, -723, 146, 1326, 959, -622, -2098, -847, 906, 1622, 914, -470, -1147, -228, 638, 1201, 990, 211, -617, -564, -317, 346, 1829, 1487, -635, -2007, -562, 1800, 1890, 22, -995, -668, -406, -16, 801, 911, -355, -901, -1356, -248, 960, 1352, 517, -1239, -1915, -219, 1240, 944, -400, -1030, -1234, -249, 469, 691, 898, -478, -1436, -993, 508, 1170, 1059, -49, -1287, -1247, 268, 1862, 1360, -296]
4825b96p71N44N88O67N60n09p73j146J53J577J037n46j265q20M3J379P85n09j185
4844d87l62P30J11rN60K77j000j393N35J440J052j474j060n3N32J117L23o03j035
4863g99l7M73L44L35R4J02j081q80P97J808L40k026l80K71N79L70P24k64q81m93
4883f04L91N57K14M56j89j060q83J044J398L87j879n46N85L02j38M21K52m15p65
4902d72L36Q4J92l10O87p68q33N66J016L26j982j37J478O54j070l82P52o6n11
4921d40k30Q46L53k54q62J1%O67R32n05j455m90J254J008k38p70J227m96j242
4940f84m52J875R07j013j281K83K86K69N32L67r32p36K83P89k98o91R53M03j043
4959a83j035Q58J216n78j107L39O49j93n13J84J00k76O31j28Oo42N71N98q76k23
$$ y = [-296, -1067, -523, 65, 732, 1292, 783, 10, -1136, -983, 594, 1631, 1085, -180, -1000, -957, 422, 1207, 698, -487, -849, -119, -8, -17, 543, 820, -180, -1573, -1038, 402, 1454, -20, -1080, -1133, -601, 516, 839, 236, -799, -836, -363, -19, 316, 410, 512, -569, -1449, -652, 1156, 1496, -530, -910, -639, -60, 310, 1034, 770, -111, -604, -213, 344, 558, 1014, 825, -235, -1118, -74, 1324, 1711, -168, -714, -129, 173, 35, 456, 708, 293, -472, -136, -52, 140, -170, 517, -251, -1084, -518, 498, 824, -1158, -1295, 183, 837, -233, -615, 137, 71, -440, -670, 176, 529, 275, -587, -576, -576, 91, 1023, 518, -937, -1427, -173, 835, 597, -173, 1054, 558, -684, -1136, 739, 1646, 633, -648, -365, -79, 190, 722, 1089, 157, -579, -296, 493, 195, -496, 457, 860, -183, -1218, -360, 856, 278, -829, -490, 159, -34, -547, -363, -263, -539, 92, -36, -30, -672, -101, 497, -379, -602]
4979f02R03P25j303r10Q06J202M0j054k29K33L01N4J29k85L80P2n69o3k9J085
4999H86J16j041p37O56J005k54q28j98P13o2m37j95R34j59P6n82k57k72Q61L84
5019F09q26k35N66J39o15m12L21R52m18p64M6N27k7Q5P3k37k87P12J7o31k89Q23
5041A29O60o20j006P20R22k88q87l3P57j37m32K50M50J33l22R2j38k09K34N92
5061H67n43o69M24R70r96p02J03J324k54j029%O42K73p33P2OO23n53k44K23q3
5082b79N04J03m24r65N64P14J29n86l73P90j45p19J24P77L66l78o44q6N78R01
5102I51m72n50l40K51P94o2n88q7M71p6o41M93N57L50j159o76J90J402K48r22
5122A34m91j11O40P30k87n15k35L6M1m10M49N88k13j049q79J187Q76P2q44o51
$$ y = [-602, 301, 1026, -277, -1187, -381, 821, 861, -193, -422, -189, 112, 166, 295, 10, 390, 462, -107, -170, -199, 886, 1002, -39, -776, -120, 885, 631, -197, -395, 318, 256, -181, -376, 558, 399, 475, -107, -364, -636, 225, 609, -217, -452, 114, 253, -362, -774, -453, 499, 81, -683, -637, -110, -137, -52, 21, -216, -503, 209, 226, -405, -694, 129, 789, 169, -837, -117, 805, 517, -370, -403, 354, 217, -215, 35, 485, 618, 296, 388, 250, 41, 275, 867, 324, -345, 79, 1049, 53, -649, -546, 778, 524, -505, -505, 137, 410, -323, -251, -245, 378, -175, -419, -196, -279, 225, 328, -96, -1061, -497, 217, 346, -240, -613, 177, 32, -687, -563, 214, 580, 202, -442, -528, 50, 951, 479, -71, -411, -160, 634, 572, -16, -103, 368, 292, -349, 144, 701, 1051, -108, -784, -594, 808, 1056, 134, -357, -468, 172, 902, 615, 100, -135, -99, -58, -468, -19, 569, 356, -693, -1572, -385, 491, 563, -281, -932]
5142i32M54M08q4J50O6j74l15j21L75M20Q69p54r56j56P68J361o65p41k44J29
5162a42M02pk0LJ09l50l50O78M98M7o93q36j60J390M34m25q78j96M70K52J12J08
5184D46n07j43m17j47P10J011l74j160q66N14J373N33j055o55l15R02L66k50L52
5203C18l95q2r46K63J297P03p19j321k36P73J186Q2r79l55L67L40J24p2L74k54
5223D68m34q44N49J043M90j023r97J99N77J024m39p02j52L34j04l22M32L96k94
5242B01o97m15R68O18o0r35r34n1J392K30k5r23P0M32j83J18K61N82o46q79m14
5263a290J432Q07k03j337j98P32P93j32m77k46K99p3k18o2J055P0p97p48j27J058
5283C38R43p86q23k50M35N86O4o49K83P1n14L7J2Q23jp48p59L18R87K35p00n16
$$ y = [-932, -478, -70, -154, -4, 62, -112, -427, -548, -173, 247, 1116, 362, -594, -750, 18, 1379, 714, -27, -271, -142, 260, 253, 233, 236, 345, -5, -355, 323, 821, 868, 175, -661, -821, 569, 1003, 578, -300, -496, -26, 226, 338, 446, -61, -204, -621, -768, -58, 953, 579, -581, -1447, -933, 440, 973, -82, -737, -1052, -150, 216, -34, 318, -77, -159, -1105, -842, 455, 1158, 439, -882, -1118, -345, 841, 923, -56, -411, -44, 296, 420, 348, 722, 468, 34, -810, -261, 782, 1272, 249, -748, -549, 28, 1052, 613, -89, -241, 93, -11, -333, 99, 495, 201, -496, -911, 57, 675, 615, -320, -1254, -1305, 87, 317, 292, -631, -561, -129, -312, -194, 67, 649, 3, -876, -1290, 142, 949, 746, -591, -789, -57, 736, 604, 127, -119, 180, 107, -111, -173, 882, 952, 155, -593, -720, 338, 1281, 495, -328, -578, -143, 443, 507, -142, 141, 212, -302, -265, -253, 570, 569, -179, -938, -620, 367, 602, -98, -614]
5305f14j76N08M30l61j16L53k12k50k95P78O88n78q36r6L82J012Kn88q23L37R51
5326D96j10n34N91J37n39l01j06M98Q00p29o66j55R08N33m83o13L12q1J40N5Q4
5347B37K98k40m93l57O7Q22M28q28j003Q54P26m24k31l52K14L33l52l11P29j00
5367A7j58p32K22L33M09K52j007r2K30Q38K67q06k72M65N54o08j56O13M42m56
5387C55q60K23P02L03k95p78L36J82L80K62r03k33M02M27m32n60M95R36p86r48
5407g92K48J134J04m43j032R01l3k05O5j49L18k58J54l91j27N85M53o78n86K67
5427d65R36J12j339K56N67M72q53p3M22N13l93n07M46K45k11K24k79n17Q67M12
5447H35j92o78l83J033J55o24l24M79L75l58o76K37P07l00j56o89j66J050n1j48
$$ y = [-614, -790, -282, 148, -213, -329, 24, -188, -438, -733, 45, 733, 155, -681, -777, -395, 617, 619, 31, -792, -455, 496, 386, -148, 443, 580, 41, -260, -366, 132, 932, 203, -463, -618, 290, 823, 340, -273, 39, -42, 98, 153, 237, 535, 295, -198, -555, -488, 334, 762, -66, -1069, -215, 511, 87, -144, -496, -282, 51, -301, -612, 117, 17, -141, -873, -651, -318, 91, 343, -664, -756, -526, 312, 579, -227, -499, -34, 520, -88, -244, 369, 811, 355, -505, -282, 420, 723, 428, -350, -14, 168, 548, 810, -93, -326, 76, 503, 71, -489, 6, 942, 156, -792, -544, 590, 694, 251, -781, 120, 87, -118, -53, -202, 116, -142, 12, -379, -506, 79, 532, -146, -732, -465, 471, 583, -756, -500, 67, 539, -314, -387, 35, 548, 155, -352, 94, 339, 128, 352, 73, -444, 423, 835, 643, -35, -418, 615, 770, 146, -178, 301, 676, 318, -358, -121, 586, 286, 130, -559, -725, 325, 274, 126]
5467A26n76m20J276n9q85L0R12K70o62n40k26J398k31j094o5N94J65nj9k42J13
5488a40L35k94m81J74R99K76j165m98P71R64o74l37n4O82l30L9m15L59K64Q3n06
5509E2l28J04M41J81r17j64O46R11q98k89J68L89k47m34J77l2M59l49o35L10N69
5530A14L80o21n33J46M66Q15p08r62O22P15l43n75J6P74J51o54k96M57N33J08
5550F05o87n56N16L95K00o8n76K39J28J24n56N93M17j45p57k46Q85L96l84q98
5570c75J8M97J53k22l63J23Q0L94m64n5K36Q38o31r96M7P06N94o76p21M87M46
5591A16m0k77%K58j15j70Pm56M97N35k44q54Q0J249J97p14q43O78Q97q63l44J99
5613b07P17J83p65l07J48R12P0q54k93M49M99k07p34j83P21P57n20n79J9L05J69
$$ y = [126, -450, -870, 406, 347, -538, -508, 404, 674, 12, -528, -754, 644, 413, -681, -746, -152, 13, 8, -11, -253, -140, 195, -99, -580, -406, 593, 869, -296, -794, -23, 941, 267, -70, -124, 558, 228, 267, -148, 211, 475, 558, 52, -276, -172, 269, 450, -467, -631, 15, 926, 28, -261, -93, 296, 49, -385, -208, -240, 219, -130, -765, -455, 114, 494, -127, -660, -514, -48, 767, 59, -903, -281, 434, 91, -484, -468, 306, 457, -197, -493, -36, 497, 605, -82, -638, -122, 273, 473, 405, -171, 68, 196, 320, -236, 357, 774, 629, -128, -374, 511, 907, 523, -375, -357, 140, 293, 71, -292, -169, -89, 305, -159, -214, 22, 860, 229, -767, -720, -14, 580, -96, -817, -330, 116, 76, -201, -201, 57, -58, -228, -221, -677, -180, 355, 111, -743, -663, 586, 783, 69, -774, -96, 801, -62, -406, -207, 510, 693, -72, -379, -231, 681, 751, -103, -396, 53, 552, 345, -389, -572, 149, 906, 386, -193, -174, 131, 300]
5634C00j121L04Q39L47q12p25K95M78Q95q13m49L49j67J08l4j11M18L20p47n31
5654h57L07J123O68j223j041N40R52r0m30M74j33j92m65K15L26L66n1j42q10j75
5674f38J375O7o98p20M57Q38p7j432P64P81j97j055J66P90j4k38o03j16M71N56
5694D77pp95m46O07P36m79n67J60N86m15n80O06P09J59j427l99N21R27K33l40
5714B66m55l20L44N32L59o47k06M68l72n38M24R93L03j455o03N91R87q2m86j95
5734i2j4L04j32l3j54N06k9m59p70Q59R54l78j405j74P55J106p49m49k91O16j15
5755a44k85K86l5K47R5p51k39R52N79p52r33K73J016O49r80m13R7P69m01j76K10
5776F4K53p7o49L6J49Q31L12n25j212K43J121N31j230k23O66N9j31k77L63K95
$$ y = [300, -821, -517, 322, 669, -143, -868, -573, -95, 800, -13, -462, -113, -280, -172, -206, -317, 101, 421, -326, -857, -550, 573, 1241, 18, -1023, -483, 469, 379, -51, 423, 290, 98, -367, -152, 174, 540, 489, 347, -463, -638, 737, 804, 106, -614, -157, 681, 604, -828, -64, 717, 520, -535, -369, 421, 407, 169, -434, -550, -79, 477, 470, -325, -771, -164, 572, 93, -474, -314, 272, -143, -723, -117, 592, 751, -676, -1075, -554, 373, 606, 266, -189, -509, -165, 367, 726, 79, -127, 341, -31, -569, -145, 848, 1151, -304, -907, -316, 671, 589, 103, -92, -106, 198, 66, 33, -121, 385, 356, -103, -873, -14, 940, 562, -843, -1017, -262, 844, 95, -354, -645, -29, -144, -429, -143, -178, 69, 164, -587, -826, 126, 705, -47, -980, -707, 309, 958, -22, -435, -338, 431, 30, -146, 64, 317, 240, -409, -373, -224, 607, 919, 394, -818, -575, 546, 1077, -153, -376, 290, 349, 218, -59, 304, 599]
5796E99k74p96J97N86L34j31o10q49N55R52n9o12n04M61M82n98j91M85P03q29
5816i9j022M32Q94K71p38n85n6O10N87k46l60P0O71O2q75QP49O03o33j060O57
5837f0J058m32q94j01M57J25P5j72j42J7K00K19m11q9O76l01m42m68N76P68m31
5858B28p83l8P13o6k32j73M26R8n34M98q58N24O37l33p48q7O87Q09l82j284J06
5879g92Q92M05r64j46O32J93j1p81L58N89L79p08k90j93Q12K82k97o51J48P28
5899E85l95m89L17P25q9j273j38J148J51r2p37J79K50J51l83j22j23J39L34m26
5919b88k54K31M45k3p84K15N17L59l97p79M30P83j08l77m86K20L76K29r1n53M34
5940I9L2l5m76j18Q75L13n18j095O67Q89j66l27k95M26K62l30j26l95O21N1j52
$$ y = [599, 325, -471, -274, 312, 646, 515, -95, -944, -389, 563, 504, -108, -612, -151, 331, -267, -458, 27, 730, -99, -1121, -689, 205, 476, -262, -847, -903, -293, 294, 48, -312, -242, 429, 491, -384, -376, 373, 976, 343, -717, -60, 998, 566, -328, -429, 28, 153, 228, 56, -86, -69, 131, 350, -61, -150, 526, 225, -217, -685, -109, 659, 228, -555, -593, 120, 54, -178, -351, 75, 173, -361, 137, -721, -197, 440, 107, -641, -728, -41, 768, 386, -898, -792, 100, 505, -459, -605, 27, 220, 209, -572, -214, 375, 754, 46, -244, -437, 375, 657, 360, -291, -143, 585, 190, -299, 18, 743, 654, -619, -757, 391, 542, 450, -287, -108, 142, 293, -90, -212, -335, -196, 138, -288, -542, -311, 134, 111, -673, -458, 59, 418, 21, -758, -328, 455, 347, -30, -516, -296, 80, 309, 218, -335, 99, 131, 96, -380, -498, 377, 690, 172, -923, -256, 633, 467, 140, -155, 271, 533, 203, 77, -318, 303, 354, 202]
5961B02l70r1O77K19j050j56M31Q12m49p54K58O96N0j033p7L33R97q58l25K69
5981b19N24p7n23j99K69M93J49o02k99L00N36j7p74j14P77L81p71k85M80O60l48
6002C41m11J46O8J96p6n76J32N61L94l93p53L2K73O61l43q51M62O59K2j067J56
6023c67J83Q93m31j052L10P80j3m65o34L01J129k64p72o3K89M93j76o51j12Q93
6043B71K64r84o26J025J114l41j345mJ094q5k87l03K02K24k33m87N06K96R9l31
6063F9o06o0J106M44m80j037R2Q07M32o11l07L97N1l78k3L1M56k47j30n10M4Q35
6085C75L47o10j082K24Q59M64l52o52O2L42k31m41N74M86k49m40k99O45M89P9
6105E90p21n00N02M43Q1l71m5J14L11p66O2J034K76n06j134K2Q06N32l13p82R2
$$ y = [202, -168, -259, 418, 637, -413, -569, -138, 674, 225, -529, -271, 425, 475, -558, -635, -302, 695, -163, -488, -219, 305, 228, -295, -494, -225, 268, 417, -185, -484, -184, 352, 335, -439, -553, 224, 605, -166, -451, 29, 689, 341, -70, 76, 144, 340, 264, -312, -180, 381, 775, 382, -371, -339, -66, 595, 252, -599, -137, 522, 544, -523, -367, -184, 709, 278, -774, -464, 316, 303, -162, -796, -495, 634, 370, -402, -465, -176, 317, 141, -510, -622, 271, 535, -449, -1075, -50, 1064, 723, -622, -626, 468, 383, 96, -207, -5, 219, -14, -501, 5, 301, 400, 69, -537, -597, 509, 953, 473, -564, -472, 335, 767, 156, -151, 246, 297, -81, -104, -73, 383, 136, 6, -504, -460, 375, 722, 112, -970, -746, 113, 577, 225, -427, -365, -23, -254, -695, -121, 365, 116, -324, -623, 22, 511, 590, -131, -631, -129, 314, 395, 24, -21, 93, 404, -362, -300, 734, 1010, 504, -630, -608, 198, 730, 417, -365, -273]
6126b73P6L88j0J73J2O5j000K03M03O66p9r81l03q2R07K1L34r59M1M5N57k35j83
6149b14K90n6n71p4Q34K47q5q13l54M38J041j45o60k79j11M35N02j09k12K23q
6170C19p59j13J011P80r05j022k9O26Q59k59n68k4K91l02k36P68M50m97n23o92
6190h25M79J107k40n29q33K04R11j88l68j08O91l96n93O6P07L95j42o80j54L6
6210d60O23m5m79j98R9R13J34p55jK96p1j52n5L17M03p52k30L87K23L68J3p93
6232b15k15L17R00j38r39K96L71k28q69J16J761J27j477p99N85P99K70m09l99
6251a46k20J61M92l63l28L73P89j160r71N89J911l99j333n42J237J67o32k46O09
6270a2M58q93L46K98m67J28L71q4n70o2J562j19j387o33J570P95j231o06N93L79
$$ y = [-273, -197, 191, 181, 354, 366, 431, -569, -366, 37, 703, 624, -357, -660, -742, 165, 186, 520, -439, -398, -353, 204, -31, -214, 76, 20, -551, -625, 209, 456, 371, -442, -796, -358, 683, 538, -122, -401, -512, -77, 425, 316, 104, 327, 319, -440, -553, 458, 1238, 333, -689, -718, -92, 767, 508, -60, -84, 207, -95, -331, 437, 887, 390, -133, -825, -346, 761, 521, -8, -841, -637, 274, 86, -282, -390, 301, -95, -688, -622, 85, 480, 338, -342, -496, -460, 163, 118, -361, -559, -460, 453, 587, -168, -169, 127, 56, -96, -151, 166, 569, -183, -413, -26, 197, 565, 578, -215, -430, -113, 787, 649, -290, 6, 377, 149, -720, -604, 1157, 1284, -193, -992, -407, 392, 662, 253, -146, -366, -205, 287, -76, -404, -31, 758, -402, -1373, -784, 1127, 728, -605, -1147, 90, 257, -375, -621, -12, 446, -447, -101, 197, -270, -142, 229, 145, -425, -487, 1075, 956, -431, -1064, 506, 1301, 70, -536, 57, 436]
6290D36n35L0L33J83n48j0L82n01k03J310O71j994p42J273J133j014j235J170
6308A39R16r04j128R63J014j046o62N41J5k15O13j90l19o35J017N49r72o04P97
6327a11J227j339j190J523J055q92j203M41J077j59o07K48J81p02L67O88o6j005
6345d67M79O24k54j163Q18J445r46j326J95J293j80p46L40K47n50o87J233J28
6363D83n59k44O31n21p82O55J358j47j688PJ045J98j239l6J367K63j223p7L16
6382a93M36m88M88J97p38p7P90j82j100L95J051Nj357j54J236M31j078M8R26L1
6402F67r69p9P65K23m56K89j76p70K31J049k62n76k45M32J07m80P4J053k59r39
6422c21p10Q39M98J86m42K32n63n16N58N44k41j83K73j02p94n2J040P97p46r41
$$ y = [436, -99, -69, 264, 447, -101, -111, 271, -230, -433, 877, 1548, -446, -1188, 85, 1218, 204, -1031, 139, 1055, 151, -977, -14, 1000, -46, -708, -167, -152, -367, 246, 56, -263, -898, 119, 668, -304, -908, -111, 1116, -223, -1413, 110, 1165, 273, -930, -489, 588, 429, -178, 70, 251, -451, -84, 604, 538, -467, 12, 636, 382, -781, 37, 1482, 536, -790, -595, 698, 518, -228, 112, 359, -191, -878, 355, 483, -76, -320, 311, -210, -992, -337, 1021, 874, -814, -807, 238, 436, -803, -839, 528, 791, -432, -509, -193, 243, -245, 243, 440, -298, -375, 415, 233, -867, -472, 579, 584, -773, -927, 309, 740, -338, -290, 636, 667, -302, -381, 384, 607, 151, 440, 264, -506, -275, 774, 512, -64, -309, 123, 230, -250, -176, 877, 618, -321, -1031, -192, 306, 492, 50, 282, -281, -797, -239, 305, 64, -119, 154, 52, -742, -794, 246, 1043, 297, -644]
6442f44K24M04K06l63N90r9K9n56k83N26L24L32m12n77m6Q04K78p49n25P31P36
6463I30n70j058O92N67j36p65K93N04J21p62j18j4P11K91o45q31J58O22M47k74
6483A63o63PN05k30j59L01M45J92j172m82R07M62N57r41k42m93J005L00o6j82
6503B14n1J11l21l40K45P63j84o12l60M19J107l87p87l86O18N00j65l87R5j9K76
6524C49l97k36L97Q25o19q49K50M24O82n48n50l41P51k9k55L1L75M3l51o89N32
6545b05N78M27q50m15L8Q09N3m60k51j46R33m26k78K56R0j36k17j28J13N52M32
6566G69o55o20L42O24Q1o74k92L18M92J0p37N4O87k66m21NO70K04N2r12KM05J61
6589B99j84n71J7L26N74p08K6o3P44n23o19n7Q12L64k80p59nP19K09k55k37P2
$$ y = [-644, -420, -16, 190, -173, 417, 318, 347, -209, -492, 34, 358, 690, 278, -299, -345, 459, 737, -12, -537, 194, 930, 360, -698, -6, 561, 425, -340, -47, 457, 578, -184, -302, -316, 395, 686, 41, -790, -632, -10, 437, 163, -500, -493, 12, -218, -377, -76, 369, 561, -611, -1093, -186, 276, 833, -108, -350, -843, 162, 462, 396, 214, 163, 274, -47, -387, -142, 621, 437, -175, -535, -116, 991, 604, -183, -569, 49, 549, 384, -3, 92, 73, 349, -48, -284, 113, 938, 319, -530, -280, 144, 826, 278, -272, -613, 138, 109, -146, -115, 260, 303, -48, -737, -205, 373, 800, -50, -465, -427, 382, 435, -25, -276, -422, 511, 85, -193, 63, 153, 17, -200, -328, -215, 337, 769, 114, -506, -164, 460, 541, -133, -425, -107, 385, 395, -342, -288, 399, 133, -288, -283, 387, 591, 643, -269, -267, 138, 299, 115, -456, -439, -113, 461, -247, -221, -284, 460, -63, -682, -739, 73, 437, 157, -602, -607, 112, 321, 66, -171, -99]
6611i9L20j16l25p4M42L86k63q72J72P14K27l90o28M29p3J01k84L18L41k23k51
6632a48P9n5M25l3r0p40K66O14J82n68p33Q32MP9j90K10O0l30l65J45N66L72m86
6655I6n01k2O0N62J35l80k50J52M3J75l68J79N67k93p49J78J023k5n20n44K82
6676b00L67K58k16k20J56K1k52k03N64N2M4l95n92L74Q09j22m53o30P08j63m2
6697a35K49j48K19l82k01j40J117o9n52k23k39M74K08J47n86n87N33N77j88k96
6717b22qJ67J55m87J52N11l48q4l11O2O42L04l14o08J05L56K16l11j52M76K91
6738E92p27n03O17O16k58l60n70L23O78J91l64l81rO57k24n06l92Q72L9q05j46
6759f60O75Q62q68m17j97O35J30k45K9j09p1J54j53K0K40l7L65o59k69O09M38
$$ y = [-99, 221, 105, -220, -294, 148, 534, 271, -601, -429, 285, 512, 122, -506, -77, -150, -49, -333, -15, 326, 103, -148, -69, -124, 301, 268, 178, -562, -296, 318, 500, -68, -801, 31, 35, 114, -76, 134, 194, -136, -501, -356, 210, 582, 96, -405, -427, -367, 195, 330, -50, -300, -148, -105, 70, -298, -119, 448, 155, -594, -416, 607, 582, 62, -482, -200, 167, 425, 209, -11, 145, 166, -86, -289, 275, 327, 371, -24, -616, -242, 567, 445, -8, -638, 70, -93, -135, 114, -34, 185, -197, -398, -538, 579, 510, -42, -265, -504, -30, 178, 325, -261, -848, -315, 262, 74, -222, -230, -63, 92, -395, -243, 268, -80, -164, -475, -413, 229, 533, 219, -389, -284, 72, 288, -23, -175, 301, 592, -135, -638, -21, 595, 337, -23, -593, -270, 408, 599, 235, -146, -155, 502, 278, -228, -620, 252, 291, -514, -660, 15, 877, 9, -408, -605, 30, 160, -85, -56, -165, -236, -82, -235, -215, 25, -12, 353, -306, -575, 34, 472]
6780D72r5q92K48M17O1j08l51J66K42l10J37R2rL37j93rm75O42Q29j016m51O8
6802a98P94k93o09n2O88K01p15j1P0P43l07l61o09N81K74L48q54n72K47Q91k10
6823D6p92N53O07q6q62k01R43K88o08m09K06L79k86K80p9j36K53K44pm55m09R00
6845C69K34q18m27R02L50m64m64L16M06l79R9k13K29j99J58J98k81m42P70p1m55
6866a82l08J078L31r00q95N65P86l95m50k08P70m0k93K7L79l73J93l58m14R20
6886B33J74J30p18o54M95P05p20Q6K07L88m06l88J88O67J00l53Nl72M55k4j14
6907H4nO7k39L35P3j80K2P9L00n20q5o1L87j96j69Q1L61j89ll79J94K24K93k80
6931A94n77M91l2l11m7M63Q0l13p15L98K45L30j7m49k36J07M46O3j50j22N16O1
$$ y = [472, 377, -515, -267, 150, 211, 103, -248, -82, 160, -150, -13, 79, 70, 407, 214, 205, -270, 372, 1201, 185, -266, -198, 596, 303, -306, -358, 330, 531, -184, -195, -125, 618, 311, -50, -659, -78, 196, 544, -310, -882, -635, 256, 46, -746, -193, 414, 328, -534, -735, 208, 496, -112, -521, -315, 64, -222, 58, -21, -157, 96, 340, 333, -122, -531, 369, 603, -215, -642, 260, 610, 146, -318, -2, 404, 25, 124, -89, 140, -59, 99, 297, 16, -426, 344, 273, -182, -490, 588, 919, 19, -876, -311, 475, 80, -370, -578, 192, 152, -141, -114, 265, -108, 85, -273, -687, 233, 407, 537, -181, -835, -340, 365, -355, -269, -62, 326, -80, -468, -280, 387, 487, 134, 139, -233, 222, 198, 84, 79, 146, -93, 242, 315, 135, 157, 236, 536, 16, -69, -130, 257, 61, -108, -27, 334, 145, 142, -237, -43, 181, 474, 194, -383, 108, 76, -235, -282, 181, 261, -52, -767, -369, -124, 206, 189, -260, -496, -389, 57, 120, -30, -152, 364, 425]
6953D25q78k61P52P32o47p04L16R36n67j46K7N02l48j26k58J74J88K82M27j400
6973e74R4N56M23l99n01K75J17J90p46L60P06l46n24O5O35J1m47K12k12m58L80
6994a83N18pp63l2M47L55m49l13P64m57k61n72J259M88n69p55oP40k7n6Q7j86
7016B2j45J69jj2L50k7O2p15n57Q75J005p21q86J62P69N7p04OO25j51n07q4O55
7039B47r3k62L9k14J69M68P1m24p58l5J168J86o29k49L9Q1l33L18J310l51p85
7060c7p97K14M90M16K54j2j127m36Q08J096k91q88N87j09n28l19J070J025p70
7079F46j205P9R45n3l58Q5j5n39M89P5r0l21J44N91o84m89P00P37n36q85K19J180
7101G15m02r48M54J9K29M5L86j75m51p09J037j9j15J81Pk07j010N91J384J93j564
$$ y = [425, -453, -714, 38, 770, 123, -581, -265, 671, 104, -42, -15, 487, 139, 13, -245, -71, 117, 399, 826, -574, -480, 76, 499, 100, -401, -126, -9, 181, -565, -205, 501, 155, -369, -304, 331, 342, -105, 107, -105, -563, -183, 335, 328, -435, -467, -20, 335, -114, -427, 337, -120, -381, -953, 306, 794, 225, -530, -536, 204, 177, 121, 208, 22, -123, 46, 45, 33, 383, 356, 418, -297, -854, 21, 1026, 305, -581, -419, 350, 407, -297, -291, 334, 183, -324, -408, 247, 154, -108, -69, -283, -114, 354, 425, 1, -757, -792, 376, 562, -67, -316, -277, -196, -529, -211, 1099, 748, -37, -834, -620, -130, 286, 540, 528, -599, -1035, -227, 869, 578, -310, 277, 168, -360, -679, 391, 1416, 646, -559, -480, 465, 412, 54, 139, 124, -415, 74, 149, 59, -262, -118, 473, -211, -700, 0, 737, 201, -684, -465, 715, 313, -635, -181, -162, 67, 112, 498, 323, -128, -837, 200, 181, 66, 247, 254, 47, -963, -372, 1012, 1205, -359]
7122c59j47N4K20J15N58N81q04j055L17N81K2j75Q43n49r20j62J579L28j053o06
7142f32P53r4q14N59J156k89p03l24O1j10M42J55L97j143M2P03L19n78k60R91
7162F31m23o37m24J036M70j278J21P75l7k58k88O28l30k63K34O50r05p6L62N58
7182E46m81k35O58oq81k95J149L70p54j81K30O8l72o1P61K23q24j14L74k96j05
7203b26N58M55j044m85M04N47J11l53J68K82q77r5O02M79l05o99K95p9l4N87L1
7224C22l86l52K46M30k16m72M09L82m51k50K16P12k86n11k05Q99k24P7k94k54
7244b08O6L99p7j11J1J51l35m3l23P76L99m78p31K49M55O9j73j14k13J35J41J91
7266B36k57J08j27J63k11n63O66N94q57n53K70N85L51n59J80R6j40j52P4J63p8
$$ y = [-359, -506, -452, -232, -117, 441, 1022, 218, -837, -520, 61, 83, -92, 751, 202, -718, -880, 699, 1027, -26, -632, 121, 27, -787, -228, 928, 639, -64, -388, -327, -437, 5, 160, 557, -586, -544, 159, 478, -100, -360, 631, 208, -429, -853, 183, 653, -625, -504, 271, 234, -24, -312, 316, -14, -277, -43, 607, -298, -374, -12, 546, 65, -170, 488, 482, -399, -694, 455, 825, 71, -110, 120, 188, -184, -245, 516, 739, -85, -199, 175, -121, -226, 332, 787, -257, -742, -338, 209, 320, -33, 135, 417, -460, -555, 47, 526, 221, -478, -183, -262, -296, 291, 322, -64, -416, -170, 260, 44, -428, -19, 363, -88, -338, -122, 590, 304, -207, -412, 487, 263, 340, 46, -208, -142, 257, 180, 69, 80, 231, -104, -147, -470, 306, 705, 227, -504, -255, 200, 269, 96, -18, -231, -96, 45, 236, -21, 87, -40, 123, -88, -651, 15, 609, -248, -801, -531, 54, 405, -154, 26, 122, -18, -170, -96, 67, -11]
7287a1L76m46o4k30N74K42j65r80N62M75l4l90J22Q5M36n72j53M92n3On17J28
7309a17J89N85j67p96j37K90M30J5m71k04L51J33o11J51N34M29l92r44N65K29
7329F2M2j05k04J1n18R89k67P6k85K12l79o3J88N53J11m00l85k96P21L20r3k12
7351G8j65K54K36j40k66KK26k59j91j6O73K31l56p47J57O54J38m07l22o9K10r
7373h8K68k86M20j83n34RM58O09m02n79j67K62N42j15Rn62J45J94QR1N2j31M6
7396F6p13M29N08j7k67j90j8L2J45R0j83J23k24N8J17J59J16m96K38n17M78M82
7418D16P2k82n07j52O52J04J68m64n33M10n2J46L00r3l80j52J88M33K44l10o65
7439d57MN6M21L07j65l90m7L49k48P1M58r3n17m91L70P29j89n08J54nL0J49K16
$$ y = [-11, 365, -81, -145, -375, 199, 441, 276, -704, -142, 333, 299, -91, 31, 116, 552, -20, -173, 319, 266, 272, -245, -117, 72, 657, 490, -306, -443, -153, 277, 292, -179, -383, -32, 101, -510, -359, 175, 604, 212, -732, -167, 62, 104, -1, -205, -194, -712, 277, 10, 86, -199, 13, -366, -429, -241, 312, 423, 23, -362, -658, 63, 383, 290, 78, -87, 167, 403, 263, -3, -1, 225, -34, -225, -241, 432, 663, 307, -440, -283, 371, 509, 102, -220, -289, -79, -88, 180, -106, 314, 131, -403, -394, 64, 673, 271, -308, -475, -213, 329, 214, 223, -339, -194, 0, 8, 99, 151, 20, 66, -647, -218, 290, 273, 6, -184, -202, -170, -25, 65, -118, 5, -219, -161, -44, 115, 231, -265, -27, -544, -66, 416, 488, 206, -301, -453, 199, 303, 471, 7, -526, -116, -168, -22, 278, 185, -195, -347, -159, 274, 518, 208, -457, -453, -397, 24, 331, 166, -224, -271, 78, -170, -99, 359, 266, -251, -742, -372, 357, 168, -340, -186, -191, -161, -12, 204]
7462B04k24k38J54j33J54K41n4Q0l91j89L95N83l27k49l87M65j25kK10P6k01m13
7484c71J48L53o1l0J18m14k43K38O68N4o30m52M07K79r3p8J56J32n68j44P7O05
7506A51K19m63q22P93M72nj99m93K47R8L33r8j81J36J15l07m66M07O72J42p55
7527dn78O65L80l32l49P2L38p3m52M99r6K60j69p8l39J04K15K74l94l83N07J29
7549A96k94k39J07L46j58n01J16N51l27j3NK18l76L76J01j03n25O14L38j07p02
7570c77j89R10k56m58J57M92N4l03n21L50O26l14K98n84q1R0O85m58k2L28K8l38
7592A17p92N38N15L02j019K3N43k19n4J9L34k92m49K74p3J19k6M24m42m21J41
7613d38R88k65m74j60O18j67k92o9M25K78p20M16K42n17k77O64j57j58k10O26
$$ y = [204, -20, -258, -104, -237, -83, 158, 104, 184, -207, -396, -1, 582, 255, 6, -381, 84, -41, -43, 167, 243, 42, -371, -223, 130, 69, 39, 157, -257, -500, -262, 406, 460, -170, -622, -215, 64, -29, -107, 49, 181, -387, -531, -454, 151, 370, -93, -915, -122, 350, 345, 146, -347, -100, -2, 331, 233, 52, 188, 303, -4, -470, -63, 609, 751, -4, -582, 83, 463, 131, -218, -146, 192, 119, -333, 166, 70, 330, 161, 83, -256, -152, 63, 337, -57, -440, 67, 196, -98, -337, -230, 116, -42, -543, -427, 124, -203, -216, -211, 7, -369, 7, 108, 5, -520, 94, 432, 325, -377, -566, 344, 88, -370, -213, 279, 333, 30, -491, -141, 485, 171, 469, -115, -196, -106, 579, 121, 99, 427, 455, 117, -675, -137, 378, 680, -339, -316, 227, 8, -46, -27, 307, 15, -434, -160, -233, -114, -140, 284, -158, -579, -438, 550, 285, -189, -349, 269, 102, -190, -259, 166, 444, -276, 140, 382, -135, -412, 252, 95, -63, -273, 353]
7633C53L16o70n94Q12N86p59m88K60K94j2q4N56k89l93n8J06J53K09l6K36o98
7654b00m73R90L41p81l99P44J09q93q4Q50K08p87q6O89k08k66j6N03Q1o32L61
7675E1N9l01k51N46P97j257r2M42N05n91n09J021J43q80j80O19L28p73K14O32
7695E23l24n62j9R36n13l04L75N89p05q33R58O58p00n46M39K64l46m48Q16N6o41
7716c27J40P00q17k82M60P47n36q42M94P77j000m30P36R93p88p49O76M13j9n98
7736b52L52M66n07m34N10J77k19l38O39j77p85N92Q29k29j129L77O51l04p78M99
7756f0K57J51n78K84M47q20o2N73K36n39P9L13M2r06K38J189j36r33l36L27M29
7777A95o77M96M16m51m19j75N04p6L36K18l38n23j07J057L90r32l36Q28L13r17
$$ y = [353, 669, -1, -595, 217, 803, 44, -444, -184, 110, 98, 14, 570, 281, -112, -170, -64, 89, 298, 262, 498, -200, -673, 317, 658, -123, -522, 222, 331, -562, -646, 204, 412, -375, -461, 228, 20, -246, -262, 241, 322, -310, 51, 110, -191, -442, 104, 901, -356, -448, -6, 499, -92, -601, 420, 563, -317, -497, 122, 450, -323, -109, 523, 199, -363, -382, 554, 41, -263, 112, 701, -4, -837, 121, 779, 79, -467, -28, 236, -110, -558, 258, 314, -327, -187, 513, -304, -586, -126, 621, 85, -757, -263, 514, -486, -916, -180, 813, 25, -724, -48, 365, 346, -252, 100, 566, 59, -375, 135, 312, 93, -245, 394, 217, -568, 24, 853, 624, -505, -128, 523, 219, -559, -60, 197, 348, -230, 54, 501, -319, -381, 192, 428, -111, -32, 281, 323, -583, -345, 844, 708, -225, -561, -234, 195, -482, 14, 430, -21, -440, -615, -111, -187, 149, 367, 29, -494, -601, 456, 846, -86, -422, 406, 719, -198]
7797a98l29P23M75n81l14J93K89l36J81J56j26l45L99J13p20j87J084J96q24o73
7817h24Q02M49m25l35Q11J06n98o26N22L59k78L8K20p58k7N27M84j35o31o5L74
7838a0j58l24M10P75k94l58k98M13j09L15k70j46m93M98K82l8o19P01K81q21l37
7859f00L94Q35k57l25k07K45M1j7m53K58K89Jk49J40j44j04L83m3m70J11K02p3
7881d3l12N4L86J41j94l44K04L74k06l14P17n88j60k5k22R45n29j1n8p5L44k88
7903b04N79l99k28J85j59K15j01J31M02l69m24L19K54j02O3J27l99Q4n3K34J4
7924A69l3J2l10K90o24M77j7L78n69J2O71j71l18n9J36j31j29J79K87R1k91j88
7946a38j05L31R0j49j69m11L26N29K42n58j54K89k65j66K34K28L09m55j84L41
$$ y = [-198, -527, 196, 671, 90, -224, -31, 258, -78, 103, 259, 133, -212, 187, 300, -420, -607, 477, 673, -151, -824, -22, 427, 2, -333, 478, 584, -14, -640, -118, 241, -37, 1, 221, -537, -564, -37, 447, 312, -319, -384, -10, -168, -492, -82, 693, 399, 41, -257, 156, 47, 362, 92, -54, -547, -49, 233, 195, -424, 277, 558, -263, -600, -206, 629, 372, 47, -160, 85, 126, 109, -344, -86, 203, 204, -45, 95, -49, -153, 230, 187, -283, -172, 30, -43, -355, -301, 85, 226, 32, -312, -108, 266, 60, -254, 463, -125, -285, -310, -532, 413, -116, -127, -185, -260, 84, -204, 375, -24, -252, -67, -226, -11, -112, 19, 421, 52, -372, -53, 201, 99, 162, 289, -110, -26, -79, 155, 169, 136, 148, -162, 128, -496, -19, -36, 342, -227, -215, 456, 285, -33, -92, 44, -87, -216, -37, 250, 341, 50, -138, -243, 88, 178, 29, -140, -551, -225, 304, 546, -12, -166, 123, -142, -308, -74, 154, 463, 8, -176, 165]
7966A65J55J19k89l60J72J36J94J41l53k01j07K91j34K72L21k79m63L7Q5K13j78
7987f3k15M52l89N2O45m7k79m43j17L97k60M3M68k6n85l23M51Q56m63l44k99K87
8009b02R8Q1M80m90l67r4J30L23p8R65p54r05N01N21L54j52q45J04L06J58M4P9
8031B57M0j58l43k5O57j69K7j05l74j38N09J73k69l39k72P01j7l11K59j07k71
8052b75n2J72J79j56L32j04m64K76K89OP3p45K44M11j17l9l32L23O7n96N93p0
8074A5M56k33p03M4N22O1j21l03q1K97L7O16n01k63L63J45k39l74L16O40o44j30
8096h0l6O32m15j10kJ09j15L01l31L17m89K20j92J37J44k57K85L5k49j56L96R8
8118B42k87Q7j03k18N0J54o7r2K15j5M26o18J68J51j22k6q7J35L11J23o81J15
$$ y = [165, 320, 439, 150, -210, -38, 98, 292, 433, 80, -121, -228, 63, -71, 201, 522, 243, -220, -183, -98, 115, -63, -278, 174, -215, -163, 482, 435, 156, -287, -404, -7, -267, -224, 244, 218, -367, -690, -239, 617, 154, -190, -489, -202, -104, -23, 457, -33, -400, -494, -364, -41, -119, 846, 92, -813, -312, 209, 563, 411, -434, -330, -24, 134, 178, 257, 297, 139, -204, -229, 428, 259, 286, 181, -193, -331, 178, 351, 82, -257, -529, 172, 155, -156, 103, -4, -275, -327, -155, 24, -132, 200, 96, -368, -92, 197, 203, 276, -469, -225, 186, 69, 30, -302, 21, 88, -508, 85, 15, 471, 238, -465, -421, 101, 162, 41, -262, -343, -46, -9, 607, 106, -157, 206, 351, 112, -262, 54, 694, 50, -80, -116, 516, 101, -9, -11, 98, -17, 284, -47, 270, -219, 1, -191, -54, 90, -167, 118, 153, -96, -252, 144, 242, -45, 42, -61, -279, -229, -75, -142, -234, -19, -34, 392, -226, -58, 93, -29, -55, -142, -7, 304, 427, -254, -139]
8140a39N21j55l14%l86K32K31L0k35M31k13j6L86r1j21m4j53K1N9K34l72K7j62
8163b29L42k70K0k8l1o1J42j74L22J34j67m11L21K22J28l67j25Q2%J77k17M19
8185B29l4l61j20O49k34J49
$$ y = [-139, 382, 227, -87, -87, -473, -241, -10, 20, -215, 216, 3, -13, 373, 282, 161, 117, -36, -15, 44, 278, -94, -67, -229, 113, -157, -137, -165, -196, -257, -115, -289, 33, 167, 0, -411, -90, 132, 260, -107, -232, -150, -150, 27, -190, 229, 195, -166, -286, 363, 129, 278]
8191B78
$$ Imaginary data points
##PAGE= N=2
##DATA TABLE= (X++(I..I)), XYDATA
0@%%%Qj6QqK4l2L2m0N6p2Q1r4J20j47J73k02K35k79L28l73M31n03N74o49P38q40
29d47R50j065J195j343J501j672J863k076K307k556K832l136L473l846M254m713
45b479N233n816O478p242Q131r179J0438j1984J3942j6505K0014k5151L3397m8752
59b9475Q6774l45518o02431P52906N37328k16302j82363K39562k03800n07397
69d70716J59983P03910N4905n38154j73131K15549p0254n6251M30228K77625n21508
80A2186n11956K98605M55127j66768k42995K27709J34738l44336j33577L93577
90A22310J74067l71230j95718K73156J33364j87459J0961J88163j47313k72821
100b72520K16416M02172j43670m41947k813K89366J3627r0271J83832J01018l35143
$$ y = [0, 0, 0, 0, 8, -8, 0, -8, 16, -16, 16, -24, 32, -40, 41, -53, 67, -80, 93, -109, 126, -153, 175, -198, 233, -270, 304, -345, 393, -447, 503, -562, 633, -710, 791, -881, 982, -1094, 1213, -1343, 1489, -1647, 1826, -2020, 2234, -2479, 2754, -3062, 3416, -3826, 4305, -4874, 5564, -6420, 7522, -8983, 11031, -14120, 19277, -29475, 57299, -288219, -890650, -137744, 399584, 183282, 919, 240481, 36681, -470716, -310733, 393177, 448082, -90072, -263203, -47654, -117908, -174159, 256069, 533694, 12186, -499770, -201165, 253962, 87194, -155801, 71908, 206646, -137690, -271267, 122310, 296377, -74853, -270571, 2585, 135949, -51510, -40549, 147614, 301, -272520, -56104, 346068, 202398, -239549, -242362, 47004, 60631, -29640, 154192, 255210, -79933]
111g9933k76782K44377L45038k1954j62312o3759j38644j35952K39853M13481
121C63413l4193m20404j79092J50868P5090P429J89463J22743k78258l34354J08544
132b28751L54408J13927j33674j39091j17792p1315J38806K60620M9244j92802
142C3580j36505N910R892M8832J62078O8132j95277j95252R3325K11855L9168
153A45738r0484n9905n3239n2412P2268J52515J1680j34512o3488M8116K1334
164b389L295O6556J3853j40828j02091J22332J66217k2545j20515m2784M71o194
176f4622O8468J03270l9832j51530l4894J01702N6719k382L7766j2595j56621
187i4551r3618J60304J94685m8770j67638l4921N2509P868L1598R4458l467j47635
$$ y = [-79933, -356715, -112338, 232700, 210746, 48434, -15325, -153969, -289921, -50068, 363413, 329220, -91184, -270276, -119408, -44318, -36889, 152574, 275317, -2941, -337295, -228751, 125657, 239584, 105910, -33181, -150973, -222288, -83482, 177138, 226382, 33580, -102925, -97015, -87123, -38291, 123787, 191919, -3358, -198610, -105285, 106570, 145738, 55254, -4651, -57890, -110302, -38034, 114481, 126161, -8351, -71839, -23723, -2389, 906, 67462, 81315, -59513, -161604, -39272, 126945, 104400, -16115, -58899, -58428, -64622, 3846, 107116, 67284, -84246, -119140, -17438, 39281, 36899, 74665, 62070, -94551, -188169, -27865, 166820, 118050, -49588, -84509, -32000, -24132, 7466, 101924, 98457, -49178]
199d9178q6733P6680R8733L4003J6729l6352j34608p1493J35588J58131n0993
210I0507j42683j1322N9945j7208q823R7312N1185j22251j27121M6890J24377
221D0808L6547l5375l7147m5920k6326N5288P8695j5118p4374j6199K7786p131
233a8466j952N8719L3487p2265p9721K8814P9561J9383l3852l1736j8226O620
245b9634M4079L0470l4187m4656J5675K9229j9835j5107M3345K8407n3018n4186
257e9418L5644O9880N385n2723l9771N703M2174M0055j3763n1822r933M5014Q869
270B5294m6598q39O7349R929q6323m3651P5062P1933l4026o6862p149L0264J6132
283A0515K584q264j7578M398K6931j2124m8541J0340P4576P800q8167l3883P8822
$$ y = [-49178, -135911, -59231, 39502, 73505, 90234, 53882, -80726, -152219, -16631, 141500, 90507, -52176, -63498, -3553, -20761, -29584, 67728, 118913, -3338, -130459, -83569, 40808, 77355, 41980, 4833, -41087, -67413, -12125, 66570, 51452, -22922, -39121, -11335, -18466, -20418, 38301, 71788, -477, -80198, -51384, 28177, 47560, 13708, -18028, -36254, -29634, 14445, 44915, 10728, -33928, -18253, 10976, -8859, -23966, 19379, 47786, -5232, -59418, -23774, 46106, 51491, -1232, -41003, -35300, 6874, 46929, 33166, -18656, -28589, 16425, 25294, -21304, -22143, 45206, 55135, -31188, -74839, 223, 72156, 38130, -28732, -35881, -5617, 10515, 13099, 4835, -12743, -8345, 18586, 6462, -42079, -31739, 42837, 50637, -37530, -71413, 7409]
296G409M9803o0718m7217M6890M1730l6848l6265K1608K2023l965R542O388l9385
309a9005k6959N0752M9886m3692n5328L8151N2705m2042n7727M6984P6374k9999
321D0100q6713p461O5547L4586j8182k7507k1164n876K7975L1879j5595l4799
333a7210J1549K5179k8945l5764M7082P0513l5732j04250j2234R6734N9309m9919
345B6312o5588P25L2134J2443j065O714J839j6927k5772r610L0175N3282J3013
358E7675o3033p0824J7698Q7305M3759m4158o0321j0656K4779K3740J8308J1486
370C5758j5629m0883k8586J8350N4626M2782j6065p1481n4973K9056Q7103M3306
382H3364m6678p3946k1660L4974M4623K3168k450k9634m6619k5502K9474O8778
$$ y = [7409, 57212, -3506, -50723, -3833, 37897, 1049, -35216, -13608, 8415, 4450, 13992, 20380, -19005, -45964, 4788, 54674, 10982, -44346, -6195, 46510, 4468, -53259, -6275, 70099, 40100, -46613, -54074, 11473, 46059, 27877, 370, -20794, -26670, 1305, 33184, 17589, -17210, -5661, 19518, -9427, -45191, 1891, 72404, 36672, -67578, -79812, 16922, 76231, 26312, -39276, -38551, -6417, 6026, 4961, 11675, 13514, -3413, -29185, -38795, -8620, 44662, 57675, -5358, -76182, -58484, 28821, 72580, 28422, -31899, -42555, -17776, 5964, 24272, 35758, 20129, -20754, -49340, -30990, 23636, 66418, 50353, -21128, -76101, -47045, 40058, 83364, 36686, -37260, -58920, -23946, 20677, 43845, 41395, 11761, -34858, -60360, -30886, 37892]
394C7892M2043l8591r1331m5688N9150R9921K3680p1991p5055m130M2533L8570
406A7003K4156O723l6906o9338k5607O3714R2078J5232q0889q9215l333Q1585
418d797P8561m60o6008n8565p593L0660M7497M5225j53o9774p9460R015R9158
431B3306P6531k8269r1237o0149J5563O9452O6864O535o4350p3246j2279N1249
443b0030O3868L1428k5936p8919o6290K8897J08118O7065m8744j01880m7521L2121
455e7823P1250N7519j288o9961p6232l155O9508O8894J5024m2043p8308n7012
467a03627L8934J17519O5852o9055j17715l1917O5817P3562K7050j7340n2404
478c324o1672j3078O3384Q7293K4926o7029j01659l6559P6188J14899K6087q8537
$$ y = [37892, 79935, 41344, -49987, -95675, -36525, 63396, 87076, 15085, -59970, -64100, -21567, 17003, 41159, 47882, 10976, -58362, -83969, -20255, 71823, 87055, 6166, -83049, -86382, -4797, 73764, 73304, 7296, -51269, -58862, -28202, 19295, 64520, 64367, -5407, -84867, -75852, 23306, 99837, 71568, -19669, -79818, -64255, 5197, 72061, 78596, 14246, -59000, -71279, -20030, 43838, 75266, 49330, -29589, -95879, -66982, 41136, 108201, 59457, -42423, -89944, -57823, 13427, 70946, 69658, -303, -76535, -79690, -10182, 58712, 73736, 31693, -46615, -103627, -64693, 52826, 118678, 49623, -68092, -100009, -34192, 39370, 66420, 49080, -3324, -64996, -78074, -14690, 72603, 97529, 30500, -71159, -107718, -31530, 83369, 109456, 20919]
490B0919r2231k891N8025N2163K6859m444n7100p7164r707Q5023R2020J198q6489
503F181r0758j0534Q4443R8678M529r2910p7676J0024N4763M2288L0265R96o8444
516h155q8735P100J09989Q1083l2535r0477o1822L372P1142R2985J1733r9164
528c484r1388K3609P8653L4664J867K027m3143q7098p917J17008R7263n0197j18681
541d6817m6408M3475P2155N6203l901q0266p6045K0797P8235L4491j0077q955
553C2887l6453p5620n855J22718R9378p2503j46037k9040Q9741P3367R347k0360
565D1570m5657o1947q285P0904O9647J009m9903o0248m5367K4735J08923P7753
577A23134o6860j35126l3822Q6073P9227Q026k6676l7840m9724j6508N4879P6922
$$ y = [20919, -71312, -74203, -16178, 35985, 62844, 58400, 1300, -75864, -85571, -548, 91472, 92670, 6181, -84577, -95111, -10668, 88010, 92539, -371, -78047, -68023, -13260, 29028, 59293, 60289, -8155, -96890, -89790, 20199, 101282, 68747, -21730, -83552, -80180, -9038, 83947, 95680, -3484, -94872, -71263, 7390, 42054, 43921, 45948, 2805, -84293, -92210, 24798, 122061, 71864, -46817, -93225, -49750, 22405, 78608, 74707, -5559, -81604, -60807, 17428, 51919, 41842, 32887, -3566, -79186, -85041, 37677, 137055, 64552, -81485, -110525, -20784, 52583, 61930, 41570, -4087, -66034, -74319, -3415, 66232, 67241, 17338, -42910, -88277, -63542, 45381, 123134, 56274, -78852, -112674, -26601, 52626, 60652, 33976, -3864, -53588, -70096, -15217, 61705]
589F1705J4862n6222p0021k8592M0286Q5458M7450n4007r7946k6227O6419P0751
601E3916M951m2588m0243j3364J1660K9776L5249J4121l5206o9300k7146O8845
613i329R3644l858r9416o5720L6432O9251K7806o650k7891n0474l2812L5900O9889
626C6772K7456k8158n0182n2207j4902P5126J06275q491j27385p2350O2312P5698
638B9964L155l488J3072m9064q4903J9278J18235M7996o6876n9630n618m430J6128
651b6181P8759M0827q7914r3654M3356Q7117j0677l9472K9252J0999p3600k5578
663f6766R3417N7176p4300o6147L9561L7475k1259Q284L6490m2475p4696M1933
675c1307J00718j6955r1436J463N5947k7014l8040P1903O5516q7384j08805M8852
$$ y = [61705, 76567, 20345, -49676, -78268, -37982, 47476, 94926, 40919, -57027, -83254, -16835, 53916, 58867, 16279, -23964, -37328, -25668, 4108, 39357, 53478, 18272, -51028, -78174, -9329, 84315, 80457, -18959, -84679, -48247, 21004, 48810, 42160, 14269, -36205, -69017, -33117, 36772, 64228, 36070, -14112, -66319, -81221, -6095, 100180, 91689, -35696, -108046, -45734, 29964, 33119, 29631, 42703, -6361, -91264, -71986, 46249, 94245, 27369, -32261, -37879, -42309, -26181, 52578, 93405, 5491, -88163, -44807, 42310, 31633, -7839, 21413, 32412, -41188, -66766, 26651, 83827, 9527, -56620, -17059, 20416, -843, 7441, 43931, 1456, -73240, -31307, 69411, 52456, -38980, -37517, 18430, -8584, -46624, 25279, 90795, 3411, -105394, -56542]
687e6542J08850l20n2218L177m985n7155M722R7011L7069p5494m8753K7526L95
700a6717k1273N8536P3301o2733j18816J7946J08106J1825n9394J0336L7024n1268
712a3127n6031N8878P8840l1899o5499J2669K6835k6022k607N3833M729o6677
724b6078j2762O2373J0504n9462n000N8316L081n4491o88M7633o077m5834P591
737b0894M3685j382l1554j231O963j3872O676L9592M034n0359k2883L6450K3965
750A9190k0275p772K5479J113l7973j7535L1073L6753q91k9304k4860L938K7193
763F129J2726j7244j0296J9772Q632l0703k0375L0088L5524j3796l2084k306J3605
776c28K641P60N090m161m408Q944m183k8524N81M8126K0408n0885l8275L4526
$$ y = [-56542, 52308, 51988, -230, 2947, -2038, -59193, -54471, 42540, 79609, 4115, -44638, -17112, -16717, -37990, 20546, 93847, 31114, -87702, -69756, 38350, 50175, -9219, 1117, 38141, -13127, -69158, -10280, 68560, 36661, -28838, -16169, 10666, -15356, -17963, 35870, 40599, -26078, -38840, 23533, 34037, -25425, -30425, 27891, 30972, -23519, -24207, 23426, 17349, -28485, -20894, 22791, 21409, -10145, -11376, -4413, -18285, -11609, 27983, 32017, -18342, -41225, -4775, 19190, -1085, -8857, 16622, 17735, -20238, -37773, -6700, 30053, 29162, -142, -25002, -21064, 6129, 18855, 1611, -8685, 11087, 19719, -10984, -31359, -1271, 34253, 20457, -11627, -13933, -328, 2313, 3073, 8163, 4002, -406, 8538, 4355, -24169, -23588, 24538, 44946, -5939, -44214, -9688]
790i688L6150k3240k2083K6463J4069l5243j8217L1862J9534j6668l784P272k3573
803a7146j8390M3384M0814m1772n6290K8464N4618j8755m0843K2583L2730l1859
815b462l5548L1567M0801j5071k9061j038j477k975L3820L0712m1225n9088K4920
828b6125O2680r574m6558J6185L7217l3780n1059L5350O8985j0814o2448j7619
840c7560K5458J7092J2257J0044k2380l7733P530M0372J976k4686Q913J7794l2699
853a3622l2443M0398N5494k2859o0450n774L5807J7075K123K101k2519l4006J2706
866b5969M7919Q523k9755p017O028k3051j0891N1998M6808m1327p0987j151M8271
879f01K7687O585k794l7298m7051J7249O5346J8406l4233j4211J34l4869j4283
$$ y = [-9688, 26462, 3222, -18861, 7602, 21671, -13572, -31789, 73, 19607, 2939, -845, 6427, -17146, -35536, 7848, 48662, 6890, -49400, -20936, 33682, 14927, -25916, -3333, 29397, -2462, -38010, -6443, 34358, 19287, -9774, -10812, -12289, -15264, 18556, 49268, 8043, -51045, -26125, 36555, 26981, -19577, -3392, 33825, 45, -51014, -15664, 53321, 42507, -19941, -37560, -12102, 4990, 17247, 27291, 4911, -32822, -25292, 15080, 17056, -7630, 1283, 19077, -13622, -46065, -5667, 49827, 26968, -33482, -39256, -3449, 13626, 15749, 17850, -4669, -38675, -25969, 21950, 30473, 718, -6299, -271, -23322, -34213, 17785, 64593, 23266, -47721, -48872, -601, 27086, 33671, 30877, -6421, -53472, -36223, 29123, 47529, 13296, -915, -781, -35650, -49933]
892d9933P2085O6851n2823r8597q88O9500K6435j3304L675j1504n2134j4173O1644
905F834M5412k7874l4209l658j5935j2166N5483O2484m6736r7879M097Q5220K1882
918D2955m1107k642J5657m0584l3101O1600P0099l6688p6994m510L7045J0227
930A957J7347L3895k8638q5331j0846R0351N2955m2753m3292J236j3198j6274
942d2591N2917P1401k9690r7156k7157N5595M4529J0663N599k9006p2133j9117
954g6146Q1336P1481l0439o3223j4604K360n227L7101O7844j0491r9006n1648
966i0662O0068P4550O323l0071k8301l4081j2255M9210O2478o570n9944l5137
978d4392N891K1116L7797M1284j9842q4271m1177O3396P9902j599n3582l1608
$$ y = [-49933, 22152, 89003, 36180, -62417, -63305, 6195, 32630, 19326, 23001, 11497, -40637, -54810, 6834, 52246, 24372, -9837, -13495, -29430, -41596, 13887, 76371, 29635, -68244, -64147, 21073, 42955, 1848, -794, 14863, -25721, -58822, 2778, 72877, 36189, -40805, -45315, -8270, 1957, 19304, 53199, 24561, -60770, -71616, 18735, 71690, 28937, -14355, -13119, -26317, -42591, 10326, 81727, 52037, -45119, -72276, -16681, 27848, 38511, 44110, 15104, -57029, -76146, 5190, 76671, 46232, -16991, -31595, -29235, -34462, 2639, 70483, 59992, -39014, -90662, -30594, 43956, 50279, 20208, -8093, -42174, -54429, -5219, 57259, 50689, -9255, -44392, -38501, -17385, 20412, 61696, 41854, -42417, -83594, -20198, 59704, 58105, 4523, -27085]
990b7085n750K919L1009N0274N060o0221n6363J0540N6193M6257K916m4531n9946
1003d8728j5852N4530O5788M249n1410m7281p960K4485M0449L2269q698n3074
1015a1233m8587Q248N8603N2184n674n8046n6394L024N9215N2226n760m9026l9853
1028d1073k898K6101L8001K5809j1717m9510m2907J1567O0842M8853j5461o5586
1040a7979m6296K1784O2241L4770k1693m1484k2996J124J7872L3144K8823j4525
1052C4785n7169l9687K8424O8301L1532l7111o0156k2518L0508M6963K0533j7920
1064B6485l4783k4413P65K4499L5486J6703k5388n1612k4344L4882N8507J8316
1076E5103m0327n2096j1515L3095L9558J2493j9605l0339j8557M285K5340K9569
$$ y = [-27085, -32835, -29916, 1093, 51367, 56427, -3794, -60157, -49617, 6576, 52833, 55749, 11218, -48728, -64580, -10050, 55738, 59987, 8577, -38704, -46664, -22179, 18270, 50539, 41841, -11233, -59820, -51572, 7031, 59215, 53541, -4505, -60899, -57875, 1340, 53566, 47806, -1220, -41073, -43971, -17870, 20131, 45940, 34223, -15287, -58194, -46627, 14215, 63068, 47607, -17979, -64275, -42491, 19750, 54520, 32827, -8657, -31653, -30529, -12657, 20487, 49310, 34785, -22384, -62071, -33647, 34654, 66186, 29075, -31081, -53599, -23091, 23872, 44405, 26485, -8298, -32711, -31946, -7447, 28039, 44742, 19354, -32258, -56602, -21720, 36787, 55103, 14776, -37320, -48835, -15740, 23818, 36311, 16706, -13633, -32190, -27905, -2565, 27004]
1088B7004Q862k5798m2806j5569L4361N1246J1450m0944m6645j526L7860L1752
1100B9247m86k0679j9079r457Q41J7053K9408J1794k9091m5144o608M3729M3403
1113D4931p173m4140k7943J2163K7644J5257j031j0897j6457j4606J475K3283
1125B506K6869J35l3319l4284O342M1240K8257j6601l5853j3834J3673J6993R580
1138A1704L723p032k0054j4737J0232K6709J4675j0245k4695j7792O197K9421
1150H106K2331j1919l2114j2273J7279J8197K217k543j990j2125j4148O387K5674
1163A3079J3179j4065k3717q860J0415K1013J3610j1154k5724p389J8276J3762
1175A2425n938m980O250n479k0510P82L0871J5765k5489k7985O931K3477N698
$$ y = [27004, 35866, 10068, -32738, -48307, -13946, 37300, 48750, 7806, -38839, -40365, -2505, 29247, 28761, 8082, -10997, -20454, -19613, -2560, 26848, 38642, 9551, -35593, -42201, 1528, 44931, 37758, -6382, -34325, -22162, 5482, 20739, 19708, 8811, -7646, -22252, -20777, 2506, 29375, 29510, -3809, -38093, -31751, 9489, 37746, 21145, -14708, -28542, -14869, 2124, 11704, 15427, 8395, -11659, -26396, -16164, 10545, 25220, 14975, -9720, -27512, -21315, 8106, 30437, 18518, -13596, -25869, -8590, 9607, 11824, 9281, 7291, -4834, -18982, -12595, 13079, 26258, 12193, -11524, -20384, -9969, 11044, 24654, 13500, -12224, -19613, -1337, 12425, 6487, 1507, 7757, 2278, -18232, -17450, 13421, 29186, 3697, -24288, -17357, 6120, 11818]
1188A1818q274l706k984p174L06J2210O991m817o911m362n181L978J8008R082
1202A8984j9275k2013R221K4202J467j5501j572R208o005j1638R511J9914l103
1215A3400k0727n049J2144N976k283K901O55j1448o876J3095J1798r923j1510
1228g847R961Q517j3052j1357J5890J5771j3968j8682Q994J6370o978j3166O128
1241c419J1647n731q847M447J892p058N012J4018o946k2330M639K5930k568k7039
1255a6353M495L0121n786l6073J960M0534N709l6256j0274K7705P868j9184o28
1268f162J6624o492j6412J1760J6129j5491j3625K0563J1892k8611j1268L7027
1280A5934J5351m2867k3124M1460K9642l3341k7474K4202J5635k4397m772L2700
$$ y = [11818, 3544, -162, -3146, -10320, -10014, 2196, 9187, 4370, -2541, -6903, -12084, -8106, 9902, 18984, -291, -22304, -13083, 11119, 12586, -2915, -4487, 4721, -1284, -12922, -3411, 16503, 13400, -7327, -12376, -232, 5744, 3461, 6362, 7017, -4431, -11307, 1788, 13586, 3663, -7847, 2114, 10631, -2421, -13778, 2112, 17883, 3915, -14767, -5773, 10597, 3619, -9547, -3419, 8228, 2497, -6350, -1903, -11, -7069, -2057, 11961, 5015, -17315, -12676, 13254, 10686, -16353, -11858, 18263, 12477, -23596, -21636, 18898, 24607, -11649, -21923, 5782, 13650, -5534, -6162, 10462, 3970, -12442, -682, 15447, -44, -13669, 6894, 18786, -9825, -21093, 15934, 31285, -11582, -34706, 6754, 36396, 3055, -24419, -217, 15418, -8979, -13751, 18949]
1292A8949K393l7775p214L1044L518k1032J3243K2634l1043m1002L1303N7750
1304D2768j4446n4417M61L4151o128k0454K4107K5283k9920l6477J7115L1298
1316A3341k822n300R376j7993l4564J8005N6088J552n4414j4400L6749P822k5822
1329a2382R473L3889j4832m6930J751M4628J4887k2064j4005m714o907J2881L1400
1342B7075k27l8759j6055K6092J4187j2536L718J6246j8271l5409J0378M5516
1354B1955J1878l0086k2364j365M324J7575K6535n027m0441j7413K6148K0672
1366A2391o130J524Q411k2538l2521J7339M9481R155l5849k4201K555Q661J7977
1379F255K5381p683m3815j5484L3248K2561j2233k151J1286k3092l6207K4322
$$ y = [18949, 21342, -16433, -23647, 7397, 10915, -10117, 3126, 25760, -5283, -46285, -14982, 42768, 28322, -26095, -25634, 8517, 2389, -18065, 6042, 31325, 1405, -35072, -17957, 13341, 10519, 5219, 14595, -3398, -37962, -19957, 36131, 37683, -16731, -31131, 5618, 13440, -12382, -2909, 30980, 16148, -30782, -29031, 15597, 30484, 8420, -5585, -10299, -17206, -4325, 27075, 26848, -11911, -27966, -1874, 12313, -223, 3495, 19741, 1470, -33939, -23561, 21955, 33833, 3747, -18617, -19982, -15658, 1917, 28452, 23425, -17016, -34429, -8281, 12391, 6261, 7785, 16196, -6342, -38863, -21524, 27957, 37112, 1263, -22938, -20383, -11722, 6255, 31636, 23953, -19862, -35346, -2098, 20463, 8230, 6079, 17365, -5727, -41934, -17612]
1391a7612O1500K231n7160k6799K3936J9359M580J5579q24m2108k6713L3046L9297
1404B8312n900j5975m37j9751l0567K5741O6110L602o7022l2650L2811K4786n533
1417C527J1894J4849l5283m5003K2102N4772M681l0831o030L52k2655M439N1492
1430B8306J8784n3820l9180L2879L5203j3762j1238J6980q417l6407Q283N0867
1442B8478Q641m3373j8780J8521N914r02K5663J0235m7025l9509L6561N4548p341
1455C1631l5463k408J343k3313N536N4688K3516n1395n1187J1846L6126J6829
1467A7749R632p93l5537m0234J6258N1817J7615k0945j7444j2454k0331O350N0240
1480B1923L0680l7535n1939J331L3096J5837J779K372j3138k9182l825L1991K3660
$$ y = [-17612, 43888, 46119, -11041, -37840, -13904, 5455, 10035, 25614, 24790, -17318, -44031, -10985, 28312, 22412, 6437, 6000, -13751, -44318, -18577, 47533, 51135, -15887, -48537, -15726, 9060, 3527, 15421, 30270, -5013, -50016, -27914, 26858, 31539, 708, -5322, -4970, -27625, -23186, 28306, 47090, -6730, -45910, -13031, 22172, 8410, -2828, 14152, 5735, -30672, -22389, 28478, 37119, -6254, -25034, -6513, -599, -1501, 24162, 34397, -12628, -52137, -15576, 38972, 31631, -3832, -6240, -4897, -28210, -22674, 32014, 55530, 4135, -47052, -35206, 920, 17749, 27381, 26588, -8949, -49183, -32925, 18892, 36507, 15562, -1882, -14336, -34667, -28317, 21923, 52603, 15068, -36871, -35540, -2444, 13393, 15172, 17544, 4406, -24776, -28601, 3390, 27050]
1493B7050r289j9744j0647m391P845K5540J3020k3266l1517M343K8363J3173o938
1506A3542j1687j1032p763Q125K2570J0965j3753k1901j2000O115K3786K3843
1518C0810n194l6350k6158J4474L3567J6564q972k0853j9438n153J7426K5565
1530A6288J0651j2449k4950k2432L034L6338L5204j2555m7430k1617K4048K7781
1542A1911M636k244l876k0239k0858J2397L6389J4642j9685k5308j1123N078K3857
1555E577K6013o550l8172j7887K3732K3617m243p140L504r809k1165O684L5167
1568A9328J1900k8338k5013N453J5538J0271R515m421k6971j7607K2073L0190
1580B1918l947k1555m224K446q851K305K7193J4536k7682l3156N525K9781J6664
$$ y = [27050, 17761, -1983, -12630, -17021, -9176, 16364, 29384, 6118, -25399, -21056, 7307, 20480, 13542, 1855, -9177, -16940, -8815, 13755, 24720, 10967, -10934, -22934, -16819, 6967, 30810, 25616, -10734, -36892, -22418, 11149, 27713, 18741, -2112, -21550, -26703, -9277, 16288, 26939, 14490, -10460, -32892, -29858, 6480, 41684, 29129, -18301, -39918, -15870, 11911, 16547, 14303, 10427, -9812, -30670, -18273, 18116, 32758, 13073, -12235, -23358, -18280, 5577, 31590, 25040, -13132, -31019, -7287, 16330, 12087, 4947, 8451, -1358, -22523, -15839, 19328, 31228, 2890, -22123, -16670, -1132, 9139, 18654, 14233, -12738, -30345, -8272, 21918, 17971, -3584, -7808, -5362, -14213, -11908, 15285, 29821, 2139, -31017, -25492, 4289, 20953]
1593B0953m138j4552j8813q078J7963K4783J97j7417q571l21m811M407K5128J3363
1607C0093k5907l3682N584L3696J5067j2495j6310n993N06O807J1634N145p261
1620F884j1005o568R34J0737J5514J032k0872j8536Q640K3901P705j2858j3374
1633g866k721L979O185P650K403o982j0930m583N349J1905R068m679j6835j0506
1647a8563Q927J7536O469r827j2561l531O277Q231K864j145l054l750n956k53
1661h336J1959J1694o334j8287m945J4362J2008m335r183k177K585J02J781L371
1675D265N89k978l848k683J784P943N878q134j3250J126J4822N009j0760o587
1689f824O216L113o468q69R075K805r421p058M839P010J31j695j724l129j179
$$ y = [20953, 16815, 2263, -16550, -24628, -6665, 18118, 18315, 898, -7673, -7994, -12805, -8398, 16730, 30093, 4186, -29496, -23912, 9784, 24851, 12356, -3954, -9947, -9441, -2634, 9000, 14145, 6884, -4121, -10689, -9755, 982, 16496, 17528, -3344, -21880, -13240, 10661, 18366, 5508, -7866, -10587, -6608, -423, 7227, 9630, 2648, -8282, -12865, -7516, 4389, 13457, 8778, -8057, -18563, -9636, 7900, 14369, 4542, -8019, -11550, -5273, 2958, 5822, 4677, 1623, -2127, -8083, -8336, 3623, 15317, 8983, -9304, -14249, 113, 12121, 7786, -1397, -3574, -989, -887, 894, 4265, 4854, 1876, -1972, -4655, -2871, 5072, 10950, 2816, -10434, -9308, 5514, 10523, -237, -6824, -608, 2505, -3963, -4832, 4243, 7048, -2373, -9431, -4592, 2418, 2549, 854, -870, -3999, -5178]
1704e178M852M074l508l948K819K904m049k826N399N049m138n442J653M360J53
1719B174k663P11J263k61j72n80j454P57M272J349n901m316M069O410j353n505
1735a200o18L966n63l853L66N244K272n755o402O29Q894N127n607r451R1P699
1751H39L204m270k804L628R83p024k293Q568Q231m667j1985l662Q531Q982P20
1766F981p007n886N22M697L366q1M07l23l779o341K707J1319O484q601j3634j129
1782a0298J1142R250j476p399n833q02L239O047L222j253n157o015k292M283J0518
1797G176O667r293j7073l030J5459J4254m060j4165n410L828M188J473M862K742
1811G618o946j2146k565J2603J4173Q01j4973j5320J605J7614J3008o145j4802
$$ y = [-5178, -326, 3748, 240, -3708, -889, 2015, -2034, -4860, 539, 5588, 1450, -3992, -2339, 2021, 2174, -489, 222, 1485, 1224, 1052, 472, -982, -225, 4047, 5396, -505, -4821, -752, 5658, 4305, -1200, -1818, 2148, 1585, -2268, -1902, 3342, 5614, -141, -6543, -5914, 2980, 8107, 2500, -6951, -6860, 839, 4043, -227, -3031, 597, 1580, -5444, -7737, 831, 9062, 4395, -7590, -11252, -2721, 6261, 6981, -26, -5912, -5390, -693, 2673, 2592, 2999, 2676, -1103, -7444, -4737, 6582, 13066, 4465, -9169, -10298, 844, 10094, 8618, 1219, -4614, -5416, -2177, 3870, 7092, 5839, 682, -5333, -7625, -3342, 7176, 13843, 4550, -12523, -15553, -94, 14160, 10100, -4065, -9475, -5647, -1459, 14, 4876, 7618, 672, -11474, -14039, -1436, 12737, 13538, -1435, -16755, -15150, 2464, 15472, 9327, -5475]
1824e475m283N348K551J622Q083N473j2295j8593J840K2380J4325r201j8530q020
1838a4775O211J2256J0239q59j2839j1239J251R268P760M537j464j2409j5750
1851a7813K667K2855J6280j1690k3597q081J1342J4382O740k943j1412j2623j365
1864a5258J2981J3518K104q828j3262r867M638K1667J6674j1603k9407r441J9281
1877f803K0608J116r694q398p416m337R830K0254O714j6661k2756l794J6478K1247
1891A6388O901j4507k3347p841J6713K1165L234j1760j1814o823k213J1089K0772
1904A7957O548k2086k6188J652K5190J7327l266j5743j5005o126J1599K1329Q903
1917B2091j5065k0418o180Q953J4233J3496R13k0139k3867K604K8486J9731q559
$$ y = [-5475, -9758, -4410, -1859, -237, 7846, 13319, 1024, -17569, -15729, 6651, 20976, 11775, -6755, -14775, -8564, 3692, 13931, 13072, 233, -11006, -9755, -487, 7273, 11810, 10346, -2063, -17813, -15146, 7709, 23989, 12299, -11298, -19379, -8037, 6345, 13085, 10142, -1270, -13893, -15258, -2277, 11241, 13345, 4517, -8745, -18612, -13974, 7693, 24367, 12764, -16643, -26084, -6803, 13805, 14921, 5227, -3171, -10587, -14924, -5094, 15160, 21874, 5213, -17543, -21337, -4859, 16388, 23289, 8782, -14565, -22406, -5693, 15472, 18706, 6946, -4868, -11691, -13904, -2815, 17957, 24505, 2419, -23769, -22117, 3073, 20400, 17134, 1391, -13614, -19740, -8141, 13188, 22091, 7026, -13392, -19572, -10619, 3614, 17110, 18023, -2116, -25983, -23379, 5107, 24838, 16279]
1930A6279k1278j3201L39J2689J9799Q387j6174k4068m793J4979J7105R307l217
1943A6153j8953k2837L829L1127K1320j4326k6337q268Q448J0749J1130Q226r876
1956A0385k4959r893J8547K4200M020j4724j8189r633P661K3082J4271j3131k4112
1969a2475o964J0787J2157Q495L693j0689k3056p626K2309K5605j541k2619j6620
1982a8544N02J1987J6158R105r142k1586j0883J0990J8978J0027l916j5273j7315
1995a8912q97J9940K1175j435k0911j6665J205J5433J5513L659j2384j6162n169
2008a5610R126J4006Q939l231j5372j5941K557K1295J5424p408j9447j0582N244
2021a1000J3395J0735j92j2386j1987j500Q985J0381O027k326j5665j5774O772
$$ y = [16279, -4999, -18200, -17861, -5172, 14627, 23014, 6840, -17228, -22021, -7042, 10063, 19370, 16153, -2800, -25637, -21808, 9319, 30639, 16313, -10024, -18292, -9844, 905, 12035, 20261, 10385, -14574, -24467, -5920, 18280, 22300, 7576, -10613, -20246, -12585, 10497, 24768, 11637, -12475, -19439, -8652, 3505, 12000, 15693, 5004, -18052, -25678, -3369, 22236, 20695, -1924, -18544, -18042, -6055, 10103, 19208, 10066, -11520, -22403, -11413, 7565, 17592, 13676, -1597, -18912, -19809, 131, 21306, 19871, -1040, -17705, -16500, -1067, 14446, 18105, 5721, -10441, -15610, -6484, 7522, 16461, 13230, -2142, -18083, -15526, 5769, 21193, 13785, -5662, -16244, -11000, 2395, 13130, 12938, 552, -11435, -12935, -3950, 6431, 12458, 10132, -5533, -21307, -14535]
2034a4535K5258J1970j6511k0731n24J1281O479M137L604o496j5906m676J3294
2047c356J5759J634r516j2626p908O181J9627J0466j3432j8896l70J2145N108
2060D816L52L407j867j3629p932J2123J6919l40j3437q399j55M484R597P414p405
2075E948j5275k090J2469O855m867l767J971k883p459M067J4957K662j5520j1986
2089a4918O251J3916M090n356p582m903K36P528P966m69p056m906q88p32N223
2104a600J1971L655j5413j6490N642K0207O523j0764p777J985p98l348N887J1985
2118A1665q78j3428p319N585P214K100K392j671j0481n109R680J0182o109r434
2132e611N205O791p636q019R322R670q465j0387P357R195o679q114N228M973m770
$$ y = [-14535, 10723, 22693, 6182, -14549, -15073, -3792, 2687, 6824, 10428, 3932, -11974, -16650, -3356, 12403, 14037, 4521, -8105, -16013, -9832, 9795, 20261, 6829, -12067, -12437, -292, 4816, 5168, 8575, 6708, -6921, -14853, -2730, 14189, 13849, 412, -7987, -8142, -3658, 5939, 13353, 5948, -9327, -11417, 1052, 7907, 3040, -727, 1244, -1639, -9098, -5031, 9926, 12588, -2932, -14918, -8667, 5249, 9339, 3983, -3599, -8502, -8266, -738, 7228, 6759, -297, -5203, -6091, -6823, -1600, 10371, 14026, -1387, -17877, -12235, 7972, 14495, 3731, -4046, -2061, -2859, -6207, -320, 11665, 10787, -2641, -9960, -4375, 2839, 4939, 7331, 5660, -4821, -9930, -250, 9932, 3823, -5611, -406, 6385, -1251, -9270, 52, 9722, 1257, -9130, -1773, 7422, 743, -7371, -2143, 2830, -1940]
2147a940J32P621l480j4086K421J7510J614j5227j516J1837l384j3850O649K0164
2161A4465k106k1524l910J4007L957o030M332N897j0169j0576Q985J1005n826
2174B507m392Q560R4j6405k305K0156O976j6737p506J3357K918j5331j05J7283
2188I070K669j6055l076J0493k012q300P102J1729q718j3625O416R960p217n914
2202g478J2284O533j6720j0240J4583J1069r576o589R303J85j1756R01J4379R64
2216G842j2538n86R697l908q221Q522J0561j0481j2505J0242J3043q623j2336
2229i291P993R775p257o823Q406M664j0046m757R567M875o291j374L511o119n519
2244h686J1238J1075r775j5189N288J1084l821n333Q637M022j4238r367J2866
$$ y = [-1940, -1808, 5813, 2333, -11753, -9332, 8178, 9792, -5435, -6951, 4886, 1502, -12348, -5699, 14465, 12359, -9165, -13075, 932, 4889, -1141, 3191, 9088, -1081, -11657, -2672, 8333, 2507, -1885, 6675, 6769, -9636, -11941, 8215, 15191, -1546, -9052, 4305, 7223, -8108, -8213, 9070, 11739, -4316, -7392, 3101, 1089, -7211, -109, 11620, 2902, -10723, -4307, 5653, -1564, -7478, 4806, 11339, -5381, -15621, -1038, 10031, 455, -6134, 3169, 3354, -8402, -7501, 6878, 7842, -4696, -5282, 4415, 507, -7714, 808, 11369, 888, -11617, -1375, 11668, 3045, -9291, -1298, 8477, 1220, -5603, 2803, 7467, -2579, -7336, 2231, 7106, 815, -559, 2952, -3167, -8686, 2552, 13627, 3852, -11337, -6049, 5035, 1214, -4119, 4518, 8540, -5698, -15065, -2199]
2257b199J3115n433q493J6j256l655Q121J1792o645j5254Q01J0838Ol959O766
2272D561L385j3648r710J4011J5583n930j3540j00L551j556M805J0521m363j6828
2286i258k607J4940N728o803j64M172r419j0655J1543K0276l892k1031o265J0309
2300c126O738R07K912k425j3039n148J1629J0359k807m656j210o946p179J1350
2314b641J9438l403k2724q280J3586J0994k326k378L08o725p612O518J3828J917
2328A0500r397p446k285J694J0564J0602m632j8461o686J3156J2517j719n958
2341B449k935m671m029P612J3221R46j2578r924N60P708R530O238p439j6363o706
2356a6381J2997J5170k10r826o532k675m23O714J1159K590j1980j3717m89J1165
$$ y = [-2199, 10916, 5483, -3010, -2994, -4250, -7905, 216, 12008, 5363, -9891, -9090, 1748, 1754, -2205, 4561, 7946, -5702, -15412, -1401, 14182, 8252, -5288, -5388, -1837, -3393, 1412, 11933, 7570, -9258, -11865, 3075, 8803, 2000, 1836, 6008, -3411, -14066, -2523, 17753, 13861, -7170, -13435, -3126, 3612, 4519, 7431, 5006, -8033, -13181, -1552, 8807, 6000, 1344, 134, -6812, -13991, -2641, 16797, 13394, -9330, -17610, -4024, 6970, 4644, 2266, 2574, -4151, -11763, -5245, 8583, 10500, 1103, -6343, -8628, -6934, 3630, 14232, 9600, -8861, -15547, -2391, 10126, 8407, 2449, -486, -5157, -9186, -1574, 11647, 12593, 15, -9909, -9349, -1641, 7889, 14127, 6688, -9675, -16381, -3384, 11786, 11576, 1750, -4782, -7457, -7880, -1166, 9993, 12583, 603, -13114, -13603, -2438]
2370b438J2708K869j0983j4116k750J2160J1704k39p773n597l198o43O565J2082
2384A0351K358j2733j4358K065J4258J1076k466j1256r575J218Q992Q588Q79n636
2398C761p689n099K806J0342R182l724j3385r143N035J3041P714l975j0839q912
2412a0885J744J0248Q834m45q187q386k945M801J0373P115m884j3515q562O505
2426h189J3632O558m971j1303p534K734R770Q418j122p447q044k932N263J0602
2440E435P423n898j4565p121Q712J3893M463p774r550l389K274P050P263K033
2454A0249p626j0945l015R260J2252K751r424j1926k206Q002J0652K784n997r023
2468d212m364K440Q058P557k60r405j0651j33J1291J0370r37j0699r069M80P335
$$ y = [-2438, 10270, 13139, 2156, -11960, -14710, -2550, 9154, 8915, 1142, -4455, -7653, -8296, -1731, 10351, 12709, -24, -14382, -12317, 1941, 13017, 10551, -705, -10280, -9062, -70, 8518, 9397, 3761, -3928, -9027, -6221, 4121, 13303, 9579, -3806, -12949, -7914, 5127, 12841, 8866, -1973, -10885, -9141, 1107, 9941, 9496, 1309, -7077, -10022, -5221, 5152, 12267, 7383, -6132, -14694, -8189, 5443, 12001, 7030, -4273, -11807, -9073, 697, 9115, 7993, 546, -7498, -10430, -5167, 5435, 12858, 6960, -7605, -14726, -6014, 7879, 12342, 4568, -4982, -8371, -6097, 953, 8216, 10249, 2623, -8322, -11337, -2077, 10175, 12926, 3502, -8424, -10630, -2628, 8024, 10808, 4811, -4212, -8576, -6136, 1922, 9479, 9219, -186, -10837, -10970, 321, 10691, 9754, -945, -10014, -9534, -2199]
2483b199Q294K849n454r792m784M873R956N080k949q353p732Q02R958J0314j409
2498I454j1600q797L066R189N920K80m611p556m113M337R775N305m174r892o134
2513i551L119J0311Q251l456j2301o606N444Q966K430j617k723n129n399K760
2527e501J1082O655p700j2578l189Q338Q470K221n295o994l609K893P216L843
2541E852j463n071n090k059M202R279L235p192j0372j201R341P656r95n571n170
2556d619j139K699N331L683j328n351m713L5N725O600Q09o520q089J7P850O911
2572G901j134p059m605J671L613K616K40l06k246m432k253N154P970k08r386o277
2588h741M228Q466J318m593k917l39j58P16L137J807j336l426k741L89M133N270
$$ y = [-2199, 6095, 8944, 3490, -6302, -11086, -6213, 3743, 8823, 5874, -2479, -10211, -9409, 549, 10863, 9454, -2146, -10943, -7877, 1312, 7232, 7512, 2901, -4655, -8768, -4431, 5344, 10649, 6475, -3417, -9551, -6432, 3879, 12130, 8674, -3627, -10233, -4789, 4177, 6607, 4990, 2267, -2862, -8261, -5501, 5581, 12236, 4536, -8042, -11231, -2893, 5577, 7798, 2503, -4491, -8100, -5207, 2009, 5852, 4389, -682, -5772, -7831, -3629, 5650, 8885, 1693, -8679, -9880, -539, 7117, 6122, 551, -4619, -5758, -3059, 2272, 5955, 4627, -724, -5437, -5402, 323, 6923, 7732, 1212, -6877, -6860, 990, 7901, 6767, -292, -4897, -3226, 387, 3003, 3243, 2937, 691, -3741, -5994, -840, 7130, 6922, -2464, -8741, -4513, 3953, 5271, 678, -2239, -2578, -2736, -2020, 1117, 2924, 1588, -1838, -4579, -4190, -57, 5213]
2604E213p86p955m621O067P511j739o057L74K694j557k069M226M469l949n980
2619d159Q54M461J580n11O63k633m585J689P347P95o449k456M836J084n008Q69
2635a623O514np803k022N690K548k653p82O58k468j511M540K369m886k750N784
2651A600K222p050l195Q354M190q263n022O805N315n962m372N464L900m445k706
2666c165L643O11k706J200M048l217m528M363N120m879n179N378N753n486o592
2681e636N410O651n202n987M630N584l964m980L743K859m046q40N557l60o982
2696c563o71O566J127n495R9N448k612p191K266Q715L95p103k360L130J00q27
2712a976M057J948n051m540K794L962o96J74K789k347p385K15R336L917o225n247
$$ y = [5213, 4427, -3528, -8149, -2082, 5429, 3690, -2367, -1993, 701, -856, -2925, 1301, 5770, 1821, -4159, -3305, 1156, 2736, 2225, 2888, 255, -4330, -2641, 4706, 5501, -948, -3404, 1432, 2516, -2492, -1623, 4891, 4886, -2917, -4939, 751, 3299, 646, -136, 522, -1946, -3457, 1083, 3452, -1434, -4184, 1600, 3822, -3228, -6423, 1931, 6121, -2142, -7164, -359, 4956, -1006, -5378, 86, 3986, -459, -3165, 478, 1089, -1617, -417, 3631, 414, -4114, 249, 5369, 490, -4689, 689, 6442, 956, -5636, -226, 6425, 1223, -4764, -134, 5450, 1486, -3494, 249, 3108, -938, -1778, 3779, 3419, -3563, -4234, 2332, 3459, -2036, -1937, 3511, 899, -6292, -4026, 4689, 5084, -2019, -4379, -1249, -1149, -1976, 2081, 4029, -1022, -5562, -2768, 1194, 498, 672, 3461, 1114, -6271, -6056, 3280, 7197, 972, -4275]
2728d275K659J996r49Q90L442k37m871k684K935M053J352j510m020k369K076M842
2744C330P89l504k465P19J122J87O91J733j511m232j403M052M677M36n410m725
2760e514N62N430L619j506l406j755j587K60M509N190j759o507m056K061M585
2775A26L968J917l971q349k196Q277P671k286o131r35r7k176K437Q619J203r042
2791i65p058M338P129J958r08k386o297l111P835Q304l383q834k89M033j459j073
2807b166Q209L038j1579j1013Q329J3975L22r508m412L81j376M570R011L52j0755
2822b622o920L925N439K440M195R40j1208j1204O898J6946L314j1246o736P45
2836e094P95J770Q471M774r043j1052J574Q637M503N56p95o080q776L106J3697
$$ y = [-4275, -1616, 380, -569, 321, 3763, 3526, -1345, -4029, -1094, 2959, 4311, 2801, -1219, -3588, -1512, 3330, 4119, 615, -1850, -1131, -9, 178, 869, 2602, 1091, -3141, -4544, -492, 4185, 4621, -789, -5514, -4952, 478, 4097, 2591, -815, -2570, -4157, -3897, 612, 5802, 4043, -2464, -6520, -4459, 126, 4094, 6011, 2040, -6309, -8505, -228, 7443, 5157, -974, -1909, -2006, -4182, -1745, 6874, 8077, -965, -8023, -3685, 3444, 5402, 4494, 2108, -4189, -7300, 535, 8839, 5456, -3378, -3667, 366, -1093, -2166, 6043, 9081, -2498, -13511, -5182, 8793, 9115, -393, -4805, -4424, -5800, -1230, 7781, 8133, -2622, -9542, -5617, -178, 2262, 6457, 7397, -3811, -15015, -8117, 8829, 12143, 897, -5839, -5094, -4299, -2529, 5942, 10716, 1673, -9379, -7805, 832, 5335, 5891, 5096, -984, -9760, -6654, 7043]
2851G043N256j0251r157K366N416J173J871K649n684q276P06R174N773k876n681
2866d98o317j955O945J1606J141j3080r543M193R072L695k0j420o625q468J915
2881i359J2811Q693m448j2027p582K603R920R947l41j0348j0180R51Q049O652
2895E341K885k279q432q223K113J2188Q658m729j0306n879K190P900P184j6q286
2910C09p039L55O580N112R30k712o562m786L373Q983N002n749r340k829M765P711
2926D103L885l703q775m084M330P295K878k073m188n726k630N878J0645K665r952
2941E48j0604N06Q550P304Q46l898o837n012K676Q957N815k309p441o133p30O344
2957a418R241K439q442r672P1Q347N603n52k612l861m641K91O531P504k386q767
$$ y = [7043, 12299, 2048, -7109, -4743, 673, 1846, 3717, 6366, 682, -7594, -6888, 2286, 8059, 5183, -498, -6815, -8770, -1825, 9781, 10922, -2158, -11701, -7508, 1564, 5259, 5239, 3819, -2806, -11274, -9359, 3452, 12145, 7697, -4330, -11912, -9309, 611, 10558, 10217, -131, -10311, -9360, -1311, 5341, 8226, 5947, -2485, -10708, -8595, 3593, 12251, 7522, -2784, -8663, -6473, 1427, 8611, 8595, 309, -6730, -6375, 205, 5317, 6247, 3535, -3027, -7813, -4440, 4543, 9545, 3796, -5544, -8373, -3608, 4103, 7988, 4285, -4490, -8574, -4244, 3051, 5929, 3856, -332, -6058, -8688, -2810, 7835, 10500, 548, -10056, -9550, -1000, 6304, 7150, 3252, -3585, -8597, -5921, 3036, 8851, 6542, -899, -7032, -7762, -1418, 7823, 10262, 1820, -7852, -7781, 566, 6169, 5617, 3005, -856, -5497, -5206, 1325, 8829, 6443, -2324]
2973b324m753L400N216L515l06m282n727j052N675O490j503n411l072p8J626L853
2989A267L981j355p532m955M378Q461K583n120n084j754J157L828N148M93o396
3004i00m548R26L658L504K439m79o766n923L863R855K051o664m843J698J932m76
3020f73K752L523k731o756j209N211M481o10l029k882k153K073N882J212n005
3035H6m181J993K743n54J79K721j542n855j576O479M924l278n079q33J095J601
3051a077L155J784l421m764L63M129J891j043J57j63l469k179M248N836j274o213
3067b040k155K819K805O49J78j248k359k10J899J158j80Q10k76l089k287L856
3083C30M832j957n626j302M379K198k142j379P54L21j358n04J784P92k85j870
$$ y = [-2324, -7077, -3677, 1539, 5054, 4748, 466, -5261, -6313, -638, 5852, 4349, -1062, -4134, -4212, -2586, 1267, 5248, 3893, -3639, -8594, -4216, 4245, 6828, 1708, -3376, -5130, -3973, -145, 5003, 5496, -900, -5448, -4522, -864, 2640, 5079, 4600, -2166, -8089, -4226, 5629, 7680, 1016, -3827, -2129, -197, -673, 2079, 5602, 2871, -3885, -5094, 117, 4598, 3988, 959, -1923, -4076, -2003, 3879, 5091, 86, -4095, -2102, 641, 87, 266, 2987, 1445, -4410, -5986, 493, 5417, 2139, -2940, -3773, -2678, -1077, 2078, 3862, 441, -4323, -3960, 169, 2060, 1017, 1174, 1011, -2458, -4637, -389, 5447, 4173, -2040, -4195, -1376, 1429, 2078, 2256, 1008, -1351, -1561, 338, 1496, 1316, 2126, 1850, -1239, -3526, 330, 5162, 3205, -2421, -3723, 656, 2854, 712, -667, 87, 408, -950, -1454, 330, 1122, 837, -1033]
3099a033j414N75K875J436k227l816J000L352P43k348r44J940j09j231k04K045
3115F40O30j122r46m46R93J426O19j415j960L40K567P83j892q38J406J037j378
3132D44j362J165J332l77p80p47L75R69N4r23j344J341J412p40k424k91L305J123
3150B532l017k143J536K338p70j929N75J372o12j610O6K071J279j112k628p29
3166b781K413J943J04k466j455J249J340j06M05K44k62j631m15J468K355K70k361
3183C14k638L29K897K252p66k396j991P08K049R93pn73j735j687J076K234K514
3200C573j464k922k747Q85M017K369j370m019k041J214K956J334k63j390k497
3215b365j272J652L224K428k188m666k401L445M939J069l183l586k30J877J745
$$ y = [-1033, -2447, -1872, 1003, 2439, 212, -3604, -2604, 748, 1491, -857, -1801, 139, 30, -1201, -1405, 640, 1270, 148, -798, -1244, -251, 1175, 1794, 379, -1581, -1241, 1326, 2109, 217, -621, 785, 1822, 444, -918, 247, 1579, 1202, 422, -325, 50, 1019, 1073, 150, -1194, 147, 1559, 819, -1605, -1896, 1409, 2532, -485, -2628, -1092, 1246, 476, -1453, -878, 494, -118, -1728, -1662, 409, 1688, 576, -2052, -2781, -368, 1575, 1679, -787, -2242, -993, 347, 241, 646, 890, 628, -1003, -1418, 50, 2405, 2675, 314, -2324, -1995, 902, 3154, 2388, -8, -1999, -1291, 758, 1751, 1744, 1171, -564, -2251, -1175, 1059, 3573, 2109, -813, -3560, -2675, 1342, 3711, 2341, -1678, -3719, -2505, 451, 1785, 1522, 132, -2365, -3637, -1985, 1239, 3667, 1479, -3187, -5588, -2143, 2796, 3865, 682, -2904, -3134, -1257, 488]
3230D88J647R55k203m441j277M283N441K17m992m160P24L398L424P90k297m372
3246b375j706L033L831J474j600k779l792o59M700O058j215o485m043J914M803
3261A159K107L3k223m192k397L283N564J367l649l964j779R61L879N289m14p413
3277b389n465L615P225J646l062k591j459j643J644O230L034m483o926j125M512
3292a237M609J997j576n979m955L924P548K215m814l251m33o70L43N332M765m695
3308C123r273j135P805N433j753l840k293k598O88O016M214l371o754j197K596
3323b339K279K626K401l248q088j711Q052P359k749o802k534J096J901L440L967
3338E650j838p810k885M208N192J663m69k742n634k721P195Q353j215q588m335
$$ y = [488, 2135, 3090, 887, -3554, -4831, -548, 4893, 5110, 118, -4042, -3318, 80, 3504, 4294, 1997, -2375, -4081, -1048, 2783, 4257, 2657, -122, -3914, -4573, 127, 6185, 4970, -1515, -5558, -3644, 1159, 3266, 3299, 1076, -3116, -5513, -2230, 3334, 4701, 1052, -2912, -4691, -3730, 149, 5438, 5024, -2389, -7854, -4239, 2986, 4632, 1570, -1021, -2480, -4123, -2479, 3751, 6785, 2302, -4624, -5749, -1237, 3372, 5369, 3793, -2186, -7141, -3217, 4331, 6546, 1732, -1519, -1952, -2622, -2279, 3053, 7818, 3123, -6150, -7285, 520, 5953, 4200, 360, -1933, -4531, -3843, 2173, 6387, 3016, -3738, -4935, -2339, -60, 2566, 4967, 1719, -6369, -8080, -28, 7331, 4582, -2220, -4754, -3658, -1757, 1683, 5650, 3812, -3998, -6883, -2675, 2517, 4180, 3711, 969, -4665, -7386, -191, 8162, 6947, -1641, -5976]
3353e976L564L369J140K182M60n452o164K748P650L062l266m806k656n19M673
3368IO211k84p481m521L104M217O05J96P00l570n965J282Q811M222n802o877l
3385e146L393K572K531M57m486n077J090O015K864j960k027k514k867J625P130
3400C600L995n144p982m82N366M344O67j219l540m532P13N877M375j722m534k726
3416b944q72J881N625M029m379q489j348O049M787J9k838k043l076j118M475N392
3432E150p98n220l529K28K856M243K139l767o558l60N272M124j503k453r71j706
3448b853r79L386N717j167o652l314L426M359J674o49k608l731j051N054M543
3463E155j203m091k039l75O24L273M691j277p175l326M096M851P23j672j891l039
$$ y = [-5976, -2412, 957, 2097, 4279, 4739, -713, -6877, -4129, 3521, 6583, 3317, -1489, -4145, -4664, 9, 6220, 5936, -1545, -6066, -2962, 1255, 1860, 2056, 2756, -814, -6779, -5497, 3314, 7536, 1734, -5143, -5146, -1753, 819, 3350, 3807, -679, -5756, -4666, 1349, 4213, 2253, 226, -2288, -5155, -3530, 3600, 7595, 2451, -5531, -6013, -647, 3697, 4364, 3145, -395, -4927, -4214, 1663, 6038, 4316, -218, -2944, -3816, -1935, 3690, 7719, 3340, -5149, -6497, -448, 4339, 4358, 1520, -523, -3599, -4717, -242, 5150, 4352, -868, -4397, -4169, -1313, 2930, 5069, 1302, -5256, -5616, -344, 3780, 2277, -176, -1147, -2853, -3832, -446, 5271, 4104, -2548, -5862, -2436, 1923, 3597, 2948, 340, -3391, -4442, 612, 5155, 3952, -139, -2178, -2553, -1929, 1344, 6035, 4758, -2417, -5743, -1647, 3204, 3927, 2255, 364, -2675]
3479b675j855M082M988q02m924j507R90L99J539L117L78o076l665M013N649q16
3495B835m037o63L32q94J589L936l91m926j921K803J768M81J495m25m846l040
3511e904N493O225j865o123p07K649q80O8M391K087n805n231L111N113N30j015
3527B137j99k913l478K373O352N59m817j842K077p28k212L536L659l037n432J291
3543b674M532k42k988J229J360k566j193L199J224l732j153M105J225l712j015
3558b401L058k01l065Q67M598q3m702j408L025J280l66J217j6l268j650K647K920
3575B452j073j067J723j308m291P46N921K386n243k846K082J152j532J207K893
3590C202q62l599o92J556M41N13J608j82l572j750L228K042k030o61K188j55m067
$$ y = [-2675, -4530, -448, 4540, 3738, -1186, -2693, -1703, -1304, 235, 3352, 3730, -2346, -6011, -1998, 3651, 2835, -1202, -1865, -1533, -2427, -838, 3098, 2707, -2219, -4140, -1337, 431, 912, 2407, 1982, -2864, -5904, -411, 5814, 3949, -2174, -2881, -232, -1112, -1044, 3347, 5434, -371, -5602, -2491, 2622, 3152, 2137, 1938, -975, -4453, -2080, 4272, 4831, 14, -1828, 249, -479, -2691, 845, 4504, 1467, -3965, -2674, 1858, 1616, -1372, -143, 1217, -1349, -2542, 657, 1881, -1851, -3004, 1101, 2326, -1386, -2401, 657, 456, -2609, -1742, 2856, 2773, -1929, -3337, -312, 968, 602, 1819, 1803, -1465, -3115, -468, 2452, 1379, 312, 2035, 727, -3564, -2818, 3103, 5489, 246, -2600, -518, 634, -898, 309, 3202, 2340, -1259, -1951, -395, 46, 559, 2167, 1985, -1587, -3337, -109, 1933, -97, -758, 1430, 1275, -2792]
3607b792o03M273J278k047j337M05j96o35J609J765j541j512O40J068j351l01
3623a277L038O64k894k004K476J595j244n78L37O50p47M1Q77r94j74J157O65j649
3641f1r76K089O66k750n02L040J339k828k050J550J508n50lN4j012j182Q01J544
3659F77m61M5O48j204k781O83M191J477l814k359J653J564j415Q07J930o13l373
3676b345m53K813J717j085j60p4k250o77L560K688k306l509R51J971m66Q4J594
3693B053j31l296j306L256J940q88j644k39n43r06K704K485k049m267N15L218
3709I02J75j223R13O61l040k202K807M395r01m132j313J009J472J349J437j220
3725A089l575p68K078J955Q23n77o40k823j955L681M669l84m488k559J845K189
$$ y = [-2792, -3395, 878, 2156, 109, -1228, -823, -1019, -1654, -45, 1720, 179, -1333, -693, 375, -976, -1277, 1761, 2425, -469, -2473, 3, 1598, 354, -224, 113, 763, 16, 57, 934, -60, -234, 923, 1588, -61, -1037, 1052, 1718, -1032, -1534, 1506, 2845, 17, -2033, -483, 1025, 475, 472, 526, -486, -1668, -867, 677, 216, 261, 909, -295, -3076, -2393, 1798, 3275, -539, -2898, -1245, 319, -1096, -289, 1641, 1028, -2345, -2798, 15, 1732, 647, 487, 413, -1837, -2514, 1046, 3734, 1428, -2081, -1130, 841, 375, 459, 2053, 1922, -1374, -2680, 576, 2516, 1628, -16, -255, -798, -1704, 1000, 3485, 1436, -2831, -2316, 902, 1077, -146, 767, 1428, -1612, -3814, -1007, 3388, 2487, -1645, -2958, -1949, -477, 872, 2309, 1089, -2486, -3254, -1176, 779, 1602, 1025, 385, -2438, -4393, -712, 3957, 3573, -915, -3474, -1629, 560]
3741E60R57P57q8k880k478J544L483J665j622k369j545r0K632K976K6l862l170
3758c504J175L424J780o54j325k566j570J933L535J475k220l453j963J040M013
3773A120K899j630m377k594J614L810K115l70k869k385j139J888L955K634l088
3788A583m469j954K229N363J640k085m252j936J783L459K182k16k548l484r68
3803c673K980M365J733l983m907o73L996L662O87k746l305j623J442L442K507
3818C904p56l970k888K96L598L650K00l782m563o1M077L802J30l544l471m08J936
3835a850L761J801j761m044k729J835L826L071q01l753l983N43M620M096j110
3850C522m287k580N57K447K432J487r92l827l158J915N239K665k509m610k250
$$ y = [560, 1517, 2274, 2186, -694, -3172, -1628, 1855, 3520, 1898, -471, -2016, -2106, 526, 3502, 3528, -334, -3504, -2329, 1095, 2875, 2221, 896, -1670, -3240, -1307, 2228, 3703, 1483, -1970, -3933, -2893, 1120, 4019, 2389, -1988, -4582, -2968, 842, 2957, 2587, -282, -2667, -3806, -1918, 2037, 4671, 1583, -2886, -4840, -2611, 2752, 4392, 2307, -1945, -3881, -2098, 1361, 3543, 3327, 779, -2705, -3673, -693, 3672, 5405, 1422, -3485, -4158, -162, 3500, 4187, 1441, -1864, -3487, -2045, 1397, 3904, 3148, -822, -3710, -3414, 184, 3834, 4034, 252, -4311, -4372, -295, 3507, 3637, 93, -3378, -3786, -1850, 1911, 3712, 1951, -2093, -4822, -2987, 839, 3910, 3109, -644, -4627, -4084, 536, 4632, 3522, -765, -3345, -2788, -341, 2091, 3578, 2586, -1241, -4399, -2484, 2755, 5420, 2911, -1699, -3949]
3865c949J498L803L022j181l381l279P11K901K679P27j979l670k404K409M900
3880B807J975m058l947n71K668K246J673q16k788l253O36L503K760n57k567k421
3896b710j139K700L914J299l002m361n76L471K528N24j154k366j979M22L404K510
3912C485p07l090k266L47K338K780R99k935l985R0L441K407p64j360j469j331
3928b020L41K135L031r39l849k302J567L328J273o11k244k234r5K482K119k33
3944A749k069j257p38P27J828K277o19l476k253K658K582N17j240j530l95l58
3960a597J366J951P70k438j767M42J505J013O56l08k015j881J399K912N92j744
3976H56j886J34N49N97J059M39j276j702l13J432K065J07j377j876o89J022J673
$$ y = [-3949, -2451, 1352, 4374, 3193, -188, -3467, -2756, 145, 2824, 3551, 1572, -2098, -4502, -2093, 2807, 4782, 724, -3223, -3794, -1126, 1120, 2793, 1977, -811, -4064, -3428, 75, 2835, 2278, -289, -2710, -3849, -1149, 2765, 4064, 1062, -3299, -3875, -404, 2124, 2648, 1494, -872, -2851, -2429, 975, 3485, 2778, -312, -2578, -2231, 107, 2887, 3886, 951, -3034, -2944, 497, 2904, 2140, 780, -689, -2020, -1679, 456, 3487, 2548, -1301, -3603, -2036, 1292, 2565, 1954, -290, -2524, -2619, -137, 1982, 1749, -320, -1577, -2315, -1588, 240, 2517, 1898, -1578, -3831, -1173, 1409, 1926, 686, -844, -1239, -1597, -231, 1720, 2490, 52, -1715, -1273, 232, 1245, 1901, 1593, -422, -2303, -904, 2008, 2600, 856, -1030, -896, -347, 250, 1309, 1748, 472, -1230, -1543, -111, 1954, 2061, 684, -1192, -1881, -859, 814]
3993H14R79j488j737j13J093L94L43N35l19j904j101J807K445m12k316r34R64
4010i50R81M17Jq2r10o04N72J303K17n55n13m41m44J141J484k4k165p09J405R05
4030A029j85q64O12j83r25Q7J751L99j600r89L18N14K38M06O20j197j612O01J664
4049F84j59j086L8J254r57j505J385J555q81j678L03J185J44p20M48K77j197o8
4067i78J062M3q78K99J490n17j569L41J369L90j589L7J633r8j528o20J535J026
4085A448q87n26M04k65N7K14M44m23o30J156o20q43J32J237k96p10n44J182q4
4104D46p81l85Q12J47k88M3oq56k50J158O74j129m79O18k49m95O85J361j4j686
4124f74q96Q69P42Q43K5p61j169n50K015J131r44m69L07q34j273J428K599L3l098
$$ y = [814, 1793, 305, -1432, -1545, -452, -58, 285, 820, 501, -1403, -2504, -697, 1748, 1336, -980, -1914, -950, 31, 448, 449, 367, -543, -1147, -575, 728, 945, 390, -123, -564, -1008, 133, 1617, 1593, -572, -1281, 124, 1029, 844, -20, 592, 409, -516, -429, 1322, 1721, 121, -868, -550, -36, 202, 608, 1228, 31, -1581, -980, 684, 525, -561, -523, 731, -226, -1731, -346, 1209, 328, -1350, -1047, 138, 282, -438, 10, 287, -910, -978, 84, 127, -751, -452, 1038, 521, -1048, -707, 662, 1052, -537, -500, 1133, 1035, -493, -1113, 422, 1448, 561, 35, 439, 174, 231, 445, 889, 466, -164, 992, 372, -471, -339, 898, 602, -108, -652, 530, 446, -335, -720, 92, 239, -49, -6, -12, -868, -1118, 40, 714, -415, -894, -276, -525, -1020, -335, 1026, 1012, -674, -1570, -701, 41, 884, 909, 148, -1021, -1571, 444, 1575, 631, 162, 469, -365, -1638, -210, 2389, 2422, -676]
$$ [...]
8191F6
##END NTUPLES=NMR FID
##END=
