##TITLE=1H_ADM2905
 CDcl3, 8 sc, 
 29.5.2019
##JCAMPDX= 6.0         $$ Bruker NMR JCAMP-DX V2.0
##DATA TYPE= NMR FID
##DATA CLASS= NTUPLES
##ORIGIN= UXNMR, Bruker Analytische Messtechnik GmbH
##OWNER= root
$$ XWIN-NMR		Version 3.5
$$ Wed May 29 15:56:36 2019 Russian Standard Time (UT+4h)  she@DPX200
##.OBSERVE FREQUENCY= 200.13155
##.OBSERVE NUCLEUS= ^1H
##.DELAY= (6, 6)
##.ACQUISITION MODE= SIMULTANEOUS
##.ACQUISITION SCHEME= undefined
##.AVERAGES= 8
##.DIGITISER RES= 18
##SPECTROMETER/DATA SYSTEM= spect
##.PULSE SEQUENCE= zg30
##.SOLVENT NAME= CDCl3
##.SHIFT REFERENCE= (INTERNAL, CDCl3, 0, 15.7039)
##AUDIT TRAIL= $$ (NUMBER, WHEN, WHO, WHERE, WHAT)
$$ ##TITLE= Audit trail, XWIN-NMR		Version 3.5
$$ ##JCAMPDX= 5.01
$$ ##ORIGIN= Bruker BioSpin GmbH
$$ ##OWNER= she
$$ F:/spectra/data/she/nmr/H-F/1/audita.txt
$$ ##AUDIT TRAIL=  $$ (NUMBER, WHEN, WHO, WHERE, WHAT)
(   1,<2019-05-29 15:55:17.92 +0400>,<she>,<DPX200>,
      <created by zg, POWCHK disabled, PULCHK disabled
       configuration hash MD5:
       00 E9 B6 7A A2 85 ED C7 34 08 36 98 17 FE 4E 26
       data hash MD5: 16K
       D3 A8 1F B9 BF 51 E0 4D A4 04 DC A0 C8 C2 C9 01>)
$$ ##END=
$$ 
$$ hash MD5
$$ 07 CE AD 9A 04 12 1C 89 CA 83 51 5D 31 B9 C1 38
##$RELAX= 
##$RELAX= 
##$RELAX= 
##$RELAX= 
##$RELAX= 
##$RELAX= 
$$ Bruker specific parameters
$$ --------------------------
##$DU= <F:/spectra>
##$EXPNO= 1
##$NAME= <H-F>
##$PROCNO= 1
##$TYPE= <nmr>
##$USER= <she>
##$AMP= (0..31)
100 100 100 100 100 100 100 100 100 100 100 100 100 100 100 100 100 100 
100 100 100 100 100 100 100 100 100 100 100 100 100 100 
##$AQSEQ= 0
##$AQ_mod= 1
##$AUNM= <au_zg>
##$AUTOPOS= <>
##$BF1= 200.13
##$BF2= 200.13
##$BF3= 200.13
##$BF4= 200.13
##$BF5= 200.13
##$BF6= 200.13
##$BF7= 200.13
##$BF8= 200.13
##$BYTORDA= 1
##$CFDGTYP= 0
##$CFRGTYP= 5
##$CHEMSTR= <none>
##$CNST= (0..31)
1 1 145 1 1 1 1 1 1 1 1 1 1 1 1 1 1 1 1 1 1 1 1 1 1 1 1 1 1 1 1 1 
##$CPDPRG= <>
##$CPDPRG1= <>
##$CPDPRG2= <>
##$CPDPRG3= <>
##$CPDPRG4= <mlev>
##$CPDPRG5= <mlev>
##$CPDPRG6= <mlev>
##$CPDPRG7= <mlev>
##$CPDPRG8= <mlev>
##$CPDPRGB= <>
##$CPDPRGT= <>
##$D= (0..31)
0 1.2 0 0 0 0 0 0 0 0 0 0.03 0 0 0 0 0 0 0 0 0 0 0 0 0 0 0 0 0 0 0 0 
##$DATE= 1559130917
##$DBL= (0..7)
120 120 120 120 120 120 120 120 
##$DBP= (0..7)
150 150 150 150 150 150 150 150 
##$DBP07= 0
##$DBPNAM0= <>
##$DBPNAM1= <>
##$DBPNAM2= <>
##$DBPNAM3= <>
##$DBPNAM4= <>
##$DBPNAM5= <>
##$DBPNAM6= <>
##$DBPNAM7= <>
##$DBPOAL= (0..7)
0.5 0.5 0.5 0.5 0.5 0.5 0.5 0.5 
##$DBPOFFS= (0..7)
0 0 0 0 0 0 0 0 
##$DE= 6
##$DECBNUC= <off>
##$DECIM= 24
##$DECNUC= <off>
##$DECSTAT= 4
##$DIGMOD= 1
##$DIGTYP= 9
##$DL= (0..7)
0 120 120 120 120 120 120 120 
##$DP= (0..7)
150 150 150 150 150 150 150 150 
##$DP07= 0
##$DPNAME0= <>
##$DPNAME1= <>
##$DPNAME2= <>
##$DPNAME3= <>
##$DPNAME4= <>
##$DPNAME5= <>
##$DPNAME6= <>
##$DPNAME7= <>
##$DPOAL= (0..7)
0.5 0.5 0.5 0.5 0.5 0.5 0.5 0.5 
##$DPOFFS= (0..7)
0 0 0 0 0 0 0 0 
##$DQDMODE= 0
##$DR= 18
##$DS= 0
##$DSLIST= <SSSSSSSSSSSSSSS>
##$DSPFIRM= 0
$$ [...]
##$SUBNAM2= <"">
##$SUBNAM3= <"">
##$SUBNAM4= <"">
##$SUBNAM5= <"">
##$SUBNAM6= <"">
##$SUBNAM7= <"">
##$SUBNAM8= <"">
##$SUBNAM9= <"">
##$SW= 24.9336996594482
##$SWIBOX= (0..15)
0 0 2 0 0 0 0 0 0 0 0 0 0 0 0 0 
##$SW_h= 4990.01996007984
##$TD= 16384
##$TD0= 1
##$TE= 0
##$TE2= 300
##$TE3= 300
##$TEG= 300
##$TL= (0..7)
0 120 120 120 120 120 120 120 
##$TP= (0..7)
150 150 150 150 150 150 150 150 
##$TP07= 0
##$TPNAME0= <>
##$TPNAME1= <>
##$TPNAME2= <>
##$TPNAME3= <>
##$TPNAME4= <>
##$TPNAME5= <>
##$TPNAME6= <>
##$TPNAME7= <>
##$TPOAL= (0..7)
0.5 0.5 0.5 0.5 0.5 0.5 0.5 0.5 
##$TPOFFS= (0..7)
0 0 0 0 0 0 0 0 
##$TUNHIN= 0
##$TUNHOUT= 0
##$TUNXOUT= 0
##$USERA1= <user>
##$USERA2= <user>
##$USERA3= <user>
##$USERA4= <user>
##$USERA5= <user>
##$V9= 5
##$VALIST= <valist>
##$VCLIST= <CCCCCCCCCCCCCCC>
##$VD= 0
##$VDLIST= <DDDDDDDDDDDDDDD>
##$VPLIST= <PPPPPPPPPPPPPPP>
##$VTLIST= <TTTTTTTTTTTTTTT>
##$WBST= 1024
##$WBSW= 4
##$XGAIN= (0..3)
0 0 0 0 
##$XL= 0
##$YL= 0
##$YMAX_a= 153201
##$YMIN_a= -99648
##$ZGOPTNS= <>
##$ZL1= 120
##$ZL2= 120
##$ZL3= 120
##$ZL4= 120
##$ABSF1= 10
##$ABSF2= 0
##$ABSG= 5
##$ABSL= 3
##$ALPHA= 0
##$AQORDER= 0
##$ASSFAC= 0
##$ASSFACI= 0
##$ASSFACX= 0
##$ASSWID= 0
##$AUNMP= <proc_1d>
##$AZFE= 0.1
##$AZFW= 0.1
##$BCFW= 1
##$BC_mod= 2
##$BYTORDP= 1
##$COROFFS= 0
##$CY= 11.3945322036743
##$DATMOD= 1
##$DC= 2
##$DFILT= <>
##$DTYPP= 0
##$F1P= 18.9103706918063
##$F2P= -1.10871071338519
##$FCOR= 0.5
##$FTSIZE= 0
##$FT_mod= 4
##$GAMMA= 1
##$GB= 0.15
##$INTBC= 1
##$INTSCL= 1
##$ISEN= 128
##$LB= 0.24
##$LEV0= 0
##$LPBIN= 0
##$MAXI= 10000
##$MC2= 0
##$MEAN= 0
##$ME_mod= 0
##$MI= 1.114404
##$NCOEF= 0
##$NC_proc= 0
##$NLEV= 6
##$NOISF1= 3.799351
##$NOISF2= 2.8
##$NSP= 1
##$NTH_PI= 0
##$NZP= 0
##$OFFSET= 15.70392
##$PC= 1
##$PHC0= -8659.316
##$PHC1= 25.80023
##$PH_mod= 1
##$PKNL= yes
##$PPARMOD= 0
##$PSCAL= 0
##$PSIGN= 0
##$REVERSE= no
##$SF= 200.130013532006
##$SI= 16384
##$SIGF1= 3
##$SIGF2= 2
##$SINO= 400
##$SIOLD= 16384
##$SREGLST= <1H.CDCl3>
##$SSB= 0
##$STSI= 0
##$STSR= 0
##$SW_p= 3612.71676300578
##$SYMM= 0
##$S_DEV= 0
##$TDeff= 0
##$TDoff= 0
##$TI= <>
##$TILT= no
##$TM1= 0
##$TM2= 0
##$TOPLEV= 0
##$USERP1= <user>
##$USERP2= <user>
##$USERP3= <user>
##$USERP4= <user>
##$USERP5= <user>
##$WDW= 1
##$XDIM= 8192
##$YMAX_p= 0
##$YMIN_p= 0
$$ End of Bruker specific parameters
$$ ---------------------------------
##NTUPLES= NMR FID
##VAR_NAME=  TIME,          FID/REAL,        FID/IMAG
##SYMBOL=    X,             R,               I
##VAR_TYPE=  INDEPENDENT,   DEPENDENT,       DEPENDENT
##VAR_FORM=  AFFN,          ASDF,            ASDF
##VAR_DIM=   8192,          8192,            8192
##UNITS=     SECONDS,       ARBITRARY UNITS, ARBITRARY UNITS
##FACTOR=    0.0002004,     1,               1
##FIRST=     0,             0,               0
##LAST=      1.6414764,     0,               0
##MIN=       0,             -99648,          0
##MAX=       1.6414764,     153201,          0
$$ Real data points
##PAGE= N=1
##DATA TABLE= (X++(R..R)), XYDATA
$$ [...]
1262BK040j279k287R69J930q84j262J493J023k278j511K630J768k113j720J758
1278B79P80j942j45K891k8l600o45L413R28k583l41K019r22k637J637L709j291
1295A522l944L46K952m21j650J691J551l127k610L101L635j760k901J002R92j923
1311a544J86L768P65m373k211L097K145j332j50J419j711l228J570M535R1l568
1327e41j058J536k41n18K475J455l222l110J720L232k33j158J99p75k130P07L577
1344A915R29l094j974J056R11J41J209P21k367k505J349L091M80j488q72o25j001
1361b124J203L022M53k983k105R73J695P55Q60o4k629k155J805L453N37j883j326
1378e13p95o76J615L353L03l676k503J317K077Q27P79j97k986k551J992M006O45
$$ plain form
1262 2 2042 763 -1524 -555 1375 491 -771 722 1745 -533 -2044 586 2354 241 -1479 279
1278 279 1059 -883 -1028 1863 1835 -1765 -2410 1003 1931 -652 -993 1026 104 -2533 -896 2813 1522
1295 1522 -2422 -2076 876 455 -1195 496 2047 -1080 -3690 -589 3046 1286 -1615 -613 379 -1544
1311 -1544 -1358 2410 3175 -1198 -3409 -312 1833 501 351 1770 59 -3169 -1599 2936 3027 -541
1327 -541 -1599 -63 -304 -822 1653 3108 -114 -3224 -1504 1728 1495 337 536 -239 -2369 -1662 1915
1344 1915 2844 -250 -2224 -1168 -257 -116 1093 1814 -553 -3058 -1709 1382 1862 374 -498 -1123 -2124
1361 -2124 -921 2101 2554 -429 -2534 -1561 134 889 1749 1685 -944 -3099 -1294 2159 2696 813 -513
1378 -513 -1308 -1984 -369 2984 3287 -389 -2892 -1575 502 1329 2108 1911 -1075 -3626 -1634 2372 3017
1395C017k458j593n03n96J413L367O42l866l008J509K525P99K25j90k336k568
1411c621J601M214Q70k896j900Q0K04R12K723P47l240l244J495L325Q07r23n75
1428E79j319j975J315L862J180l214k782O04J557J047J265M20k730l085J044L929
1444A697J474j646j912j164p87J369L327J248l083l392K7K382J873Q32n25k655
1460i35k494Q48L618J989j298k571j672n7J983K731O36k448k802l67J900K435
1476A496J225j253k878j557J429K749J308q37j957j926j07K568K618l82k658j761
1492a923K22J364J852J247j229l274j172K433K615Q6j381j387j330k69K395K827
1508C076o39l716j616J577J654P75P99o61l122j866K733L730k76k748j179j02
$$ plain form
1395 3017 559 -1034 -1537 -2133 -720 2647 3289 -577 -3585 -2076 449 1248 1473 1283 -1053 -3621
1411 -3621 -2020 2194 3064 168 -1732 -1652 -1448 -536 2187 2934 -306 -3550 -2055 1270 2077 1154 579
1428 579 -740 -2715 -1400 2462 3642 428 -2354 -1750 -193 854 2119 2539 -191 -3276 -2232 1697
1444 1697 3171 1525 -387 -1551 -2338 -969 2358 3606 523 -2869 -2842 -460 1413 2245 1720 -935
1460 -935 -3429 -2581 1037 3026 1728 -843 -2515 -2572 -589 2142 2778 330 -2472 -2839 -939 1496
1476 1496 2721 1468 -1410 -2967 -1538 1211 2519 1682 -275 -2201 -2308 260 2878 2496 -162 -1923
1492 -1923 -1701 -337 1515 2762 1533 -1741 -2913 -480 2135 2221 840 -547 -1877 -2146 249 3076
1508 3076 2437 -1279 -2895 -1318 336 1111 1910 1249 -1873 -3739 -1006 2724 2448 -300 -1479 -1581
1524a581l03J523L157m0m073k406K218K807J33l39o2k111k361J949M420M36l643
1541b76j769J044N17K94K263J012l262l307J831L656K41j712l31m10j768L82L718
1558B123J434l431k719J208J939j87M06R81j543k985M84L723J258k484j474L91
1574h76j06j54J984J734k157l163M80K733Q99q27j83m90j827o2K835J878j768
1591I30k457J00J005M40R59J007j235k673j43K538J524p65j052n47q06Q6J862
1608G73J588j061k272n43J046R97N71K38r51j741l06J681J513l82j158p41m06
1625a154L17J239R26o04j635o28Q25J013M25j09p79j050k6J099J035j73r04o28
1643h11j68N30R84M95p18r47l14O04Q41L53k10p21o88J74R89O03l00o58m43p4
$$ plain form
1524 -1581 -1884 -361 2796 2756 -1317 -3723 -1505 1302 1435 1096 1034 -1077 -3438 -1489 2931 3367 -276
1541 -276 -2045 -1001 -484 -190 2073 3085 -177 -3484 -1653 2003 2244 532 201 -209 -1977 -1595 2123
1558 2123 3557 126 -2593 -1385 554 367 773 1754 211 -2774 -2290 1433 2691 207 -1267 -876
1574 -876 -982 -1136 848 2582 425 -2738 -2258 475 1374 547 364 -126 -1953 -2015 820 2698 930
1591 930 -1527 -1427 -422 18 977 1984 749 -1924 -2067 471 1995 1230 178 -369 -1175 -1089 773
1608 773 2361 1300 -972 -1515 -469 528 1099 1337 386 -1355 -1661 20 1533 1151 -7 -748 -1154
1625 -1154 -837 402 1328 724 -911 -1539 -714 299 724 615 -164 -1214 -1240 -141 894 721 -183 -811
1643 -811 -979 -449 535 1030 312 -635 -949 -345 496 849 639 -82 -770 -596 393 996 696 38 -405 -479
1663d79M60P58K49o85q20L1M55M31K69j31n94o10J72Q32L47m29m39j86l1M6N97
1684B43L25n71o65P0N44K00k15J4p6l72j59O22M75m03l73J19Q3J1lL66N0m21k83
1707d19N13K42k80j38K94P5l51o8L93J38l00%K28j10l55J65L84ol02j00M8p2n2
1730g3K61K22l87l36M5K67N2j9Rk43l17J39L87K35j55m23j40KK69M72Nl44n17
1753e89O1M01M03J16j37n76l37K51P73L39l62n45k83J23L85O92J18p07p25M3P52
1774A96N83j8l39o02m95K85R57N53n66r28l20L93N37N30L0p83q97j02R97Q58j45
1795G24p63o30k33L93Q72N81n50j221m87O79R51M18k27p83p55m2R86J110k6j063
1815f6r68J35P24Q47M74m86j262o68P23J392M53n46r97o35J57Q74J139J02j275
$$ plain form
1663 -479 -19 739 988 303 -517 -486 -31 400 669 538 -56 -666 -494 338 685 256 -183 -369 -400 -354 243
1684 243 568 -3 -668 -598 -54 146 -69 -55 -131 -503 -662 -40 435 32 -341 -222 -139 -128 -131 235 285 -136 -419
1707 -419 94 336 56 -82 212 287 -64 -132 261 399 99 99 327 217 -138 27 411 405 103 3 51 -21 -73
1730 -73 188 410 23 -313 -268 -1 51 32 41 -202 -519 -380 7 242 87 -336 -476 -474 -205 267 272 -72 -589
1753 -589 -528 -127 276 392 255 -321 -658 -407 366 705 343 -202 -485 -362 23 715 833 126 -599 -556 196
1774 196 779 761 422 -180 -675 -390 567 1120 554 -374 -694 -301 236 766 796 13 -884 -986 11 869 724
1795 724 -39 -669 -902 -509 363 944 394 -827 -1314 -635 316 734 507 -276 -1031 -1073 -87 1023 997 -66
1815 -66 -1034 -899 -175 672 1146 660 -602 -1270 -547 845 1298 752 -245 -880 -723 151 1290 1392 117
1834A17j244J82J148Q63L9o13j056o85N02J566P04p87j447n90O17R02O87J81j076
1853A0j411j48J423J460k87j145r77j89N25J231R64p57j708q20J088J426N24n31
1871F78q01r95l56J321J723Q7j782j306L88R99R08M72k77j660j161R83J987O34
1889A842j108j274m38J24Q28J429L65j629j883L03J740J006k14o39j148r15N04
1906a107J978J036j274j802l57P13R33R52K25j314j818M1J949J380m53j209q61
1923i88m57N49J594J148r92k093m69J173J280N14j11j155j431n8J785J589m61
1940A417j616r54J24P91J321P20r05j984n76J286J477L25n82j140r74M2J521J449
1958A742m28j757j107L99J111J002L96r17j698o20J225J702L05r02j225o98K16
$$ plain form
1834 117 -1127 -945 203 1066 1105 492 -564 -1249 -747 819 1523 736 -711 -1301 -684 218 905 1086 10
1853 10 -1401 -1549 -126 1334 1047 -98 -1075 -1264 -739 492 1456 699 -1009 -1829 -741 685 1209 678
1871 678 -123 -1118 -1474 -153 1570 1657 -125 -1431 -1043 -44 864 1336 1059 -601 -1762 -779 1208 1842
1889 1842 734 -540 -978 -854 -26 1403 1768 139 -1744 -1441 299 1305 1091 452 -696 -1611 -1107
1906 -1107 871 1907 633 -1169 -1526 -813 120 1072 1297 -17 -1835 -1794 155 1535 1082 -127 -988
1923 -988 -1445 -896 698 1846 854 -1239 -1708 -535 745 1259 1148 -7 -1438 -1496 289 1878 1417
1940 1417 -199 -1153 -1029 -238 1083 1803 898 -1086 -1662 -376 1101 1426 844 -296 -1270 -1228 293 1742
1958 1742 1314 -443 -1550 -1151 -40 962 1358 441 -1257 -1877 -652 1050 1355 453 -772 -1470 -1254
1975a254J437J361m77j677j036N39J189R96J03q87j446l61J142J552K56r83j074
1992f20n90M50J393R71n96j519p31O31J025P52J36j010j417j59J385J269j59j090
2010A21q10k48L41J192Q31o76j691n37R46J036L68k31o88j079l27J357J399l38
2028I66j378p49K41N20P18Q15l27j656q30J111J424J77o72n30n93l39R28J477
2046A303O8j455j009M09P53M96L35n2j070j045O92J493M52r52p51j15n2L99R37
2065H36L39j086j126K39J063M34l12k48m91m30J42J067O09p85j048o4O23M33J26
2084C21J10m99p32n5R72O74l91p75l37K40K84M34L99k46r83m07P60R29K7n87k88
2105a50k12r9N13Q00N6r24p09L77P87M0J8m0m20p26J61J135L39p00p20K07J92
$$ plain form
1975 -1254 183 1544 1067 -610 -1646 -1107 82 1078 1181 294 -1152 -1513 -371 1181 1437 454 -620
1992 -620 -1210 -760 633 1604 1008 -511 -1242 -611 414 1166 1302 292 -1125 -1284 101 1370 1211 121
2010 121 -689 -937 -596 596 1427 751 -940 -1477 -531 505 873 642 -46 -1125 -1452 -95 1304 966
2028 966 -412 -1161 -920 -400 318 1133 806 -850 -1680 -569 855 1032 360 -170 -763 -1102 -174 1303
2046 1303 1371 -84 -1093 -684 69 565 900 848 -222 -1267 -575 918 1370 418 -333 -448 -500 -101 836
2065 836 1175 89 -1037 -798 265 699 387 139 -352 -782 -640 427 1036 251 -797 -861 -238 195 321
2084 321 431 -68 -800 -855 117 791 400 -375 -712 -472 -188 246 645 399 -584 -991 -231 698 725 138 -150
2105 -150 -362 -461 52 852 908 -16 -725 -348 439 479 497 457 37 -689 -528 607 946 246 -474 -267 -75
2126g5j94L81O43m30j060j07J098K62o64m1L69l59o71O34R09m76r71K39P94k48
2146C3n06N40L57p43n75Q94P68p18o86O62M41o64k49Q81K29r62l20J031L19r23
2166a91m0O64%r11K83R74k51r79J25Q61j49p52L45O53n59p41N44Q07n83o41M99
2187d2N10o74m97P89M48q31l48P30K24p60p5Q00J04q31q6O78M4o33K69P74m36
2208A57q00K21Q70j74m63K15L57n84m01P58O67n51n72J69L70j66q3O02p4q00j54
2229d36N63M60l31j95J36k91k97L18O73j63o16k03K58P0J06K53j41n53j67L34
2249b22M91o6k76j32j95l5M57L72k15m68k09K50K39K30J60l40m82l6N13M63j42
2270C57k56k63k08Q8O92L12m42o39r9M33K71K42J45m20p37m6P71O37k79n92k62
$$ plain form
2126 -75 -269 112 755 325 -735 -842 256 518 -146 -187 182 -177 -848 -214 695 219 -752 -513 281 33
2146 33 -473 67 424 -319 -894 0 768 50 -636 26 467 -197 -446 435 664 -298 -618 413 732 -191
2166 -191 -231 433 433 -478 -195 779 528 -451 -326 535 386 -366 -21 632 73 -668 -124 683 100 -541 -42
2187 -42 468 -206 -703 86 534 -297 -645 85 309 -451 -526 274 378 -453 -539 139 183 -450 -181 593 157
2208 157 -643 -422 448 274 -189 26 383 -201 -602 156 823 272 -300 -131 239 73 -10 592 518 -282 -436
2229 -436 127 587 256 61 197 -94 -391 -73 600 437 -179 -382 -124 -54 52 305 164 -389 -556 -222
2249 -222 269 203 -73 -205 -400 -435 22 394 179 -289 -498 -248 -9 221 381 41 -441 -477 36 499 357
2270 357 101 -162 -370 -282 410 722 280 -359 -458 -25 246 488 633 213 -524 -570 201 838 559 -33 -295
2291b95r3J09N91M87l15r74l23N47N82N0r0k39o28k67P04Q02q3q39l22N5K63M49
2313A71M29j98q84n45O23Q38J27l71l84k96q9N22Q45l7q64n61K04O67L06J37k54
2334C86p61l04N09R20J69o27o00k19K21N40O00j17p86p07J44P85N50r4m91o62
2354e44k11M69Q34K69o50p94k61L84O39N23j80q08o44K73P43N85o2o50o42q6N61
2375b52R00R7n28q84k15M62P66M65l10o98n32L08P47N45j41o66o99K4O78Q02K3
2396H92o15p95j66M91P66L56m46q83m01L97Q03M27k53o80p13Q2Q11P34l7q79p90
2417h99R0O29N84K65m10r41k67M09R32M47m60p80m17J95P17O48j7p59p21k9P75
2438iP16l8m22p96j93M53Q08M66m89p84m04L73P34M54j20p58o73N4P85O46%o14
$$ plain form
2291 -295 -388 -279 312 799 484 -490 -813 -266 316 366 276 37 -591 -858 -154 648 565 -274 -596 -541 -278 171
2313 171 600 402 -482 -1027 -404 434 561 190 -194 -490 -579 -57 788 751 -113 -674 -470 197 503 640 386
2334 386 -375 -679 -170 750 919 292 -308 -527 -306 234 834 717 -69 -776 -632 153 703 609 118 -544
2354 -544 -755 -286 548 817 167 -627 -888 -504 135 658 478 -330 -974 -701 42 627 565 -85 -727 -813 -252
2375 -252 648 745 217 -667 -882 -420 346 811 501 -197 -729 -421 326 871 730 64 -635 -611 67 869 892
2396 892 277 -518 -684 -193 573 929 483 -400 -801 -404 399 826 573 -107 -820 -738 73 807 770 -109 -899
2417 -899 -809 -180 404 669 259 -682 -949 -540 392 839 379 -401 -818 -623 94 742 725 -34 -755 -784 -9
2438 -9 707 669 247 -549 -742 -289 519 985 496 -288 -692 -319 415 869 749 -9 -682 -628 157 803 803 189
2460A89p71q7N74N92L24m56q14m49M43P95L61k58p78m85J43P15N62o3o90o09j4
2481g76O10O48J39n29o15k37L89P35L13l94p11k48K77N68M89p9n92n96O7O10O77
2502G45j2o01m69q6L37O17L10m11p21l73M32N87L32k77m23m59j17O19O98j05p25
2523a02m68P6L47M18K54l26o64l27M27O63J96l38l78l50R2M60M42M8o24n09J61
2544e02M99L64ok52m11k16K60O30K46m20m10j48K20L80K97j4m32m96J12M68L59
2565E28m8l94k72r8K06M30J99k55n29j54K63L47K61k59l11l57J18L19K65l2k87
2586f0l56j1L33K62M1k75k43j16J97L06J78r4l90k23K53L35K0n7p5k67j4J52M16
2609C12R6m22k07P0J95J32L0R8k69k76J61M00Q4k81j11P7o9p8K51J35k51l09N8
$$ plain form
2460 189 -582 -669 -95 497 821 365 -449 -898 -455 340 701 443 -335 -820 -677 38 600 537 -153 -762 -776
2481 -776 -166 482 621 92 -523 -760 -371 364 677 283 -428 -676 -399 169 658 579 -13 -609 -542 68 745
2502 745 733 132 -337 -423 -86 531 841 430 -291 -664 -232 355 687 410 -13 -472 -589 30 728 623 -102
2523 -102 -570 -494 -147 271 525 199 -465 -792 -365 298 494 156 -222 -572 -480 -20 422 470 -154 -663 -502
2544 -502 -3 361 355 103 -308 -524 -264 366 612 192 -218 -366 -146 234 531 517 85 -411 -299 169 528
2565 528 480 86 -186 -284 -78 352 551 296 -233 -387 -124 223 484 225 -86 -443 -325 -6 259 227 -60
2586 -60 -416 -427 -94 168 209 -66 -309 -425 -228 78 256 162 -228 -451 -198 137 157 100 25 -242 -256 -104 312
2609 312 408 -14 -221 -151 44 176 206 304 35 -241 -80 320 404 123 12 89 20 -58 193 328 77 -232 -174
2632a74L59j01n4O4pl18q8L67J71k82k34J51J40j12l1K01o6j87j30L45N1k59k7
2655b21K89qk53N2K41N6l44J83K17j73j40O1L04j79j59J71J49k07k20L67J77k16
2677A47k49J24K40k40k8J91j5k06j04L62P2k56j74J72J6k01J19K31j21l94j1L47
2699B2J08k33j21J20q4j02K36K58j23m07m6L38P5l7N4Q9l33k56L85M44r9l85r5
2722a92J52K0N1L34L8m87l16K47N59l2k68l0k7k85J20M04K78m85n03K26L29M5
2744A78j3P3j59m51p3O85K22l48m12O2P8k3K02L32k71o97O5O43K11k31j86L9j76
2767b50j90M81N18l46o21j75N37K35J1J21j55n03j80N34O92k20n82j55J18nK87
2788A52N17j17q16l95N38O43j07j56j39l82l34N16P25j6p65m28J97L65J03K31
$$ plain form
2632 -174 185 84 30 94 87 -231 -319 48 219 -63 -297 -146 -6 -118 -149 52 -14 -201 -331 14 65 -194 -221
2655 -221 68 60 -193 -141 100 156 -188 -5 212 39 -101 -40 264 85 -74 97 246 39 -181 186 363 147
2677 147 -102 22 262 22 -6 185 170 -36 -140 222 294 38 -136 36 52 -149 -30 201 80 -314 -325 22
2699 22 130 -103 -224 -104 -188 -290 -54 204 81 -326 -372 -34 41 4 58 147 -186 -442 -57 387 288 -97 -192
2722 -192 -40 -20 31 365 403 -84 -400 -153 406 374 106 76 49 -236 -116 288 566 81 -422 -196 133 178
2744 178 165 238 79 -372 -445 240 462 114 -298 -236 -158 -181 21 353 82 -615 -550 93 304 73 -113 -74 -250
2767 -250 -440 41 559 213 -408 -583 -46 189 200 321 166 -337 -517 17 709 489 -93 -248 -130 -135 152
2788 152 669 552 -264 -659 -121 522 415 259 120 -262 -596 -80 645 629 -136 -564 -367 -2 101 332
2808C32R6o70n53L39Q22K11n12l30r4j20K33N93K48o46o74J40N97K65K5j32l59
2829a89l64K57O72L22m16n74j16K14K69L91Q4m08o25J6O26L77M7m50l63k65L47
2850a48O20K19l63o80j72K07N43L73j65n56n40J62N60M78r7m83m64j75M38O99
2870D56P6m52n85j48K84N08L97j48o60m98J93P35L69j51k95n69r2L73P26J15m45
2891A89n66j29L42L90L33j28n29n17K88N86M04k74n11k76J0M48M70J02n41n74
2911d83r4N98L30J36k24n48k84K29O05L47l65o14k00J60L08M98P7n02o31k0O44
2932c3L63J28m46m15j95K29O21L82l33o12k58K97N49K93j92l48m71qM85N88l0
2953E94n05m30k1L40M58J71l16m31l05K39N08K28k05m77k54Q2L05M55L4l92m76
$$ plain form
2808 332 428 -242 -795 -456 366 577 65 -265 -359 -479 -246 347 595 -51 -725 -585 12 277 302 170 -189
2829 -189 -553 -296 376 698 282 -292 -408 -194 75 466 550 142 -483 -467 159 536 583 133 -230 -495 -148
2850 -148 472 691 328 -352 -524 -317 226 599 434 -122 -662 -500 60 538 441 -42 -506 -681 -243 456
2870 456 532 80 -505 -653 -369 139 536 388 -272 -770 -577 158 527 376 81 -488 -580 -207 519 634 189
2891 189 -377 -506 -164 226 559 431 -98 -615 -327 259 663 389 -122 -398 -388 60 530 632 91 -483
2911 -483 -577 21 351 487 263 -285 -569 -340 265 612 247 -367 -567 -407 -99 399 476 -26 -657 -677 -33
2932 -33 330 458 12 -403 -598 -369 252 634 301 -311 -569 -272 277 570 378 30 -441 -449 36 624 594
2953 594 89 -341 -362 -22 436 607 291 -140 -445 -206 302 530 325 -152 -406 -324 -19 436 470 78 -398
2974c98j2L59L11K3k76l40j59J41M74K67k27m32k24J99L46K34n1l35l96M5M24
2995b7M28j31l15j96n5J41L70K46j72m81k75L94L28J29j24k50j99j24L88M04m0
3016D39n00j65Q0K05J43J71j45l58k73K51L38O9k00k12j29M6J69K89k1k04l72
3037c79N1K39K63l1j49j65j83P0L76J76k32k24o3O4J85K36k7j78k45mL05J71n3
3060B03j78q8j33J70K58N6q3l26L0Q1J72J23m5j96j86N7J52J94r1j96n4j8R2R9
3084I3M8j25j63n7J12J26N2j41j29K4L2L2Q2L2r7o9MJ43k6M9l1r1l3N2J35j9K0
3111E5r3m8J00M7M6o5k2M9k2L7J3j7L8j24N4J64q5j21O6J1J2p1J2N0pq7j7Q5l2
3140B8n8q4J35qn0m6RoML6J8o9k0k0O6N3N6q2Kj14O5Q3M2k7j00p4M8J34J32L0
$$ plain form
2974 -398 -410 -51 260 283 7 -333 -492 -351 123 390 163 -269 -493 -294 52 286 235 -100 -496 -451 -27
2995 -27 401 270 -45 -241 -296 -155 215 461 289 -192 -467 -73 255 384 260 10 -189 -313 75 479 439
3016 439 -61 -226 -146 59 202 373 228 -130 -403 -152 186 255 55 -157 -286 -240 -71 218 197 -7 -379
3037 -379 -328 -89 174 143 -6 -171 -354 -284 92 268 36 -188 -251 -187 -2 234 207 29 -216 -220 85 256 203
3060 203 25 -63 -196 -26 232 288 205 -121 -91 -10 162 285 240 44 -142 -85 67 261 170 -26 -80 -98 -6 93
3084 93 141 16 -147 -204 -92 34 86 -55 -184 -160 -128 -96 -14 18 -79 -148 -144 -1 -27 22 -9 -100 -133 -81 54 35 55
3111 55 -38 -86 14 61 107 42 20 69 47 84 97 80 118 -6 48 212 127 6 72 83 95 24 36 86 79 -8 -25 60 28
3140 28 -30 -114 21 13 -37 -83 -74 -80 -76 -40 -22 -91 -111 -131 -65 -12 44 -38 -36 -150 -85 -2 40 13 -87 -161 -113 21 153 183
3170A83j54q9k0P7J22Q4o4j79m3M3J42J36j41o0j27Q8J30J06j3j63j30o1J15J66
3194A48Q4j55k46j18J88J75J02n7k80j05R5J51J15M7k21k20M6J26K48L7j55k44
3216b39j13K71K49R0k52j72j5J1J93K66m0l00k25J24K92J11j9j60j60j52K20L36
3238C16P7k16l04p2J73J92J76j15k93k15O8L70J31j48k32j03o9K07K17J19l01
3259b2l02j01L46K23R1j37k94j99Q3M02K58j96l83j10L4J96L04Q3j76m09j29M04
3281c4L57K3j83l03j19N2L67L08j10m74k07K21L19K6N8j59l37j02K80M20J9l88
3303C4k69m8J59K55K54m2m72l27J32N26J68k18j83l35K7J54M22J68m43m06K2L36
3325h6K46O5j13l00k47J37M74J88j13m79j40J18K38L12N3k71m27n5M77L35j2k67
$$ plain form
3170 183 29 -60 -80 -3 119 203 139 -40 -83 -40 102 238 97 37 -90 -2 128 234 221 58 -72 -133 -18 148
3194 148 232 77 -169 -287 -99 76 178 121 -159 -264 -169 -18 97 144 -77 -297 -251 -125 123 160 5 -239
3216 -239 -352 -81 168 258 6 -166 -181 -170 23 289 249 -51 -276 -152 140 251 232 72 -88 -240 -20 316
3238 316 393 177 -127 -199 -26 166 342 227 -66 -281 -213 157 288 140 -92 -195 -264 -57 160 279 -22
3259 -22 -324 -425 -79 144 235 98 -196 -395 -312 90 348 152 -231 -341 -307 -111 193 276 100 -309 -438 -34
3281 -34 323 346 163 -140 -259 -207 160 468 358 -116 -323 -102 217 243 301 142 -195 -297 -17 403 422 34
3303 34 -235 -283 -124 131 385 343 -129 -456 -324 202 370 152 -31 -366 -339 -185 237 405 -38 -444 -422 -86
3325 -86 160 225 112 -188 -435 -298 176 364 251 -228 -368 -250 -12 300 353 82 -345 -400 77 412 400 133
3347A33k31q9L2L57L54k74m82k44L26L01J24M7k60l69j95M98L81K2m74k70N8J09
3369a46K73K25o2n17l06L02M31J31k04k74j74j26L35M65N9n25k85N6K64K56P8
3390B56j39k68l00J83M84K17k21l46j15P0K96K23O6m13l38R2K56M02l2k56k38
3411a21j71K22L25K08k99l98m7K02K32J20%l33l61R8L08L35n4k66k69r1K25K44
3433A09J97k54l54j71K90L33Q2p2l30j11j7K42K99n1k20k62K2K48K76M7j86k56
3455a39j29J59L44J85k25k53j82J32K61J93j34k41j57k6K13L19k1k73k06J7J76
3476A3J21J93j58l30j19L6L14J55j02k89j11J24J34J75n5j06k70qK30J65R4k09
3498cj77j13K15J56J23o7k68j19J71J85L0Q5k11k00P4J76J69r3l5j45m4P0J50
$$ plain form
3347 133 -98 -187 -155 202 556 282 -200 -444 -118 183 307 354 94 -275 -470 28 409 431 -43 -313 -255 -146
3369 -146 127 352 290 -227 -533 -231 200 331 127 -147 -321 -447 -112 353 412 -113 -398 -342 -78 178 256
3390 256 117 -151 -451 -268 216 433 212 -134 -249 -179 117 340 406 -7 -345 -253 3 405 373 117 -121
3411 -121 -292 -70 255 463 164 -234 -281 -79 153 273 273 -60 -421 -323 -15 320 266 0 -269 -360 -135 109
3433 109 306 52 -302 -473 -183 150 232 160 -170 -281 -298 -56 243 192 -28 -290 -268 -20 256 303 117 -139
3455 -139 -268 -109 235 420 195 -58 -240 -108 153 346 212 -29 -186 -212 1 320 299 26 -180 -163 13
3476 13 134 327 169 -161 -280 -244 70 225 123 -166 -277 -153 -19 156 101 -5 -275 -283 -53 112 206 -3
3498 -3 -180 -293 -78 78 201 134 -134 -253 -82 103 133 218 7 -193 -119 57 226 133 98 -47 -91 -21 129
3521A29O5j9k21j17J58J22K4j11k9r7m9J55J26O6k14j49J7Q6PJ30r0l0k10J20
3545a31J38J33j76l4l6J5%J14P6j37j14K6J69J1q6j4J7n0M6J48J21j33j92J15
3569B6N7n5M3R9m6j45l8J18J08n4j43N6M6n6n3J47O5j25q2K1R5j00P2l4p2p9J03
3596b6L2j4rq0L6j0l5O0M0K0p6K9k7O2p9J9J46j11p5Q5Pk2k1J14lo0l5M2P2o2
3626A9L8r9M4l3J18M0l0j26n6J16P3k5k9l5k9lK0J09r0m7j21J14k6K5P5k8r5p4
3654a55M6J49K8q0o6j1k9M9J37o1j7j53J8J60N0m4J7q9KJ9J00M7n1j46PL7J26
3681I0L8L5j62j18M8J33R9j6p6q9l9oK55K9j36j48l6Q1J42jn7j16r0k1K13Q2q6
3708D8o3j18n5J72P1L7j09j96O5P1J87Kr3j30j15J22J64J05j2k25n6rK18R8M8
$$ plain form
3521 129 194 175 -46 -163 -5 117 141 30 1 -96 -145 10 136 202 -12 -161 -144 -58 -51 79 -11 -41 -251 -131
3545 -131 7 140 -36 -70 -106 -91 -91 23 99 -38 -152 -126 43 54 -32 -46 -29 -79 -33 115 236 103 -89 26
3569 26 83 28 71 170 124 -21 -59 59 167 113 -30 26 72 16 -37 110 175 50 -32 -11 84 -16 56 22 -50 -129 -26
3596 -26 6 -8 -17 -97 -61 -71 -106 -46 -6 14 -62 -33 -60 2 -77 -58 88 -23 -98 -13 -6 -28 -49 65 62 2 -33 9 81 19
3626 19 57 -42 2 -31 87 127 97 -29 -85 31 104 79 50 15 -14 -17 3 112 22 -25 -146 -32 -58 -33 42 14 -81 -155
3654 -155 -109 40 68 -12 -78 -89 -118 -69 68 7 -10 -163 -145 15 65 21 38 -51 -49 -30 70 117 66 -80 -73 -36 90
3681 90 128 163 1 -117 -69 64 163 147 71 -18 -57 -63 192 221 85 -63 -99 -18 124 123 66 -50 -140 -161 52 134 48
3708 48 -15 -133 -188 -16 55 92 -17 -213 -148 -77 110 112 19 -111 -226 -104 60 165 153 -72 -128 -137 81 179 227
3733B27j97q8q4J21J83P6j70j12l2j6K85qn8j06j61K0K43R5k2k37o4o9K36J17
3757A79m9j09j82n8Q5K08M0l2j58j10J3J94Q3n5j52r0k1J36J69j4j02j63m2J27
3781a03J88O0r8j49o2Q4J72Q9k3j57j72M4J57J82l2j33o7j04J53J27N4j26j64
3804h0j18K07N9J27m5j34j39K6J77J34p9j52j49l0J52J79j0j24j63jL4K60p3r
3828D9k44K2qK01J38j00j52j46N8J65J47M3j51j48j3J07J69j8o2o7p6P9J20Q1
3852A94n2j59j11Q0J19J25p4j45r7N6J47P8K3k13m9k1M1K33m8n9p5j82Q6K22o6
3877E3q5l6j02lJ07J91j6j92r2K5R7J14k6p3j18k9P3J91L6r3j33K8N6Q4J22k7
3903A52j09j38L3J44P6lr4j61L1L5J68J0j44l5KK2Q0M5kj93k5j5J52J15n0j19
$$ plain form
3733 227 30 -58 -142 -21 162 238 68 -44 -76 -92 193 185 127 21 -140 -120 123 218 196 -41 -105 -174 62 179
3757 179 130 21 -161 -219 -134 74 114 82 -76 -186 -173 21 104 49 -103 -193 -214 -78 91 77 -25 -188 -230 -103
3781 -103 85 145 47 -102 -164 -80 92 181 158 1 -171 -127 30 212 180 47 -20 -124 29 156 210 84 -80
3804 -80 -198 9 68 195 150 16 -123 -97 80 214 135 -17 -166 -196 -44 135 125 1 -162 -163 -129 131 58 49
3828 49 -195 -173 -181 20 158 58 -94 -240 -182 -17 130 173 22 -126 -139 -32 137 119 57 -10 -86 -7 113 194
3852 194 142 -17 -128 -48 71 196 122 -23 -120 -64 83 161 184 -29 -78 -99 -58 175 127 68 -7 -189 -103 119 53
3877 53 -32 -68 -170 -173 -66 125 109 -83 -175 -150 -53 61 35 -38 -156 -185 -112 79 115 22 -111 -83 -27 57 179 152
3903 152 43 -95 -62 82 158 155 61 -100 -69 -34 134 144 0 -35 -33 -11 69 114 112 -81 -106 -121 31 146 96 -23
3929b3p7l5O3J21M2o4j30p5N7J40pqj06l4K5J05J22n9j90l0K2J36J3kK6j27pJ01
3957aJ05Mj7n3j5n8P7J49q7q0n7K6P9K7K4n4j27O9L5O5J1j00n0n2Q4j2qP5p5q5
3987a01L1N7N4J7j08l2m3J01O9l3j14K2l0R8jlK2n9n6O1N4k8M6n5K1m6P3J3M9
4016G9m5q8L3L5J01k6q5P1n8nN7J7l2lk4n0J21l8k2K4k9n2L6jll9L7p7L4R%k3
4048d6l8L8n5Q6l6JrqN5n2K7J3K1o2KP0l2J1q2J34j6j0m4L5JN8N3j45K9M7oL5
4080G5n6J3k0K7O7m6l2J7Mk2p2J00n3l0o0N1K3O1m5L4p4N3j00j5O0J8M4j7l6k1
4110e2J1J03r3K9j8k8OJ9l0K3L4k3j3K2O2Ko0j4%J03l9k3K6M0j31O4K6O8q0K5
4140E9L9j1n9R7j1j08Mj1M9l0P1q8l9K6K2P2m8n3p3kJ11q8J04n5j05M0J9Q9o7
$$ plain form
3929 -23 -100 -135 -72 49 91 27 -103 -178 -121 19 12 4 -102 -136 -111 -6 116 57 -133 -163 -141 -5 8 6 32 -95 -102 -1
3957 -1 104 108 91 38 23 -35 42 191 104 24 -33 -7 72 99 123 69 -58 11 46 111 122 22 -28 -80 4 -8 -16 59 -16 -101
3987 -101 -70 -13 41 58 -50 -82 -125 -24 45 12 -102 -80 -110 -12 -13 -16 6 -53 -109 -48 6 -22 24 -31 -10 -56 17 30 79
4016 79 34 -54 -21 14 115 89 4 75 17 12 69 86 54 51 27 -23 98 60 38 62 33 -19 17 16 13 -26 11 -66 -32 -23 -23 -46
4048 -46 -84 -46 -101 -15 -51 -50 -59 -67 -12 -64 -37 -24 -3 -65 -63 7 -25 -14 -96 38 22 12 -32 3 4 62 115 -30 -1 46 40 75
4080 75 19 32 12 39 106 60 28 45 49 27 -45 55 2 -28 -88 -37 -14 47 2 36 -38 15 -85 -100 -40 -22 22 5 -31 -52
4110 -52 -41 62 -31 -2 -20 -48 -42 -23 -53 -30 4 -19 -32 -10 52 54 -6 -20 -20 83 44 21 47 87 -44 20 46 114 34 59
4140 59 98 87 28 125 114 6 10 -1 48 18 89 1 -38 -12 10 82 34 -19 -92 -94 17 -71 33 -22 -127 -87 -68 21 -46
4169d6n4K1pN5L0rl7M3l6L9j6NO0n2m0l4J19rkJ4J1o4N8n8M9L5j18J2J4Q3l9O8
4201I5j34JO0J6L5L3j10j07N3Q4l7J02j41l1K3L5N8j0j24n3J08k7J4M0O1j36k8
4228a20Q0Q6Rj20N8%l2MN8Kj5j20N9J08L5m4rj2j1J9k4R4ko1n6L0M0j0M6p2j7
4259Ck9Q5m0M7q7ok2L6J4O0p8K5j38N9R2M8r6o8Kj9N7J13n3j5n9j1M1P7k0l7k3
4290d2m0Q2N8k2k8m2MM0Q3J6m9n6J3J5L5K9k2qj10M1L5O3n0M2j42kM4O6M2l8n2
4321Ep9K7Q0L7m0n2m2k7O9pP6l6o9k3MQ4km5o5j8N0J06J5J7q8o5lJ05L3M1l4r4
4353d0k1K2J67j09K0p4k5O4P8L0l8r9K9j2N1Q9j07rJ0o4M4L5J3l2q3l6K4Q9N3
4382F9Lj41n4N0J05N0k3p8o6K2M5L5N9j09j08N9L2Q5m1J2r0l1Q9K5O6l3n5Km6
$$ plain form
4169 -46 -100 -79 -86 -31 -1 -10 -47 -4 -40 -1 -17 -12 48 -4 -44 -78 41 32 30 44 55 -9 49 -9 40 75 -43 -31 -17 66 27 95
4201 95 -39 -38 22 38 73 106 -4 -111 -58 26 -11 91 -50 -81 -58 -23 35 25 -99 -152 -44 -71 -57 -17 44 -92 -120
4228 -120 -40 46 55 -65 -7 -7 -39 -35 23 25 10 -110 -51 57 92 48 39 27 16 35 11 105 103 42 -14 16 56 46 92 20 3
4259 3 -26 59 19 66 -21 -27 -49 -13 1 61 -17 8 -130 -71 21 69 -27 -95 -93 -112 -55 58 5 -10 -69 -80 -39 38 18 -19 -42
4290 -42 -82 0 58 36 8 -34 -30 10 93 109 60 4 17 32 67 96 74 66 -44 -3 32 95 45 87 -55 -57 -13 53 95 57 5
4321 5 -74 -47 33 70 30 -22 -64 -91 -22 -29 47 11 -58 -81 -77 7 5 -40 -105 -123 -73 33 48 65 -23 -88 -91 14 47 88 54 -40
4353 -40 -61 -39 128 19 39 -35 -60 4 82 112 74 -25 4 -8 43 132 25 16 26 -38 6 41 54 22 -61 -97 -73 16 69
4382 69 72 -69 -123 -73 32 82 59 -19 -85 -63 -18 17 76 -33 -141 -82 -50 35 -6 6 -84 -115 -26 -1 65 32 -23 -21 -67
4411f7J07NO7r8n6J9P5M8j9K7j22J4J3J30l5j16K0o1M1M3k5N7r1m4qO2L5J2m5
4440a2l3n7K9J17p0Qk6J7K1M9J8n5q5NJ8R4K8n8rm7kO8K9n2N0p2K0L5rL0Nl3k2
4473aJ5KO1Mj19L5N0l5m6Q4n2l8M7L7j9j0L8o4r9M5K4J6L5pk0r0M7K2J01k8r1
4504e6Nk8J10k2j4p0K5j0J17l0Lj9j4pO5K4L8n9l9n2OO3J2Rk4p8L1O9J1L5r9O1
4536F3K6rp1l9L7rM1j01K2P2P8j17L2n4o3Q9LmJ6r3k4K8k6R7l4QL1l7l5N9Mj8
4568b8j5J5J7j5L7l1K8k4l3R1J2mk8m0L1j3N6J00j94M9j4O8J6m8p8PL9j8R2j4
4598F1k3k9l7L5l8QR5m9q8j8P8M4m5k3j4q7N4P4K9J3q1j06R7N4j8jK2r0J5j1J11
4629C2K6m9j13J07j3M4O6k2n2q7M5J23j5m8l7J5k7J33qk0p2J1o4K3J1P1J6j48
$$ plain form
4411 -67 40 45 112 14 -42 -23 52 100 81 108 -14 0 13 143 108 -8 12 -49 -8 35 10 67 -24 -68 -76 -14 21 33 -12
4440 -12 -45 -102 -73 44 -26 -18 -44 -27 -6 43 61 6 -79 -74 -56 38 66 8 -1 -48 -50 18 47 -5 45 -27 -7 28 19 49 54 21 -1
4473 -1 14 16 77 81 -38 -3 47 12 -34 50 -2 -40 7 44 25 15 53 -11 -110 -65 -41 -25 10 3 -17 -107 -60 -38 63 35 -56
4504 -56 -51 -79 31 9 -5 -75 -50 -60 57 27 30 11 -3 -10 55 79 117 58 19 -33 -27 36 48 57 33 -45 -14 55 66 101 2 63
4536 63 89 80 9 -30 7 -2 39 -62 -40 32 110 -7 25 -29 -92 -3 0 -4 12 -81 -105 -77 -103 -6 -40 -32 -1 -38 -73 -14 -10 -28
4568 -28 -43 -28 -11 -26 11 -20 8 -16 -49 42 54 50 22 -18 13 0 56 156 -38 11 -3 65 81 33 -45 -38 1 -17 75 61
4598 61 38 9 -28 7 -31 -23 72 23 -65 -83 -5 39 -6 -29 -43 -130 -76 -2 27 40 -41 -147 -50 4 -14 -15 7 -83 -68 -79 32
4629 32 58 9 -104 3 -10 34 100 78 26 -61 -16 107 92 44 7 22 -5 128 120 100 28 39 -25 -2 9 80 96 -52
4657e2m1K7Q1M0j9kj15o1J70O8m3n7j20N4j0J30J6r5n7q0J58J5N6J3o3o8o7J60
4685C8O0p9k3o7O2L9M1N5p2j03m1J18N3M8l5j11l9m1J41J19k5j35m7l1P5J14l3
4712H1p5n6j8N2Q4K7o6r2j19P7J14J7J00k56p6P8J08R3m5r9Nq7O8J63Pj9j20o2
4740a16L6Q0J07m5q8q1j0J87P4k5l6q4j8N2J05j2n7j28q5J28J75j5o0o7j58K8
4766a13J50J70j09k00k6J16qP8J8j32p2oK5K38l8q4j14k9M7R9J55j19j12j55J26
4791i5J02J41l1j41l0o0O3J47K2r5r6k9P4R8L2L3j72p5P6J43P4r2o5j35L6M3J10
4818G8J00m4k01PP5R8K1m9k01kR6O9J10p2j09q4n5J56R2k8k3j96L0O9J38j2j0
4845E3j33Nm0J27M8Jj55n0N2P7J58l7j36n0l5P1J72k3m9j49N8N0Q0L6m3o0j79
$$ plain form
4657 -52 -93 -66 15 55 36 34 -81 -142 28 96 53 -4 -124 -70 -80 50 66 -29 -86 -166 -8 7 63 76 13 -55 -122 38
4685 38 98 19 -4 -71 -9 30 71 126 54 -49 -90 28 81 129 94 -17 -56 -97 44 163 138 3 -44 -75 0 114 81
4712 81 6 -50 -68 -16 68 95 29 -63 -182 -105 9 26 126 -130 -206 -128 -20 73 28 -71 -66 -153 -85 78 85 66 -54 -116
4740 -116 -80 0 107 62 -26 -107 -117 70 144 119 83 -1 -19 33 138 126 69 -59 -144 -16 159 144 84 17 -141 -113
4766 -113 37 207 98 -102 -128 -12 -20 58 76 -56 -128 -134 -109 129 91 7 -107 -136 -89 10 165 46 -66 -221 -95
4791 -95 7 148 117 -24 -54 -114 -51 96 118 23 -73 -102 -28 70 102 135 -37 -112 -36 107 181 89 24 -111 -75 -32 78
4818 78 178 134 -67 -60 15 113 134 85 -116 -118 -22 47 157 85 -24 -108 -163 -7 85 57 34 -162 -132 -63 75 63 53
4845 53 -80 -75 -115 12 60 61 -94 -144 -92 -15 143 106 -30 -80 -115 -44 128 105 56 -93 -35 15 95 131 88 28 -151
4872a51J22J76m6p3rj05l5Q1Q5P1j03j14K4Q6L8m3Qq4p6L2J20P1r3k7n9N6mN8
4900FO9r2j09M9P5l1J08j06oj5L2J8O6J2j02o9J06J9M9M1j18m5l6R9O4J4r3Om7
4929c6J7R1N5n3j07n4N6J5R5r8M1m2o7J42n8K0qk4j20J35J6pK0q0m6P4j4M6L5
4958D4m7n0L2k0P3rk9k3JM9n9Q5Mq3m0J44r8K0O9k8o2L5J3O4l1j1n2J5j0L4R5
4989A25o4l6o4O5oo8N2J2m9L3Rk6Ok9OK4l9M0J8L3o7l0m0R4J0k6J5J1o4k3J23
5020D5nl8L7M6j12P3m0K3j5J8m9M9l4j5J07p2o7Q2o0N0Q2j00J5j1j7L1M4j5j6
5049C6p4j6P5j8L3j5m2m9o6J40Pm9L1j2p1J00Mm6lL9o2O2K0K7j4o5j2m4O5P6l7
5080B0M5j27N6oO2M0q0n5K2oJ00k0Kp1j19J33N1N1j25O7j03N9jJ16K3j56p2L1
$$ plain form
4872 -151 -29 147 101 28 19 -86 -121 -40 45 116 13 -101 -77 9 47 4 12 -72 -148 -116 4 75 -18 -45 -104 -48 -52 6
4900 6 75 -17 -126 -77 -2 -33 75 -31 -37 -52 -20 -2 64 76 -26 -95 11 30 79 120 2 -43 -79 20 84 98 5 11 -36
4929 -36 -19 72 127 74 -33 -87 -31 -16 79 -19 22 -20 -87 55 -3 17 9 -15 -135 0 16 9 29 -51 -97 -23 -37 9 44
4958 44 -3 -53 -21 -41 32 23 -6 -29 -28 21 -38 47 51 -32 -72 72 -26 -6 63 35 -27 8 21 85 54 43 -9 6 -4 30 125
4989 125 61 25 -39 26 20 -48 4 16 -33 0 9 -17 -11 -40 -34 -10 -49 -9 9 42 -25 -55 -95 -1 9 -17 -2 9 -55 -78 45
5020 45 40 2 39 85 -27 46 6 29 14 32 -17 32 -2 -17 90 18 -49 33 -27 23 105 5 20 9 -8 23 67 52 36
5049 36 -38 -54 21 3 36 21 -21 -70 -136 4 11 -38 -7 -19 -90 10 14 -32 -35 4 -58 4 24 51 37 -28 -40 -84 -19 57 20
5080 20 65 -62 -6 -12 50 90 10 -45 -23 -29 71 51 53 -18 -137 -4 47 98 -27 40 -63 -4 -5 111 134 -22 -94 -63
5108f3qJ26M3l1j42o7Q9N9R2j21j2n8N4jJ00Lj22rl8Q9L4O8k2j44o6J24O0P8k0
5137I5j12j20R7J05L6M2p4j21o4J56J09k2r2n1r9O6P2J90j04j36j09J18P4R3q8
5162F1j28pq9J76P9m7j8j80k3P6J43P0j23n6j11K2K04M5l8q9j44P0J18R1M7j32
5188A7n6o4L5J67oq6n8q6J22L4Q6n2q3l7O3M6J09Jj49j6j14J17Q5K5m2j05j00
5215a47Q6J65J5q4m7k05R0J91j5j8p7j01kR2J33L6j03j07n5P0P3J20J6j94r2k8
5241a88K17J19m4q9o7mM3R4K7k7j58l3R7J49Qn9j35o3J31L3J29q1q2j49J0J60
5267C8J13p5J4j94n1J17J45j9k5q3q3N9J17N1j15o3p0lQ7J24J6j52q3j5P9J99
5293A28m9J0j76k0N1Q3J21j11p6j10J44O8J29r7j72p8P8J10R3R2j64r3L7o8K00
$$ plain form
5108 -63 -71 55 98 67 -75 -142 -53 6 98 -23 -35 -93 -39 -40 60 63 -59 -68 -106 -17 17 85 63 -81 -147 -23 37 115 95
5137 95 -17 -137 -40 65 101 143 69 -52 -116 40 149 127 35 -16 -115 -49 23 213 109 -27 -136 -18 56 149 61
5162 61 -67 -74 -163 13 92 45 27 -153 -176 -100 43 113 -10 -66 -177 -155 49 94 56 -33 -177 -107 11 102 149 17
5188 17 -39 -103 -68 99 93 7 -51 -137 -15 19 105 53 -30 -67 -4 42 151 152 3 -13 -127 -10 75 100 58 -47 -147
5215 -147 -61 104 119 35 -12 -217 -127 64 49 31 -46 -147 -149 -57 76 112 9 -98 -153 -83 -10 110 126 -68 -160 -188
5241 -188 29 148 104 15 -52 -56 -13 81 108 81 -77 -110 -13 136 144 85 -50 -113 18 51 180 99 17 -132 -122 38
5267 38 151 76 90 -104 -155 -38 107 88 63 -20 -103 -44 73 124 9 -54 -124 -127 -40 84 100 -52 -135 -150 -71 128
5293 128 79 89 -87 -107 -56 27 148 37 -39 -149 -5 63 192 95 -77 -155 -77 33 126 218 54 -39 -2 -70 130
5318A30l0l7r0j12Q8J33Mk8Nj24l8Q8P6rj4n4p9N5O5J07n3j77J2M7N3oLOr9p7
5348a55J17J01K8j08j64J22K8N5O2p4o0p1N2J95l3j11J3K3r4O5R3Nk8j16k3J22
5374D4J9Qj6q1n4K7J51K5r7k8m4M5MR7j5kj30p6P8R3Klj16Qm6J38N4m5j23m3O2
5405f4K0J12n8m3m6l3P2J28p0m8M2%n0P8m6M9j5j18J09K6K4j7j0m8L1j7O6O6q4
5434E6l8%j1Ml6Q7o6j7M8q4R8K9j04J9p1Q0q2R7J4r3J2M6P1qn3jn0M0M4k5om0
5466d0M2lL0p8R5m0k4N2k1P2m2q4P6L3m0n0L4P5l9j35O3nP9j0j6Lk4K0kj1Km3
5498c1M4k7rK8P8p2n9n2Q8M0q5J05J3p3p9R0M1J9j20K6oRQO9Lj29k3j8J47P5j35
5529c5J07l8n8j9J09m4Ln7oQ5r0J03l3N6r9k5J06J7o2J26j26%j16O7J71r1q3k9
$$ plain form
5318 130 100 63 -27 -139 -51 82 86 58 63 -61 -99 -11 65 56 42 -12 -91 -36 29 136 83 -94 -82 -35 18 12 15 21 -78 -155
5348 -155 -38 63 91 -17 -181 -59 -31 24 86 12 -48 -119 -67 128 95 -16 -3 20 -74 -9 84 89 61 -55 -78 44
5374 44 63 71 55 -26 -80 -53 98 123 26 -2 -46 -1 3 100 85 83 -47 -123 -45 48 50 47 -69 -61 -107 31 85 40 -83 -126 -64
5405 -64 -44 68 10 -33 -79 -112 -40 88 18 -30 12 12 -38 40 -6 43 28 -90 19 45 69 52 42 -6 25 8 74 140 56
5434 56 18 18 7 11 -25 62 -4 -21 27 -57 41 70 -34 -15 -86 -6 -88 9 23 -70 -58 -12 59 51 -2 -3 -53 -13 31 6 0 -40
5466 -40 2 -1 29 -49 46 6 -18 34 13 85 43 -41 35 68 28 -22 12 87 48 -87 -24 -29 50 40 24 27 3 23 21 10 12 -31
5498 -31 13 -14 -23 5 83 11 -48 -100 -12 28 -57 48 61 -12 -91 -1 40 59 -61 -35 -41 -32 -24 45 48 -81 -104 -122 25 100 -35
5529 -35 72 34 -24 -43 66 22 25 -32 -38 47 -43 60 27 83 -16 -41 65 82 20 146 20 20 -96 -29 142 51 -32 -61
5557f1J05k8k1N8q7m7K0P3O0j00J7l6n3j7J08J00q8j20N0J8O2j0j6o5J3NJ04j1
5585C3l9k9k4N4n5J7K04p4r2n5P4n3O8R7o0j08j1J28J6J0n5p5RL2L1N9j1j49n4
5614a12J22j4NJ3J7o8m6Q4J02m7r3n5L1KN6Q4j5j47k3M9R8J8m5k3m0j7k8K07q
5643A07j33j8kOJ27k1M1j59k4L0J12Jl9m4j4l8J12O0k1m3j07N0Q4O0j13M6j07
5670d7oL8J05n6k3ql7p7N4J47J4j29j45J14j9O6L8n7m0m9M7J12l2Lj44M9lJ05
5698B0L2m6K4j14L6J4J73l6q2J9m6jJ05k9o0k0m8L4J12M8n8n8j40O7Q9J5K5r5
5726b0l6p1J66Q9p5l1p1k6pP9P0po4l8J4O8qLj7l4m3J8O5j3J6j15O4qP0L2jj09
5758d0l2L0R1j1N5q8n9k9J08L1N8q9j01L4N5oQ6j3j51j7O4J04M1q6l9l6lM7O8
$$ plain form
5557 -61 44 16 -5 53 -34 -81 -61 12 72 -28 -11 -47 -100 -117 -9 91 3 -117 -67 -49 13 3 -13 -78 -65 -60 44 33
5585 33 -6 -35 -59 -5 -60 -43 161 87 -5 -60 14 -39 29 126 66 -42 -53 75 91 101 46 -29 -20 12 43 102 91 -58 -112
5614 -112 10 -4 1 14 31 -37 -83 1 103 56 -37 -92 -61 -59 -3 81 66 -81 -104 -55 43 61 16 -7 -47 -64 -92 115 107
5643 107 -26 -44 -46 -40 87 66 107 -52 -76 -46 66 67 28 -16 -30 -68 44 104 83 40 -67 -17 67 127 14 60 -47
5670 -47 -53 -15 90 34 11 3 -34 -111 -57 90 104 -25 -170 -56 -75 -9 29 -28 -68 -117 -70 42 10 13 -131 -82 -85 20
5698 20 52 6 30 -84 -48 -34 139 103 21 40 -6 -7 98 69 9 -11 -59 -25 87 135 77 19 -121 -54 35 50 75 -20
5726 -20 -56 -127 39 128 53 22 -49 -75 -82 -3 67 60 -4 -42 -28 40 32 35 18 -16 -59 -41 24 11 27 -88 -24 -32 38 70 69 -40
5758 -40 -72 -42 49 38 93 5 -54 -83 25 56 114 25 -76 -42 13 7 93 80 -71 -88 -24 80 121 35 -4 -40 -43 4 72
5787G2m3j6j65J34K5N2km7k5r0J00M9N1r0K7n4m2J01KN4r8n2k7OJ15M7r3J8l1
5816b2j5O0Q5k2r9po0R8N0rp1J4m0M9J1OJp1o6P3N4L3p1nk4L5M0Pj7n6m2K2L7
5849b2P5m0J0n7K9l8O4J1Np8k4K1J21o3J6mj07P5J7M9l2M2j04Ok3J27n6k6J1l0
5879b5M7l5O6K3p6l7Qj6N0RN7j67O1n2N6O0j3n7ql3Q2QO5l4r9K3J4P2j1J3q9l3
5911g1M8k7J06k1p5k9Q2J2k2K4l4n5L0M1k5J5N6q2K4k1MN3n4J9o2O2k9O7N2o6
5941B2jp0R9L0p0K7l7k6n4P6N6o4L9j30J25l9OLJ1q0J0L1K6L8L3n9l9m4O5lR9
5972H0j53O5NJ8K5rJ2n6r6J18J1j7L5k5rQJ8J6M4pj30k3Q1j3k9P3n9J4m3O2J4
6003C0Roo0M6j2J7M7J3j24m5P6L5k4L6j26lJ9M9R4j3o5n3M5k0O0k2K3j5p0N1P
$$ plain form
5787 72 29 13 -152 -18 7 59 57 10 -15 -105 -5 44 95 5 32 -22 -64 37 39 93 -5 -57 -84 -78 37 84 -9 9 -22
5816 -22 -37 23 108 86 -13 -20 -80 18 68 59 -12 2 -38 11 22 28 29 -42 -108 -35 19 52 -19 -24 -48 -13 27 34 17 -39 -81 -59 -22
5849 -22 53 13 23 -34 -5 -43 21 32 37 -41 -65 -44 77 14 30 26 -81 -6 11 60 28 70 -34 -28 -51 76 20 -6 5 -25
5879 -25 22 -13 53 76 0 -37 -29 -45 5 14 71 -96 -35 -87 -31 29 16 -41 -49 -82 0 8 73 39 -60 -37 -23 49 38 51 -38 -71
5911 -71 -23 -50 56 35 -40 -69 13 25 3 27 -7 -62 -32 9 -16 -1 55 -27 -3 -24 -20 33 -21 -2 -64 -2 -31 36 88 22
5941 22 21 -49 50 80 10 37 0 -26 -80 -4 52 -12 27 -103 22 -17 -11 -8 3 -77 -67 -36 -10 28 61 2 -37 -81 -16 -19 80
5972 80 -73 -8 -3 15 40 31 43 -13 -109 9 20 3 38 13 4 12 30 46 90 83 -47 -70 11 -2 -31 42 -17 -3 -46 16 30
6003 30 39 33 -27 19 7 24 71 84 -40 -85 -9 26 2 38 -88 -91 -72 -23 71 58 -7 -60 -15 -35 25 3 26 11 -59 -8 -1
6034aK1k6l9L5m6K7M2N4K5j47N4k6O9K0K0r2k6oO2l2R8j26k9J6nN0M9m2J4l2n4
6065g3J64j06%J5K8m7ONN5j22mP8J3m2P0Pj11J0R0P5q4K0j3r3P7m1K2P5n5n3k
6096c6N2P9m3l9Oo3L3M9M3o1n4K8k2N4P3m1j2n3j7J9J8oN8j02n6J03L1L1jj28
6126e7K1J6LN8n2k0o9N7j1J05J3j09J6k2J9N7J2k8o3j3K8P5N7m7q3k3kN9K5K0
6156D2J2q6l5O2L0M8lj08k2J0J02l6Mm3jr7J89n4L5m1o6OK7K1K3j2k6n4m7J94
6186G4l3p4Oj7LN3l6M1o4J8k3P8kJ9k4q4K1L9K2O1q9pM0J0k6J2M1K0j35R6J2L3
6218H5k4k2m1J4JM4m2n2L0k0k3l4J47mk4l8j0J8nj9L4m9%m5O6O2m2k2k9k0Q5m6
6250b5M5j5m8O3k8N6m5Nk5ok1M0J35p8q6N4l6K9M6jj7J8m7j8Q8m2n4ol3P9jk9
$$ plain form
6034 -1 20 -6 -45 -10 -56 -29 13 67 92 -55 -1 -27 42 62 82 -10 -36 -42 20 -12 86 -40 -69 -53 -58 -8 41 -1 13 -19 -73
6065 -73 91 -15 -15 0 28 -19 -13 -8 47 -75 -79 -1 12 -30 40 47 -64 -54 36 111 27 47 34 -59 18 -23 -1 74 19 -34 -36
6096 -36 16 95 52 13 19 -44 -11 38 81 20 -34 -6 -28 26 99 58 46 -7 -24 -5 13 7 65 -37 -93 10 41 72 71 -57
6126 -57 -36 -20 -17 41 -11 -31 -100 -43 -54 51 64 -45 -29 -51 -32 25 37 9 -54 -67 -39 36 93 46 -37 -60 -62 -3 22 42
6156 42 54 -32 -67 -5 25 73 70 -38 -60 -50 52 16 20 -23 -24 -121 68 14 49 8 -58 -52 -25 -4 19 7 -19 -73 -120 74
6186 74 41 -33 -27 -44 -41 12 -24 17 -47 -29 -52 26 24 43 19 -65 -44 -5 17 78 -11 -18 22 32 6 18 59 79 -56 40 52 85
6218 85 61 39 -2 12 13 57 15 -37 -7 -27 -50 -84 63 59 35 -3 -13 5 0 -19 15 -34 -34 -79 -13 49 7 -15 -44 -64 21 -25
6250 -25 20 5 -43 20 -8 48 3 8 -17 -23 -44 -4 131 53 -33 21 -15 14 60 59 42 60 13 -5 83 41 -13 -19 -52 27 26 -3
6282cL9qr7N3O7J8m5l5j4M5l2J4J9k8p6K7K9K7j9K8K0j4l3J6k7P6n7m8K1KQ4l2
6314A7J5q0qjR1l9k1O5o1L0Oj7Q3m8n5M9l7K5J7j9K4o0N6J%J7m7L8o4O4j3J0O
6347D4l6m0K3K2K6J0p7m7L5j8O8K7k5m3j1M4J2J0kp8L2J1M3m1m1PL7m0Q6L4p0
6378BJl9j5J26r1L0K7r2K3K0J7JJ9npm2K1J1j0O8j01K4N3m0K0pnNm2NP3j4p1n7
6412i2P7K7k9L6L5j12LN3J5M5j09M6o1N5K1j7L6l0NK0l2L0l2j1jJKM7j0j0Q5q7
6444Fj6jM1m4L2Ll4Q4l0j4j9l6l9N8M5K3p2l5J7M7q7O2K8o7o8N6M8P8j16RJ1m1
6476g1K7L3N4q3mK6M5n3O5r4J2J1J21j09K0l0K2k8Q6n9K5k8M0K3q8J03m6k0J06
6505A06o2p2O2o7L2OM4Pr4j8J6K7j9k7P9Mk6j8K0J9l2l1M8K8n3m5O0k1N3K7k0
$$ plain form
6282 -3 36 28 -69 -16 51 69 24 -11 -25 20 -12 2 21 -7 -83 -56 -27 0 -19 9 29 15 -18 -2 -29 47 -10 -58 -37 -35 49 17
6314 17 32 -48 -56 -57 34 -5 -26 39 -22 8 14 -3 80 32 -23 26 -11 14 31 12 36 -24 32 33 33 50 3 41 -23 41 28 38 44
6347 44 8 -32 -9 13 39 49 -28 -75 -40 -58 10 37 12 -31 -42 2 14 24 22 -56 -24 -13 30 -11 -52 -45 -8 -48 38 72 2
6378 2 3 -36 -51 75 -16 14 41 -51 -28 -8 9 10 29 24 17 -25 -4 7 -3 65 -36 -12 41 1 21 14 9 14 -28 -23 50 36 -35 -92
6412 -92 -15 12 -17 19 54 -58 -55 -2 13 58 -51 -5 -66 -11 10 -7 29 -1 4 24 -8 22 -10 -21 -22 -21 -19 28 18 8 93 6
6444 6 -10 -11 30 -14 18 21 -13 71 41 27 8 -28 -67 -9 36 59 -13 -48 -31 16 -71 -9 19 -48 -116 -60 -12 66 -50 -41 -30 -71
6476 -71 -44 -11 43 -40 -44 -18 27 -26 39 -55 -43 -32 89 -20 0 -30 -8 -36 50 -9 16 -12 28 51 -37 66 20 0 106
6505 106 44 -28 34 -33 -1 5 49 56 -38 -56 -40 -13 -32 -59 20 24 -2 -20 0 19 -13 -44 4 32 -21 -66 -6 -27 26 53 33
6536C3o5O4m4j0l8J03o7O5k2q1P2O4o9Lk7q5J38j4J3Qj0r3J09m3j2O5l9p1O3n8
6566d8N5P9l6J2j00L4l0J02l8r7M0J7K1k2O2K0o9k3nM7O1p8m2k0L1OK8J1lj0L0
6597C5j3j9k6O3%q4R6NP7j12Jl5k4O5J6K3k5o4L6%l7L1k8J9n1p2J48l0j3Kk3N3
6629A4k0P7m8k9p6R8M3j7j09R5k5n5O4pL6q3j7M5k0Q2o6J3L5o9K3L5rK3l8J8n7
6660d4L0P6p0k9j1L6OL6j5j4L1q5K0N8L0Jq1l9J5L2K7%k7k8M2J9l7M8n1O2m6K5
6692A7JP4no2o3L5NJ00j29mM9m8P7l5n5Q5j7m2k4Q9J9l5l5m3lL1K6L0k0L6j19
6723f5J7M2P0k6nm5o5P4P8j32L8K6k9J9L6kl6n8K3K2O2o8lL3j0l2Q4On3J1r8L7
6755d9RP4l1O3q8L4K1K1o0jJ0j8l0K8PN6n6n4N9O7km7K7rl8K8L1l8P1p0m5N7j9
$$ plain form
6536 33 -32 32 -12 -22 -60 43 -24 41 19 -62 10 74 5 8 -19 -104 34 20 33 41 31 -62 47 4 -8 57 18 -53 10 -48
6566 -48 7 86 50 62 -38 -4 -34 68 30 -67 -27 -10 11 -11 51 71 2 -21 -26 21 82 4 -38 -58 -27 -21 7 18 15 5 35
6597 35 22 3 -23 40 40 -44 52 57 134 22 23 -12 -36 29 45 68 43 -21 15 15 -22 9 -19 0 -51 -123 25 -5 -18 -16 -39 14
6629 14 -6 71 23 -6 -82 16 59 42 -67 28 3 -52 12 5 41 -42 -59 -14 -34 48 -18 -5 30 -39 -16 19 10 33 -5 13 -44
6660 -44 -14 62 -8 -37 -48 -12 -6 30 15 1 32 -53 -33 25 55 56 -25 -64 -49 -17 10 10 -17 -45 -3 16 -21 27 -24 38 -8 17
6692 17 18 92 87 25 -38 -3 2 102 -27 -31 18 -30 47 12 -43 42 25 -17 -41 48 67 32 -3 -46 -49 -18 8 38 18 54 -65
6723 -65 -48 -6 64 38 33 -12 -77 -3 75 -57 -19 7 -22 -3 33 31 -5 -63 -40 -18 44 -24 -27 6 -4 -36 48 54 1 12 -86 -49
6755 -49 -40 34 3 66 -22 12 33 54 -6 -7 3 -15 -45 -17 -10 46 -10 -64 -5 62 60 13 40 31 -7 21 52 14 85 15 -30 27 8
6788HK2p5RJ6J5J9k6M8n0l0K1kN0j0K3q4k5R0ll2mL9l9KJ8l0R8j04j9O5k5K1L0
6821C6p2M6m8K5O8m1k7J0K2j6N9Po4k8K4kjJ7J6n5K4p3mJ52n1m5lpK7rl3O9p0
6854d7P8l9l9O0Ok0k3L6n5J4M8Jm4K4N3k3l9o8J36j05L6Jj5O7r7nP8k4Q8l9p3
6885b9J7k5Q2J1Ol1j4J5no4J07q3MPl9P8qo0Q0n1ll5QP4L0q3%Mm8M2k3PK2m4O0
6920Imm9O6r6K4L5pQ9j04j0O6j1k2l8N6l6Pj5J03o8J2J6k1N8p9ML0j8rl0P8k5
6952A1m0K8L7j3j1j7nJ5L2m6L7m6PL4L5q2L4m1kJ9Kl9J8N3n4k8N1J5m9j8K8%M4
6985Ik3j6Oj5R7p3M3k3j6rPK9n5j2J78j16j1J5m0Q5l7KL3m8j0%Q4Pr0l6J03m6
7017B2P0j6m8p8L3L2p6M2K5J7n3l2M4jJ5m6N3Qo0O6m1J1K1O1n4N2j13KL2p2J10
$$ plain form
6788 8 30 -45 -36 -20 -5 14 -12 36 -14 -44 -23 -25 25 15 38 -46 -71 19 16 -16 -20 19 -20 -18 0 -30 68 -36 -55 10 -15 6 36
6821 36 -36 10 -38 -13 55 14 -13 -3 19 3 62 69 5 -23 1 -1 -2 15 31 -24 0 -73 -77 75 24 -21 -24 -31 -4 -13 -46 23 -47
6854 -47 31 -8 -47 13 19 -1 -24 12 -43 -29 19 20 -24 0 53 30 -9 -77 59 -46 -10 -9 -24 43 -54 -59 19 -5 83 44 -29
6885 -29 -12 -37 45 56 62 31 17 32 27 -37 70 -13 -9 -2 -41 37 29 -31 49 -2 -5 -40 -32 42 72 -11 -11 -7 -55 -13 -36 -29 -7 -51 9
6920 9 5 -44 22 -74 -50 -15 -22 67 -37 -47 19 8 -14 -52 4 -32 -25 -40 63 -5 7 23 2 60 -19 -15 15 -3 -12 -42 36 11
6952 11 -29 -1 36 23 12 -5 -10 5 37 -9 28 -18 -11 23 58 -24 10 -31 -33 -14 -12 -51 -33 20 -34 -62 -11 4 -45 -63 -35 -35 9
6985 9 -14 -30 -24 -39 58 -15 28 5 -11 -20 -13 16 -39 -51 127 11 0 15 -25 60 23 25 58 10 0 0 84 91 1 -35 68 22
7017 22 92 76 28 -50 -17 15 -61 -19 6 23 -30 -62 -18 -19 -4 -50 3 11 -49 17 -24 -13 8 69 15 67 -46 -44 -12 -84 26
7048B6l9K0l7K3n6N4P4n9L5J8j14P3K0j8L4o2K2n2M6O0k7k9n5L6N9L5n0n1J8R
7078A3n2R3q8Q1k4o5rK2J18p3m3j2m4Q2M3k1K3q1n1R0k9K6rl3L8m3O7J1j1n1L3
7109Ap0L2K2O1l1o5J5ONK9nnJj2M5K7o7RLLL1j5O7j03j8L7j1j6K6Q5j48M9K3J3
7143B4J8n4L4n4k4J7M1MMom2PK4J8M2r1rLQ2J0l5m4K8k7PQ5r6K3K9m1o5J90j07
7176eM4n3poK3L5%L8j09K2P9j2NMj45J0J25L7r3Ml4o2J57n2j1j9Ll8%O8P2q2j5
7209a7J0m4L0j3P7k6q9O9om4R3k7K4qn5M3K6l7nO7q2L0L3j04N2rm0J1O2M0m7m5
7241c1O0o5M4o0J06j6p5m1J14J6p8O4o8R9j03j6N9J10j47K2J02j29P1o9R2j07
7267d6O1K4J7l6m4Pj5n5J07L1j8L5j59L8J06rj1K2q3j2K9MJ3l6L9l6k9k0J49n0
$$ plain form
7048 26 -13 7 -30 -7 -63 -9 65 6 41 59 -55 18 38 20 54 -8 14 -38 8 68 41 12 -43 -7 52 87 37 -14 4 13
7078 13 -39 54 -34 47 23 -42 -51 -29 89 16 -27 -39 -83 -1 42 21 44 -37 -88 2 -27 -1 -10 -43 -5 -48 19 30 19 -32 1
7109 1 -69 -37 -15 46 15 -50 -35 -29 -24 5 0 -5 -4 -16 29 56 -11 -2 1 4 35 20 87 -16 -34 3 -8 -24 2 87 -61 -12 11 24
7143 24 42 -12 22 -32 -56 -39 2 6 10 4 -38 -31 -7 11 53 -38 -47 -44 38 48 13 -31 -3 -30 -23 62 -34 -11 18 -23 -88 102 -5
7176 -5 39 -14 -21 -27 -4 31 31 69 -40 -18 61 49 54 58 -87 -77 48 85 -8 -4 -38 -100 57 5 -6 -25 -22 -60 -60 8 80 -2 -17
7209 -17 -7 -51 -21 -34 43 17 -72 -3 -9 -53 40 13 37 29 -26 17 43 6 1 68 -14 16 49 -55 -3 -12 -52 -41 21 61 14 -31
7241 -31 29 -36 8 -52 54 38 -37 -78 36 52 -26 38 -30 69 -34 -50 9 119 -28 -6 96 -33 38 -31 61 -46
7267 -46 15 39 56 20 -24 -17 -32 -87 20 51 33 68 -91 -53 53 44 33 55 -28 -40 -11 -7 6 -30 9 -27 -56 -76 73 23
7297B3r6Q0K4M9r1L2%k7K6j7K6k3J5k6k3M0m7n7Q6rJ9l1j9O3k9nM2j7n2O0k2L8
7329C2k3k8L2kJ2nnm6J9M6J7oo5m3Q6K2r0M1J6p3P0pk5Q4o0Jk4k1K5M3k0j6%K0
7363Gj6n6J13o1pp2N9L8n9NJ00r9N5l1L9Lk1K7k5n0O4L8pp6l7O5K6r6L4J8J2L4
7395B4j7m7N6k8Kn9O7M5l9L2k0j9L2oKK9m0l7nj4K6j7pn0J43n4pmQ2r8p2J36P
7428D3K0q5J7j3JJ7jP4j30P1j2j0J7K3j1l2Mj3rQ3p2jJ7M5p5N4L1m6J9l4NlJ3
7461Gj8K6j5M9Lm8nl2ML0l0Q2n1p0M8J9K1o7M7L1K5q6N0j2N1n5N9j33jQ8j5O5
7493F7r5O2q0M0K0Q0j22lJ3k8N2J4M0k5pl0K3j3R9p0k9K1n7N2p0K0M3j6n6K2K3
7524a0R5q8l5K5jQ3n9rj1L7l3mL8L5r7J9P%k9N1o4O0l1LL3M6p0l5R0o0JN9J8p2
$$ plain form
7297 23 -73 7 31 80 -11 21 21 -6 20 3 29 6 21 -5 -28 12 -35 -92 -6 -15 4 -27 -46 17 -12 -17 25 8 -44 16 -6 32
7329 32 9 -19 13 11 23 18 13 -33 -14 32 49 43 -22 -65 21 43 -47 -6 10 -63 7 0 -25 59 -1 0 -24 -45 -20 23 3 -13 -13 7
7363 7 -9 -65 48 -13 -20 -92 -33 5 -54 -49 51 -48 7 -24 15 18 -3 24 -1 -51 13 51 44 -32 -69 -4 22 -74 -40 -22 -10 24
7395 24 7 -40 16 -12 -10 -69 -2 43 4 36 16 -3 29 23 25 54 14 -23 -28 -42 -16 -33 -40 -90 53 -1 -8 -12 70 -28 -100 36 43
7428 43 63 -22 -5 -18 -17 0 -1 73 -57 14 2 -8 9 32 21 -11 -7 -20 -29 54 -18 -19 -2 43 -32 22 53 7 26 -8 -3 -6 7
7461 7 -11 15 0 49 52 4 -1 -33 -29 1 -29 53 2 -68 -20 -1 20 -47 0 31 56 -30 20 8 59 4 63 -70 -71 17 2 67
7493 67 -28 34 -46 -6 14 94 -28 -31 -18 -46 6 20 60 35 28 -2 21 8 107 37 8 29 -28 24 -46 -26 17 1 -55 -33 -10
7524 -10 85 -3 -38 -13 -14 69 10 1 -10 27 -6 -10 28 63 -34 -15 -8 -8 -37 14 -50 10 -21 -18 15 61 -9 -44 46 -14 -13 46 64 -8
7558hom1K0N9MK9j06J21j00J01J7j11j3j6P6J6m0n5Q8q8K7J6QL0l5l5K8L2k8o3
7588g3M2OL3j4Q5o5K0l4l1L0L2m5l1Q0l0L2m8L9N7k5r4k1R6l7pJ2m7K5NK4O2p8
7620@K6n0nM7J3%n5L1mJ7m5P7o4Om7O3K0l0kk4L4J3k9l8L8kk1L7k9K3L1p6N6l0
7654a9JLP1k1p4qJ35j23O5j4k1J3l5m3O2N9o2J08r4J00q1l4Q7m8q0oJ22k7q2M9
7684CNM0K0m9j5o7N0j8JL2O2m9L5q2O2p0N9l6LM2l7l0Q5m5Jp9l5J06L1%rm8jJ28
7718I5o8j7N3j21O8O3kn2l2o5L9K2PQ4m7m2k7L6j8RNN2m0m0O9N4q3K1jk4Mjj2
7751a1L0n4K2P9o7%J2l4m0N0j3K2LJm4J5J4%L5Ro8Q2l3o1Q7o3m4KJ01m5M3K2p2
7784b0O0q5M0j7JJ5K9k5j4P1L3kj18M3j6l4jJ04o6J1n7O8rK9l8m7K1k5M3J9rl3
$$ plain form
7558 -8 -14 -55 -35 24 28 57 -49 72 -28 73 90 -21 -34 -50 26 42 2 -53 35 -53 -26 -10 -2 28 -7 -42 -14 18 -10 -73
7588 -73 -31 -25 8 -6 79 14 34 0 -31 -1 31 -14 -45 35 5 37 -11 28 85 60 -34 -55 41 4 -3 9 -38 -13 -8 16 78 0
7620 0 26 -24 -29 18 31 31 -24 7 3 20 -25 52 -12 -6 -53 10 30 0 -2 -26 8 21 -8 -46 -8 -10 -31 6 -23 0 31 -45 11 -19
7654 -19 -18 -15 56 35 -39 -47 88 -35 30 16 -5 8 -27 -70 -8 51 -11 97 3 103 22 -12 75 27 -53 -59 63 36 -46 3
7684 3 8 48 68 19 4 -63 -13 -31 -30 2 64 15 50 -32 30 -40 19 -17 -14 28 -9 -39 46 1 2 -77 -112 -6 25 25 16 -32 -33 95
7718 95 27 10 63 -58 10 73 71 19 -13 -78 -39 -17 -10 74 27 -15 -42 -6 -24 -15 -10 42 2 -38 31 85 2 23 22 -2 2 1 -11
7751 -11 19 -35 -13 66 -1 -1 11 -23 -63 -13 -26 -4 -1 0 -44 -29 -15 -15 20 29 -39 43 10 -51 36 -27 -71 -69 32 -13 30 52 -20
7784 -20 40 -45 -5 -22 -21 -6 23 -2 -16 55 88 86 -32 11 -5 -39 -40 64 -2 9 -48 20 11 40 2 -45 -24 -49 -6 13 4 -29
7816b9nL9m0M7j9oj2l9M9jPj7oK6K1j2MJ9k8j6J6j0K6nK3m6J0MqoM5l0L2l9l2
7851c8O2j5k9k4N3m5rK6l9K4J6NQ6r4M9m1M1l0k1mO0q1RK3j1j0M2J1m7L4pL7k2
7884A1j09J44l1j4Or3R9l4K6l4M0j8kM4j3kRoK4j9j9l1pK3J9K7J0p0mkK2J0K1
7917B7l9N2q0R2o5K6j5jK2n2P3k4Km4lK4L5n2rJ7Jk5J9K8l9L9K2l4l1RN1l0j7
7950b1K4o3J2J5L9R0j16J3pM5Jn8JR7j26N8O8n8m8M7l0O1mPn4NK0q6O0L9oo6K4
7983a7N1m1rj7j1K5K7l9M3n1J9k6K5N4lo1O4o2k1N9k2J5K6j7l4j2LM9J1O2j56
8014f6L3M3m5M5Lk2OlmQk5l8qP7N0m0n8R7m5k4K2k7L9L2p4K0o6J39l1J7L0j11
8046b6K3k2M0k9j1Ll2M1N6q8O4o2K9L8l1J3j3K3o5K0P9n9L3l1J4L1q6Q7Mm2m7
$$ plain form
7816 -29 -34 5 -35 12 -7 -13 -25 -64 -15 -16 -9 -26 -32 -6 15 3 7 26 -2 -18 -2 -12 14 9 32 -14 -4 0 -8 -14 31 1 33 -6 -38
7851 -38 24 9 -20 -44 9 -36 -45 -19 -58 -34 -18 -13 73 -21 28 -13 28 -2 -23 -27 33 -48 -39 -16 -27 -37 5 16 -31 3 -4 33 11
7884 11 -98 46 15 1 7 -86 13 -21 5 -29 11 -7 -9 35 22 20 29 23 47 28 9 -22 -29 -6 13 40 50 -20 -24 -26 -4 6 27
7917 27 -12 40 -40 52 -13 13 -2 -3 19 -33 40 16 18 -26 -29 -5 30 -22 -31 -14 -13 -38 -19 9 -30 9 31 -3 -34 -25 26 -4 -21
7950 -21 3 -60 -48 -33 6 96 -20 -7 -14 31 32 -26 -25 72 -54 4 72 14 -34 13 -17 44 40 47 -7 -2 18 -68 -8 31 25 -41 -17
7983 -17 34 -7 -16 -33 -44 -19 8 -31 12 -39 -20 -46 -21 33 30 -31 33 -29 -50 9 -13 2 28 11 -23 -35 -32 17 28 90 -66
8014 -66 -33 10 -35 10 13 -9 -3 -6 -10 -2 -27 -65 -73 4 54 14 -44 53 8 -16 6 -21 18 50 -24 -4 -70 69 38 55 85 -26
8046 -26 -3 -25 15 -14 -25 -22 -54 -13 43 -45 19 -43 -14 24 -7 6 -7 16 -49 -29 50 -9 24 -7 7 38 -48 39 43 1 -46
8077d6K1J0J43j07L4m0qN7n8K2l7J8k5m3N4J8M3p3o3M6K8M4l0J0L5m6Pn8P1k1
8107Fj4J9J8q5JM9qj3K2m4P4J1Jq3O1j4KR1r9m4L6jj4K6R9k6o3Oj5P1k1l7kk2
8141a2J3P6j14Q6r2j6j3j8O5OQ3n6n9J12K2r6K2J1k1k5O4j5Qj0l9j4L2k8N2n7
8171c3N1n0L3l3P3oj26P2RP9m5m0K8J8m3L9k8J4l9O1
$$ plain form
8077 -46 -25 -15 128 21 55 15 7 64 6 28 -9 9 -16 -59 -5 13 56 -17 -80 -34 -6 38 8 18 53 7 14 -44 27 6
8107 6 -8 11 29 -56 -55 -6 -14 -27 -5 -49 25 36 37 -46 15 1 3 94 -5 -49 -13 -14 -28 -2 97 71 8 14 -1 70 49 12 10 -12
8141 -12 1 77 -37 49 -43 -59 -72 -90 -25 -19 64 8 -51 61 83 -13 9 20 -1 -26 38 23 31 21 -18 -32 0 -28 24 -33
8171 -33 18 -32 1 -32 41 35 -91 -19 -10 69 24 -16 12 30 -13 26 -2 12 -27 34
8191C4
$$ Imaginary data points
##PAGE= N=2
##DATA TABLE= (X++(I..I)), XYDATA
0@%%%%%%%%%%%%%%%%%%%%MqQj0J3j4J4j5J6j7K0k3K4k5K8l2L6l9M1m5N1n7O2o8
44c6P6q5R5j07J24j45J68j98K41l00L86n20P41j154K068m829K6457J30219p2156
63H1045j33784K0481M1055n6149J516J20088K2073j36263n9710R7628N3564n1068
75D76J884N4130m8559r6751L8482J13335n167q0153M696M1429l7815l4350O4751
88A6388M6629o9182n5388N8817N1117m5539l2587M0394P675n0960P691O7255p953
101C4357p7200k008P0658J0472m5584L532K5011l9498l8143N8235O8813l4886
113C3759o7933M677K7399j2457R027N3740j620p9537l4026N7479M5596j2720p973
126A5411K123l9944l7982M3876P1289n657n4791j8338O737o803J5303M8766O111
$$ plain form
0 0 0 0 0 0 0 0 0 0 0 0 0 0 0 0 0 0 0 0 0 0 4 -4 4 -6 7 -7 7 -8 8 -9 11 -12 12 -13 15 -17 19 -20 21 -24 27 -30 32 -36
44 -36 40 -45 50 -57 67 -78 90 -108 133 -167 219 -301 440 -714 1354 -3475 22982 153201 81045
63 81045 -52739 -32258 8797 -47352 -45836 74252 96325 -39938 -99648 -2020 51544 476
75 476 2360 56490 7931 -88820 -50338 62997 57830 -22323 -17627 23802 -14013 -48363 16388
88 16388 63017 -6165 -61553 -2736 48381 2842 -29745 10649 18324 -32636 -24945 42310 34357
101 34357 -42843 -44851 25807 36279 -9305 -5773 19238 -20260 -58403 -168 68645 33759
113 33759 -34174 -29497 -2098 -14555 -5528 48212 46592 -32945 -66971 -9492 36104 23384 15411
126 15411 17534 -22410 -60392 -16516 54773 49116 -5675 -24013 -17276 -24079 -8776 39990 46101
139D6101n8927l5044L1666L2004k410K769O214l1939l7129K4236N2381P11l4871
152d238o689R683j1218k016L1828J2327l7874k6351K6238K6337j0866r468J0251
165G944p756k3177J1270L5118k687l4606n970K2009L813p390J2328N971k8619
178a1752j9563K7934L0610j1738k1598K186Q7j2348J1584L1769l057l8452j2886
191b7224K4063J3426m774O571M182k6328k2979K2951L5130m415k3902l549K401
204d447r343N279K7461N524l1093j9355J6437J7165k060P27N378j3956k0958Q507
218a4734K7465M679j7677o944M357k725q60J3890Q084j5603j5394P758J3736j98
232E834l449K202m426j0457L196J5153K567j1618m880M947J059o03O365K653j0899
$$ plain form
139 46101 -12826 -47870 -16204 15800 13390 16159 22373 -9566 -46695 -22459 29922 30633 -4238
152 -4238 -10927 -1244 -12462 -14478 17350 29677 -8197 -34548 -8310 18027 7161 -2307 7944
165 7944 188 -22989 -11719 23399 20712 -13894 -19864 2145 5958 -1432 10896 16867 -11752
178 -11752 -31315 -3381 27229 15491 -6107 -3921 -3834 -16182 -4598 27171 24114 -14338 -27224
191 -27224 -3161 10265 5491 12062 16244 -10084 -33063 -10112 25018 20603 -3299 -6848 -4447
204 -4447 -13790 -8511 18950 24474 -6619 -25974 -9537 7628 5568 6295 11673 -2283 -23241 -14734
218 -14734 12731 17410 -267 -7211 -2854 -5579 -6439 7451 15535 -68 -15462 -7704 6032 5834
232 5834 2385 4587 161 -10296 -7100 8053 10620 -998 -5878 -931 128 -475 5890 8543 -2356
247b356q505Q120R999k451m718J198k206o042M013J1214n44j1572l642O089K100
262F97q77M227J495r069o481P499Q398k839m555J627j037n422K515R548L57r232
278c149k329N685O29l103L409M118n500o301M721O430l471l977M645K519o291
293a965k540P096K575o833j598O912L16p758L3Q243M14p245K73N790k592o460
309e339M304Q187l807r063J961O785j753m033M328L106p358n587P209P732l889
324B783o346J467J800k907J005P071M71r067m274O304N433j399j411M48l626m414
340f662M381Q790J06p929m125K472K725K383L520o15p719n301M884Q128J513l635
356B916l585l436j339N189Q043J59q870o452K016N504M360K143k680q268n107
$$ plain form
247 -2356 -10861 -2741 7258 4807 89 1287 -919 -6961 -2948 8266 7722 -3850 -7492 -1403 697
262 697 -180 4047 5542 -3527 -10008 -2509 5889 3050 -1505 122 -915 -6337 -3822 5726 6083 -3149
278 -3149 -5478 207 836 -2267 1142 5260 -240 -6541 -1820 4610 1139 -2838 1807 4326 -1965
293 -1965 -4505 2591 5166 -1667 -3265 3647 3963 -3795 -3762 4481 4895 -2350 -2077 3713 1121 -5339
309 -5339 -1035 7152 3345 -5718 -3757 3028 1275 -2758 1570 4676 -2682 -8269 -1060 6672 2783
324 2783 -3563 -2096 -296 -3203 -2198 4873 5344 -3723 -7997 -1693 3740 2341 930 1378 -2248 -6662
340 -6662 -2281 6509 6615 -1314 -5439 -2967 -242 2141 5661 5046 -2673 -7974 -3090 5038 6551 2916
356 2916 -669 -4105 -5444 -255 7788 7947 -923 -7375 -5359 145 4505 6648 3968 -4300 -9407
371i407N479R552K465n354o249l516P55O686P787m68r694p857K260P963N895Q20
387G117m947q600l976O583J0402K856o569q099l384K844Q276P552j804j0720q106
402a0575L303R513O425m89o492q614l096P596J1236K418q239r407k669M743Q745
417D398O594l128j1333q062M168J0681O432k068p765q379j892Q407J1287J700
431A1040r640j0203j690O381R073N671l983j1846p791N312J2055O083l812q818
445b168p460p89R109J1824J332j1271j1128o4Q556Q977L775m639j1287p729N998
460f964J3666O348o198j0572o370J625R374J0522P08j1603j1698L49J0455R592
474I234J813o932j0893n604O651J3074N761o961j1609o323L449J0674R331j325
$$ plain form
371 -9407 -3928 5624 8089 2735 -3514 -7030 -6275 411 8198 7730 -1964 -9821 -7561 402 6297 7117
387 7117 2170 -6430 -10406 -3823 6579 9435 2866 -5233 -8617 -5773 2503 10055 8251 -2469 -10575
402 -10575 -7272 2241 8666 8177 1685 -6929 -10025 -2429 8807 11225 2986 -6421 -9090 -4347 4398
417 4398 10992 7864 -3469 -11531 -7363 3318 9750 7682 -83 -8462 -10354 -1947 9340 11040
431 11040 1400 -8803 -10493 -4112 4961 10632 6649 -5197 -12988 -7676 4379 10462 6650 -2168
445 -2168 -9628 -10417 -1308 10516 11848 577 -10551 -10615 -2059 6918 10693 6054 -5233 -12962 -6964
460 -6964 6702 13050 6852 -3720 -10090 -8465 909 11431 12139 536 -11162 -10813 -358 9234
474 9234 11047 4115 -6778 -12382 -5731 7343 13104 6143 -5466 -11789 -8340 2334 11665 10340
488A0340j2100j0468J431J0693R332J051p708j1245m592Q200J3270M295q088j1122
502f711m921M045J0514Q981j990j2698j0134L479J1718P952q68p610r924l974
516a2141Q528J3706L389j0392j1204j992N817Q737P084k081j2708j0316N092J3846
530E365O637m669q389o969k320P544J2981L406j1942j2793Q5R371Q074L194l319
545F256j0801r338M791J4876P529o934j1056n325J233P291J0483L357j0616j3631
559a1885o89J1444R808J034n627q846o867L420J3044Q710n702j2469n952L629
573f948Q061P694J651q077j1435k101J0008J0407Q31p297q214l519L963R362O179
588A0565l952j0350n965L711Q775N846j980p938o695M76P259P354Q94o979q709
$$ plain form
488 10340 -1760 -12228 -10797 -104 9228 10279 2571 -8674 -13266 -5066 8204 12499 4411 -6711
502 -6711 -11632 -7587 2927 11908 9918 -2780 -12914 -9435 2283 10235 9367 1757 -8167 -12141
516 -12141 -3613 10093 13482 3090 -8114 -10106 -4289 4448 11532 9451 -3257 -13573 -8481 5365
530 5365 12002 7333 -1056 -8025 -10345 -2801 10180 13586 1644 -11149 -11064 -1693 6381 9575 6256
545 6256 -4545 -13883 -9092 5784 13313 6379 -4677 -10002 -8769 -1478 9005 12362 1746 -11885
559 -11885 -12574 -1130 8678 9712 4085 -4761 -11628 -8208 4836 13546 7844 -4625 -10577 -6948
573 -6948 1113 8807 10458 2381 -9054 -11155 -1147 9260 10091 2794 -5420 -8939 -4976 4386 10565
588 10565 6613 -3737 -9702 -5991 2784 8630 6650 -1288 -7983 -7507 -248 7106 8000 1021 -7688
603g688j468P725Q233N04o128o152k681K482Q044P014l765j1754n251O472Q449
618D036K552j259m133q115l933R010J2731n42j1558o335K188K883M071P612O20
633I828j2932j0452P308J3267J480n530j818l196p026K699J4684N276j2824j0572
647i808M925N996j303K625O294n909j3883J469J5195L581r916k893M875l277n443
662g472Q371R960q338j3096M916J1459k827o749M855L328r369l790J2864O863
676A0975j2079q530Q361O134n911l64Q214l105j3338J388J5301K999j1172l071
690d198N561k818n000Q671J0143q459j3845L149J0739p51l637M972Q97j1777m858
705a1211J2752R036p502p239L644N46o270L116J1509q37j2890k829Q841K065m841
$$ plain form
603 -7688 -9156 -1431 6802 7306 1178 -4974 -7655 -5173 2871 9885 6120 -5634 -10885 -4413 4036
618 4036 6588 5329 1196 -6919 -10852 -1842 10889 10347 -1211 -7546 -5358 -2475 1596 9208 9828
633 9828 -3104 -13556 -6248 7019 8499 2969 1151 -2045 -9071 -6372 8312 13588 764 -9808
647 -9808 -4883 1113 -190 2435 8729 2820 -11063 -9594 5601 9182 -734 -3627 1248 -2029 -7472
662 -7472 899 10859 2521 -10575 -5659 5800 2973 -3776 1079 4407 -4962 -8752 4112 10975
676 10975 -1104 -9634 -1273 4861 -1050 -1414 6800 3695 -9643 -8255 7046 10045 -1127 -4198
690 -4198 1363 -1455 -6455 2216 12359 3900 -9945 -6796 3943 3192 -445 4527 5424 -6353 -11211
705 -11211 1541 10577 3075 -4164 -520 26 -6244 -3128 8381 7544 -5346 -8175 666 2731 -2110
720b110K611N445n904q597M876R144k463o493K840L836n122l235O531M028n929
735e42l558N259K155n408j155N559Q49m684K54M126j808m578K247N153j443l886
751a460J053J620k627o80M622J629m415k616K467Q97j577J908K872k907m744J519
767b439M208q15k015K147Q22m271j884M720K640l520j371K935o26m243J157N384
783B829k23m451O33L078k762l172M052M799l205m560J826K203k886N0N830J033
799E074o811l146M498K695k130J084L009l794o318K377P640O21m574p93Q57l077
815b788j188O299M420n202o095J574L536n29L72L292j553o699j023O545L288l486
831G63k203J234j039k193L200M544k245n594N0L962R47j227N84j96l045n53M454
$$ plain form
720 -2110 501 5946 42 -8555 -3679 5465 3002 -3491 -651 3185 -1937 -5172 1359 5387 -542
735 -542 -4100 1159 3314 -2094 -3249 2310 3159 -1525 -1271 2855 1047 -3531 -1284 3869 2426 -1460
751 -1460 -407 1213 -1414 -2094 2528 4157 -258 -2874 -407 490 -1087 821 3693 786 -3958 -2439
767 -2439 1769 954 -1061 1086 1908 -2363 -4247 473 3113 -407 -1778 1157 531 -3712 -2555 2829
783 2829 2606 -1845 -1212 1866 -896 -4068 -16 4783 1578 -2982 -1156 1047 -1839 -1789 4041 5074
799 5074 -1737 -4883 -385 2310 180 1264 4273 479 -5839 -3462 4178 4799 225 -568 289 -2788
815 -2788 -3976 2323 6743 1541 -4554 -2980 556 27 399 3691 2138 -4561 -5584 961 4249 763
831 763 -1440 -206 -1245 -3438 -238 4306 2061 -3533 -3483 479 1426 199 783 587 -2458 -3011 1443
848A443K594l079l273M16J291R11K068J062l455m043J228M624J960j105j854k844
864b056k199K595N858J305m382m219n32J419L015M030Q1n871n180J930N326K768
880C888j29k170m576l362L189P103K026m657m483r38O75K934M967J054o108n909
896f496K032N629K207n99j003l477l989K087P701K524n745m873J062K039J030
911A29L140K107m955o915J923P946K361l920k587n82k231O57O749L848o212p525
927f067J223N696J962P0M29l514o089N77Q653M498m807n721j000O99J623N060
943C292L459n052q261k06O843M149n81j712l173m688J31P821N729l875p293j656
959e073K339K458L439K906l418q079j926P206N985j281l750k311k306m15N598
$$ plain form
848 1443 4037 958 -2315 -1899 -608 303 2371 3433 -22 -4065 -2837 1787 3747 2642 788 -2056
864 -2056 -4255 -1660 4198 5503 1121 -3098 -3630 -2211 804 4834 4915 -956 -6136 -4206 1120 3888
880 3888 3759 1589 -2987 -6349 -3160 3943 5969 1312 -3171 -4109 -3434 -500 4467 5521 -587 -6496
896 -6496 -4464 1165 3372 2773 1770 -1707 -5696 -3609 4092 6616 871 -4002 -2940 -901 129
911 129 3269 5376 421 -6494 -4571 3375 5736 1816 -771 -1353 -3584 -2927 3822 7670 1458 -6067
927 -6067 -4844 852 2814 2884 3313 -201 -6290 -5713 2940 7438 2631 -3090 -4090 -3391 -1768 3292
943 3292 6751 1699 -6562 -6768 75 4224 3643 1931 -1242 -5930 -5799 2022 7751 3876 -3417 -5073
959 -5073 -2734 -276 3163 6069 2651 -5428 -7354 -148 5837 4556 806 -1505 -3811 -4226 1372
974A372O096k318q390l062M087M276J547M59k181o014k546N779P047n76n926l664
990d014N3J689M002L959j697p003l993L629O062K160j951l820l758o93M638N896
1006E159K64n550n028J7L945M379J921k494n626l034K948N908K717k179m799l384
1022d836P95M691M665j17n026m740N3M001M517J272l073n169k241L078N270K234
1038E374k420m607l138J120M766L967r61m909l831N97L844L875O79l216m852j692
1054e404L520N040J481k959m337k082J524M497L356j327m834l373J245M116L255
1069C718L6l247m079r19L330M728J051l297l978j340K020L971K486j423m297k942
1085d182J491M076K718q06l161l284m63L229L857O07l081l763q06K241L326J858
$$ plain form
974 1372 7468 5150 -3240 -6302 -2215 2061 3608 4067 1886 -4128 -6674 -895 6152 5576 -350 -4014
990 -4014 -3961 -2272 1730 5689 3992 -3011 -7004 -3375 2687 4847 2896 -924 -4682 -5375 -737 5159
1006 5159 5423 -127 -5155 -5138 -1193 3186 5107 2613 -3013 -6047 -3099 2809 5526 3347 -1452 -4836
1022 -4836 -4041 650 5315 5198 172 -4568 -4515 -514 4003 5275 2202 -2967 -5208 -2130 3140 5374
1038 5374 2954 -1653 -4791 -3671 1095 5062 4101 -808 -4639 -4042 -198 3677 4356 1140 -3712 -5404
1054 -5404 -1884 3156 4637 1678 -2659 -4741 -3217 1280 4636 3309 -1525 -4898 -3653 463 3718
1069 3718 3754 507 -3572 -4491 -1161 3567 4618 1321 -2657 -3997 -1977 1994 4480 3057 -1240 -4182
1085 -4182 -2691 1385 4103 3297 136 -3148 -3611 -382 3475 4082 1001 -2762 -3568 -1327 1999 3857
1101C857j756l910k191J688L509K034r26k829k778j35L001L466J3l123k816k10
1117c106J999K705J451j458l600j879K066L524J211j331k399j692n8K559L026
1132C018Rl161k647N28K261J945P15j234k791j507J721L188R69j734k112r98L26
1149a504J749K359Pk873k312O71K356J261j39r42j760j336J092K888R01k008k053
1166a643r8P86R24J352L91j917k368N47K461J153q64r42o30o56L25K007J307j492
1184F43k237k6J597Q30O2J52o50j547k12J835J523p99j566k10L58K72N22Q08l41
1203A014j668o33J158J346k96q15k53k49l74N15J159J42j317q83O45P88r6k58
1221g5L08k52q99p3J187N24q38p90N68M48n30k45J007L04j107m79J015N68r82
$$ plain form
1101 3857 2101 -1809 -4000 -2312 1197 3231 2305 -524 -3302 -3437 -436 3030 3043 -80 -2896 -3106
1117 -3106 -1107 1598 3049 1591 -2009 -3888 -1822 1702 2913 1582 -817 -2509 -2567 -8 3018
1132 3018 3027 -134 -2781 -2253 8 1953 2668 1434 -1357 -2864 -1143 2045 3014 1280 -832 -1830 -1504
1149 -1504 245 2604 2611 -262 -2574 -1903 453 1714 1575 633 -1127 -2463 -1371 1517 2418 410 -1643
1166 -1643 -1741 -955 -31 1321 1712 -205 -2573 -2026 435 1588 724 -218 -848 -1504 -1179 828 2135 643
1184 643 -1594 -1620 -23 807 869 1021 371 -1176 -1388 447 1970 1171 -395 -605 -247 25 547 1355 1014
1203 1014 -654 -1287 -129 1217 921 106 -147 -396 -770 -255 904 1046 -271 -1154 -509 279 183 -75
1221 -75 233 -19 -918 -991 196 720 -118 -908 -340 108 -422 -667 340 644 -463 -942 73 641 -341
1240c41l57J259L23j330n05J396M54j142p9J220k17j659K94J972r3j705j2J361
1258H39m05j378J084J830j390k352J022K244q63j528J119R24j910j165K487J648
1274B206k436j855J903J277j810m42K434p2l287l30L618R04l005q15K264k99k207
1291a952J559L107j588l915P09L601o2k239R98J375k532k031L401L338k531l493
1307b255J212K002j225j74K813J71m393j547L905K474k129j363J022q42k186J904
1323f11L930p37m345q35K451N91n62J420O08l213k310K649L496r19k340r1N7j098
1341a859J096L023O3l608j740K252J704k06J74J3k037j647K120L195l97k584r26
1358a364L88K25J220K010m36l295j513K227K187k9l64q24j994j008K528L139p10
$$ plain form
1240 -341 -698 561 884 -446 -951 445 899 -243 -322 898 681 -978 -684 1288 1195 -510 -522 839
1258 839 434 -944 140 1970 580 -1772 -750 1494 631 -897 222 1146 -764 -1929 558 2206
1274 2206 -230 -2085 -182 1095 -715 -1157 1277 1205 -2082 -2412 1206 2110 -895 -1710 554 255 -1952
1291 -1952 -393 2714 1126 -2789 -2080 1521 1459 -780 218 1593 -939 -2970 431 3769 1238 -2255
1307 -2255 -1043 959 -266 -440 2373 2544 -1849 -3396 509 2983 854 -509 513 -329 -2515 -611
1323 -611 3319 2582 -1763 -2598 -147 444 -118 1302 1910 -1303 -3613 -964 2532 1613 -727 -818 -761 -1859
1341 -1859 -763 2260 2323 -1285 -3025 -773 931 725 899 912 -1125 -2772 -652 2543 2146 -438 -1364
1358 -1364 -976 -751 469 2479 2043 -1252 -2765 -538 1649 1620 1256 432 -1562 -2570 -42 3097 2387
1375B387k937j260M32O50J576K100r67l928j600K678K705p5p58r31k179j136K845
1392c98L638o93l584j479Q57Q50J402K154o73m155j877K869L216j33j360p81j590
1409a737j118K457L697l37l918j720J463J431P91J313k92l350k139K674L680k60
1425B635k304j036n03n35J653L157j17l938k357K007K509N43j40o35k510j836
1441c407K203L906L47l147k156J80P89J693K243k80l626k555J679L191J344p53
1457A651j655k146r81K169L501O79k734k770m05J554K346J686q50l050j992J167
1473a830K830J769m36k226k326k15K551K499K0k176j991p02J194K693J494j705
1489A443l135q37J584J950J020k43j939k490J04L078K325j234k435j042N6Q20
$$ plain form
1375 2387 -550 -1810 -1378 -728 848 2948 1981 -1947 -3547 -869 1836 1761 1003 72 -2107 -3243 -398
1392 -398 3240 2547 -1037 -2516 -1659 -809 593 2747 2074 -2081 -3958 -1089 2127 1994 634 -147 -1737
1409 -1737 -2855 -398 3299 2962 -956 -2676 -1213 218 1009 2322 2030 -1320 -3459 -785 2895 2635
1425 2635 331 -705 -1208 -1743 -90 3067 2950 -988 -3345 -1338 1171 1714 1574 939 -1571 -3407
1441 -3407 -1204 2702 3049 -98 -2254 -2074 -1285 408 2651 2371 -1255 -3810 -2131 1060 2404 1651
1457 1651 -4 -2150 -3131 -962 2539 3218 484 -2286 -2691 -1137 1209 2895 2045 -1005 -2997 -1830
1473 -1830 1000 2769 2333 107 -2219 -2434 117 2616 2636 460 -1531 -2233 -1039 1654 3148 1443
1489 1443 -1692 -2529 -945 1005 2025 1782 -157 -2647 -2543 535 2860 1626 -809 -1851 -1795 -975
1505i75K151J746j909l667n59K867K102k26o80j113k171l93L317K992j555l489
1521a562q26J343Q84J272J634j076l957j292L487K970r38j679n12j146r53K421
1537G0L695r04m337j379K312J472r1Q62J36l159k290K810L844o90k975o46M81
1554g89n41O72K938M12l878k389K424K649n00p54K46j142k111J292L776L19l336
1571g12j553J314Q99o8J206Q30k291k568J434L326M15j929p81n7p04N07K399J005
1589B672k497k352R98J843M56j2K03j387k066P64K780R73j751j590k7J80N71J468
1607A226P37j770k119K42J708J079k12m42r85j146L92K012R01j045j489m49M65
1624h95P47R36L42j069j443M0J271J054j11o33q48m78M23J287O45o92j067l53
$$ plain form
1505 -975 1176 2922 1013 -2654 -3213 -346 1756 1530 850 -263 -2434 -2827 490 3482 1927 -1562
1521 -1562 -2388 -1045 -161 1111 2745 1669 -2288 -3580 -93 2877 1939 260 -252 -1398 -2351 70
1537 70 3765 2861 -1476 -2855 -543 929 838 1700 1836 -1323 -3613 -803 3041 2351 -624 -1270 -789
1554 -789 -1330 -658 2280 2692 -1186 -3575 -1151 1498 998 244 490 -652 -2763 -1471 2305 2624 -712
1571 -712 -2265 -951 -52 -120 1086 1916 -375 -2943 -1509 1817 2232 303 -478 -535 -1239 -732 1667 2672
1589 2672 175 -2177 -1179 664 1120 1108 1311 -76 -2142 -1378 1402 2375 624 -966 -993 -813 -242 1226
1607 1226 1963 193 -1926 -1684 24 1103 891 449 -536 -1682 -1290 722 1623 578 -911 -1360 -895
1624 -895 -148 788 1130 61 -1382 -1342 -71 983 872 239 -609 -1087 -664 623 1268 576 -491 -844
1642h44M96Q15N02o7p75q55N7R93O56j13n89p12l10N47R10K71o49p80j29K82O31
1663C37L98j34q71o17L37P00L95j63m39n33k39M30Q26J15p42m70J5K75L71L48
1683C39J02n90o28K44P88J48l19j50jk32l4O34L26m55n49K53L86l4j16K83k8m73
1705a06j76N12K84l21k66L11Rl16K3K88j2k59j12K26m6k25N1L47o7l31m0P9J6
1728a31m5K27L2l44k56J86K81J26j28j29j36j56K49M53P2l56l49M1K60L50K40
1749D87n6o01l29K72N60K40j50m14k75j67N50N95N6o94m60K2L87L93L12k37p04
1770b13n18L98Q06K73l64o37l54N4N09P05J66q99q85R1P47O00Q4m38o63o19M89
1791f68J085M86o03q97l90M17N98P20J41r16j072M7J142Q57n9p83o71l25M48J164
$$ plain form
1642 -844 -348 467 969 902 127 -728 -671 322 978 865 276 -436 -746 -199 711 982 333 -447 -576 -294 337
1663 337 735 601 -270 -887 -550 150 545 382 -57 -590 -829 -399 427 542 -200 -670 -655 -380 -9 339
1683 339 441 -149 -777 -533 255 403 84 -66 -67 -299 -333 301 627 172 -377 -124 262 228 112 395 367 -106
1705 -106 -282 230 514 193 -73 238 247 -69 -46 242 230 -29 -141 85 39 -186 -135 212 145 -186 -226 -147 -131
1728 -131 -176 51 83 -261 -517 -331 -50 76 -52 -181 -317 -473 -224 229 301 -55 -404 -363 -103 247 487
1749 487 431 -170 -499 -227 333 573 423 9 -266 -433 117 712 768 74 -386 -364 23 416 728 491 -213
1770 -213 -731 -333 473 746 382 -255 -609 -555 -46 659 825 -74 -959 -868 -121 479 563 125 -538 -1157 -668
1791 -668 417 903 300 -597 -987 -570 28 748 889 -27 -1099 -1052 90 947 888 105 -566 -891 -443 721
1811G21O27o30j265n12O46J047N41l02q00r70q7J157J183j50j182q70p3O67R71
1830G19N67n99j373p93P47J335N33o09r34p09o5J012J315R9j523j180Q9J250R58
1849H39J07n21j226p65N81J626R78r30j590m26O00R21R57J39j039j651k9J687
1867B58J282k54j126q96l47M58J406J129p75k005p42J074J419L75l16q51j259
1884a170k98J420J763k17j793j121L26Q28Q79O95m28j794j221J141K013M16j035
1901D04j030n92r8R72J734K18j819j611L60J478R49J44n21j352j053Q55K047R03
1919A988j312j555l46N17R66J137K88j548j783K09J932J075k50r98j085n76O41
1936g00J844Q75j271j848l84R56J072P44r6j385j508J43J850J330n79j260r42
$$ plain form
1811 721 1348 718 -547 -1059 -413 634 1175 873 73 -897 -984 173 1356 1206 24 -846 -919 -252 719
1830 719 1286 687 -686 -1479 -732 603 1136 527 -407 -1116 -1181 -169 1146 1245 -278 -1458 -1369 -119 839
1849 839 946 425 -801 -1566 -985 641 1619 689 -901 -1327 -727 194 1151 1290 251 -1400 -1429 258
1867 258 1540 1286 160 -736 -1083 -625 781 1910 1135 -870 -1612 -538 881 1256 940 89 -1170
1884 -1170 -1468 -48 1715 1498 -295 -1416 -1090 -262 617 1312 884 -910 -2131 -990 1023 1439 404
1901 404 -626 -1218 -1316 -344 1390 1608 -211 -1822 -1462 16 965 1109 588 -764 -1817 -962 1085 1988
1919 1988 676 -879 -1225 -708 258 1395 1683 135 -1648 -1439 493 1568 1318 320 -765 -1341 -700
1936 -700 1144 2019 748 -1100 -1484 -528 544 1288 1192 -193 -1701 -1558 292 1622 1043 -217 -1159
1953a159k21P38J521Q32j188j937m27J248J287N32n05j149j187J61J818J300m97
1970A167j575q40Q5R73J285N36j057j704l25J104J394M48o97j154r58L71J619
1987F72J037n13j425q79K64R14J137K73j169j433j88J213J093R7o59j021q40N22
2005i05J466R22q90j444m53N27O82R67K04j111j455N4J570R49l88p26o53m51L21
2024h14J414R18q82j665k25R06P37M46J62p28j330k36J536J317n24j142n19K2
2042f07J78R40R60n07j742n87J058J171K2l24l84q85m60J064J308j54j300o36
2060h85L15M05L40N60j57j093p94O59J206J60o64m20k41q4M58Q13L13j054q20
2079i83L18Q94K89r7l36m15l18K03R53M82o95q81LN81L88K25m3m28o58j49R54
$$ plain form
1953 -1159 -1380 -642 879 1711 523 -1414 -1841 -593 694 1226 721 -428 -1615 -1454 364 1664 1167
1970 1167 -408 -1248 -1163 -190 1095 1631 574 -1130 -1455 -351 1043 1491 794 -360 -1318 -947 672
1987 672 1709 1196 -229 -1108 -844 70 1207 1480 311 -1122 -1310 -97 996 1093 434 -587 -1427 -905
2005 -905 561 1483 593 -851 -1304 -777 -95 872 1076 -35 -1490 -1436 134 1083 695 -31 -684 -1135 -814
2024 -814 600 1518 636 -1029 -1254 -348 389 835 997 269 -1061 -1297 239 1556 1032 -110 -629 -607
2042 -607 -429 511 1471 964 -778 -1365 -307 864 886 562 178 -707 -1167 -103 1205 1051 -249 -885
2060 -885 -570 -165 175 735 578 -515 -1309 -650 556 716 52 -368 -609 -693 -235 578 891 -163 -983
2079 -983 -665 229 518 421 85 -330 -648 -445 508 990 295 -586 -583 -2 386 611 568 140 -518 -667 287
2100B87P06l40q37k62J53K14L82M55j94j050n00P26Q49k4m27k25k01m58L90J030
2120F74J63j119p15O21M78j27R0L42m24r49K77J172J92q96k63M67m3m86N58Q01
2140H13n37j035L55R11j45p33M35N09o44n90R65O11p76p78P57N91p06l09P24J80
2160E98r57j91R57L82j029k93Q15J23p99J49Q50k47j006J29J018j36q46K51O04
2179C72l73p62N91P96o30o84N23N13o00m09P80M39p44m77P79L92p56j75Q48K8
2199D51q35j76R35M8o44J39N95l26p05L47Q92k70o67K36L56l85l44O94M31o03
2219A69o95L98M48k48j17M23j16p20j48P23M07m62m51J91j9j44L17M65k71o71
2239e21o5M90J96n5J5r5l74q9M77M21k00l88o7N2J27L58J86l52m44L7M06K41M4
$$ plain form
2100 287 993 653 -184 -446 -293 -79 303 758 564 -486 -986 -260 589 565 138 -87 -288 -746 -356 674
2120 674 837 -282 -997 -376 102 -25 65 407 -17 -966 -689 483 675 -221 -484 -17 -60 -546 12 813
2140 813 276 -759 -404 507 362 -371 64 573 -71 -661 304 915 139 -639 118 709 3 -306 418 598
2160 598 -359 -550 407 789 -240 -533 282 405 -394 -245 605 358 -648 -519 499 363 -483 -232 372
2179 372 -1 -763 -172 624 -6 -690 -167 346 -254 -663 117 556 -188 -665 114 506 -250 -425 423 451
2199 451 -384 -560 375 423 -221 -82 513 187 -518 -171 721 451 -216 20 376 -9 -353 341 772 169
2219 169 -526 -128 320 72 -45 378 262 -458 -606 117 524 62 -389 -198 -217 -361 -44 421 150 -521
2239 -521 -586 -96 100 45 60 -35 -409 -498 -21 400 200 -188 -255 -203 -76 282 468 116 -328 -291 115 356 400
2262D00j60l03l20K67N47J72l46m31m2O0K64M79O9o45o40J96O18K71q6j97l21
2283a48m75J78P76M22o34n89q7K31K30M03J95n27q91R8Q43N45k40m33k94k27L3
2304e91Q36N66m57q38k31N21M28K19jk44p65j66P88Q56k43p19l81P9K45M78M94
2325H74m04q46l37N68O51J47k14n14m98m5P63P43k03q33n46R6M43N97J38m09p50
2346e79k95N60Q03K25n02p27l42K02P29N96o4r03n42J68O33O31O3n28p50k32O33
2367b21R05J89n52o51l58K26Q24N28j93q47o07K33P35O36l2o67p09j53O61P43
2387F90K59o51p21l79M38P82N01n00p94m86L14P33N23r5p40p05n7P88O69Q9p14
2408e6o04k53N18Q00M44m84r28m07M08Q72L84j72p21n90M5Q08P58Qq03o93n6N91
$$ plain form
2262 400 240 -63 -383 -116 431 603 257 -174 -216 -156 108 587 656 11 -629 -433 185 456 370 173 -148
2283 -148 -623 -445 331 753 119 -470 -557 -326 -96 307 502 -25 -916 -818 25 570 330 -103 -397 -624 -591
2304 -591 245 811 354 -484 -715 -194 234 453 452 208 -557 -723 65 921 678 -41 -422 -343 -98 380 874
2325 874 470 -376 -713 -145 506 653 439 -75 -573 -618 145 888 685 -148 -694 -598 -155 442 580 171 -579
2346 -579 -874 -314 489 714 212 -515 -857 -655 74 670 606 -297 -839 -671 -38 593 656 128 -622 -854 -221
2367 -221 684 873 321 -330 -688 -462 362 890 697 -150 -757 -524 211 847 815 148 -561 -714 -53 690
2387 690 949 298 -423 -802 -364 418 919 419 -375 -861 -547 186 709 614 -126 -831 -888 -100 569 658 -56
2408 -56 -660 -913 -395 405 849 365 -563 -970 -562 310 694 522 -199 -789 -744 64 822 830 27 -666 -722 -131
2430a31P45K38l54r14l76M46Q97L84l99p09m48J25O66O82l1p74p74J9O45P15J47
2451G99o26p32l02M86P87L54m03q31m11L59O86M16j5p33o47M8O59P43Mo77o56
2472f92j97O92O94K67m46p26m26M74P71K99k78o58l33J06O30O56r6p52n82Q1N68
2493E2N53Q9l69o25l61M28P24K64l46o91k63J72N15M91l7o01o90J8P05N12r1n15
2515f6m23j78K94O85K96l52p78k56M39N14K62p2m28n09j01O04O63j62n32l54J
2536d53L05N31J28j60o43l12M61N67K19l28m41k42LN33M97j07n49m90J72M21K86
2557C98M0k13m56k98L14N83O5k41l96k23J91K21L13L0m33m15L8M60K69jl28k76
2579c58j14K59M10R8k14l67k09J79L77K76j18l32k83J43L13K42Jk03l04o0L89
$$ plain form
2430 -131 614 852 498 -416 -792 -346 551 935 536 -173 -621 -496 170 852 821 47 -727 -708 -63 652 799
2451 799 173 -559 -861 -375 412 766 363 -468 -879 -520 166 582 567 -166 -813 -765 -106 637 641 -36 -692
2472 -692 -889 -197 497 764 318 -408 -834 -360 411 710 432 -226 -559 -453 177 833 737 -15 -597 -516 52
2493 52 605 694 325 -300 -661 -233 491 755 409 -282 -545 -373 142 633 596 -5 -695 -677 28 540 449 -66
2515 -66 -489 -667 -373 312 608 256 -522 -778 -339 175 437 365 -63 -572 -673 -69 594 432 -100 -454 -453
2536 -453 -148 383 511 351 -292 -604 -143 424 643 315 -126 -368 -365 168 665 558 9 -481 -309 112 398
2557 398 438 225 -231 -529 -215 368 433 192 -204 -427 -236 -15 298 328 -105 -520 -482 -22 247 246 -82 -358
2579 -358 -472 -213 197 295 81 -286 -495 -316 61 337 219 -113 -396 -253 60 302 303 100 -204 -264 125
2600A25K19rj68k29p1J40J30K82j09l80j53J73K44k5Q1r4l05j14K27L87j03l39
2622i1k13K70o2jJ64R3k83k66K12L10m8k85R4L5j54j3L13J44k84k14J85J99j38
2645c3J6J14k4k77Q0L16K3k06o5K30K9k60P5K49j14k26M9L19j71k49J58K32j59
2668A06k37J30K18j68k18K34J75k35k79K86J49j59j74J14J34l22M3K33R4k40k00
2689c16K30J37j96K8J97q8l88N2N21M4k97j22J50P9j69K39K05k01l98R8L43J20
2711B68j12r3J00k71n3L82L05k84m43J3K62O6J3R5j9m12k27L76M99j33l89j32
2733a89KP1L3M06k4n19m01L41N24j09k07k2j52k91K57N15J90n12m96K94K96M4
2755E1N2J88l38m60J06O65K40m53k50N3O5l9M01L39m88o13K2O85K24j68j56l4
$$ plain form
2600 125 344 335 167 -62 -133 7 137 419 310 -70 -223 -50 194 169 250 156 -149 -263 -36 351 248 -91
2622 -91 -304 -34 -96 -97 67 160 -123 -389 -177 133 85 -200 -106 -71 -225 -238 75 219 -65 -279 -94 105 -33
2645 -33 -17 97 73 -204 -124 192 215 9 -56 174 203 -57 18 267 153 -73 -24 295 124 -125 33 265 106
2668 106 -131 -1 217 49 -169 65 240 5 -274 12 161 2 -172 -58 76 -246 -203 30 124 -116 -316
2689 -316 -86 51 -145 -117 80 -8 -396 -344 177 221 -76 -198 -48 31 -138 101 306 105 -293 -195 148 268
2711 268 156 63 163 -108 -161 221 526 242 -201 -188 74 140 153 248 229 -183 -410 -34 465 332 -57 -189
2733 -189 -187 -116 -83 323 299 -220 -621 -280 244 135 -72 -94 -246 -537 -280 235 425 -87 -583 -289 7 51
2755 51 103 291 -47 -507 -401 264 504 51 -199 -146 -81 -120 281 620 132 -481 -459 226 450 282 126 92
2777I2m16p6P23M62m98o48l8L38J46R3K40k83o83j37P33N22k81m47j08j48j11
2798e25N96N70l49p95k91N13M74o3j5m9m85l50N68Q22l7p01l71J14K81K24M54
2819E85n8p41m66M43O54J33k92k67k94o9L69O00Q2o33n40J74M13K84J04j67n51
2840b37l51L10O52J96l24n44k38J61M44M58p0o83l89N9N30M29L5l58o05k61N28
2861b58N53K93m34n46l07K46O17M10j39o85m11J58O26M32N1m64n93j87M88P31
2881E81O5l60n74j65J54N51M48j80o61m13K03N78L44p1k99o49j00M49O33P2n31
2902G5m38j47K22M73K81j59n70m28K63N99K88k18l83l95l6M34O38L5o26m97J30
2923d59L82L49K38k66n76k61K57O82K97k81n60k70L8M80N19O7n46o21J08N11M65
$$ plain form
2777 92 -324 -400 323 785 287 -361 -399 -61 85 178 418 135 -548 -685 48 570 289 -158 -266 -414 -525
2798 -525 71 641 292 -503 -794 -281 193 130 115 66 -419 -769 -201 621 584 -117 -488 -374 -93 131 585
2819 585 527 -214 -680 -237 417 550 258 -9 -303 -372 -3 597 679 46 -494 -320 93 377 481 314 -237
2840 -237 -588 -278 374 570 246 -298 -536 -375 69 527 457 -226 -615 -556 -26 403 438 80 -525 -786 -258
2861 -258 295 588 154 -392 -699 -453 164 574 435 -250 -661 -503 123 555 606 142 -451 -638 -150 581
2881 581 646 286 -288 -453 -299 252 700 520 -141 -554 -351 227 571 500 201 -448 -548 -99 534 606 75
2902 75 -363 -510 -288 185 466 307 -263 -691 -428 171 459 241 -142 -537 -573 -139 499 534 -92 -589 -459
2923 -459 -77 272 510 244 -332 -593 -336 346 643 362 -198 -468 -430 50 569 636 90 -531 -423 88 553
2944E53j1l17m07k84K14O47L05l65n88l30L49L69L07r3l11n20n5M84M31M1m32
2965a3l97k6K46L54K18k30m27k91K08N02K66j82m77j65m5M10L38O1l83l44k8L58
2987d7M41l9k01l16k35J87N13J96j94m42j45J64K50K62K2l17m66rN31L26n8l49
3009G4k41q3Q7K33L62k17m23k66K79L40R4r9j63l09j15K97L76O3l93k25K3K06
3031a00J48J31k8m03j10J60L12J35j34k12j63O0K27K81l6l06j85M0K51J34J32
3052C34j28k74j05J51K91J06k45j82p9M2J52J71K0k46k28P2K22Q0l7j01j76p1
3074b31O4K39L5k9l11j5J03J54K6N8j36j83k3J78O7L6p5j84Q7J49m0J16l2p1m9
3099f7PJ63RKq9m5PP2N6l9mo5pM5Q2jn8n8J1L4J0L2O3j22o8N8jJ7o2JL2n2j6m0
$$ plain form
2944 553 542 225 -182 -466 -252 395 700 335 -253 -583 -234 135 442 349 38 -482 -537 -53 378 419 -13
2965 -13 -410 -436 -190 164 382 152 -275 -566 -358 144 410 228 -249 -414 -459 -49 289 350 -33 -377 -405 -47
2987 -47 394 355 154 -162 -397 -210 303 499 305 -137 -282 -118 132 394 416 99 -367 -376 155 481 423 74
3009 74 -167 -250 -163 70 432 215 -208 -474 -195 145 239 140 -23 -332 -447 -150 226 289 -104 -329 -306 -100
3031 -100 48 179 151 -252 -362 -202 110 245 111 -101 -264 -204 23 304 268 -38 -223 -183 68 202 334
3052 334 206 -68 -173 -22 269 375 130 -52 -131 -89 63 234 254 8 -220 -148 74 154 117 16 -160 -231
3074 -231 -167 72 107 78 -233 -248 -145 9 35 93 -43 -226 -249 -71 -4 32 -43 -227 -140 9 -31 85 53 -18 -67
3099 -67 -60 103 112 114 25 -20 -13 59 115 76 72 7 0 45 127 126 68 10 21 55 65 97 160 38 -30 28 27 44 -18 -17 15 -37 -53 -93
3133i3Q1k8o3M2J1k9o8MJ13O5j14l8M1L8m0O9jPj26K6J82L0o1p3Rn8J02N2R0n8
3163A12j56k5J37R3j8Mj71j5M4Q9Q6k7p8j39j2R1J14L2j22j95l6J85J25K5n0k15
3189a22j16P9K10J30j70j18k19N3K58J15K8j85j92n2K30J72L5j29j96r0J98K73
3211A92jj13j21j35pK66K52j07k64j09N5J34J62L5q0k90j23K57K72L1j51k35n4
3234a34L3J97J66%l93j85R4K91J17Nk07k39q5J72L58M5k04l69j8J99J60K35l5
3257B03l90k50J35L84K67k10j41k80l4K10M53Q2m34k35j02L96J60P5p0k79k38
3278b98R3M33J88j66l26j17L3K26J98J92l48m12m5L57K76%k50j74j27L1L25L38
3300D27j52m84j80J78K20J83L6j63l90j73L66M76J7l83l18j6K33K24J92l8l72
$$ plain form
3133 -93 -12 -40 -103 -61 -50 -79 -147 -143 -30 35 -79 -117 -76 -38 -78 -9 -10 -3 -129 -103 79 109 48 -25 -16 -74 28 80 170 112
3163 112 -44 -69 68 161 143 147 -24 -39 5 94 180 153 75 -64 -76 15 129 161 39 -156 -192 -7 118 143 93 -122
3189 -122 -238 -159 51 181 11 -107 -326 -273 -15 100 128 -57 -249 -301 -71 101 136 7 -189 -279 -81 192
3211 192 191 78 -43 -178 -185 81 333 226 -38 -147 -92 42 204 239 159 -131 -254 3 275 306 155 -80 -134
3234 -134 -101 96 262 262 -131 -316 -222 69 186 191 -16 -255 -340 -168 190 235 31 -338 -356 -157 3 238 203
3257 203 -187 -437 -302 82 349 139 -2 -282 -316 -106 347 429 -5 -240 -342 54 214 289 219 -60 -298
3278 -298 -205 228 416 250 -76 -193 -160 66 264 456 108 -304 -349 8 284 284 34 -140 -267 -236 89 427
3300 427 275 -209 -389 -211 9 192 228 65 -325 -498 -132 344 361 -22 -340 -356 -123 101 293 255 -117
3321a17l68K29M45J94j54k02k42j89L28L90J78l40m84PL43K72N6j35k39l45J52
3342b21M72K56k79l42j95J27J20L39J02l27m89N1M15K21m6k15k72j50N2M71M02
3363D92l49m39j54K32K56K04K6k67n00m5N12M14j19l16j51r6J52K81L19j68m97
3384b13j93K36M15Q5p9j96k30j65L67M19k5l79l80O0L23K01Q7j52l81j53J62M44
3406B53J17k06l04r9J3K47K66Ql27l83P8L30K05J9k83k62j41K36M23J51k26l96
3428b81m9J40K60J73kk82k96P6L31K48l9j79k79j26K39L61J78l98j96j31K06K76
3450B30J01o1k84k65J22K44K06L1l62j95rK40K19J29k90k67j63K22K85Q0j61k04
3472a52j35J27J84J89p5k58j48lK36J91K9j66j74q8J83K06M6j36j84j45J43K32
$$ plain form
3321 -117 -485 -256 189 383 229 27 -215 -404 -76 314 492 152 -332 -325 18 290 346 211 -28 -373 -221
3342 -221 251 507 228 -114 -309 -182 -62 277 379 52 -437 -386 29 250 204 -11 -283 -433 -381 90 492
3363 492 143 -296 -450 -218 38 242 268 1 -499 -544 -32 382 263 -53 -204 -300 -148 133 452 284 -213
3384 -213 -406 -170 245 330 251 55 -175 -340 27 446 421 42 -338 -278 45 246 333 181 -200 -353 -191 253
3406 253 370 164 -140 -239 -226 21 287 295 -32 -415 -337 -7 198 217 -66 -328 -469 -233 190 341 115 -281
3428 -281 -330 -190 70 243 241 -41 -337 -261 70 318 279 100 -179 -305 -66 295 473 75 -121 -252 -46 230
3450 230 331 270 -14 -279 -157 87 293 324 -38 -233 -242 -2 217 346 56 -211 -374 -152 133 213 52 -152
3472 -152 -287 -160 24 213 138 -120 -268 -271 -35 156 185 19 -155 -243 -60 146 192 56 -128 -273 -130 102
3494A02R2r6j12j92O0J64K58J7k21k45Q7J61J40j1m0k16j40J09J60J48j47j19
3516d1j22Q2Q6J68n4p9j97j00K20J15nj17j32J8%J71J07m5k69K0P7J11j2K0k9
3541gr1l9J08R3M0j10r7M3K4P5Q0K6r1j82R4J73n0k4m9J7o0qJ34Q1j94n3K7J67
3569A27m9PJ1k0j20kJ09Oo3m8RP6j38N8Q8j38k2j4J53L7j01l7Q1l0r3NN4J15j30
3598f9OR0o1PQ9K0n7q2j5J31J6q2KJ15l5p3O8Q0j05K2L0l1nn5Q1Q3r4j15Q9o3
3628a3O6n3N2m0j27jJ21N5K3j56P1l7o8K8R9k9j43qJ28P5Op4K2j04N1L9L8M8q0
3657a1j00O7KJ29J5m2m6j50J93Q1N5j15Qr6K6O8P1L7j49j36J23NJ44j3j17j40
3683i1j3P1J45M2j61m0j10R4J48lJ8j79j41M1K06Q6n0j05q8l5J11J63j2n5k04
$$ plain form
3494 102 194 98 -14 -206 -146 18 276 293 72 -173 -86 75 215 204 164 -52 -192 -83 77 225 78 -41
3516 -41 -163 -81 5 173 119 40 -157 -257 -37 78 73 -44 -176 -158 -158 13 120 75 -194 -174 -97 14 2 22 -7
3541 -7 -98 -137 -29 64 104 -6 -103 -60 -36 39 119 145 54 -128 -34 139 89 65 16 33 -27 -35 99 180 -14 -67 -40 127
3569 127 78 85 96 76 -44 -46 63 69 6 -42 -33 43 -95 -37 51 -87 -109 -123 30 67 -34 -71 10 -20 -113 -108 -54 61 -69
3598 -69 -63 27 -34 -27 62 82 25 -57 -72 59 75 -7 -5 110 75 2 70 150 45 67 97 66 61 6 87 170 76 -39 50 -13
3628 -13 53 0 52 12 -115 -116 5 60 83 -73 -2 -39 -107 -79 20 -9 -152 -160 -32 43 49 -25 -3 -107 -56 -17 21 69 -11
3657 -11 -111 -44 -42 87 102 60 14 -136 57 138 193 78 86 -10 16 84 155 192 43 -93 30 35 179 166 49 -91
3683 -91 -104 -33 112 154 -7 -47 -157 -63 85 82 100 -79 -220 -179 27 113 63 -42 -130 -165 -54 109 97 42 -162
3708a62l1R7J70K5o2j07j58J28K10O4l1j48q1o3J87J23J0n8j98k0N5K12N1l6k20
3733d3p1J4K18J20r9j44j18K8J04J42L3j61j80o1J87J51N7j38r9j32J2K44O4j06
3757B2k08o3Q7J16J66l1j71r4J0J56O4Q8j14j48l1P5J49J10q1j52j8k1J93J25
3781B29n0j07j33o1J43K17l0j72o8q1N7K29l2l1j66j08R3R7K21j32j46j56RJ27
3805e1J50M3k37j21oQ2K87k0j85p1j34J29J50J38q1k01k1PJ33J25K5k00j52O8
3829a43J27K24j4j40j44m6J62P7J59j61j85%O6P1J57o7j18j09n6J95J15l2j11
3852B7j84L3J61J09j2q5j46j32J31J68J12j23j60j13O4K26P2p3q8k18K0K09J34
3875A32k4j67o5r7J40J36O1q0j05q9Q3K30Nn1j35l0l3J23J03J6j39j58R3P8O6
$$ plain form
3708 -162 -193 -96 74 99 37 -70 -228 -100 110 174 143 -5 -86 -149 38 161 171 113 -85 -105 -50 162 213 177 -43
3733 -43 -114 -100 118 238 139 -5 -123 -95 9 151 184 23 -157 -218 -31 120 177 39 -60 -192 -180 64 128 22
3757 22 -186 -249 -162 -46 120 89 -82 -176 -166 -10 54 142 28 -120 -151 -76 73 183 102 -50 -68 -89 104 229
3781 229 179 72 -61 -122 21 238 208 36 -32 -113 -56 173 141 110 -56 -164 -71 26 247 115 -31 -187 -178 -51
3805 -51 99 142 -95 -216 -222 -140 147 127 -58 -129 -263 -134 16 154 73 -128 -149 -142 -9 116 141 -59 -211 -143
3829 -143 -16 208 194 54 -90 -136 26 103 262 101 -84 -84 -18 53 210 143 25 -84 -140 55 170 138 27
3852 27 -157 -124 37 146 134 49 -97 -229 -98 70 182 59 -101 -214 -150 76 148 75 -13 -231 -211 -2 132
3875 132 108 -59 -124 -221 -81 55 116 36 -69 -158 -75 155 160 109 -26 -56 -89 34 137 153 14 -144 -51 27 93
3900I3P0nj83q2J37R5M3p2j32k8J2J16M3M2j83j16R8Q6J8K5p8j53L2J02J10O5
3926A55j69j24PK8Q6M2M3j32j02O7J01Q9l5p0j33M4N7R7Q6q8j19K6R6K9K1J4j06
3953A0k1NR8Q9q5j04K1KJ5P4k1n3n8l0kJ31Nn9m3l2m0O5J10J8j99m1Q2OJ41m7
3983C7p8n8o7J72O0L1j05o8O9rj5O4K2o9Nk2J2Q0j0Lp3L4m1J07j5j0p7K4N9L5
4013I7Rq8l6L1K8L4m8nj19L7R4pkQk1o9m9J72n2m2llql%m5J08m1pm6P4r2P8J7
4047Am2jK9k6j6L2J3k0k0N6K6j4k3N4J2q2M2K5J9j9l1k0L6PP9m1p2N5k8j2k9l0
4079d0O9m3j0jL4jK7om9l2nO5L2n8p0K0O3n6N0k6kK5k5k9J9L7pj4j1L9J9N0l9
4112B5p4L9M9O3o2K5o0pN0j7L4o2N7j14O8K0m0J04r6omJ0K3m2Ok4K3K3M3o1rr
$$ plain form
3900 93 163 158 -25 -107 30 125 168 96 -36 -64 -52 64 107 149 -34 -150 -52 34 52 77 -1 -154 -122 -20 90 155
3926 155 -14 -138 -131 -103 -17 25 68 -64 -166 -99 2 91 56 -14 -147 -103 -46 51 137 49 -70 -44 52 81 102 116 10
3953 10 -11 -6 92 181 96 -8 13 15 30 104 83 30 -28 -58 -60 71 76 17 -26 -58 -98 -33 77 95 -104 -145 -63 -57 84 37
3983 37 -41 -99 -166 6 66 97 -8 -76 -7 -16 -31 33 55 -14 -9 -31 -19 61 51 54 -19 15 -26 81 66 56 -21 3 62 97
4013 97 106 18 -18 13 41 75 27 22 -97 -60 34 27 25 33 12 -57 -106 66 14 -28 -31 -34 -42 -45 -45 -90 18 -23 -30 -76 -2 -94 -16 1
4047 1 -41 -42 -13 -39 -55 -23 -10 -30 -50 6 32 18 -5 49 61 -21 21 46 65 46 15 -5 31 38 117 76 4 59 31 19 -10 -40
4079 -40 29 -14 -24 -25 9 8 35 29 -20 -52 -57 8 40 -18 -88 -68 -5 -61 -11 -37 -39 -14 -39 -68 -49 -12 -19 -33 -44 -5 14 64 25
4112 25 -49 -10 39 102 40 65 5 -2 48 31 65 3 60 -54 14 34 -6 98 2 -4 -8 2 25 -17 -11 -35 -12 11 54 -7 -16 -25
4144b5k2j8L0K2mpr5P1jO5K0r7j1J8L7J0J7n1Nk2P1M5ln1Ok0l2K2O2K2m7l4j8
4177c5R6%rk0l1j8M7N8J8o9j6n4J7Q9K3n1k5m0k6O5RM5j32k4J6kP5P0r5n8m6L0
4209i3Q4O5q0k1l0RN3P5J5j60Q5K0k0M9O9j26K2qK5R9m4j31N1j2N5K8N1o7j05
4238d2j2Q6LL1J0n1l3m4L2J17o4p4L0o6J7J30p2j2l8p5M4Q7j4qKj10M7P4nll1
4269d4Om9R6J0P8n8r9LL9N5N1n2j38J05K6kO6l3n0nm2J35rK0n4o0p3P0R3k3n7
4300Ep5J7R8L6k8k1j29l4M6Q7K7k1n5l3o6J07R3k4j14jl0P4K2LN4j25J2K1J29
4329G5l0k0o6l9l2J91N4m8m2r6LM9M5Q9j23o5L3M1P2J2m3j01O1%L0N4m2n2n8O
4359d2P2K6qk7mn9J08o2O6o5j61P6j9J02K4Kj29p8Q1J06N2j8n7o1m3Q7N9Kk9j30
$$ plain form
4144 -25 -47 -65 -35 -13 -17 -24 -119 -48 -49 16 36 -61 -72 -54 -17 -7 10 -41 -36 -58 13 58 55 4 10 -10 -42 -20 42 64 17 -17 -35
4177 -35 61 61 52 32 1 -17 30 88 106 37 21 -33 -16 73 96 45 20 -20 -46 19 28 73 -59 -83 -67 -69 6 76 -19 -77 -123 -93
4209 -93 -9 56 -24 -45 -75 -66 -13 62 77 -83 2 22 2 51 120 -6 16 8 33 132 88 -43 8 -4 51 79 130 63 -42
4238 -42 -54 32 35 66 76 25 -8 -52 -20 97 33 -41 -11 -77 -60 70 -2 -14 -52 -127 -83 4 -10 -18 -16 -126 -79 -5 -10 -13 -44
4269 -44 -38 -87 9 19 97 39 -60 -57 -18 37 88 36 -102 3 29 27 93 60 10 5 -37 98 89 109 55 -5 -78 -8 85 62 5
4300 5 -70 -53 45 81 53 32 -97 -131 -85 2 29 8 -47 -80 -146 -39 54 30 -84 -85 -115 -41 -19 -16 38 -87 -75 -54 75
4329 75 45 25 -41 -80 -112 79 133 85 43 -53 -50 -1 44 133 10 -55 -22 19 91 103 60 -41 20 20 50 104 62 10 -48 -42
4359 -42 30 56 48 21 17 -42 66 4 70 5 -156 -80 -99 3 27 29 -100 -178 -97 9 61 43 -14 -75 -118 -31 28 30 1 -129
4389a29M4J00J01m6L4p9q3N3O4L3l0p1j6J8P3Q0n1o1r7Q1Q9n1L3j3j31L3pJ09
4417H0L3q4j7r2J1K6M0K0l3p5P4k2O4l4n4l1oN1R8l4rq3o4J11L1J6Rpj51J33%
4448AQ1j8Nq8j0K1J30j9r4N8l5M1J4Mrr6o7Q2Q1m8P8k9q4m4K4J28p1Rj28L5L6
4479a2J5L7Mj29Q1l2M5l0Rl0n3J4J6P5K0m6o1J2k0O3L5O0o3Rq3J50o6o2L7MjQ5
4511H3m6L1K4q7L3M3k5Nj7k0j5K2m8Q6p1Njo6J00l9k1Q1j8q9P1q4R7q4j9p3P1
4542g1oN8j1lQj9nJ07j07NlK4k8kN5l5O5o6PK0N6m8R3j2q8n6O4N9J2l4j0L6p8
4575a3P1K5m2m0jL7op5R8k6r2K1K1M0k9K3r9K0P6o4Q2n2No6k1J1O2L8L8m4q8O3
4607b7J0J11o4j16L0k5N6J05l8om6p3M5J13Rjp2Mk5K3J06m0o7k2k8R7M5o5l6j2
$$ plain form
4389 -129 -85 15 116 70 104 25 -58 -5 59 92 62 -9 -25 -7 66 146 95 34 -63 18 107 56 89 76 -55 -22 -29 80
4417 80 113 29 12 -80 -69 -43 -3 17 -16 -91 -17 -39 25 -9 -63 -94 -100 -49 49 15 6 -77 -141 -30 1 17 26 19 -132 1 1
4448 1 82 64 69 -19 -29 -8 122 103 9 67 32 73 87 91 82 -14 -81 1 82 34 112 83 -1 -45 -21 107 36 45 -83 -48 -12
4479 -12 3 40 44 -85 -4 -36 9 -21 -12 -42 -95 -81 -65 10 30 -16 -77 -65 -85 -22 13 73 10 19 -64 86 20 -42 -5 -1 -2 83
4511 83 37 68 92 5 38 81 56 61 44 24 9 31 -17 69 -2 3 2 -64 36 -3 -24 57 39 -50 21 -63 34 -50 -69 -142 -71
4542 -71 -77 -19 -30 -33 -25 -44 -49 58 -49 -44 -47 -23 -51 -53 2 -33 32 -34 -27 -7 49 1 94 82 -6 -62 2 61 73 39 29 65 -13
4575 -13 58 83 41 1 0 37 31 -44 54 28 -64 -43 -22 18 -11 12 -87 -67 9 -55 27 -25 -20 -86 -107 -96 -34 4 42 -2 -90 -27
4607 -27 -17 94 30 -86 -56 -81 -25 80 42 36 -10 -83 -38 75 84 83 11 15 -10 13 119 79 12 -10 -38 59 104 39 3 -9
4637in5O1P9l1k9p2j9L0R3K2m7j22pO4J4O4j9j14QN2l7O1K8k0r4nmJ30Q3j16j6
4668b7j2jJ02L2o1m7n4j2R1O8K4q3q6O0O5J1O2j0j78j5P4N2J1L9j03p8K7J03j1
4697D3j9j33RL5L6P8k4j4j14m0N6J71No9Jj44%J29P4j2j31q4R5K8R2J8j11j4j80
4726b19J72J49lq7m7m6M4N7J32k1j30j11O7M8J02K9r7q9j1Q1J42l8r0m1j32J40
4752AK7R3o4l6j48O7R6M2L5j29o9o2M5K61o4p0j83O9L6O8M6j0q7r4l8J96Q7j4
4780A01j50p2K7P7R0J09j57j35JJ18J20j18j6m7l7O7J16R0o6k03L9p2K40n0J33
4805B05j63j11j5J05Q8O8j52j17j2O4R9J5j4p6q1j5J15J05j08n5r9K7Q2R7N0j40
4831c8q9L4M9J51r4N7p6j4q3J17R8k6o9p0l1J17O9J2j09m8J3M1J10j8m6o3m6K2
$$ plain form
4637 -9 -64 -3 76 45 16 -56 -75 -45 48 70 23 -99 -106 -42 -28 36 17 -97 -89 -37 -74 -13 15 -5 -99 -104 -108 22 105 -11 -27
4668 -27 -39 -40 62 94 33 -14 -68 -80 11 79 103 20 -66 -6 59 70 132 122 -56 -71 3 55 66 105 2 -76 -49 54 43
4697 43 24 -109 -100 -65 -29 49 25 11 -103 -143 -87 84 89 20 21 -123 -123 6 80 68 -63 -147 -52 -24 68 86 -25 -39 -219
4726 -219 -47 102 99 12 -35 -81 -37 20 152 131 1 -110 -43 5 107 136 39 -50 -61 20 162 124 34 -7 -139 1
4752 1 28 121 57 21 -127 -60 36 78 113 -16 -85 -147 -102 159 95 25 -158 -89 -53 15 61 51 -36 -130 -168 28 115 101
4780 101 -49 -121 -94 -17 73 182 25 -110 -109 9 129 11 -5 -52 -89 -22 94 184 118 -85 -46 -118 122 72 205
4805 205 42 -69 -84 21 109 177 25 -92 -104 -40 59 74 60 -16 -97 -112 3 108 0 -55 -154 -127 -45 52 102 -38
4831 -38 -127 -93 -44 107 13 70 -6 -20 -103 14 112 86 17 -53 -84 33 102 114 5 -43 -30 11 121 103 57 -6 -52 -30
4859c0R3R0o2j42r4P9J19K9R4k51L0o5J03O2j0p4p4K2J5J0M8Q1p4j91J40P4k5
4886cJ33j27q6p4J24J25Jo8j13L1K9L6N4nn4j31N5J22R7p3j07m7J5Q8O6qn8j28
4914a06M4P1J3J14j02m3l9J6M6J42j14p3Oo1J17KM4j15j09P9Q9%K6k8n9l2MJ07
4942C9K0m3j11J8J4L9P2l5J1q8M2L5pnM0q3Pj7Q7lJ5J0q2O6q1R0j8j9j7MN5N0
4974A05o0K8q6l8QK0M3K8j51L0N7k8Q4Rn5p9K7P8jo3J3OJ1n2R0oN2o8K0j2K6K4
5006F0m0k3J1o6P3Oj7P5k2l5n7K4N0J6k9r5O2N0o4L8J1k7No1J01oLM0k9Jr5Q3
5038D3oRl1J2o6K2jj3P1o3n4K6N9j2j1p3K1K8J1K7%J5Qr3L9N8P6m6p4k1O3OL8
5071F8m9k7j0j8P6N4j9r4J9L5p9J12j6m6l6L3J6oL8J6o1l7r8R4J02m0l2m1J3l3
$$ plain form
4859 -30 63 153 91 -51 -145 -66 53 82 176 -75 -45 -110 -7 55 45 -29 -103 -81 -66 -56 -8 73 -1 -192 -52 22 -3
4886 -3 130 3 -83 -157 -33 92 93 25 -88 -57 -28 8 62 57 3 -128 -73 49 146 73 -34 -81 -66 22 88 80 22 -106
4914 -106 -62 9 22 136 34 -9 -48 -32 14 156 42 -31 -25 -86 31 33 77 -38 -147 -68 21 21 47 19 -40 -72 -68 39
4942 39 59 16 -95 -77 -63 -24 48 13 24 -64 -22 13 6 1 41 -42 -35 -52 35 32 47 57 -25 41 -40 50 32 13 -4 0 55 105
4974 105 45 73 -13 -51 -43 -23 20 48 -103 -73 -16 -44 40 49 -6 -85 -58 20 19 -44 -31 -25 -14 -66 24 18 70 2 22 10 36 60
5006 60 20 -3 8 -58 15 21 4 79 57 22 -35 -11 39 55 26 -69 -7 43 -21 17 28 1 6 -55 46 40 43 83 54 55 -40 43
5038 43 37 46 15 27 -39 -17 -18 -31 40 -23 -77 -51 8 -4 -15 -88 -67 -39 -28 -1 -1 14 22 -71 -32 26 102 56 -18 -39 24 30 68
5071 68 19 -8 -18 -36 40 94 75 -19 0 35 -44 68 52 6 -30 3 19 13 51 67 6 -31 -129 -35 67 27 -5 -46 -33 -66
5101f6O8L8m1l7j22Q8J3R3Rr2n0k7P7J12Q4j88l6N6QN4OJ4j13qP7K6O2m7r4p9
5131a15O6P4J14j7p1j00m0N0N8J26n2j38o6P2R6P1j46N5j71m9K03P8jj22n4o6
5157a45P8J63o2m6j25n2Q1J18J51j46l8p8k2J32N7J2j15l6q2J10J78m5k1j13o
5182e2L8J46kr0n4m8L4N6J70n6j36j10K1Q5R9O9j35j43k1J00J35K3j34o5r1R9
5208f2Q7J42p1j03j36K4J47J6J09j31j49p2J98L1J12j30j50J3J8J02J29n4j40
5231g0r9M4K16J3jj36k6p6J72O8j2J6k01M3l6J71J18j39q2n1K0K02j2kq7j83L7
5258i3R4J31o3j4q9j04J22N1P3j00j19PO7N3Q6p6l7j46L0O4P8P1q2j73j6J30J38
5285H3N9o0n1j55M8R4J07j8l8k36J13J05J18j4j57j8n4J08J31j7j09j20J2M1J53
$$ plain form
5101 -66 2 40 -1 -38 -160 -72 -59 34 43 -49 -99 -126 -49 63 147 -41 -77 -21 -13 41 47 61 -52 -60 17 43 105 58 -36 -115
5131 -115 -49 25 139 122 51 -49 -89 -39 19 145 93 -45 -111 -39 57 128 -18 37 -134 -183 20 98 97 -25 -79 -145
5157 -145 -67 96 34 -12 -137 -189 -108 10 161 15 -23 -101 -123 9 66 78 -37 -73 -155 -45 133 88 67 -46 -52
5182 -52 -14 132 130 40 -14 -62 -28 28 198 142 6 -104 -83 2 101 170 35 -108 -129 -29 106 129 -5 -70 -161 -62
5208 -62 25 167 96 -7 -143 -119 28 44 153 22 -127 -199 -1 30 142 12 -138 -125 -107 -5 124 70 -70
5231 -70 -169 -125 91 104 103 -33 -59 -135 37 105 93 109 -92 -49 -85 86 204 65 -17 -68 -48 154 142 140 53 -130 -93
5258 -93 1 132 69 55 -34 -138 -16 35 108 8 -111 -104 -37 16 102 26 -11 -157 -127 -63 15 86 4 -169 -185 -55 83
5285 83 142 82 31 -124 -76 18 125 107 69 -167 -54 51 169 155 -2 -20 -74 34 165 148 39 -81 -69 -28 125
5310A25K6lj87n7J17j7Q5K7j24r4K6P5K6J04q4j47L1r6K52N2r6r5p3Q4J8Q9n8
5337Fpj65JJ80J16K0j24j26P0k7J33P1q4j45l8L8J13K6oRj36n0J43J04k9r8q6
5364i1j0O2J01N6mj50j18J26J63k3p2j2p4j2L7J53o1j19n8kR2j8J9K6k5j53O2
5391a05Q9N6J4j11j4J7N3R0Lr5n4k9J33J6k0K6j12L8j0MR5l9m5l2P8J8JK3p2J
5421A7r7J29j0jk5l9L6l4P0n0N7q2m9L9N7k6M8p1mJ9k2Q2k5j2l7k0L7l9j3R4K4
5452E3j35LQ8MNKl4n8R9K0Jm0k1j8L7qK8K6m8o6PK1M7Q1n6k5j5kjN5K8p8j8K9
5486A1L4k2K5r6Q9j10K5j4J18m4j46R1K7j6J0M4n5k7r4J48J35j66j6P8Jm7K9K9
5514D1Oj13KK3N7L3jj8m8l5Q9L4o6K0j0q9NJ18lK7jm8q0P0M2kj3l1j30O1J29k2
$$ plain form
5310 125 151 148 -39 -96 21 4 89 116 -8 -102 -76 -1 25 129 45 -102 -71 -167 85 137 41 -54 -127 -43 -25 64 6
5337 6 -1 -166 -165 15 131 151 27 -99 -29 -56 77 148 64 -81 -119 -81 32 58 52 61 -75 -125 18 122 93 -5 -91
5364 -91 -101 -39 62 118 114 -36 -154 -28 135 112 40 28 -46 -58 -21 132 71 -48 -106 -108 -16 -34 -15 11 -14 -167 -105
5391 -105 -16 40 54 -57 -71 -54 -1 89 92 -3 -57 -86 47 63 43 69 -43 -5 -15 -11 84 45 0 -32 46 64 65 88 16 17
5421 17 -80 49 39 38 13 -26 10 -24 46 -4 53 -29 -78 -39 18 -8 40 -31 -35 -16 -38 44 19 7 -30 -50 -13 -52 -65 29 53
5452 53 -82 -79 9 13 18 20 -14 -72 27 47 48 8 -13 -31 6 -2 26 52 4 -62 -55 -34 13 94 38 13 -2 -4 -5 50 78 0 -18 11
5486 11 45 23 48 -48 41 -69 -44 -58 60 16 -130 -39 -12 -28 -18 26 -29 -56 -150 -2 133 -33 -49 29 30 -17 12 41
5514 41 47 -66 -64 -41 16 49 48 30 -18 -53 36 70 4 24 14 -75 -70 48 45 72 71 23 -57 13 55 53 40 9 -121 -60 69 47
5546D7n9o4K0k5J5J61k1j18qLNL2MK6m6j53J23J08Q7j36p3O3q3P7P0Ql0j01L8
5575c0K9O3Pk8k9o7J4R8Q7q8o6lJk8R7P8j36p5J2N0N9M7j0j00j19M3J03O2p9J8
5605A0Rm1L0R9p8J4j13n3O8R4rj2k5n2m0J29R3j08p9mrO3N6N3n6j68J2J98M3p1
5635E3q7jn9N2J23L3m7j28M5mJ11lj8o1q6l0J58P7l3j12p7L9L3k2J36l3j14p8
5663a33O7J15K8J4r1j59P1L5P5O8j75l0J26mn6J14k7q4l5L7J18j6l1n1p4J4O6
5690a8J04j5m0j26J4Q8L9L9o3J0r0l0J27L2l9o8lJ3J29m8L3j56l0O8PJ18n1k3
5718B1q2oj7R9O6m6p4o9R5J4P8p2p4n5P3O1L6Joj37k7J72P2Mj24q7L1K4R1L2j0
5749H4j11oJ9P5%N9j08m5jQN0L2l5m2k3k1Q2L2K2j06p2N2Q9K4o1R1j31m3oJ67
$$ plain form
5546 47 -12 -76 -56 -81 -66 95 74 -44 -52 -49 -44 -12 -8 18 -28 -181 -58 50 137 1 -72 -9 -92 -15 55 63 33 -68 -30
5575 -30 -1 62 69 41 12 -55 -41 57 144 56 -10 -13 -12 -40 57 135 -1 -76 -64 -14 45 92 82 -18 -137 -94 9 71 -8 10
5605 10 19 -22 8 107 29 43 -70 -123 -55 39 30 18 -7 -59 -99 30 123 15 -64 -68 -77 -14 42 95 39 -129 -117 81 124 53
5635 53 -34 -35 -94 -42 81 114 67 -61 -16 -20 91 88 70 9 -77 -107 51 128 95 -17 -94 -55 -22 -44 92 59 -55 -133
5663 -133 -66 49 77 91 0 -159 -88 -53 22 90 -85 -115 11 7 -49 65 38 -46 -81 -44 74 58 27 -24 -98 -84 -18
5690 -18 86 71 31 -95 -81 7 46 85 22 32 -58 -88 39 71 32 -36 -39 -26 103 55 88 -68 -98 -30 -23 95 44 21
5718 21 -61 -67 -84 15 81 35 -39 -108 -13 1 79 7 -67 -122 -49 12 48 49 43 -94 -121 51 123 127 3 -84 -53 -29 62 94 84
5749 84 -27 -33 -14 61 61 120 12 -33 -34 -26 24 56 21 -21 -44 -65 17 49 71 -35 -107 -55 34 58 -3 88 -43 -86 -92 75
5779G5l3m7r3L5L9M2L0J4j09n2O0N3J00r9pj08K8R3jL0n4q0P7J6L7j9K6q2n0J07
5809B8Q5k1K2j18m3l2J22m7L9k5l1j2RO4L4q5no1P8qQ1j06k8j3P7m6R2N7j70p
5839g0l2R9j6N0N2j22p7J3Q2JL7N0j60O3M2K8K2l9l6J0oN6k0M6l3p5mN9J01o8
5869E3j0m4MN2o1L2L7p8M6n1P3j0k5J1j02J3Q2j9j2N7j00m5J34l5j4J0j2j6pK7
5899a0K2m2L7ml8P4p2O5j02NR5p0R5K4p2K9m9K5QJ5O8r7l6j6J03kn7KJ3n1L7j1
5931a2O5q8L2l9k2O9Q1r7m7l2P9L5n6j3N4q4O4j08J18J8o7J3l3Q3k4o6O4N9j04
$$ plain form
5779 75 42 -5 -98 -63 -24 18 48 62 -47 -99 -39 14 114 15 8 -100 -72 21 20 50 -4 -84 -7 9 46 27 53 -29 -79 28
5809 28 113 92 114 -4 -47 -79 43 -4 35 10 -21 -33 -24 40 74 -11 -16 -77 1 -7 74 -32 -60 -73 4 -42 50 107 -63 -70
5839 -70 -102 -3 -19 31 83 -39 -116 -103 -21 -20 17 67 -93 -30 12 40 62 23 -13 -3 -9 47 27 73 40 -35 -39 20 121 53
5869 53 43 -1 3 55 -6 26 63 -15 31 -20 53 43 18 29 -73 -60 22 3 -9 48 -52 -97 37 2 -12 -2 -14 -30 -37 -10
5899 -10 12 -30 7 3 -35 39 -33 32 -70 -65 30 -40 55 79 7 36 -13 12 20 35 103 6 -30 -46 57 55 -2 0 13 -38 -1 -12
5931 -12 53 -35 -3 -42 -64 5 86 -11 -58 -90 -11 24 -32 -45 9 -75 -11 -119 -1 17 -50 -37 -70 13 -11 -77 -13 46 -58
$$ [...]
8191E
##END NTUPLES=NMR FID
##END=
