##TITLE=1H_ADM2705
 CDCl3, 8 sc, 
 28.5.2019
##JCAMPDX= 6.0         $$ Bruker NMR JCAMP-DX V2.0
##DATA TYPE= NMR FID
##DATA CLASS= NTUPLES
##ORIGIN= UXNMR, Bruker Analytische Messtechnik GmbH
##OWNER= root
$$ XWIN-NMR		Version 3.5
$$ Tue May 28 14:20:08 2019 Russian Standard Time (UT+4h)  she@DPX200
##.OBSERVE FREQUENCY= 200.1315
##.OBSERVE NUCLEUS= ^1H
##.DELAY= (6, 6)
##.ACQUISITION MODE= SIMULTANEOUS
##.ACQUISITION SCHEME= undefined
##.AVERAGES= 8
##.DIGITISER RES= 18
##SPECTROMETER/DATA SYSTEM= spect
##.PULSE SEQUENCE= zg30
##.SOLVENT NAME= CDCl3
##.SHIFT REFERENCE= (INTERNAL, CDCl3, 0, 15.7039)
##AUDIT TRAIL= $$ (NUMBER, WHEN, WHO, WHERE, WHAT)
$$ ##TITLE= Audit trail, XWIN-NMR		Version 3.5
$$ ##JCAMPDX= 5.01
$$ ##ORIGIN= Bruker BioSpin GmbH
$$ ##OWNER= she
$$ F:/spectra/data/she/nmr/H-F/1/audita.txt
$$ ##AUDIT TRAIL=  $$ (NUMBER, WHEN, WHO, WHERE, WHAT)
(   1,<2019-05-28 14:17:15.45 +0400>,<she>,<DPX200>,
      <created by zg, POWCHK disabled, PULCHK disabled
       configuration hash MD5:
       00 E9 B6 7A A2 85 ED C7 34 08 36 98 17 FE 4E 26
       data hash MD5: 16K
       CB D7 27 0B 66 1B F8 73 0E A7 32 75 5E 3D 11 8A>)
$$ ##END=
$$ 
$$ hash MD5
$$ 1D 11 EC C6 1F D1 31 09 73 22 66 5C 56 E5 70 8F
##$RELAX= 
##$RELAX= 
##$RELAX= 
##$RELAX= 
##$RELAX= 
##$RELAX= 
$$ Bruker specific parameters
$$ --------------------------
##$DU= <F:/spectra>
##$EXPNO= 1
##$NAME= <H-F>
##$PROCNO= 1
##$TYPE= <nmr>
##$USER= <she>
##$AMP= (0..31)
100 100 100 100 100 100 100 100 100 100 100 100 100 100 100 100 100 100 
100 100 100 100 100 100 100 100 100 100 100 100 100 100 
##$AQSEQ= 0
##$AQ_mod= 1
##$AUNM= <au_zg>
##$AUTOPOS= <>
##$BF1= 200.13
##$BF2= 200.13
##$BF3= 200.13
##$BF4= 200.13
##$BF5= 200.13
##$BF6= 200.13
##$BF7= 200.13
##$BF8= 200.13
##$BYTORDA= 1
##$CFDGTYP= 0
##$CFRGTYP= 5
##$CHEMSTR= <none>
##$CNST= (0..31)
1 1 145 1 1 1 1 1 1 1 1 1 1 1 1 1 1 1 1 1 1 1 1 1 1 1 1 1 1 1 1 1 
##$CPDPRG= <>
##$CPDPRG1= <>
##$CPDPRG2= <>
##$CPDPRG3= <>
##$CPDPRG4= <mlev>
##$CPDPRG5= <mlev>
##$CPDPRG6= <mlev>
##$CPDPRG7= <mlev>
##$CPDPRG8= <mlev>
##$CPDPRGB= <>
##$CPDPRGT= <>
##$D= (0..31)
0 1.2 0 0 0 0 0 0 0 0 0 0.03 0 0 0 0 0 0 0 0 0 0 0 0 0 0 0 0 0 0 0 0 
##$DATE= 1559038634
##$DBL= (0..7)
120 120 120 120 120 120 120 120 
##$DBP= (0..7)
150 150 150 150 150 150 150 150 
##$DBP07= 0
##$DBPNAM0= <>
##$DBPNAM1= <>
##$DBPNAM2= <>
##$DBPNAM3= <>
##$DBPNAM4= <>
##$DBPNAM5= <>
##$DBPNAM6= <>
##$DBPNAM7= <>
##$DBPOAL= (0..7)
0.5 0.5 0.5 0.5 0.5 0.5 0.5 0.5 
##$DBPOFFS= (0..7)
0 0 0 0 0 0 0 0 
##$DE= 6
##$DECBNUC= <off>
##$DECIM= 24
##$DECNUC= <off>
##$DECSTAT= 4
##$DIGMOD= 1
##$DIGTYP= 9
##$DL= (0..7)
0 120 120 120 120 120 120 120 
##$DP= (0..7)
150 150 150 150 150 150 150 150 
##$DP07= 0
##$DPNAME0= <>
##$DPNAME1= <>
##$DPNAME2= <>
##$DPNAME3= <>
##$DPNAME4= <>
##$DPNAME5= <>
##$DPNAME6= <>
##$DPNAME7= <>
##$DPOAL= (0..7)
0.5 0.5 0.5 0.5 0.5 0.5 0.5 0.5 
##$DPOFFS= (0..7)
0 0 0 0 0 0 0 0 
##$DQDMODE= 0
##$DR= 18
##$DS= 0
##$DSLIST= <SSSSSSSSSSSSSSS>
##$DSPFIRM= 0
$$ [...]
##$SUBNAM2= <"">
##$SUBNAM3= <"">
##$SUBNAM4= <"">
##$SUBNAM5= <"">
##$SUBNAM6= <"">
##$SUBNAM7= <"">
##$SUBNAM8= <"">
##$SUBNAM9= <"">
##$SW= 24.9337058887773
##$SWIBOX= (0..15)
0 0 2 0 0 0 0 0 0 0 0 0 0 0 0 0 
##$SW_h= 4990.01996007984
##$TD= 16384
##$TD0= 1
##$TE= 0
##$TE2= 300
##$TE3= 300
##$TEG= 300
##$TL= (0..7)
0 120 120 120 120 120 120 120 
##$TP= (0..7)
150 150 150 150 150 150 150 150 
##$TP07= 0
##$TPNAME0= <>
##$TPNAME1= <>
##$TPNAME2= <>
##$TPNAME3= <>
##$TPNAME4= <>
##$TPNAME5= <>
##$TPNAME6= <>
##$TPNAME7= <>
##$TPOAL= (0..7)
0.5 0.5 0.5 0.5 0.5 0.5 0.5 0.5 
##$TPOFFS= (0..7)
0 0 0 0 0 0 0 0 
##$TUNHIN= 0
##$TUNHOUT= 0
##$TUNXOUT= 0
##$USERA1= <user>
##$USERA2= <user>
##$USERA3= <user>
##$USERA4= <user>
##$USERA5= <user>
##$V9= 5
##$VALIST= <valist>
##$VCLIST= <CCCCCCCCCCCCCCC>
##$VD= 0
##$VDLIST= <DDDDDDDDDDDDDDD>
##$VPLIST= <PPPPPPPPPPPPPPP>
##$VTLIST= <TTTTTTTTTTTTTTT>
##$WBST= 1024
##$WBSW= 4
##$XGAIN= (0..3)
0 0 0 0 
##$XL= 0
##$YL= 0
##$YMAX_a= 133182
##$YMIN_a= -91006
##$ZGOPTNS= <>
##$ZL1= 120
##$ZL2= 120
##$ZL3= 120
##$ZL4= 120
##$ABSF1= 10
##$ABSF2= 0
##$ABSG= 5
##$ABSL= 3
##$ALPHA= 0
##$AQORDER= 0
##$ASSFAC= 0
##$ASSFACI= 0
##$ASSFACX= 0
##$ASSWID= 0
##$AUNMP= <proc_1d>
##$AZFE= 0.1
##$AZFW= 0.1
##$BCFW= 1
##$BC_mod= 2
##$BYTORDP= 1
##$COROFFS= 0
##$CY= 11.3945322036743
##$DATMOD= 1
##$DC= 2
##$DFILT= <>
##$DTYPP= 0
##$F1P= 18.9103706918063
##$F2P= -1.10871071338519
##$FCOR= 0.5
##$FTSIZE= 0
##$FT_mod= 4
##$GAMMA= 1
##$GB= 0.15
##$INTBC= 1
##$INTSCL= 1
##$ISEN= 128
##$LB= 0.24
##$LEV0= 0
##$LPBIN= 0
##$MAXI= 10000
##$MC2= 0
##$MEAN= 0
##$ME_mod= 0
##$MI= 1.114404
##$NCOEF= 0
##$NC_proc= 0
##$NLEV= 6
##$NOISF1= 3.799351
##$NOISF2= 2.8
##$NSP= 1
##$NTH_PI= 0
##$NZP= 0
##$OFFSET= 15.70392
##$PC= 1
##$PHC0= -9009.493
##$PHC1= 6.200252
##$PH_mod= 1
##$PKNL= yes
##$PPARMOD= 0
##$PSCAL= 0
##$PSIGN= 0
##$REVERSE= no
##$SF= 200.130013532006
##$SI= 16384
##$SIGF1= 3
##$SIGF2= 2
##$SINO= 400
##$SIOLD= 16384
##$SREGLST= <1H.CDCl3>
##$SSB= 0
##$STSI= 0
##$STSR= 0
##$SW_p= 3612.71676300578
##$SYMM= 0
##$S_DEV= 0
##$TDeff= 0
##$TDoff= 0
##$TI= <>
##$TILT= no
##$TM1= 0
##$TM2= 0
##$TOPLEV= 0
##$USERP1= <user>
##$USERP2= <user>
##$USERP3= <user>
##$USERP4= <user>
##$USERP5= <user>
##$WDW= 1
##$XDIM= 8192
##$YMAX_p= 0
##$YMIN_p= 0
$$ End of Bruker specific parameters
$$ ---------------------------------
##NTUPLES= NMR FID
##VAR_NAME=  TIME,          FID/REAL,        FID/IMAG
##SYMBOL=    X,             R,               I
##VAR_TYPE=  INDEPENDENT,   DEPENDENT,       DEPENDENT
##VAR_FORM=  AFFN,          ASDF,            ASDF
##VAR_DIM=   8192,          8192,            8192
##UNITS=     SECONDS,       ARBITRARY UNITS, ARBITRARY UNITS
##FACTOR=    0.0002004,     1,               1
##FIRST=     0,             0,               0
##LAST=      1.6414764,     0,               0
##MIN=       0,             -91006,          0
##MAX=       1.6414764,     133182,          0
$$ Real data points
##PAGE= N=1
##DATA TABLE= (X++(R..R)), XYDATA
0 0 0 0 0 0 0 0 0 0 -8 8 -8 8 -16 16 -16 24 -24 32 -36 40 -48 56 -65 80 -89 104 -116 132 -152 169 -193 215
32 215 -242 269 -300 333 -372 413 -460 508 -564 623 -690 764 -847 939 -1043 1163 -1299 1459
50 1459 -1644 1869 -2146 2493 -2945 3568 -4474 5923 -8622 15372 -67554 -73791 93480 71466
64 71466 -246 -9814 22707 -36406 -79621 -10141 89656 57562 -32872 -51395 -11192 -13840 -14561
77 -14561 42025 80942 8270 -78491 -56406 23872 32356 -5727 149 27366 -2751 -44765 -15301
90 -15301 43507 31381 -24795 -32226 1623 4931 -7825 15781 39795 -83 -53143 -30731 34063
103 34063 41764 -2026 -18626 -4902 -13102 -25093 9515 53649 33668 -25529 -43478 -17997
115 -17997 -1823 7679 37214 47140 -5274 -62718 -43379 22401 45562 19570 1363 -2720 -23616
128 -23616 -39707 -8028 43868 50019 8121 -28654 -34837 -22755 1595 31943 38478 6202 -29664
141 -29664 -30646 -7080 10989 20114 23259 7551 -23498 -34584 -8939 21751 25140 10561 -1711
154 -1711 -12719 -21556 -10923 16398 26444 4736 -18285 -15845 -1581 4913 8424 13262 5937
167 5937 -13572 -19774 -2796 12956 10679 2614 -1488 -9211 -16147 -4082 18509 19012 -5986 -21856
181 -21856 -12199 1064 3988 8475 14793 4232 -17992 -21340 -546 15499 12623 5026 -738 -12326
195 -12326 -19851 -4900 19483 20888 -786 -14714 -11737 -7900 -5180 7838 20226 9347 -14535
208 -14535 -19584 -3164 7920 5839 5693 7187 -3116 -16853 -11248 9437 17058 5112 -5899
221 -5899 -6115 -5310 -5435 1725 10450 6696 -5221 -7780 -815 1987 473 4256 7570 -1044 -11978
236 -11978 -6668 8231 10784 495 -4314 -392 -47 -3066 989 7836 4353 -5178 -5430 1818 3434
251 3434 74 1979 5355 42 -8139 -5148 5330 8184 1609 -3537 -3085 -1579 548 3758 3752 -511
267 -511 -1796 1551 1429 -3277 -1648 6741 7344 -3882 -9952 -1257 7123 2982 -3511 -823 3125 -632
283 -632 -4070 163 3721 -376 -3162 1376 3501 -2504 -4927 3003 7620 -389 -7634 -1982 5174
298 5174 519 -6436 -2651 4580 2786 -2836 -2037 836 -1473 -2790 2349 4801 -2215 -7218 -887
313 -887 5662 1172 -4696 -228 5670 174 -8251 -4882 4402 4991 -1417 -3827 -2040 -2303 -1289 4050
329 4050 5738 -1796 -7421 -1815 4727 599 -4852 751 7504 326 -11183 -6678 8869 11500 -1706
344 -1706 -9807 -3746 2967 671 -1507 3072 5101 -1542 -7405 -3253 4953 6618 2233 -1780 -3538
359 -3538 -4419 -2728 2873 7642 5691 -2003 -7586 -5464 2501 8076 5566 -1396 -5248 -3768 -1054
374 -1054 987 4521 7549 3802 -6170 -10448 -2822 7614 9319 2983 -3232 -5923 -5372 74 8260
389 8260 10090 1673 -7246 -7048 -1282 2017 3865 7265 5929 -4976 -14202 -6919 9618 14620 3312
404 3312 -7947 -7709 -2405 56 2811 8090 8029 -2133 -12490 -9767 3462 12333 8762 -1506 -8450
419 -8450 -8379 -3616 2735 8037 8216 766 -9884 -12691 -2811 10214 12642 2851 -7275 -9127 -5423
434 -5423 -555 5462 10003 6113 -6406 -14535 -8300 5358 11903 7246 -2005 -9237 -11105 -4772 6404
449 6404 12450 6629 -4762 -10575 -8249 -1494 6080 11060 7273 -5568 -15190 -9877 4675 12681
463 12681 8364 -789 -7637 -10248 -6737 3044 12210 10630 -1535 -12039 -11242 -1487 8362 11138 5601
478 5601 -4160 -10756 -8982 -387 8973 12323 5966 -6669 -14570 -8924 5641 13913 8654 -2094
492 -2094 -7898 -7502 -4022 2577 10250 11082 563 -11986 -13277 -1910 10464 13495 5781 -5498
506 -5498 -11361 -7111 2831 9539 8643 2870 -3935 -9264 -8516 1334 12846 12852 116 -11540 -10987 -2031
522 -2031 5968 9487 7540 -611 -10105 -10484 176 10243 10211 2838 -3993 -8016 -7970 -1184 9081 12239
538 12239 3156 -8626 -11528 -4606 4778 10139 8218 -1090 -10506 -10536 -915 7740 8393 4106 -1033
553 -1033 -6740 -10076 -4305 8147 13652 4647 -8931 -12987 -5940 3506 8871 8208 1468 -7391 -10645
568 -10645 -4991 3615 8146 6921 1343 -6686 -11797 -6866 5930 13524 7303 -5320 -11229 -7141
582 -7141 332 5143 6393 4001 -1999 -8134 -8241 -748 7761 9045 1888 -6317 -8317 -3951 2131
597 2131 6191 6305 1069 -6847 -8792 -906 7920 6978 -868 -4503 -2526 -2400 -3268 2345 9759 5803
613 5803 -7382 -11645 -1253 8331 6264 653 -760 -3009 -7433 -4280 7182 11777 2600 -6732
627 -6732 -5528 -1651 -1284 2217 9932 8418 -5552 -13568 -4484 7331 7307 2702 2391 -388 -8839 -9308
643 -9308 4023 12933 5048 -4968 -3288 21 -4406 -4226 7974 13536 -70 -13036 -5660 6865
657 6865 4420 -3012 1380 6781 -2056 -10819 -1967 10357 4992 -6688 -3443 5644 1274 -7073 -755
672 -755 9374 2450 -10321 -5199 9231 7619 -5359 -6096 3276 2125 -6308 -2459 8861 6214
686 6214 -7409 -9360 1418 5347 -31 44 4947 435 -9477 -7497 4365 7884 1542 -1227 159
701 159 -3795 -8164 -970 9443 6081 -4986 -5609 1273 -440 -6288 -75 10941 6091 -8923 -10259
716 -10259 2227 5983 -2025 -3098 5116 4752 -6069 -8108 2328 6631 -838 -4109 2115 3881
730 3881 -3698 -5952 2030 5984 -332 -4357 908 3999 -1467 -5292 -653 4174 1902 -1291 257
745 257 1442 -1645 -3556 94 3878 2535 -564 -1218 -240 -540 -1185 182 2562 3438 976 -3253 -4513
762 -4513 -377 4213 3016 -1291 -1326 2294 1660 -3384 -3602 3050 6469 1335 -4191 -2503 1349 1169
778 1169 -335 1346 2863 697 -1783 -1554 -1054 -1238 1045 4345 2803 -2726 -3922 553 2586 -2
794 -2 -207 3100 2181 -3775 -5078 619 4058 1296 -234 1829 397 -4979 -4577 2989 6219 373 -4149
811 -4149 -1539 878 -1283 -1464 2994 4220 -827 -4299 -2045 115 -448 1040 3932 1033 -5451 -4956
827 -4956 2852 5223 -1014 -4232 421 2697 -2425 -4766 1164 5655 1001 -4796 -3253 1338 1975
842 1975 329 295 -605 -2968 -2260 1918 3230 -98 -1885 -41 -151 -2709 -1192 4099 4256 -2312 -5980
859 -5980 -2231 2226 2366 1607 1931 -436 -4601 -4323 1526 5253 3236 -363 -2357 -3612 -3138 1364
875 1364 5806 4402 -672 -3625 -3702 -2951 204 6149 7218 -811 -8393 -5293 2849 4749 1883 2090
891 2090 2749 -2843 -8213 -3162 7303 8757 817 -4608 -3464 -2004 -1164 3430 7546 3186 -5662
906 -5662 -7224 -631 3789 3161 3095 3178 -2034 -7728 -3889 5785 8207 1547 -3585 -3206 -2680 -2345 2506
923 2506 7881 4382 -5186 -8018 -1922 3338 3602 3451 2557 -3012 -8249 -4120 5375 8129 2228 -2538
939 -2538 -3548 -4978 -4513 2989 10337 5509 -6532 -9975 -2467 3526 3016 3103 4466 -642 -9635 -8890
955 -8890 3043 10635 5361 -3105 -5217 -4381 -4140 88 7832 8423 -1552 -10047 -7127 1194 4986 4526
971 4526 3423 -357 -6710 -8271 -985 7434 7623 1124 -4709 -6879 -5246 809 7536 7358 -603 -7450
987 -7450 -6332 -897 3025 5088 5346 985 -6491 -8533 -1630 6817 7835 2128 -3615 -6225 -5232 -122
1003 -122 6442 7905 1546 -6020 -7058 -2030 3112 5210 4906 1739 -3926 -7514 -3806 4668 9222
1018 9222 4819 -3250 -7201 -4660 704 4912 5704 2872 -2287 -6017 -4776 964 6214 6251 1452 -4042
1034 -4042 -5801 -3341 2020 6746 6501 256 -6610 -6706 123 5686 4844 918 -1297 -2500 -4320 -3040
1050 -3040 3247 8299 4549 -4577 -8012 -2846 3635 4877 2785 419 -2279 -4736 -3557 1937 6008
1065 6008 4198 -1470 -4823 -4007 -1137 2085 4231 3503 -961 -5364 -4994 165 4928 4559 274 -3600
1081 -3600 -4132 -2059 750 2851 3140 933 -2527 -4382 -2661 1491 4296 3121 -1084 -4337 -4132 -642
1097 -642 2940 3746 1083 -2378 -3406 -1721 250 1350 1975 1799 -675 -3996 -3888 789 4938 3382
1113 3382 -1539 -3794 -1938 260 987 1213 1583 330 -2376 -3159 -818 2418 3172 1157 -1597 -2761
1129 -2761 -1769 699 2444 2018 276 -1257 -1676 -1092 674 2575 2412 -383 -2710 -1870 644 1681
1145 1681 982 641 610 -778 -2138 -782 2352 3304 568 -2094 -1760 186 1411 1333 1020 401 -650
1162 -650 -990 -373 569 1225 1452 451 -1443 -2039 110 2581 2019 -640 -1428 72 788 -344 -245 1547
1180 1547 1659 -1100 -2597 -195 2358 1536 -949 -1062 283 189 -923 -293 1494 1266 -1032 -1895 -308
1197 -308 1116 868 85 -315 -780 -1120 -339 984 906 -528 -1002 13 223 -1025 -780 1364 1927 -1026
1215 -1026 -3197 -1079 2291 1641 -1535 -1898 495 1064 -1095 -1780 563 1855 -104 -2063 -915 907
1231 907 537 -532 -308 228 -394 -739 25 539 -293 -812 -103 275 -352 -350 405 47 -1166 -563 1365 940
1251 940 -1321 -1124 1568 1438 -1908 -1911 2219 3175 -1580 -3980 270 3807 570 -2986 -462 2931 544
1268 544 -2813 -483 2969 1019 -2244 -381 2538 272 -2499 556 3891 377 -4126 -937 4668
1283 4668 2091 -4172 -2737 3699 3615 -2390 -2969 2545 3148 -2241 -3161 2013 3755 -514 -2518 560
1299 560 1500 -1321 -1054 3088 3089 -2269 -4004 214 2890 415 -793 1575 1334 -2543 -3088 1376 3508
1316 3508 739 -1216 -56 -566 -2974 -1151 4034 4196 -1799 -4644 -673 2405 195 -1291 1517
1331 1517 2501 -1665 -4478 -934 3489 2706 -782 -1856 -1229 -1184 -427 1751 2214 -527 -2822 -1919 275
1348 275 1290 1145 775 -475 -2240 -2317 -329 1876 2596 1061 -2085 -4218 -2349 2107 3962 1202
1364 1202 -1903 -2016 -1609 -1878 -111 3731 4167 -1059 -5294 -3148 1267 2393 1813 2149 528 -4107
1380 -4107 -5314 328 5622 3588 -1604 -2615 -1154 -1669 -1338 2930 5573 1136 -5050 -4415 595 3068
1396 3068 2446 2005 623 -3189 -4585 -74 4834 3891 -92 -1874 -2299 -2925 -858 4487 5974 250
1412 250 -5005 -3492 419 1538 2095 4093 2449 -4160 -6851 -717 5929 4587 -130 -1398 -1107 -3221
1428 -3221 -3008 2933 7005 2379 -4606 -4749 -386 1558 1861 3446 2854 -2676 -6442 -2276 4271 4652
1444 4652 912 -1028 -1622 -3544 -2943 2763 6650 2504 -4254 -5009 -1292 869 1724 3793 3373 -2288
1460 -2288 -6972 -3876 2943 5397 2675 -563 -2901 -4588 -2992 2160 5596 3052 -1779 -3812 -3445
1475 -3445 -2019 1441 5336 4157 -2384 -6726 -3641 1905 3648 2344 859 -1359 -4191 -3841 786
1490 786 4585 3424 -329 -3040 -3839 -2466 1680 5112 3365 -2390 -5027 -2471 670 1890 2758 2733
1506 2733 -860 -5246 -4318 1651 5058 2807 -484 -1893 -2840 -3218 370 5332 4875 -1100 -5206 -3408
1522 -3408 340 2436 3502 2850 -959 -4685 -3429 1183 3496 2736 1757 -167 -4094 -5208 779 7228
1538 7228 5103 -2577 -4909 -1190 768 -223 1826 4992 2035 -4926 -5862 493 4781 3072 626
1553 626 128 -2113 -4592 -1386 5089 5578 -758 -4192 -1494 669 -644 335 4142 3372 -3181 -5994
1569 -5994 -618 4495 2965 -672 -858 -402 -2108 -2036 2214 4550 980 -3648 -3348 16 1512 1414 1570
1586 1570 757 -2015 -3271 -1121 2069 2995 1540 -759 -3032 -3514 -268 3782 3412 -714 -3034 -1725
1602 -1725 -544 -648 610 3113 2298 -2574 -5039 -1566 2886 3123 652 -1024 -1576 -2082 -1381 1203
1618 1203 2685 1145 -1394 -2212 -1377 -222 990 1940 1053 -1568 -2826 -1119 1306 1842 760 -450
1634 -450 -1106 -1306 -583 874 1762 1000 -805 -1804 -1284 372 1605 1458 4 -1232 -1045 -295 449 1035
1652 1035 1385 467 -1473 -2005 83 2176 1685 -347 -988 -336 30 -248 488 1577 1120 -906 -1840 -419
1670 -419 1441 1673 387 -625 -699 -241 261 589 785 685 92 -861 -918 294 1545 1111 -441 -955 -6
1689 -6 496 86 126 761 679 -623 -1226 95 1374 661 -607 -542 239 184 -261 102 746 102 -790 -400 648
1710 648 543 -393 -431 183 165 -456 -296 684 558 -774 -1300 -12 1040 392 -723 -764 -230 -21 -269 40
1730 40 470 2 -782 -946 -149 534 511 -20 -545 -762 -713 -81 627 826 -153 -1294 -1282 -61 990 759
1750 759 -211 -709 -573 -494 -460 302 1182 879 -825 -1941 -1097 974 1735 657 -655 -1221 -920 -241 640
1769 640 1290 945 -508 -1467 -1253 56 1358 1697 835 -980 -2066 -1254 931 2215 1527 -291 -1543
1786 -1543 -1521 -449 1105 2042 1423 -519 -1857 -1566 -30 1652 2202 1420 -756 -2573 -2083 820 3115
1803 3115 2474 -257 -2129 -1713 -366 929 1943 2132 662 -1915 -2912 -957 2296 3458 1539 -1423
1819 -1423 -2896 -1911 500 2627 2694 757 -1655 -2657 -1679 598 2716 2885 625 -2463 -3483 -1283
1835 -1283 2078 3401 1982 -861 -2882 -2890 -695 2289 3503 1587 -1794 -3535 -2452 413 2809 3138
1851 3138 1012 -2258 -3927 -2300 1446 3716 2656 -268 -3027 -3677 -1659 2061 4232 2387 -2009
1866 -2009 -4223 -2569 368 2009 2720 2177 -913 -4645 -4403 903 5393 3758 -1352 -3822 -2697 -974
1882 -974 478 2806 3999 624 -4382 -5221 -686 3997 4020 1157 -1673 -3309 -3323 -678 3362 4731
1898 4731 1502 -3031 -4484 -2092 1232 3710 3665 669 -3327 -4554 -1578 2738 4360 2511 -874
1913 -874 -3410 -3700 -941 3077 4739 2252 -2182 -4424 -2867 996 3978 4028 675 -2944 -3880 -1676
1929 -1676 1651 3864 3543 683 -3375 -4715 -1311 3823 5069 1690 -2271 -3376 -2204 -247 2353
1944 2353 4335 2711 -2208 -5258 -2789 2315 4559 2707 -320 -2323 -3167 -2060 1344 4379 3587
1959 3587 -781 -4315 -3756 -68 3256 3569 1454 -1660 -3430 -2654 107 2861 3487 1281 -2238 -4087
1975 -4087 -2423 1457 3884 2915 -615 -3254 -3111 -822 1792 2942 1749 -940 -2981 -2861 -619 2107
1991 2107 3181 1497 -1956 -3735 -2220 1168 3005 2053 -349 -2213 -2582 -1237 1041 2656 2032 -684
2007 -684 -2918 -2734 -460 2124 2826 1062 -1504 -2801 -1875 302 2060 2244 690 -1636 -2941 -1533
2023 -1533 1310 2707 1462 -677 -1542 -1389 -930 352 2275 2441 -277 -2971 -2242 888 2403 1337
2039 1337 -256 -670 -878 -1076 -343 1635 2146 336 -1627 -1756 -264 1063 1705 1329 -165 -1659 -1589
2056 -1589 233 1763 1564 316 -602 -917 -966 -156 1372 1865 724 -1131 -1627 -448 897 1388 980
2073 980 208 -756 -1086 -455 830 1359 733 -297 -761 -427 -30 361 726 602 -192 -901 -604 406 961
2092 961 354 -366 -524 -371 -66 406 696 243 -663 -877 -147 383 314 275 304 -281 -1223 -894 751 1479 194
2113 194 -1051 -789 -123 -295 -293 713 1072 -222 -1557 -943 485 448 -175 153 335 -631 -1425 -369 1043
2132 1043 617 -599 -553 200 -182 -851 -51 938 244 -1032 -430 765 168 -980 -330 873 271 -1141
2150 -1141 -523 1192 528 -1311 -843 1110 1086 -904 -915 847 818 -962 -1074 1073 1421 -635 -1468 344
2168 344 1181 -193 -934 488 1216 -227 -1128 132 1145 220 -621 126 713 -193 -498 352 724 -191
2186 -191 -553 581 910 -198 -674 356 794 -79 -536 470 880 -159 -690 19 761 240 39 464
2204 464 136 -872 -585 904 1273 -78 -645 220 325 -714 -542 1295 1569 -514 -1797 -414 992
2221 992 482 -85 544 641 -872 -1854 -289 1659 1247 -559 -1075 -309 -111 -274 171 888 577 -690 -1468
2240 -1468 -893 609 1430 682 -841 -1530 -518 669 527 -92 93 111 -924 -1667 -117 1900 1393 -813
2258 -813 -1775 -796 -112 257 987 1268 -382 -2221 -1540 805 1638 540 -98 -109 -1112 -2049 -498 2441
2276 2441 2519 -598 -2526 -1324 264 453 714 1501 651 -1849 -2733 -358 2153 2022 217 -854 -1184
2293 -1184 -1331 -573 1465 2420 893 -1463 -2175 -932 723 1988 1925 141 -1883 -2005 -74 1426 1549
2310 1549 975 305 -1154 -2323 -942 2178 3248 880 -1923 -2143 -504 830 1354 1669 895 -1063
2326 -1063 -2382 -1304 1254 2597 1714 -232 -1861 -2040 -469 1728 2474 1096 -957 -1991 -1601 7
2342 7 1659 2316 950 -1410 -2637 -1402 892 2247 1871 16 -1681 -2355 -988 1229 2334 1588 -399
2359 -399 -2039 -2236 -602 1712 2630 1053 -1311 -2273 -1423 86 1383 1962 1099 -1098 -2818 -1921 860
2376 860 2540 1598 -505 -1748 -1778 -909 505 1857 1678 -261 -2252 -2283 -437 1577 2090 849 -1153
2393 -1153 -2230 -1500 147 1507 1729 498 -1124 -2200 -1647 577 2222 1822 -362 -2067 -1806 -452
2409 -452 1009 1709 1288 -236 -1757 -1984 -544 1557 2182 981 -1094 -2127 -1314 397 1700 1714 394
2426 394 -985 -1682 -1146 449 1965 1908 140 -1601 -1790 -517 1147 1973 1392 -201 -1571 -1605 -174
2443 -174 1537 1901 907 -689 -1553 -1181 163 1582 1827 636 -1058 -1671 -963 782 1830 1503 115
2460 115 -1377 -1572 -400 1178 1699 928 -393 -1308 -1260 -111 1083 1578 935 -553 -1729 -1278 348
2477 348 1709 1511 -47 -1386 -1336 -347 559 1028 1062 207 -1109 -1795 -756 1245 1782 614 -922 -1390
2495 -1390 -902 -16 894 1219 619 -910 -1670 -868 539 1237 797 -84 -899 -1236 -824 393 1351 1017 -459
2514 -459 -1556 -1282 17 1147 978 77 -750 -898 -673 -105 568 1080 555 -876 -1716 -779 882 1350
2532 1350 408 -588 -801 -586 -361 371 1046 809 -528 -1241 -611 406 770 541 295 -230 -1022 -948 349
2551 349 1507 853 -646 -992 -265 246 227 467 846 268 -1010 -1087 262 1253 772 -187 -408 -217 -309 -71
2571 -71 657 1190 357 -997 -972 199 1041 624 -56 -74 157 -301 -587 227 1260 875 -666 -1190 -147
2590 -147 905 761 -25 -146 164 -117 -555 -26 878 855 -163 -803 -424 207 470 273 253 -36 -511 -490
2610 -490 113 510 321 17 -95 -323 -466 -131 549 508 -228 -663 -241 47 20 4 277 193 -348 -694 -144
2631 -144 421 352 -56 -251 -331 -381 -166 217 329 -138 -352 -263 -179 -323 -6 468 273 -593 -759 -2 412 -24
2653 -24 -357 167 358 -383 -907 -140 836 410 -635 -645 137 309 -327 -337 437 482 -292 -668 -225 423 495
2674 495 1 -201 -117 -81 -60 141 154 113 112 25 -184 -320 191 665 489 -441 -563 111 490 140 -146 144 421
2697 421 -6 -494 -163 608 726 2 -376 -153 160 150 234 521 364 -265 -496 -122 400 351 267 280 -39 -525
2719 -525 -407 368 788 352 -201 -219 -143 -382 -116 708 839 -98 -915 -367 383 159 -203 280 725 -185 -1153
2740 -1153 -474 852 930 -211 -629 -102 -46 -310 -29 622 328 -520 -638 21 67 -126 369 608 -382 -1409
2760 -1409 -447 1155 831 -663 -815 204 172 -904 -433 1127 1030 -936 -1691 -252 861 287 -176 488
2778 488 148 -1250 -1429 322 1516 546 -774 -636 -291 -699 -409 1051 1446 -203 -1519 -938 84
2795 84 358 471 972 383 -1201 -1669 26 1360 851 -169 -210 -241 -921 -773 894 1729 402 -1165 -1013
2814 -1013 -51 219 440 956 623 -805 -1404 -118 1171 873 42 2 -80 -898 -781 892 1874 625 -1245
2833 -1245 -1059 141 550 427 730 658 -523 -1444 -622 1012 1440 623 -291 -830 -858 -339 896 1410 664
2852 664 -584 -1115 -802 69 1096 1580 575 -1089 -1520 -457 643 852 756 553 -442 -1635 -1078 963
2870 963 1887 619 -891 -931 -499 -441 127 1268 1299 -494 -1858 -1061 609 1069 467 101 -292 -1030 -1217
2889 -1217 207 1391 936 -478 -1109 -780 -324 287 886 748 -241 -1257 -1114 58 916 804 62 -690
2907 -690 -1053 -670 287 841 677 68 -719 -1123 -691 450 1254 559 -638 -1138 -574 59 386 686 720 -186
2927 -186 -1307 -951 389 1225 556 -249 -537 -466 -515 -17 907 1095 -80 -1200 -925 223 917 714 168
2946 168 -214 -496 -539 -136 665 980 434 -441 -932 -454 497 1005 593 -94 -501 -456 -127 353 742 610 -67
2967 -67 -519 -485 51 647 688 350 -352 -730 -367 469 760 346 -68 -214 -306 -325 281 808 535 -323 -760 -302
2989 -302 260 486 423 239 -197 -702 -564 258 719 471 -142 -462 -510 -195 280 723 372 -366 -598 -363 -42
3010 -42 127 372 574 -181 -1026 -817 416 852 116 -454 -344 -117 -288 -342 382 665 45 -900 -780 12
3030 12 424 412 31 -325 -692 -386 174 412 139 -168 -229 -353 -549 -102 714 701 -275 -962 -382 288 358 139
3052 139 139 72 -448 -681 -112 776 748 -122 -598 -387 -9 120 334 451 145 -411 -545 -131 456 688 366
3073 366 -199 -553 -406 141 578 489 96 -220 -301 -222 -30 504 595 153 -472 -544 -18 443 613 351 -91 -339
3095 -339 -170 80 244 398 329 -19 -294 -440 37 664 633 -71 -458 -243 203 238 110 341 292 -109 -599
3116 -599 -214 521 729 74 -445 -273 42 107 56 133 255 -42 -411 -412 30 529 275 -177 -434 -215 138 147
3138 147 -8 43 17 -142 -336 -115 235 201 -97 -391 -209 -3 1 -80 -40 23 -110 -303 -229 86 110 -18 -210
3161 -210 -183 -45 11 -39 -98 -132 -172 -30 13 4 -47 -131 -58 -17 -64 -35 -39 -34 -138 -236 -28 269 242 -107 -409 -166 241
3188 241 204 -81 -106 71 35 -270 -325 282 651 161 -538 -412 182 442 134 -31 97 -9 -341 -292 324 763
3210 763 297 -405 -398 -15 233 201 272 365 -10 -568 -366 327 843 397 -191 -375 -168 50 254 523 445 1
3232 1 -429 -523 142 623 706 213 -387 -553 -257 313 636 424 86 -438 -617 -265 400 707 535 -156 -539
3253 -539 -601 -178 386 806 523 -482 -924 -498 328 624 453 127 -257 -771 -748 66 927 756 -289 -906
3273 -906 -593 -78 231 456 556 -36 -934 -1093 -72 870 650 -4 -592 -620 -560 -256 545 881 228 -827
3293 -827 -1042 -331 452 757 486 -117 -730 -839 -274 513 740 335 -241 -704 -759 -337 725 1065 369 -772
3313 -772 -922 -249 354 516 542 313 -499 -1017 -653 592 1121 571 -321 -700 -531 -179 399 975 632 -298
3333 -298 -984 -583 202 687 716 385 -365 -930 -534 481 1018 622 -71 -492 -426 -356 212 1007 947 -105 -1007
3354 -1007 -683 354 751 545 260 -35 -575 -773 16 998 914 64 -689 -589 -202 233 812 842 -5 -855
3374 -855 -857 -38 589 698 376 -59 -700 -943 -237 896 1043 56 -684 -656 -216 67 351 685 478 -509 -1088
3395 -1088 -467 561 901 271 -452 -654 -386 -94 355 567 294 -372 -820 -614 45 767 617 -2 -783
3414 -783 -822 -188 413 515 203 -170 -616 -790 -341 508 865 269 -584 -845 -437 157 449 579 294 -466
3434 -466 -860 -521 336 751 448 -195 -636 -571 -172 393 570 279 -286 -666 -532 -66 470 572 253 -374
3454 -374 -711 -340 311 748 479 -235 -592 -425 50 337 436 378 -11 -486 -678 -31 798 836 18 -761 -521
3475 -521 38 440 318 361 208 -207 -674 -269 587 923 303 -392 -456 -81 186 341 473 264 -262 -627 -382
3496 -382 353 732 409 -94 -433 -292 -45 305 469 324 -198 -561 -483 -41 477 595 168 -346 -566 -308
3516 -308 170 487 328 -53 -345 -444 -160 159 526 324 -169 -520 -487 -6 401 390 75 -308 -514 -339 100
3537 100 244 188 -178 -342 -384 -207 143 433 312 -311 -710 -335 285 375 69 -108 -6 -270 -501 -204 520
3558 520 565 -201 -688 -363 184 141 -101 133 260 -244 -707 -246 562 410 -161 -456 8 55 -278 14 487
3579 487 371 -314 -465 44 322 76 -48 59 11 -239 -198 312 377 -55 -242 24 143 -58 28 344 281 -156
3601 -156 -399 93 422 87 -70 80 170 -72 -178 170 339 105 -94 -8 150 -17 -106 129 145 -106 -110 178
3623 178 351 -55 -298 81 356 -18 -211 168 338 -162 -417 60 473 162 -208 -71 135 -52 -246 55
3643 55 424 77 -369 -174 181 157 -188 -49 84 -77 -362 -81 269 146 -238 -231 -55 -125 -97 242 293 -132
3665 -132 -642 -296 273 201 -103 -116 81 -150 -578 -192 407 534 -139 -601 -342 -7 21 145 235 -24 -431
3686 -431 -509 -124 266 290 165 -57 -358 -590 -148 420 462 -4 -370 -243 -226 -37 238 420 124 -457 -577
3707 -577 -126 393 334 130 55 -277 -511 -231 509 782 237 -373 -490 -188 181 432 510 232 -362 -653 -252
3728 -252 285 638 511 107 -339 -565 -263 509 918 490 -223 -654 -338 120 396 481 370 -66 -589 -574 86
3749 86 814 779 69 -624 -626 -37 421 531 409 83 -353 -706 -317 557 978 391 -447 -773 -357 144 394
3770 394 646 355 -328 -821 -604 296 862 559 -121 -590 -612 -270 311 607 515 -195 -663 -755 -102 535 629
3791 629 264 -426 -783 -549 126 658 555 88 -567 -704 -435 268 665 479 -137 -722 -795 -258 434 745
3811 745 298 -464 -712 -462 1 385 506 282 -377 -783 -676 172 809 528 -220 -642 -503 -127 260 504
3831 504 401 -84 -626 -708 -122 649 754 174 -418 -639 -265 234 582 435 128 -332 -583 -372 333 715
3851 715 487 -283 -617 -372 137 398 478 371 -69 -543 -543 177 761 637 -35 -440 -305 -143 172 474 509
3872 509 -7 -459 -462 12 526 477 189 -127 -342 -399 37 571 536 -36 -366 -243 -57 195 257 390 165 -376
3894 -376 -607 -113 538 583 75 -265 -286 -106 -15 184 343 209 -208 -493 -253 225 423 280 -100 -358 -362 -49
3916 -49 347 317 174 -127 -367 -401 -73 293 343 42 -377 -400 -153 100 164 93 73 -242 -436 -224 275 385 6
3939 6 -345 -254 -134 -23 158 218 180 -240 -461 -180 119 305 190 -69 -244 -373 -152 224 321 92 -280 -287 -96
3962 -96 0 8 232 301 -107 -437 -234 260 420 145 -110 -112 -133 -80 65 387 284 -100 -312 -62 129 181 222 173
3986 173 40 -212 -185 191 355 149 -61 -175 -36 -71 81 295 302 -35 -245 -131 114 142 106 167 90 -188 -253
4009 -253 135 419 213 -103 -163 -42 39 68 162 133 83 -196 -130 8 174 190 75 -44 -249 -157 158 246 43
4032 43 -129 -50 32 -119 -142 90 286 -43 -317 -217 134 189 -30 -122 23 -37 -255 -147 180 211 -120 -284 -119
4055 -119 117 8 -66 -2 69 -145 -213 -17 105 48 -33 -208 -61 -35 -12 22 -57 -47 -61 -81 -13 -13 9 5 -57 -94 -48
4082 -48 -8 -4 5 14 -45 -79 26 185 39 -166 -148 23 116 78 -70 92 54 -115 -259 77 377 174 -206 -220 109
4107 109 187 65 -45 147 80 -200 -174 114 314 183 -122 -152 -47 93 138 172 200 13 -116 -142 12 233 221
4130 221 76 -154 -232 46 217 290 132 -18 -88 -242 -95 188 412 225 -240 -347 -112 138 261 167 60
4151 60 -180 -299 -187 110 327 293 -42 -271 -374 -102 177 355 232 -140 -413 -248 120 193 195 54 -86 -322
4173 -322 -403 -84 396 396 -94 -500 -378 18 161 200 108 -35 -277 -464 -162 221 466 96 -300 -476 -252 77
4195 77 261 238 75 -258 -474 -378 202 337 287 -62 -431 -487 -95 310 364 105 -157 -296 -345 -148 340 618
4217 618 180 -410 -485 -123 281 264 220 96 -162 -397 -297 305 547 248 -153 -303 -233 -118 209 530 300
4238 300 -280 -469 -79 215 258 169 219 27 -377 -400 163 680 288 -268 -341 -133 73 94 337 421 35 -325
4260 -325 -389 134 469 320 44 -33 -261 -223 84 498 393 -44 -207 -261 -56 58 354 318 0 -444 -237 144
4282 144 226 147 52 64 -213 -311 4 355 420 -24 -347 -290 -63 108 223 274 17 -287 -308 -121 207 322 232
4305 232 -141 -399 -313 7 231 199 -34 -250 -236 -173 -96 144 226 101 -290 -388 -75 125 243 80 -73 -218
4327 -218 -233 -168 71 228 139 -139 -285 -233 -33 164 192 27 -181 -160 -136 51 272 223 -80 -262 -122 -28 118
4350 118 143 69 4 -185 -318 -12 249 216 -51 -226 -167 -136 10 240 272 53 -310 -247 8 191 141 25 56
4373 56 -92 -322 -141 234 388 113 -272 -201 -64 77 93 200 115 -38 -200 -183 187 279 313 24 -183 -175 28
4396 28 168 156 154 81 -83 -172 -40 272 403 29 -218 -176 -12 181 115 86 108 -138 -293 -163 201 281 7 -145
4420 -145 -116 -95 -71 147 246 155 -170 -309 -146 123 129 116 25 -129 -346 -202 156 205 161 -108 -221 -181 -77 -56
4444 -56 115 159 -32 -266 -287 -89 174 177 -59 -209 -226 -107 44 78 7 34 -31 -223 -196 121 233 64 -185 -230
4468 -230 -41 87 -41 70 106 41 -303 -257 53 290 149 -107 -74 -43 -125 -60 141 194 122 -219 -134 1 123
4491 123 144 78 -54 -77 -105 -32 111 209 55 27 -158 -210 -61 148 182 31 -92 -26 -26 84 130 106 95 -26 -87
4516 -87 -121 2 193 213 63 -39 -121 10 52 226 75 -5 -56 -80 -25 62 221 133 102 -119 -161 44 196 80
4540 80 16 -36 5 -167 -142 27 275 125 -130 -188 -3 86 92 60 11 13 -105 -196 -25 213 255 -38 -149 -158 -58 -29
4566 -29 27 98 74 -182 -217 -110 63 92 126 -98 -222 -171 -54 143 52 -5 -104 -113 -142 -77 25 198 95 -131 -274
4591 -274 -59 118 162 34 10 -63 -186 -222 -19 269 156 -36 -187 -232 -55 100 180 74 -80 -162 -105 -23 95
4614 95 121 145 2 -221 -172 76 177 163 39 -71 -11 -37 49 180 236 93 -171 -235 -28 185 246 123 15 -63
4638 -63 -137 0 110 253 134 51 -78 -133 -17 167 233 48 -30 -97 -53 72 113 168 245 -61 -235 -179 55 280
4662 280 139 -26 -154 -76 -53 10 92 208 89 -116 -197 -64 136 267 51 -117 -170 -113 -89 94 135 149 -88
4685 -88 -220 -192 2 228 140 -57 -87 -160 -185 -27 142 263 -27 -253 -273 -125 65 141 111 -78 -227 -318 -181
4708 -181 114 176 42 -103 -168 -117 -42 106 173 61 -206 -298 -133 156 137 48 -1 -75 -256 -261 13 301 214 -154
4732 -154 -308 -122 60 174 111 72 -30 -152 -161 -31 230 268 130 -172 -311 -92 177 265 35 -8 -51 -127 -136 -27
4756 -27 324 246 -77 -285 -169 167 183 167 73 -36 -146 -217 158 385 260 -86 -227 -31 8 45 212 298 98
4779 98 -330 -232 123 286 197 -42 -4 -75 -149 23 289 321 -50 -250 -158 145 0 103 181 129 -220 -327 -74
4802 -74 354 279 -31 -195 -133 -84 -6 148 144 16 -169 -202 -114 122 193 235 -53 -294 -197 -36 265 61 -59 -50 -153
4827 -153 -122 -99 206 248 -31 -387 -301 64 128 65 -15 -39 -138 -296 -132 171 279 10 -229 -182 -124 40 144 184
4851 184 -10 -141 -280 -48 82 107 87 33 -206 -225 -69 184 226 74 -179 -143 -91 32 127 240 176 -126 -278
4874 -278 -154 116 208 176 23 -205 -173 -67 169 198 147 -55 -148 -173 80 160 235 161 -171 -202 -51 151 159 154 43
4899 43 -58 -208 -124 144 333 204 -35 -224 -136 -19 132 152 85 -35 -150 -243 10 222 245 39 -164 -221 -143
4922 -143 92 202 250 49 -153 -255 -133 88 282 176 -28 -296 -205 36 90 151 31 -75 -213 -232 -34 197
4944 197 263 55 -208 -333 -110 126 218 101 1 -195 -254 -150 88 197 183 -98 -305 -251 4 98 67 83 -69
4967 -69 -231 -271 -39 165 155 -36 -134 -181 -119 18 151 184 -44 -290 -245 20 147 67 41 -8 -137 -181 -132 246
4991 246 186 -9 -214 -119 -121 -13 91 84 122 -157 -185 -125 141 267 97 -33 -164 -135 1 107 168 35 24 -119
5015 -119 -152 -104 146 277 174 -222 -186 2 118 99 -1 76 93 -107 -151 -18 327 227 0 -142 36 76 -82
5038 -82 33 152 55 -24 -70 64 93 -20 36 -18 57 -89 -49 104 81 -3 -59 -49 25 2 49 -2 60 4 -50 -34 -42 26
5066 26 51 60 33 -5 -50 -45 -2 59 71 -43 -93 -81 -41 -15 -3 -20 -23 -37 -223 -124 87 194 -4 -214 -214 -2 -6 -109 -38
5095 -38 137 -16 -210 -197 -20 164 34 -48 -105 -135 -119 -13 102 45 -21 -92 -156 -88 89 24 75 -31 -177 -31
5119 -31 -45 101 65 15 -12 -165 -138 41 208 93 32 -28 -104 -110 69 151 95 47 -106 -204 -12 93 173 146 -107 -204
5145 -204 -110 8 225 147 18 -96 -73 -90 -56 201 206 39 -145 -185 -68 106 190 133 -55 -28 -153 -105 36 246
5169 246 209 23 -266 -139 80 193 163 -18 -34 -42 -89 -14 141 233 58 -101 -151 -21 86 191 90 -85 -167
5192 -167 -181 20 142 203 117 -87 -149 -158 78 239 187 -40 -138 -209 -108 46 133 143 -23 -165 -266 -99 135 137
5216 137 46 -124 -205 -159 -98 60 169 80 -48 -242 -167 8 142 154 5 -197 -197 -60 69 144 72 -5 -138 -194
5240 -194 -168 91 239 167 -162 -204 -154 7 155 95 35 -69 -199 -159 7 286 182 43 -170 -211 -80 135 234
5263 234 149 -87 -159 -156 -44 102 261 7 -97 -200 -118 82 209 163 58 -92 -133 -96 40 200 262 109 -214
5286 -214 -208 -38 183 235 171 -50 -141 -91 -23 95 232 162 -142 -251 -201 110 307 163 -19 -81 -69 -44 31 289
5310 289 279 -36 -167 -248 -39 138 244 107 -37 -242 -165 10 193 212 10 -222 -213 -142 25 216 209 -4 -230
5333 -230 -286 -119 101 200 123 -58 -249 -222 -18 243 198 42 -124 -260 -131 8 150 223 26 -203 -259 -185 94
5356 94 190 228 -39 -239 -288 -16 173 154 -20 -130 -115 -214 -128 124 330 208 -173 -347 -84 194 194 86 -12 -59
5380 -59 -202 -186 105 289 189 -85 -263 -204 72 149 135 69 -54 -231 -101 82 172 204 33 -132 -150 -108 148
5403 148 176 145 -15 -213 -124 -29 110 192 209 -33 -186 -152 2 126 191 126 -27 -133 -96 75 191 163 30 -89
5427 -89 -135 -55 59 236 130 9 -133 -144 26 75 124 111 38 -121 -236 -71 160 185 60 -196 -135 16 54 38
5451 38 60 89 -51 -213 -148 49 137 -7 -113 -128 -85 -111 -36 11 101 15 -120 -168 -55 6 3 6 -101 -134 -108 -49 -37
5478 -37 -12 -44 -64 -140 -40 -102 13 78 -43 -107 -86 14 -42 -23 -14 57 -2 -149 -119 32 78 11 -67 -36 -35 18 -30 10
5506 10 39 -89 -21 -17 -49 20 -13 77 -73 -118 2 -3 5 26 11 26 85 -28 -48 -5 98 35 -52 -81 -5 36 18 14 -11 -4
5536 -4 15 -13 -20 49 41 127 27 -28 20 6 120 58 80 13 -15 -59 -16 73 80 52 -19 -77 11 61 59 23 85 62 -68 -90 -47
5567 -47 30 49 -73 -82 44 43 27 -13 27 29 -23 -110 -161 37 52 45 -52 -91 -7 -1 -16 66 58 -6 -79 -130 -60 29 52 36 -66
5598 -66 -178 -122 -36 4 70 -32 -57 -74 -77 -51 54 80 -2 -130 -156 -37 105 115 -3 -114 -102 -130 -28 95 120 5
5624 5 -63 -160 -81 11 87 96 49 -64 -127 -116 3 133 114 9 -99 -111 -19 93 144 24 -46 -92 -29 -101 79 132 125 -53
5652 -53 -153 -135 71 180 16 8 -21 11 -70 38 140 179 -32 -136 -138 72 47 47 5 13 -55 -85 45 168 193 22
5678 22 -67 -54 14 95 149 123 -9 -94 -76 36 159 108 69 -4 -96 -74 28 111 169 67 -150 -131 14 29 50 46 -35
5705 -35 -72 -102 6 60 70 4 -47 -172 -77 27 95 -13 -87 -84 -42 -72 34 47 109 -93 -268 -55 69 131 14 -122
5731 -122 -86 -36 -118 -57 172 158 26 -194 -145 -36 56 53 -27 -50 -180 -163 -20 123 44 12 -90 -165 -153 6 104 42
5757 42 -60 -144 -110 -23 53 80 60 -56 -166 -149 48 165 32 17 -56 -101 -108 -4 148 146 -42 -114 -122 -34 -5 169 139
5784 139 -13 -253 -189 130 163 21 15 44 -67 -81 -9 140 177 5 -124 -79 68 138 73 124 16 -81 -37 18 109
5809 109 134 55 -94 -47 -130 64 167 107 11 -127 -103 -56 54 91 156 14 -173 -173 -4 165 102 -33 -51 -87 -112
5834 -112 -44 87 155 52 -123 -193 -27 45 105 72 -31 -55 -166 30 71 95 24 -5 -120 -151 -44 125 115 8
5858 8 -135 -101 -62 -28 39 78 36 -89 -173 -42 90 75 7 -38 -170 -124 -89 -11 50 50 -23 -162 -103 -34 81 99 -16
5885 -16 -40 -74 -71 9 24 47 -3 -30 -87 -102 0 99 93 -42 -97 -118 -30 82 73 33 -20 -24 -48 -24 19 82 89 -77 -94 -7 103
5916 103 121 50 -4 1 -56 5 -38 163 159 -15 -116 -44 77 130 89 73 15 -37 34 -30 21 47 43 -44 -61 -13 40 -2 37
5945 37 11 4 29 14 -8 27 2 -12 -3 -104 -39 87 41 66 10 34 45 -22 -9 -14 -16 13 -15 -14 -12 -24 20 2 -20 11 -114 -9
5977 -9 13 -70 -7 13 6 -56 -65 -22 65 -23 -66 34 -29 -21 -124 50 36 -21 -94 -41 56 13 -38 -21 26 27 -148 -87 12 78 65
6008 65 -70 -55 -59 24 20 -18 21 33 -49 -96 -54 -29 17 75 -65 -53 -69 -10 -3 93 1 6 -87 -112 26 101 130 26 -66 -95
6038 -95 -42 19 72 114 40 -64 -116 16 89 110 67 13 -48 -26 -32 118 104 57 5 -70 -22 28 18 176 83 -25 -118 -102
6066 -102 60 170 61 -37 -62 -18 -33 -13 131 107 42 -141 -125 39 118 107 -5 -70 -62 -47 41 96 111 62 -112 -118 -65
6093 -65 20 50 49 -46 -103 -28 17 22 149 51 -36 -62 -84 -3 65 43 -50 -41 -89 -66 3 15 74 52 -70 -159 -55 22 77 42
6123 42 -36 -132 -78 -29 47 69 -22 -54 -111 -152 -53 77 74 2 -41 -86 -44 26 82 57 -37 -53 -126 -24 41 38 79 -75 -121 -74
6153 -74 6 65 -24 20 -138 -29 -70 -53 161 83 -7 -52 -75 34 15 62 29 -18 -40 45 9 11 97 69 38 -65 -90 -33
6181 -33 120 104 -47 -82 -81 0 30 -24 55 132 -14 -108 -53 62 127 3 -13 10 33 -11 58 87 26 -59 -69 -29 49 85
6209 85 8 -55 -1 -49 38 -11 30 123 20 -29 -84 -21 53 79 36 -54 -55 -10 22 59 20 -38 50 -47 -52 -61 50 89 3 -51 -76
6240 -76 -16 8 32 42 1 -69 -43 -14 13 -18 2 49 -122 -131 -62 40 71 -71 -123 -51 -73 -34 52 29 17 -71 -166 -68 51
6269 51 70 -73 4 -37 -67 -83 -80 147 121 -56 -80 -105 79 70 -61 -12 -4 -66 -99 -21 74 80 50 -56 -20 -13 61 99 49 -10
6299 -10 -89 -39 -12 53 20 62 9 -76 -90 26 140 76 41 -27 -20 -41 -24 77 105 -2 -114 -121 33 75 29 70 10 -64
6327 -64 -36 -25 42 99 0 41 1 -62 -33 91 164 22 -101 -75 -22 -17 31 49 58 27 -75 -95 24 13 68 -52 -84 -12
6355 -12 23 -1 33 0 29 -29 -98 -36 48 110 -44 -52 -109 -83 -9 -7 9 -21 -29 -94 -107 -22 80 24 -5 -55 -115 -72 -38 -34 21
6386 21 20 -67 -135 -111 30 49 5 -49 -106 -65 -74 11 -2 42 -30 -73 -76 -58 -18 65 75 -3 -80 -74 21 65 15 7 -24 -67 -47 -26
6418 -26 108 91 34 -7 -22 10 -10 25 26 25 -45 -18 -46 40 127 14 -63 -103 17 5 70 24 -10 -8 -61 39 -35 43 61 64
6448 64 -87 -106 -20 41 83 -27 32 -5 -79 -18 76 63 41 -29 -47 -68 -74 45 61 3 -46 -29 -36 -5 6 -15 -27 -32 -71 -24
6478 -24 21 34 46 4 -88 -77 -58 31 96 24 -57 -127 -70 34 82 27 -25 -21 -13 -35 -50 8 -1 15 -93 -152 -18 28 35 3 -109
6509 -109 -112 -8 -31 36 5 -16 4 -5 -66 -53 -17 18 -21 -71 -125 -32 -22 16 -64 -44 -37 -11 -49 -19 -10 -18 56 -51 -33 28 45
6540 45 10 -21 -1 19 -65 -44 83 -30 2 -19 25 -35 39 -69 7 24 5 -7 -36 17 126 53 4 -73 -27 37 -2 -94
6568 -94 -41 72 65 12 -16 -17 37 26 21 -59 49 -9 -16 58 21 19 -34 23 23 8 -9 -21 31 42 -29 -35 89 28 -19 -10 35 56 -21
6601 -21 42 42 66 -57 -83 -7 69 23 -33 -45 5 13 3 -3 -7 -1 12 -44 -71 -8 26 -30 -108 -38 -39 11 -4 -50 29 -38 -3 -40 24
6634 24 61 -6 -116 -46 -3 -11 -17 -19 5 40 -49 -131 -69 56 46 -60 -87 1 -6 33 -35 1 -37 18 -94 -89 55 22 57 -1
6664 -1 -78 -35 -52 101 44 -25 -10 -35 -33 -26 2 -15 15 8 -78 -75 103 87 50 -44 -96 -51 2 44 79 46 -38 -94 -89 14 59 96
6696 96 90 -68 -72 -65 4 97 17 49 -24 -91 -43 83 109 40 13 -14 -18 -18 58 32 115 13 -66 -132 -18 63 126 1 -36 -98
6726 -98 -59 52 25 15 82 -105 -84 -49 18 65 79 8 -154 -60 29 100 66 -22 -84 -51 -53 -7 17 150 45 -8 -123 -110
6754 -110 17 45 28 -54 -99 -132 -40 56 95 17 -30 -55 -51 -9 20 64 71 8 -72 -107 -88 151 153 14 -86 -103 -44 -15 49
6783 49 48 -41 -14 -76 -65 -9 86 52 -70 -48 -85 -31 74 23 47 -59 -102 -104 10 29 20 29 36 -72 -111 25 92 89 37 -114
6813 -114 -81 -6 86 87 120 -21 -77 -63 5 96 18 91 26 -33 -123 -52 89 128 56 -30 -42 -65 32 44 101 18 -31 -64 -43
6842 -43 -17 52 110 48 -67 -46 -59 -27 98 38 -21 -29 -69 26 -35 128 80 19 -51 -121 26 59 11 67 49 -105 -130 12
6870 12 73 69 -45 -36 -9 -33 17 83 79 -29 -143 -57 4 87 24 25 -10 -86 -106 -94 92 60 24 -90 -62 -46 -41 39 -16 22
6900 22 -38 -97 -97 36 31 -15 -6 -50 -35 -43 50 88 50 -24 -59 -83 -77 84 49 -3 -61 -51 34 -27 -36 10 42 25 -92 -62 9 65
6932 65 -4 -78 7 -16 -57 -28 -37 86 -6 -37 -11 -23 -13 74 34 68 11 -107 -55 24 131 53 -38 -33 28 -13 -43 -6 -26 39
6962 39 -37 -137 -14 38 43 46 41 -9 -57 5 61 69 27 -28 -61 -8 -27 -21 74 32 14 -39 -145 12 57 78 7 -19 -31 19 14
6993 14 -3 17 63 -57 -160 -102 5 90 100 -27 -95 -104 53 69 41 -52 2 -88 -34 13 35 88 -4 -30 -97 -86 39 69
7021 69 13 -35 -64 -111 29 43 30 13 7 -113 -24 -32 17 45 16 -17 -125 -59 -35 2 34 33 -94 -111 -67 28 97 96 -52 -58
7051 -58 -60 -67 -10 74 114 46 -22 -95 9 140 32 -15 -41 -23 -24 31 6 57 -4 -22 -74 -45 -8 77 70 -31 -47 -28 94 28
7081 28 79 94 33 -124 -26 -8 63 36 -16 9 -55 -19 20 91 93 -26 -13 -88 27 59 78 38 -11 -37 -93 -14 38 71 -36
7110 -36 -9 -12 -55 27 61 61 10 -15 -11 -42 52 40 25 -14 -69 -107 0 -16 58 77 -40 -88 -102 -50 8 102 32 -68 -79 -97
7140 -97 -5 62 77 52 -51 -62 -62 7 -5 5 15 -114 -147 -38 40 77 -25 -12 -62 -138 10 26 33 0 -53 -89 -34 -6 29
7169 29 56 -21 -21 -79 -54 -75 104 12 -15 -76 -31 -4 9 112 87 -64 -89 -86 -48 103 60 21 -27 -86 -88 -28 71 126 23
7198 23 -68 -60 58 61 129 106 -77 -51 -59 47 38 56 62 2 -94 -102 42 90 26 30 -42 -33 -53 11 65 121 8 25 -22 -29 40 53
7230 53 68 -57 -40 -92 -39 60 67 -28 -88 -56 -97 18 104 89 42 -63 -120 -2 43 89 27 17 -69 -68 -114 12 82 -10 -3
7259 -3 16 -85 3 60 63 12 30 -62 -69 -65 69 97 -54 -112 -118 70 22 16 75 -15 -20 -56 -85 43 76 38 -43 -135 -115 -11 4
7290 4 50 5 -40 -104 -50 -4 16 8 -25 -57 -82 -94 -22 44 15 -2 -8 -9 -12 43 -28 24 18 -98 -57 46 54 39 13 36 -32 -15 -54
7323 -54 78 63 55 -20 -101 -24 -38 41 29 67 -68 -13 23 3 -48 65 47 -54 -14 25 84 98 -39 17 -92 -2 -70 59
7351 59 81 79 -17 -65 -47 16 96 18 14 2 -65 -41 -68 23 30 28 -2 -52 16 31 52 98 -12 -45 -11 -34 37 49 2 -6 -6 -17 -43
7384 -43 51 57 51 -65 -49 -31 -15 39 27 30 -41 25 -42 -27 39 83 39 -61 -53 -10 48 53 29 -48 -69 -6 17 -64 74 29 -8
7415 -8 -34 -63 -3 -20 41 33 -64 17 37 -3 -16 83 -10 -6 -108 -36 -29 -4 -37 -8 -5 54 1 -32 40 45 -41 -62 -47 36 76 -41
7447 -41 -47 41 -63 -2 12 -42 -12 42 1 -30 -29 32 22 41 27 -20 9 -34 17 -13 44 32 -34 -8 47 38 59 24 39 -34 -14
7478 -14 -36 32 55 0 -13 -66 -33 43 66 -6 2 -27 4 -49 -33 15 -12 16 35 -38 20 -6 116 -4 4 -24 35 108 63 29
7508 29 -5 27 -57 -106 -16 22 68 -1 -75 -38 -8 16 48 104 -1 -32 -76 13 -45 50 37 -48 -61 -71 9 44 16 -8 19 -32
7538 -32 -95 3 49 36 -73 -84 -56 -51 75 -10 -5 -17 27 -57 37 99 19 89 -70 -80 45 -27 86 37 -44 -60 -127 -65 31
7567 31 -18 5 -45 -50 -88 -33 25 113 58 4 -75 -107 55 56 -42 34 -51 -93 -107 3 9 26 -38 -39 -101 33 79 60 14 -70 -100
7598 -100 -71 -38 83 102 45 -94 -109 -13 59 78 52 28 -10 -97 -25 83 78 43 -78 -64 -8 -32 51 23 81 23 -50 -109
7626 -109 -11 93 72 12 -49 -70 -46 82 50 119 -36 -59 -112 -6 64 76 34 1 -43 -90 -33 69 44 5 -95 -57 -49
7653 -49 6 72 93 19 -38 -46 -70 34 9 73 -21 -103 -100 -86 49 37 41 -70 -150 -104 -29 57 97 24 -56 -89 -88 -36 6 -8 -2
7684 -2 -94 -88 -5 20 80 -28 -5 -126 -8 -100 43 17 80 -65 -98 -55 13 71 35 10 -65 -61 -41 -2 -31 122 -20 -17 -82
7713 -82 -100 4 127 48 -8 -31 5 -21 -22 43 66 -38 -101 -113 -27 35 40 107 -31 -31 -6 10 -1 57 -24 -1 -91 -71 -22 34
7743 34 104 18 -24 -54 -14 47 114 41 22 -105 -132 -53 47 68 -11 -27 -92 -34 29 39 39 48 -59 -18 -67 -13 102 -17 35
7772 35 -59 -91 -2 4 50 -28 24 -2 -53 -115 7 -4 5 -1 -75 -31 -10 17 41 11 -23 -101 -64 -77 -3 14 48 -38 -113 -18 -9 60
7804 60 27 -21 25 -94 -66 -13 12 3 29 -149 -147 9 16 -45 -21 26 -84 -120 -82 -1 88 -13 -13 -23 -106 30 5 46 6
7833 6 36 -31 13 -51 4 26 21 -28 -92 -20 8 -6 26 35 73 -18 -49 -43 63 -24 18 -23 -26 -44 -1 62 6 -92 -25 -5 -46 -30
7865 -30 -22 56 0 -64 -57 12 48 17 3 0 18 29 -96 -34 59 21 11 -1 -25 75 65 10 -15 2 5 -33 17 52 46 8 -76 -87
7897 -87 -19 -25 -48 11 -7 -12 -52 0 -24 9 29 -48 -66 4 16 21 -54 -2 16 -79 -32 -74 -35 52 -80 -15 -72 -26 -45 -17 -40
7928 -40 -21 -7 27 -4 60 45 -43 -54 -12 -89 -9 44 39 -47 -101 -13 0 89 4 3 -3 -67 -28 57 -43 -6 27 -47 -32 -44 -55
7959 -55 0 59 -41 -109 -92 9 37 17 51 -38 -76 33 41 9 -39 22 19 -48 -26 18 53 36 2 -71 -56 12 76 23 -44 -8
7989 -8 -37 -5 -59 6 79 36 -37 -16 3 75 18 47 13 -53 22 -15 38 0 -32 1 3 -11 16 51 33 22 -65 -103 1 -88 -43
8020 -43 48 -12 -15 -63 41 80 17 -13 -31 6 -24 -12 24 15 -3 -31 -17 -67 -31 -15 67 -54 -21 -6 25 -22 25 -84 -9 -8
8050 -8 -22 -6 21 25 -39 -15 -53 -52 32 38 18 33 -16 -14 -17 -26 -12 -45 1 -26 -108 -3 11 12 36 -70 -20 -2 72 -9 -4 -46 -14 -68
8084 -68 -81 13 -9 -24 -46 -30 -32 -3 15 8 -28 -37 -35 -29 -2 51 -28 -23 12 36 7 25 28 21 9 -54 -13 -40 71 56 -11 -23 -25 -65
8118 -65 51 -3 -10 -20 11 -3 -49 16 61 48 -17 -94 -62 24 83 -1 12 17 -28 35 20 51 42 -12 -67 -3 2 5 85 -7 26 -17
8150 -17 -10 27 -27 0 2 -19 -1 -5 35 11 -16 -60 -67 18 6 12 -71 -44 -29 0 32 -3 44 -46 -81 -24 4 9 7 -35 -48 -30 -33 -95
8184 -95 -25 10 13 -46 -30 11 19
8191A9
$$ Imaginary data points
##PAGE= N=2
##DATA TABLE= (X++(I..I)), XYDATA
0 0 0 0 0 0 0 0 0 0 0 0 0 0 0 0 0 0 0 0 0 0 0 0 4 -6 5 -6 7 -7 7 -7 8 -9 12 -12 13 -14 15 -18 19 -21 22 -25 27 -32
44 -32 35 -39 44 -49 55 -67 78 -91 112 -140 183 -249 362 -584 1107 -2850 19203 133182 87090
63 87090 -35293 -44959 307 -24055 -52390 20115 94627 38171 -65464 -64077 4335 21007
75 21007 8528 38181 50446 -23858 -91006 -40012 51831 51623 -6710 -12084 15817 -4144 -37060
88 -37060 -4217 47782 25401 -34847 -33932 12891 22148 1384 10213 24264 -11423 -50085 -15342
101 -15342 47426 40723 -16957 -33592 -6277 1112 -6473 17971 44162 10911 -46512 -46692 511
114 511 25003 21824 26619 19516 -28279 -62990 -21466 47688 53117 4037 -23607 -17971 -18925 -19136
128 -19136 13939 50438 33707 -20841 -48014 -29512 1176 23549 34978 22102 -15782 -41047
140 -41047 -24092 10813 25073 18480 7063 -10445 -29888 -25327 8035 32864 21497 -5024
152 -5024 -17405 -17379 -13471 1423 21912 20890 -6607 -25622 -13280 7884 12441 7480 4720 -3405
166 -3405 -16855 -15159 5521 18394 8537 -5626 -8627 -8747 -8277 3840 19328 11894 -14461 -23587
180 -23587 -4939 12593 11455 6810 5861 -4427 -19554 -14366 10014 21692 9152 -5424 -9577
193 -9577 -11979 -10568 5679 23031 14782 -11277 -21228 -8533 3205 6156 12001 15454 594 -19567
207 -19567 -16431 5978 16386 7892 823 213 -6202 -13241 -3305 15637 16657 -1341 -12717 -7731
221 -7731 -822 1075 5496 9904 3328 -8320 -8056 2113 5837 2128 2251 3641 -3365 -10276 -2267
236 -2267 11659 10431 -2995 -7713 -1178 1878 -726 1494 6111 1684 -7009 -5401 3520 5115 -40
251 -40 -448 2167 -2026 -7588 -2526 7540 7412 -1843 -6509 -3173 671 2205 3255 1882 -2372 -3379
267 -3379 282 1074 -2528 -1517 4847 3617 -6684 -9842 728 8649 2382 -5445 -2525 2487 -499
282 -499 -4059 136 3723 -430 -3748 489 3033 -2271 -4433 2620 5866 -2496 -8664 -1706 5653
297 5653 759 -6096 -1700 5534 2737 -3912 -2930 1376 192 -1688 2061 3681 -2705 -6455 574
312 574 6729 1351 -5140 -858 4693 -589 -7532 -2550 6802 5490 -2733 -4623 -589 1191 1411 4175
328 4175 3998 -3126 -6936 -164 6392 1841 -4127 519 6153 -543 -9374 -2757 11206 10009 -5270
343 -5270 -11396 -1536 6731 3391 -809 2147 3478 -2474 -6278 -208 7345 6050 -1002 -4729 -3635
358 -3635 -1485 1425 5346 6577 1718 -5538 -7552 -1755 6117 8051 2138 -5234 -6507 -1812 2644
373 2644 3834 4273 3793 -1171 -8314 -7978 2102 10491 7365 -2291 -7461 -5795 -1323 4126 8262 5537
389 5537 -4146 -10593 -6082 2656 5492 3856 3022 -117 -8250 -11517 -675 13431 12112 -3360 -13061
404 -13061 -7504 2028 4702 4163 4827 1786 -7336 -12436 -4493 8907 12570 2966 -8482 -11200 -5333
419 -5333 2353 6948 7251 2778 -5289 -11230 -7818 4377 13416 8954 -4357 -12104 -8228 203 5442
434 5442 7314 6206 -603 -10521 -12266 -1134 11598 12109 1464 -8501 -10527 -5694 3161 11124 10695
449 10695 278 -10217 -10669 -2473 5805 9423 7896 241 -10378 -13150 -2215 11947 13826 3018
463 3018 -7696 -10204 -6029 1102 9142 12063 4573 -8060 -13265 -5681 6572 12536 8472 -1139
477 -1139 -9217 -9951 -2657 7083 11829 8130 -1969 -11564 -12082 -839 12323 14005 2722 -8959
491 -8959 -10204 -3987 2547 7268 9385 4788 -6296 -13693 -7828 6352 14602 9855 -2343 -11466
505 -11466 -10608 -1328 8574 10533 3976 -4159 -8377 -7875 -2361 7009 12716 6369 -7842 -14723 -7294
520 -7294 5089 10436 7582 884 -6668 -10877 -5800 6015 12229 6109 -4376 -9352 -7705 -2812
534 -2812 4372 10275 7401 -4121 -12773 -9361 1784 9568 8973 1794 -7429 -11776 -6013 5431 10941
549 10941 6053 -2069 -6668 -7741 -5600 1945 10768 9976 -2573 -13618 -10991 1079 9825 9475 3085
564 3085 -4831 -10030 -7707 1257 8765 8421 2212 -4638 -8922 -7866 519 10951 11981 804 -11075
579 -11075 -11416 -1849 6659 8061 4485 -547 -5522 -7480 -3308 5032 9957 6136 -3244 -9121 -6315
594 -6315 1345 6702 6810 2949 -3040 -7555 -5322 3711 9920 5087 -4422 -6577 -1629 1082 839 3962
610 3962 7459 1590 -9533 -9424 3567 11521 5147 -3517 -4333 -2936 -3463 597 9164 9359 -2290
625 -2290 -10361 -5326 2387 3391 3758 6568 2645 -9289 -12369 511 11881 7696 -1568 -3321 -3299
640 -3299 -6877 -4319 7853 12673 1105 -9739 -5702 1467 -470 -976 7419 9219 -4962 -14883
654 -14883 -3910 9906 5713 -4311 -1616 3955 -2843 -9458 109 11117 3757 -8787 -4837 5451
668 5451 1964 -6448 -922 8158 1171 -10430 -4050 9858 6437 -7746 -7776 3370 3613 -4647 -1909
683 -1909 7671 3834 -9064 -8626 4248 7911 23 -2466 1739 -1117 -8239 -4092 7787 8824 -923
698 -923 -5166 -1975 -2452 -4352 2216 9800 3984 -7672 -6868 2319 2494 -2940 1402 9295 2874 -10822
714 -10822 -9048 5440 8927 -1057 -3788 3737 3537 -6119 -6525 4587 8129 -789 -5061 1497 3757
729 3757 -3046 -4595 3414 6665 -679 -4923 612 4011 -1138 -4392 877 5462 1979 -2324 -792
744 -792 1132 -1074 -2230 1521 4487 1726 -2201 -2107 -38 467 28 965 2414 1703 -1194 -3965 -2932
761 -2932 1865 5147 2389 -2453 -2295 1511 1144 -2934 -2331 3744 5402 -1018 -5885 -2513 2592 2061
777 2061 -401 365 1416 -876 -3075 -1784 167 472 1517 3157 719 -4089 -3931 1412 3382 38
793 38 -1372 1136 377 -4275 -4113 2201 5004 635 -2358 -502 -739 -4172 -2702 4343 5733 -1347
809 -1347 -5649 -1721 2068 256 -788 2338 2602 -2566 -5083 -1205 2153 1169 890 2168 -541 -5328
825 -5328 -3290 4225 5383 -1834 -4898 308 3102 -1499 -3546 2127 5480 -90 -5603 -2374 3176
840 3176 3012 -146 -852 -736 -1736 -564 3028 3299 -789 -2597 -176 708 -965 159 3877 2820
856 2820 -3439 -5481 202 4909 3296 346 -252 -1388 -3659 -1664 4058 5893 1535 -3005 -3350 -2024
872 -2024 120 3596 5491 2009 -3712 -4906 -2029 787 3127 5759 3853 -4082 -8736 -2541 6365
887 6365 6319 607 -1235 -389 -3474 -5868 450 9031 6829 -3388 -7758 -3276 1058 1895 3826 4861
903 4861 -676 -7836 -6130 2468 6311 2924 3 -705 -3804 -6210 -819 7606 6777 -2338 -7094 -3659
919 -3659 -143 862 3513 5612 419 -7880 -7443 1296 6417 3682 290 -1360 -4559 -6352 -428
934 -428 7839 7018 -1713 -6412 -4487 -2181 -90 5174 8167 821 -9949 -9290 1679 7535 3897
949 3897 391 104 -3389 -8361 -4152 7441 11134 1597 -7691 -6811 -1779 850 3665 7302 4425
964 4425 -5680 -10779 -3483 6245 7572 2872 -868 -3622 -6356 -4322 3836 9498 5287 -3444 -7434
979 -7434 -5151 -127 5274 8000 4027 -4574 -8691 -3529 3862 6256 4567 1454 -2946 -7086 -5257
994 -5257 3224 9334 5962 -2345 -6827 -5280 -756 4282 7490 4915 -2795 -8151 -5108 2370 6491
1009 6491 5180 1537 -2413 -5634 -5380 553 7551 7780 165 -7295 -7380 -1183 4681 6201 3447 -1240
1025 -1240 -5115 -5457 -1399 4488 6843 3306 -2999 -6427 -4671 378 4987 6171 2450 -4168 -8032
1040 -8032 -4372 3578 7146 3146 -2594 -4101 -2923 -2008 193 4736 6350 271 -7651 -7488 470
1055 470 6445 4750 -168 -3025 -3806 -3497 -705 4007 5466 1041 -4620 -5722 -2106 1987 3893 3295
1071 3295 532 -3523 -5543 -2517 3305 5722 2602 -2818 -5126 -3116 613 3052 3161 1407 -1386
1086 -1386 -3656 -3264 -60 3627 4201 890 -3359 -4529 -2013 2191 4300 2858 -929 -3571 -2801 158
1102 158 2317 2328 1372 314 -1758 -3275 -1453 3135 5210 1708 -3493 -4032 -504 2393 2169 1083
1118 1083 481 -696 -2291 -1795 1255 3595 2640 -478 -2596 -2218 90 2330 2795 1135 -1059 -1897
1134 -1897 -1103 330 1775 2420 1046 -1682 -2908 -859 1924 2286 676 -405 -297 -885 -1297 296
1150 296 2764 2343 -942 -2982 -1489 1217 1954 841 -80 -739 -1138 -911 42 930 949 411 -703 -1884
1168 -1884 -1451 913 2644 1072 -1808 -2032 133 912 -255 -482 832 636 -1735 -2428 311 2514
1184 2514 873 -1885 -1697 213 442 -703 -351 1018 547 -1590 -1874 176 1486 647 -661 -932 -789
1201 -789 -654 97 1060 681 -921 -1159 57 466 -575 -459 1187 1180 -1462 -2811 -38 2822 1474 -1874
1219 -1874 -1938 866 1464 -797 -1310 939 1849 -366 -1909 -342 1607 891 -560 -415 378 -38 -365
1236 -365 296 786 -60 -553 283 818 83 -118 557 389 -533 0 1541 931 -1125 -871 1658 1452 -1542
1255 -1542 -1434 2282 2623 -1912 -3510 1174 4163 426 -3231 -387 3028 680 -2621 -336 3112
1270 3112 914 -2354 -535 2413 494 -2336 332 3231 -48 -4064 -676 4380 1486 -4449 -2443
1285 -2443 4082 3342 -2997 -3287 2385 2956 -2391 -3118 2229 3584 -1328 -3363 253 1891 -820 -1087
1301 -1087 2177 1705 -3206 -3967 1123 3558 280 -1821 309 544 -2516 -2446 2042 3451 -329 -2733
1317 -2733 -986 -227 -1542 -48 3793 2613 -3428 -5075 150 3531 624 -1683 587 1490 -2131
1332 -2131 -3775 340 4252 1953 -2340 -2764 -762 155 678 1778 1346 -1404 -2904 -888 1781 1965
1348 1965 673 -351 -1201 -1902 -970 1344 2634 1692 -698 -2877 -2955 35 3776 3761 -254 -3232 -2107
1365 -2107 -17 434 1527 3621 2350 -2830 -5334 -1179 3866 3695 979 -103 -1259 -3810 -2989 2892
1381 2892 6440 2190 -3656 -3637 -175 652 639 3218 3895 -1091 -5890 -3062 3139 4677 1721 -330
1397 -330 -1389 -3332 -2785 2096 5567 2552 -2598 -3596 -1699 -461 1512 4640 3786 -2365 -6231 -2416
1413 -2416 2912 3280 1611 1526 -488 -4989 -5131 1995 7195 3354 -3153 -3796 -1381 -1357 -561 3844 5448
1430 5448 -583 -6652 -4356 1922 3681 1748 1147 -85 -4096 -5371 228 5941 4082 -1798 -3589
1445 -3589 -2233 -1804 -395 3779 5136 -504 -6473 -4782 1125 3460 2373 1829 232 -4174 -6057
1460 -6057 -924 5569 5479 87 -3689 -3865 -2755 181 4229 5044 563 -4422 -4505 -1483 1202 3258
1476 3258 4398 1344 -4701 -6360 -920 4782 4498 783 -1624 -2535 -3165 -1220 3252 5094 1753 -2792
1492 -2792 -3962 -2232 511 3555 4610 995 -4312 -4873 -266 3446 3105 1686 379 -2393 -4527
1507 -4527 -1672 4307 5637 1113 -2977 -2955 -1633 -370 2539 5193 2604 -3649 -5745 -1438 3225
1522 3225 3919 2426 270 -2812 -4373 -1336 3510 4384 1434 -976 -2094 -3539 -2542 3255 7195 2498
1538 2498 -5383 -5814 140 3104 1265 1248 2730 -413 -5866 -4404 3034 6113 1888 -2137 -2147 -2234 -2679
1555 -2679 680 5584 3920 -3161 -5663 -1021 2263 812 328 2524 1078 -4458 -5237 1251 5627
1570 5627 2175 -2673 -2528 -549 -987 -685 2480 3441 -924 -4825 -2701 1770 2764 1076 -34 -808
1586 -808 -2377 -2448 443 3091 2279 -413 -2480 -2970 -1652 1711 4219 2130 -2514 -3928 -1191 1173
1602 1173 887 1088 2155 538 -3448 -4028 598 4465 2971 -1015 -2465 -1665 -807 262 2137 2471
1618 2471 76 -2365 -2042 -54 1364 1698 1417 16 -1988 -2083 265 2477 2038 -25 -1302 -1111 -470
1635 -470 496 1547 1529 161 -1348 -1485 -134 1374 1856 801 -847 -1472 -573 647 1160 1011 749 -270
1653 -270 -1560 -1225 1036 2484 1070 -1252 -1504 -55 612 297 559 1111 274 -1428 -1601 409 1931
1670 1931 1255 -486 -1247 -777 121 546 591 442 11 -522 -1029 -584 631 1327 302 -1170 -1276 -36
1688 -36 619 137 -246 244 154 -1000 -1085 302 1259 231 -1087 -825 220 208 -331 -140 336 -108 -907 -482
1708 -482 621 345 -708 -713 89 163 -520 -291 451 232 -956 -1067 347 1141 178 -1073 -822 99 305
1727 305 7 117 285 -142 -748 -602 403 843 407 -434 -730 -463 -79 495 826 542 -490 -1115 -620
1746 -620 739 1416 586 -503 -804 -259 163 313 753 1025 260 -1159 -1462 -28 1882 1836 -30 -1366
1764 -1366 -1086 -120 823 1213 1185 267 -966 -1372 -263 1102 1798 1248 -224 -1545 -1591 12 1960 2189
1782 2189 527 -1413 -1811 -735 810 1765 1634 290 -1546 -1971 -616 1252 2065 1475 -142 -1792
1798 -1792 -2314 -657 1989 3103 1055 -1971 -2756 -1068 986 1763 1509 628 -1053 -2580 -2129 615
1814 615 3018 2586 -572 -3013 -2847 -524 1965 2769 1265 -1297 -2829 -2268 -169 1994 2697 1219
1830 1219 -1478 -3473 -2668 662 3260 2797 -139 -2739 -3126 -1423 1327 3087 2439 -544 -3345 -3303
1846 -3303 -552 2371 3170 1547 -1247 -3444 -3176 -117 3189 3592 784 -2491 -3655 -2145 898 3502
1862 3502 3586 37 -3775 -4030 -579 2637 3082 1735 -122 -2523 -4113 -1792 3485 5730 1834 -3776
1878 -3776 -4503 -1142 1693 2420 2688 1922 -1530 -4863 -3313 2332 5592 3133 -1389 -3532 -2935 -940
1894 -940 1972 4338 3389 -1122 -4613 -3487 593 3698 3868 1661 -1844 -4150 -3023 1220 4591 3828
1910 3828 107 -3175 -3641 -1652 1768 4279 3598 -429 -4194 -4014 -361 3385 4349 1941 -1963 -4195
1926 -4195 -2906 795 3525 3578 1236 -2183 -4270 -3164 1287 5139 3820 -1129 -4442 -3252 -219
1941 -219 2013 3058 2728 -228 -4107 -4769 -392 4410 4306 450 -2956 -3413 -2066 257 2892 3749
1957 3749 1124 -3284 -4933 -2025 2441 4149 2324 -1096 -3424 -3196 -747 2130 3410 1994 -1205
1972 -1205 -3685 -3401 -172 3296 3748 812 -2722 -3752 -1760 1314 2960 2355 -77 -2555 -3029 -1237
1988 -1237 1430 3061 2287 -531 -3094 -3199 -187 2902 3166 618 -2033 -2672 -1495 623 2347 2442
2004 2442 585 -2053 -2909 -1279 1543 3001 2047 -460 -2488 -2290 -237 1983 2656 1337 -791 -2352
2020 -2352 -2072 202 2697 2707 283 -1861 -1791 -521 544 1439 2133 1291 -1419 -2961 -975 2327 2837
2037 2837 511 -1310 -1202 -487 -103 700 1858 1493 -650 -2170 -1232 784 1774 1317 198 -1191 -1759
2054 -1759 -764 1181 1989 833 -735 -1365 -879 -237 579 1384 1208 -439 -1859 -1470 348 1466 1150
2071 1150 97 -750 -1139 -933 93 1058 1066 -119 -1041 -991 -309 345 510 389 -2 -720 -996 -334 673
2090 673 768 -98 -802 -758 -112 227 359 348 -301 -895 -740 178 645 174 -240 -250 -560 -993 -326 1045 1257
2111 1257 -281 -1420 -787 304 274 67 576 725 -632 -1525 -396 1028 857 -271 -196 109 -478 -909
2129 -909 212 1307 608 -820 -580 376 197 -493 260 1076 252 -924 -320 918 402 -756 -183 1042
2147 1042 458 -913 -242 1287 661 -1121 -572 1377 1041 -895 -929 978 986 -792 -798 1207 1422 -753
2165 -753 -1393 593 1462 -144 -910 398 1210 -304 -1163 287 1274 211 -790 -68 599 -116 -544 393
2183 393 692 -274 -660 464 695 -347 -777 222 793 -152 -563 297 685 -389 -854 128 796 138 -397
2202 -397 -39 -131 -788 -364 978 1005 -565 -1112 -57 348 -418 -323 1061 938 -1134 -1879 -123 1344 549
2221 549 -418 -105 124 -1003 -1412 335 1889 704 -1318 -1456 -111 453 71 238 592 -43 -1077 -1278
2239 -1278 -118 1140 1298 62 -1416 -1406 55 1176 651 -355 -354 -58 -728 -898 623 1941 798
2256 798 -1488 -1831 -113 1010 841 710 552 -881 -1973 -592 1775 1980 77 -918 -557 -715 -958
2273 -958 740 2743 1729 -1592 -2757 -533 1633 1330 674 668 -219 -1977 -1738 1052 2990 1669 -939
2290 -939 -1643 -958 -210 670 1860 1802 -281 -2224 -1761 310 1929 1986 822 -1142 -2264 -1231 1077
2307 1077 2093 1272 -103 -892 -1433 -1417 330 2691 2332 -772 -2900 -1870 723 1808 1427 588 -461
2324 -461 -1810 -1954 -116 2129 2308 349 -1708 -2279 -1152 890 2201 1759 -443 -2229 -2038 -489
2340 -489 1215 1974 1333 -592 -2377 -2222 -100 1902 2186 534 -1465 -2378 -1557 386 2125 2002 181
2357 181 -1804 -2356 -1305 849 2336 1814 -512 -2455 -2142 -223 1441 1790 1065 -388 -1994 -2421 -443
2374 -443 2194 2648 533 -1767 -2136 -930 443 1509 1785 635 -1365 -2353 -1202 1091 2380 1611
2390 1611 -397 -1976 -1879 -278 1540 1915 1009 -526 -1689 -1652 -136 1808 2425 871 -1506 -2160 -989
2407 -989 966 1828 1489 202 -1106 -1845 -966 957 2286 1721 -228 -1862 -1770 -50 1622 2011 924
2424 924 -714 -1605 -1252 78 1520 1996 893 -1006 -1996 -1154 748 1918 1620 180 -1333 -1796 -883
2441 -883 889 1969 1422 -303 -1609 -1494 -273 1106 1713 1028 -561 -1680 -1505 -23 1450 1670 452
2458 452 -1150 -1730 -1047 510 1635 1255 -122 -1374 -1483 -645 674 1384 1037 -180 -1467 -1678 -496
2475 -496 1167 1745 630 -1192 -1858 -934 410 1091 818 112 -733 -1444 -1292 237 1684 1357 -372 -1669
2493 -1669 -1420 -98 843 1088 676 -334 -1388 -1422 -5 1311 1210 166 -844 -1083 -764 30 991 1298
2511 1298 357 -1037 -1599 -512 928 1434 646 -578 -1062 -703 59 640 917 746 -49 -1082 -1177 133
2529 133 1499 1390 -82 -1077 -781 24 450 783 893 303 -849 -1184 3 1068 1049 179 -245 -509 -688
2548 -688 -259 988 1550 333 -1064 -1059 185 706 529 283 372 -162 -953 -625 775 1393 439 -726 -743
2567 -743 -30 165 224 701 747 -171 -1112 -757 700 1088 340 -552 -454 -87 -192 -291 419 910 231 -1020 -1196
2588 -1196 158 1102 531 -493 -494 -54 -185 -477 -10 748 439 -675 -1029 -271 467 344 13 -215 -459
2607 -459 -567 -378 244 482 48 -380 -355 -303 -277 112 470 175 -470 -797 -175 345 181 -8 17 -38 -429 -510
2629 -510 53 612 289 -274 -405 -224 -46 85 342 213 -184 -379 -113 51 -19 179 468 113 -591 -557 331
2650 331 697 40 -346 110 367 -287 -544 249 988 364 -652 -487 437 522 -84 -148 427 428 -343 -590 91
2671 91 740 521 -59 -268 -66 104 117 214 172 62 48 -20 -103 -82 330 623 252 -466 -455 253 671 209 -219
2694 -219 44 249 -75 -398 77 670 529 -301 -597 -150 349 227 176 237 -34 -452 -431 104 411 242 -77
2715 -77 -179 -311 -489 -223 474 584 -74 -622 -441 -166 -135 43 525 409 -627 -1004 -247 582 282 -316
2735 -316 -29 307 -423 -1103 -233 1045 681 -637 -965 -180 142 -174 -25 468 44 -697 -599 190 290 -85
2755 -85 142 224 -539 -1187 -65 1375 749 -948 -977 344 450 -456 -176 1135 740 -1217 -1534 302 1448
2774 1448 494 -360 29 30 -997 -728 1032 1632 218 -1166 -670 134 32 204 1182 990 -704 -1584 -439
2793 -439 989 894 456 414 -145 -1254 -1079 836 1755 565 -720 -606 -128 -371 -14 1192 1526 -195
2811 -195 -1571 -824 580 879 475 522 101 -1015 -1064 481 1518 691 -502 -516 -217 -540 -170 1150 1508
2830 1508 -231 -1693 -973 682 926 379 117 -29 -802 -1264 -29 1436 1247 -189 -1156 -983 -424 320
2848 320 1091 977 -150 -1328 -1213 -215 721 1147 835 -389 -1678 -1333 230 1297 826 106 -402 -1021
2866 -1021 -1417 -371 1506 1624 -214 -1623 -1178 0 258 545 954 500 -1173 -1836 -494 1217 1231
2883 1231 97 -609 -658 -808 -463 763 1333 394 -1034 -1254 -359 480 734 806 222 -655 -1213 -448 766
2902 766 1101 430 -507 -966 -700 96 857 953 347 -503 -823 -586 62 961 1182 134 -1067 -955 70
2921 70 772 644 480 198 -600 -1024 -396 1052 1364 289 -677 -594 -107 113 491 973 668 -557 -1285 -445
2941 -445 883 1210 479 -285 -475 -370 -153 355 787 751 -61 -817 -806 44 898 914 70 -587 -643 -215 158
2962 158 533 598 109 -455 -709 -227 329 615 378 -166 -696 -637 -30 630 591 -36 -494 -495 -245 15 379 478
2984 478 57 -640 -858 -143 578 453 58 -238 -574 -625 -283 479 738 78 -632 -640 -280 111 423 461 3
3005 3 -682 -665 -137 330 395 284 156 -451 -912 -388 683 892 -148 -755 -360 122 -21 -37 402 526 -255
3026 -255 -944 -486 472 707 250 -230 -395 -359 63 506 476 100 -254 -287 -170 -42 286 729 444 -594 -865
3047 -865 -59 783 609 86 17 2 -338 -383 359 955 511 -448 -670 -128 337 448 385 279 -26 -476 -318
3068 -318 252 660 498 69 -438 -452 -57 452 665 268 -219 -393 -251 32 279 490 402 -171 -606 -438 298
3089 298 591 391 -42 -433 -417 -76 316 391 189 -102 -279 -422 -270 191 632 310 -473 -746 -176 391 280
3110 280 -66 12 50 -352 -546 -26 558 410 -306 -676 -371 117 181 17 -35 37 -211 -406 -227 232 457 84
3132 84 -461 -480 -80 216 157 -88 -100 -146 -243 -368 -37 286 162 -227 -342 -149 60 59 -52 -8 -3 -73 -194 -5
3156 -5 222 176 -80 -197 -15 47 20 2 26 -4 -95 31 61 -2 -53 41 20 121 103 7 44 -1 -65 -4 157 346 235
3183 235 -100 -296 48 400 372 -76 -113 97 127 -86 -15 397 517 -56 -554 -245 427 596 72 -186 -53
3204 -53 25 -168 -75 415 564 23 -643 -369 262 469 156 85 -45 -278 -476 -134 568 637 43 -635 -480 -130
3226 -130 299 250 277 102 -442 -635 -264 344 651 374 -295 -659 -641 11 475 563 115 -347 -687 -480 94
3247 94 601 525 -37 -510 -726 -330 219 545 557 -80 -811 -886 -123 610 540 50 -284 -520 -616 -293 511 942
3269 942 281 -741 -1071 -313 401 493 333 154 -433 -936 -589 539 1086 426 -524 -755 -392 -100 246 710
3289 710 640 -333 -1024 -733 298 942 658 115 -499 -714 -479 332 934 600 -110 -566 -692 -178 357 922
3309 922 812 -194 -1002 -655 274 802 641 238 -161 -550 -682 -25 954 1088 119 -791 -725 -186 343 751
3329 751 784 168 -702 -938 -113 674 884 370 -140 -658 -744 -98 874 957 111 -677 -638 -255 116 503 808
3350 808 379 -713 -1152 -262 740 851 220 -323 -459 -604 -386 416 1083 557 -627 -1078 -462 293 576
3369 576 572 290 -511 -1053 -570 394 866 442 -162 -511 -796 -593 258 1065 653 -524 -1082 -520 228 439
3389 439 347 288 -48 -844 -948 -53 923 754 -282 -836 -599 -144 272 385 373 -98 -604 -764 -236 474 713
3410 713 332 -420 -852 -515 309 686 539 -96 -456 -596 -365 219 878 709 -139 -894 -670 110 640 644 359
3431 359 -113 -571 -616 -77 708 801 227 -492 -663 -155 388 646 562 62 -464 -500 -75 458 630 467 -69
3452 -69 -571 -491 27 671 736 158 -567 -665 -65 429 520 325 77 -262 -478 -385 316 897 505 -372 -832 -343
3474 -343 436 585 224 13 -131 -403 -525 76 703 705 -161 -771 -452 68 408 307 220 -113 -480 -512 -44
3495 -44 523 582 14 -596 -602 -204 195 358 316 -78 -401 -588 -246 262 528 264 -285 -716 -543 -72 345 447
3517 447 26 -355 -507 -324 37 274 375 17 -477 -538 -281 336 447 201 -190 -424 -345 -45 217 288 77
3538 77 -294 -387 -247 98 304 372 84 -413 -616 -48 522 425 -16 -253 -116 -73 -139 169 677 475 -356 -745
3560 -745 -78 461 364 50 167 177 -238 -455 118 765 424 -371 -433 114 241 -12 100 395 198 -388 -352
3581 -352 257 513 95 -169 13 50 -122 -57 340 313 -87 -357 33 151 -16 53 324 178 -229 -327 145 419
3603 419 62 -195 -20 138 -110 -201 178 233 -19 -261 -34 104 -35 -126 55 74 -168 -215 210 180 -261 -383
3625 -383 7 272 -99 -204 26 225 -270 -412 49 346 35 -380 -238 111 -33 -232 71 265 -34 -490
3645 -490 -192 190 86 -207 -165 20 -45 -260 -42 218 115 -294 -322 11 8 -33 99 194 -297 -543 -94 420
3667 420 302 -200 -200 45 -113 -323 -6 535 350 -348 -667 -154 338 302 165 102 -77 -389 -263 232 501
3688 501 273 25 -249 -390 -178 221 575 394 -154 -444 -205 78 243 389 336 -109 -552 -378 252 669
3708 669 327 -63 -243 -265 -230 110 632 602 -69 -594 -404 116 507 514 241 -133 -585 -452 96 576 537 119
3730 119 -242 -495 -352 71 714 742 29 -732 -682 -68 454 552 330 -79 -431 -616 -267 428 787 347 -417
3751 -417 -870 -445 262 563 396 -15 -318 -484 -488 19 656 679 -170 -877 -690 -65 424 485 283 -155 -708
3772 -708 -780 -265 668 716 57 -637 -780 -373 124 519 534 21 -549 -799 -348 343 674 522 -185 -753 -724
3793 -724 -65 566 702 226 -430 -685 -517 38 536 671 231 -523 -794 -417 310 811 636 -100 -685 -585
3813 -585 -56 501 618 291 -109 -568 -602 -141 667 934 283 -541 -703 -235 393 542 440 107 -339 -561
3833 -561 -283 450 790 486 -188 -650 -498 164 599 623 190 -152 -471 -438 101 645 655 118 -558 -662 -67
3854 -67 395 524 261 43 -383 -537 -260 490 762 321 -464 -605 -245 189 382 364 161 -297 -613 -355 238
3875 238 565 342 -162 -382 -420 -220 286 499 261 -340 -639 -269 132 214 165 101 -120 -568 -505 109 615 295
3897 295 -307 -520 -359 -46 97 190 168 -77 -445 -486 -16 365 349 -1 -407 -498 -210 110 308 164 -118 -264
3919 -264 -343 -199 170 315 249 -167 -454 -301 165 322 167 45 -178 -286 -367 108 464 284 -129 -405 -226
3940 -226 114 193 159 177 25 -204 -281 15 410 388 41 -103 -196 -108 88 418 335 23 -327 -192 94 139 77
3963 77 164 86 -174 -316 -14 404 382 0 -269 -123 -4 76 196 215 158 -229 -275 29 246 267 132 34 -125
3986 -125 -249 -65 250 292 20 -230 -131 -43 21 116 184 81 -218 -285 -67 237 203 44 -18 -89 -287 -183 162
4009 162 319 69 -246 -312 -25 122 76 68 36 -103 -239 -150 39 163 78 -96 -162 -169 -110 193 219 -105 -246 -84
4033 -84 -10 -38 -149 132 140 -127 -262 -177 189 174 -140 -149 19 -9 -151 -76 182 147 -122 -271 -11 187 115 -28
4057 -28 -17 12 -38 -81 49 196 111 -120 -108 -97 68 40 95 29 20 6 30 17 71 50 35 10 -76 50 63 69 -13 -44 10
4086 10 78 109 183 59 -107 -30 215 186 71 -45 23 173 -37 -147 182 364 24 -294 -112 210 242 70 13
4109 13 19 15 -136 -106 177 269 88 -242 -225 -34 207 138 78 -14 -108 -123 -84 132 212 101 -30 -326 -195 43 264
4134 264 161 -165 -254 -197 -148 -80 118 234 -42 -407 -366 29 272 243 -2 -223 -292 -210 -46 158 300 76 -245
4157 -245 -389 -217 56 293 329 47 -393 -436 -106 279 251 98 -162 -240 -258 -166 152 388 241 -329 -496 -216
4179 -216 222 346 126 -79 -165 -236 -211 37 417 424 -107 -458 -322 18 320 324 144 -96 -409 -309 -4 337
4201 337 412 159 -312 -480 -226 292 554 360 -62 -250 -230 -65 214 426 422 -42 -489 -364 199 511 299
4222 299 44 -48 -186 -310 3 467 536 34 -351 -304 -58 263 402 370 84 -380 -426 107 455 312 63 -77
4244 -77 -160 -368 -185 471 605 102 -463 -409 44 208 200 265 102 -232 -474 -236 264 420 142 -177 -189 -314
4266 -314 -97 239 396 101 -286 -341 -162 32 129 240 183 -270 -490 -137 219 272 20 -50 -207 -252 -117 112
4288 112 413 198 -267 -463 -164 121 203 117 33 -177 -333 -273 24 263 186 -82 -314 -329 -149 152 367 132
4310 132 -187 -297 -199 -61 187 165 200 -52 -357 -236 8 311 224 -36 -177 -251 -87 141 283 213 63 -187
4332 -187 -223 -27 164 311 173 -38 -188 -74 28 232 302 94 -91 -207 -15 197 277 135 132 -90 -154 -64
4354 -64 193 389 221 -176 -170 -131 45 168 325 251 -145 -268 -133 171 332 108 -21 -88 -133 -213 62 305 317
4377 317 -111 -362 -182 100 195 173 83 2 -91 -213 -24 165 231 59 -207 -258 -173 104 186 70 -39 -114 -233
4400 -233 -159 9 276 202 -146 -403 -157 53 168 64 39 -78 -174 -224 -18 273 210 -95 -289 -173 34 35 102
4423 102 63 -25 -264 -288 -29 214 141 15 -81 -209 -208 -79 199 239 -53 -303 -183 -39 10 74 138 14 -130 -275
4447 -275 -96 184 326 72 -122 -217 -147 97 155 106 33 -7 -53 -212 -66 144 268 32 -260 -228 115 139 76
4470 76 109 115 4 -151 -48 175 277 28 -86 -128 -30 50 101 129 135 52 -207 -87 120 272 131 92 -73 -76 -102
4495 -102 49 143 138 -2 -22 -109 -85 29 182 213 -50 -119 -174 25 120 53 32 47 -35 -82 -51 107 160 154 -8 -153
4521 -153 -128 20 30 37 -29 -78 -104 -79 -32 20 135 76 -78 -238 -154 124 126 58 -104 -75 -56 -50 -98 32 180 7 -301
4548 -301 -271 -66 147 75 -33 -79 -111 -248 -152 34 192 140 -125 -243 -71 46 34 54 59 -52 -215 -149 30 186
4572 186 145 -31 -113 -158 -100 84 233 71 -18 -104 -86 -15 4 125 211 111 -158 -202 32 185 162 18 -56 -43 -41
4597 -41 35 133 281 135 -36 -160 -55 132 261 221 46 -113 -127 -10 174 175 143 19 -67 -209 -46 184 293
4620 293 123 -63 -172 -73 2 50 185 134 -5 -94 -158 44 183 220 29 -69 -138 -57 36 61 120 30 -80 -203 -102
4645 -102 49 157 144 -25 -166 -142 41 60 144 96 -24 -180 -197 -80 161 238 16 -150 -143 -46 6 39 125 117 -140
4670 -140 -260 -230 0 226 159 -89 -230 -87 -38 -39 56 42 -32 -180 -345 -175 135 242 135 -113 -243 -208 -43
4693 -43 69 254 115 -151 -318 -205 30 227 140 26 -83 -230 -145 119 277 164 -91 -142 -160 -94 95 124
4715 124 206 15 -292 -191 45 212 187 26 -32 -60 -100 -68 240 397 130 -238 -266 35 212 238 73 -32 -127
4738 -127 -157 -86 153 308 220 -16 -234 -193 61 341 226 -14 -138 -127 0 41 176 240 81 -214 -290 19 251
4761 251 179 38 11 -104 -137 -132 178 366 124 -288 -308 33 72 146 67 66 -135 -372 -169 195 279 5 -149 -150 -66
4786 -66 -122 37 286 233 -250 -360 -66 148 97 32 -10 -59 -259 -212 72 241 74 -173 -340 -62 54 95 114
4809 114 113 -122 -269 -167 36 127 107 -76 -188 -262 -171 197 288 37 -247 -206 -44 -103 32 233 179 -157 -365
4832 -365 -189 164 247 28 -51 -30 -165 -147 69 335 248 -134 -178 -132 84 209 167 128 30 -188 -147 121 184 203
4856 203 57 -84 -169 -167 99 305 218 -82 -168 -90 27 117 197 192 -33 -219 -201 5 301 238 53 -101 -179 -114 41
4881 41 247 129 31 -120 -132 -33 64 223 253 -18 -217 -157 19 251 214 59 -38 -113 -169 -5 183 300 26 -254
4905 -254 -229 -97 184 209 86 -32 -163 -223 -90 88 198 175 -55 -298 -179 64 151 159 -29 -100 -158 -158 -71 162
4929 162 179 -9 -271 -264 -134 117 208 141 -59 -177 -183 -143 122 206 132 -90 -295 -265 34 272 204 -12 -200 -173
4953 -173 -76 -38 145 156 72 -148 -303 -120 112 243 68 -71 -150 -196 -106 119 181 159 -129 -105 -166 52 69 230
4977 230 174 -68 -197 -64 160 292 68 -48 -60 -125 -54 17 216 204 -82 -177 -86 44 185 97 149 60 -177 -133
5001 -133 29 266 231 59 -98 -112 -25 72 143 134 10 -126 -110 -100 73 267 220 51 -186 -175 112 226 60 -13
5025 -13 57 33 -80 -177 96 250 166 -177 -189 -50 16 -23 -64 70 -8 -116 -88 40 91 3 -49 -95 -43 -32 -109 39
5051 39 86 -65 -51 -84 -32 27 41 19 -29 -86 -120 -53 -27 1 31 -71 -61 -141 -82 6 -15 24 41 -126 -159 -28 70 36
5079 36 -41 5 41 -65 -134 -78 178 145 -100 -267 -84 16 81 -19 47 113 13 -168 -163 122 200 33 -68 -133 -21
5104 -21 42 21 160 72 -70 -90 -38 42 150 77 -7 -92 -167 -13 24 94 152 0 -32 -112 -42 149 182 104 -2 -92 -35
5131 -35 39 143 147 100 -82 -105 -48 32 172 95 -23 -99 -163 -34 123 214 129 -31 -130 -92 37 161 149 118 -70 -205
5157 -205 -199 45 200 203 -17 -199 -156 -49 14 95 139 25 -121 -256 -148 193 151 38 -177 -183 -90 -11 50 142 66
5182 66 -53 -234 -156 31 169 72 -64 -172 -221 -91 16 76 67 -24 -177 -236 -48 127 119 16 -136 -208 -205 67 155
5207 155 141 78 -83 -142 -177 47 228 153 -29 -170 -188 -51 107 155 140 26 -158 -200 -79 135 262 46 -120
5230 -120 -247 -63 -1 153 131 14 -42 -142 -90 83 253 136 12 -166 -222 -26 166 248 56 15 -62 -131 -28
5253 -28 120 164 190 -107 -165 -77 135 295 238 70 -109 -144 -18 133 193 202 -18 -134 -161 0 169 235 53 -147
5277 -147 -191 -116 -35 141 185 40 -91 -297 -146 82 291 154 -76 -215 -124 13 53 155 166 -47 -260 -332 -135
5300 -135 221 261 54 -225 -178 -47 8 165 193 9 -151 -310 -134 108 230 159 -72 -192 -229 -65 125 285
5322 285 63 -211 -237 -142 -37 112 231 93 -181 -344 -196 35 233 152 -24 -200 -281 -155 84 251 227 -64
5344 -64 -203 -193 -9 128 174 123 -102 -182 -140 45 172 237 80 -133 -230 -149 161 297 156 -78 -113 -120 -14 -1
5368 -1 226 259 58 -265 -302 74 348 209 -65 -149 -125 -25 22 137 340 68 -161 -293 -4 245 243 231 -18
5391 -18 -97 -153 -11 141 272 150 -112 -192 -155 62 222 230 91 -179 -193 -92 82 205 164 39 -144 -196 -60
5414 -60 98 131 135 -50 -173 -188 -53 134 169 24 -148 -147 -131 51 90 83 -26 -66 -158 -98 152 94 32 -44 -97 -196 -115
5441 -115 23 184 160 -47 -251 -124 86 119 72 15 -9 -89 -200 -132 44 188 -13 -150 -87 20 49 -16 69 34
5465 34 -64 -126 -112 85 68 20 -70 -100 -104 -87 22 116 -13 -67 -52 -64 6 5 46 82 -36 -19 -63 39 71 46 68 29 39
5494 39 -32 -11 193 167 -18 -74 -67 3 14 60 54 27 -2 -17 -21 17 37 116 88 -45 -66 26 175 67 -6 -22 47 71 0
5523 0 -54 66 119 -4 -29 -50 75 55 15 30 -13 38 -68 27 -17 -19 45 59 -24 -48 -90 -18 37 64 7 -49 -57 -9 7 90
5553 90 48 -59 -39 -46 -49 62 5 32 37 -27 -5 -41 68 122 16 -44 -116 0 -5 1 -4 -44 -15 -43 -112 -83 98 147 -23 -123
5583 -123 -152 30 10 1 51 61 -10 -99 -144 -53 47 7 -56 -113 -91 -58 45 141 48 -35 -103 -75 4 -3 80 102 -45 -65 -87
5612 -87 64 68 84 88 -31 -102 -38 40 166 155 24 -180 -75 -28 98 225 76 -38 -16 -18 -37 72 184 123 -30
5637 -30 -112 -57 128 140 120 41 -71 -23 -13 93 100 110 11 -66 -134 -29 246 115 1 -107 -7 -28 32 66 161 97
5663 97 -109 -132 -58 158 130 17 -6 -93 -74 -5 83 166 170 -98 -167 -72 75 57 100 53 -66 -158 -76 56 161 52
5689 52 -52 -93 -92 -60 29 153 84 -76 -162 -99 17 65 20 30 -62 -81 -57 35 58 35 -45 -118 -61 -11 125 75 -22 -120
5717 -120 -94 -29 49 20 67 56 -145 -235 -83 182 180 -70 -163 -82 23 -92 12 128 95 -88 -263 -144 152 250
5741 250 37 -33 -117 -111 -85 89 129 61 -48 -81 -13 63 155 136 78 -78 -103 -22 45 173 144 109 -65 -101 -15 171 168
5768 168 6 -82 -81 -49 -44 121 158 59 -76 -61 -31 79 141 161 -1 -156 -174 -19 161 194 -23 -76 -29 -18 -59 24
5794 24 162 102 -132 -263 -61 97 174 74 6 -60 -96 -113 64 134 84 -48 -115 -119 -70 112 197 43 -126 -176 -61
5819 -61 41 96 69 53 -67 -126 -91 46 176 9 -107 -132 -54 -55 38 47 30 5 -187 -141 -82 98 84 -17 -137 -165
5845 -165 -41 -10 54 53 -43 -71 -156 -110 41 143 169 -77 -151 -80 15 139 89 22 21 -46 -121 7 138 72 35 -109 -47
5872 -47 -48 47 87 175 44 -47 -9 -9 64 78 65 20 -86 -28 18 63 121 48 2 -80 -14 -51 40 134 118 -3 -117 -56 88
5901 88 113 101 -18 -61 -72 22 49 100 132 72 -115 -14 23 61 173 52 -30 -96 -36 16 9 105 71 -52 -77 -13 68 136
5929 136 34 -52 -30 -49 -44 -53 74 110 18 -136 -119 -1 39 32 52 -25 32 -52 -83 46 38 15 24 -28 -16 0 30 88 -41
5958 -41 -14 -9 -65 -17 -19 -46 13 -61 -7 -20 -62 -39 -26 -35 -71 -70 -27 11 20 -128 -48 -70 10 -81 -34 51 -6 -5 -12 -3 59 -47 -75
5991 -75 58 50 2 -21 -27 43 79 -33 6 10 21 -71 -39 39 119 108 -2 -57 -24 -19 96 68 72 16 -7 -60 -16 52 156 67
6021 67 -100 -73 26 47 69 34 5 -6 -89 -99 54 106 43 -32 -65 -45 90 -6 86 38 59 -123 -52 -35 124 70 -20 9
6049 9 26 -62 91 163 139 7 -138 -74 4 90 12 31 16 -42 -135 -73 100 162 -12 -83 -34 -68 41 52 73 45 -75
6076 -75 -102 -143 84 178 37 -127 -97 -78 -29 64 77 23 -47 -183 -75 -2 56 40 -136 -121 -112 -32 -23 40 9 -25 -57 -127
6104 -127 -91 32 117 28 -74 -21 -58 -8 38 43 14 -52 -109 -75 32 145 100 29 -56 -124 -43 53 44 71 14 -51 -34 1 102
6133 102 151 68 -17 -99 -89 14 144 86 -15 -24 -19 -3 33 58 48 23 -63 -35 10 141 93 -23 -30 -91 7 12 62 146 131
6162 131 -37 -145 27 112 120 88 18 -58 -36 45 55 -19 37 62 16 -39 -76 73 111 85 -74 -75 -26 84 63 17 14 -46
6190 -46 -49 -67 5 87 3 -89 -42 -147 -4 -32 40 97 4 -86 -100 -48 83 21 -8 -82 -28 -86 -33 -10 61 -23 -40 -101 -63
6219 -63 -84 30 13 -71 -154 -23 84 21 46 -54 0 -6 -89 -54 36 54 45 -41 -41 -30 21 73 62 -31 -4 -77 -44 49 31 92
6249 92 5 -40 -59 -97 53 94 140 -83 -76 27 45 -25 10 75 62 -92 -105 14 51 106 -28 -34 -30 -50 -78 75 98 56
6277 56 -78 -87 19 144 145 -84 -19 -10 -8 -53 -3 80 26 -28 -77 -48 -25 40 117 42 -123 -21 32 85 88 49 53 -18 -19 -39 58
6308 58 127 63 -52 -69 -7 -16 4 24 18 -40 -73 -47 21 50 37 84 -6 -94 -127 20 113 117 -26 -46 -47 -110 -95 41 122 -42
6338 -42 -169 -36 -17 57 14 5 56 -36 -124 -99 42 131 -42 -67 -98 19 -22 60 42 74 -53 -67 -7 -22 30 93 -65
6365 -65 -95 -6 -46 -27 11 -12 27 23 -47 -85 52 94 62 -52 -153 -8 -5 81 70 7 26 -13 -99 -3 103 96 35 -37 -77
6394 -77 -64 24 94 55 -4 -95 -69 -95 49 37 36 71 -41 -133 -65 69 117 46 -14 -24 -44 14 20 26 123 24 -42 -29 62 91
6424 91 79 68 10 27 -29 -4 99 91 1 -113 -84 7 119 81 34 39 -42 -11 30 3 55 27 22 -108 -95 49 92 51 -23
6453 -23 -97 -34 -23 34 100 37 -24 -39 -114 -14 27 40 -11 -34 -82 -84 49 18 20 -45 -68 -88 -99 -15 71 15 -31 -41 -52 -27
6483 -27 -63 2 42 -11 -16 -82 -14 55 102 2 -105 -64 19 -60 -4 -10 14 -21 -14 -71 95 6 34 -86 -59 -13 19 55 12 0
6513 0 1 -18 -24 -47 51 20 14 20 -7 14 0 80 46 15 -16 -52 -17 23 38 18 4 -1 -18 26 95 13 29 9 62 25 -15 93 86
6546 86 77 -2 -5 46 92 43 38 -5 86 72 19 60 -17 26 8 -30 -61 40 19 -16 -92 -17 40 68 -16 -39 23 -7 -19 -43 9
6577 9 35 -3 21 -17 -2 -33 -44 59 48 -32 -81 -53 -10 -51 -11 82 21 0 -21 -12 27 19 9 -17 -45 42 -77 -23 50 44 -8
6608 -8 -28 -32 -17 0 -88 25 3 22 18 -30 0 66 7 -23 -16 1 41 35 1 -65 3 -19 -49 -22 14 69 11 -88 -34 -10 109 58
6640 58 -7 10 7 -52 -82 53 82 53 -14 5 -3 28 41 68 2 35 -6 -68 -23 112 114 -14 -70 -74 44 8 87 107 5 -40
6670 -40 -43 -21 20 68 63 -6 -16 -102 -25 133 102 35 -61 -39 50 49 55 70 39 -52 -58 -27 89 68 7 -18 -42 -81 -15 69 56 34
6702 34 -34 -99 -92 -4 85 46 -64 -106 -27 60 41 43 49 -17 -22 -167 -29 104 62 65 -82 -120 -35 10 9 -50 -3 40 -119 -133
6732 -133 9 76 67 -4 -10 -57 -92 59 83 0 58 -124 -169 23 -18 -44 21 -44 -106 -82 -56 65 107 -17 -61 -140 -87 18
6760 18 138 143 15 -102 -180 -114 3 21 24 34 -103 -122 -56 91 64 69 -27 -122 -96 -10 146 46 6 35 27 -103 -28 94
6788 94 74 80 -11 -62 -59 84 91 155 18 -30 -93 14 40 89 43 16 -108 -24 -9 47 154 50 -101 -119 -79 -35 110 74
6816 74 47 -69 -99 -31 80 110 38 55 -62 -47 -63 104 108 106 -61 -95 -85 9 59 38 19 -65 -77 -49 -42 52 69 47 -38
6845 -38 -33 -76 -28 126 102 -22 -4 -44 -33 26 13 115 59 -103 -84 -40 53 120 43 4 -83 -23 -26 56 123 5 -156 -80
6873 -80 -34 -39 41 77 86 -42 -100 16 52 52 -11 -30 -18 -72 -94 8 140 91 -91 -147 -37 21 12 -29 3 3 -35 -91 -42 98
6903 98 162 -14 -81 -86 35 15 12 61 50 22 -50 -17 68 42 86 12 10 -3 112 49 23 -39 89 51 -72 -34 11 133 36
6932 36 7 -26 10 -9 -6 -1 66 35 15 -16 -30 35 79 3 59 -19 -59 26 71 100 -74 -12 -16 -58 -61 -25 41 69 -62 -93 -47
6963 -47 -9 47 17 -10 -40 -21 -45 -7 16 -7 -84 -56 -22 -16 4 27 32 -21 -28 -35 -87 -6 60 77 -76 -132 -46 57 35 -40 -7
6994 -7 9 4 -168 -70 54 8 -5 -54 -47 -123 51 27 28 -43 -34 -80 -33 22 -5 109 -35 -103 -62 33 69 75 -7 -69 -23 3 41
7025 41 55 57 8 -73 -34 -34 38 46 17 2 -88 -17 2 38 36 79 -25 -82 -51 23 102 165 2 -90 -34 -38 -10 39 99 22 -20 -96
7057 -96 -35 84 141 58 -93 -13 -42 24 26 60 26 -6 -50 -99 -17 93 35 -25 -60 -74 9 92 39 69 -10 -37 -31 -65 -3 100
7087 100 62 0 -92 -87 92 45 85 12 -14 -71 8 16 -9 95 7 -36 -149 -44 87 61 26 -9 -25 -44 -5 -38 66 71
7115 71 -44 -84 -107 35 83 70 49 -11 -80 -83 -23 31 37 -59 -26 -147 -105 58 31 58 -81 -92 -17 -68 36 6 59 -21
7143 -21 -122 -139 36 27 77 9 -14 -2 3 31 141 27 -82 1 -125 21 43 70 57 29 -85 -79 25 54 48 36 -24 -49
7171 -49 -77 -69 132 51 -2 -47 -10 -9 56 68 101 65 -27 -102 -3 102 55 37 -18 -69 -76 -17 25 80 24 -104 -114 -71 67 109
7201 109 93 -2 -60 -123 -21 43 89 101 12 -26 -78 27 109 107 1 -124 -82 66 18 117 113 30 -44 -135 -32 19 74 51
7229 51 17 -108 -55 -69 -43 93 52 -73 -61 -94 -4 43 51 21 -50 -72 -84 -28 43 50 -90 -35 -48 -73 -41 56 63 35 -61 -98
7259 -98 -42 44 56 -18 -40 -33 -37 -76 7 58 83 -74 -62 -56 61 73 6 -33 -23 -7 -97 19 38 85 22 -59 -17 1 43 54
7289 54 64 3 -114 -31 30 41 82 6 -35 -14 -33 9 48 100 44 -33 1 7 24 73 60 41 34 -24 -48 -22 51 30 53 17 -57
7320 -57 12 59 44 53 17 -68 -58 -69 -6 54 84 -4 -37 23 35 33 -24 -14 -1 -51 -23 -24 82 54 58 -74 4 29 40 52 75
7351 75 39 -44 -24 -68 19 77 44 -34 -69 -39 3 39 25 -14 71 -82 -92 11 -66 -35 29 -70 -63 -34 -35 -29 -5 26 -83 -87 -75
7382 -75 9 86 35 19 -87 -12 -17 10 20 -37 66 -68 -16 -43 -7 89 7 -17 -119 -58 -6 36 37 7 10 19 7 -20 44 70
7412 70 -21 -91 -92 40 62 86 -2 52 -20 -41 43 -98 15 72 31 -61 -76 59 75 77 -66 -31 -9 42 -9 -36 37 67 52
7441 52 -57 -76 67 66 8 -51 4 -39 -16 19 5 -28 41 -1 -34 -23 -27 69 20 -49 23 66 4 53 51 71 7 -3 30 45 72
7472 72 18 19 -40 13 -8 -12 47 67 -26 -91 45 26 91 -36 -12 -46 -25 -52 -2 -51 10 -6 12 -32 -72 30 -9 17 -41 -42
7502 -42 -32 4 35 -27 -16 12 -33 -17 -47 -22 95 17 -74 5 -20 16 80 41 10 -61 4 -46 30 29 40 8 -17 -75 -20 55
7532 55 95 46 14 -36 -9 2 45 50 45 -45 -80 4 32 61 -67 -11 30 -60 -34 -2 54 9 -41 -84 -52 57 87 57 -3 -43
7562 -43 -77 -65 60 42 65 2 -51 -36 -19 -4 73 99 -4 -99 -51 13 88 144 46 -64 -29 -49 -21 77 118 27 -49 -91 -22
7591 -22 18 94 43 -46 -46 -103 -13 29 123 21 -50 -38 -86 5 57 -3 34 13 -125 -127 3 63 77 -28 -76 -84 -11 39 76 51
7621 51 -78 -94 -93 -63 24 101 -73 -111 -111 -62 2 53 80 42 -27 -83 -77 -30 84 106 6 -47 -55 -12 16 82 24 -20 -39 -105
7651 -105 -1 33 74 -8 -37 -112 -117 -1 121 77 79 -51 -60 -38 -20 45 58 3 -28 -95 -55 29 90 44 6 16 -43 -47 31 79
7681 79 -14 -51 -88 -69 58 84 12 14 -24 -39 -45 14 80 41 -4 -2 -72 43 24 65 45 -19 7 -15 -5 73 11 97 46 -64
7711 -64 -12 18 105 152 33 21 -30 -34 31 -3 87 13 -61 -101 -65 23 123 120 -30 -82 -78 -7 88 24 19 -4 -16 -44 -5 56 -11
7742 -11 56 -56 -60 -20 23 37 56 31 54 -32 -14 52 46 49 -57 -75 -52 39 19 -16 21 4 -39 -55 -85 40 79 -10 -58 -30
7772 -30 -32 14 54 -12 5 9 84 -34 -24 56 46 -17 23 -82 -45 74 68 32 -46 -36 -10 -19 -31 106 12 -9 -102 -1 -11 -8
7802 -8 47 3 -48 -77 -68 -38 -12 36 39 -62 -75 38 15 37 38 -28 -5 -58 34 4 47 33 60 38 -45 -44 30 22 53 -39 -46 5 -29
7835 -29 -28 16 90 98 -54 -20 9 121 67 3 40 16 20 -5 10 9 55 -85 -3 27 5 104 25 -11 -70 -31 2 68 17 -33 37
7866 37 -5 -105 -5 -24 -16 -41 -46 -1 1 -22 -34 7 7 -7 -8 -60 44 73 46 -56 -22 -11 -48 2 59 47 25 30 -23 -9 51
7897 51 17 66 -6 -46 -4 -32 -57 -2 104 -13 -85 -56 -9 19 19 0 -70 -22 -40 0 11 22 44 -98 -63 30 7 32 58
7926 58 -58 -71 -31 -1 -23 -12 -33 -25 -3 -40 -9 69 27 24 -3 -96 8 84 80 29 1 -50 -38 -21 -13 102 51 64 42 -1 -17
7957 -17 55 41 15 -30 -41 -48 73 38 -5 -20 -20 -33 47 21 -7 72 -15 3 -12 51 43 20 -18 -53 -71 -18 20 29 -11 8 5 17
7989 17 -19 -51 7 -11 -36 -87 -15 -50 -1 6 -13 -77 -9 29 -6 42 6 -6 -29 -58 -16 -4 57 19 -31 -49 -7 16 32 26 17 -6
8021 -6 -56 -65 -3 16 -16 2 23 -36 -17 -5 49 12 11 31 -94 45 -27 102 1 -56 -56 -32 32 -8 -9 -113 -36 20 16 -31 12
8052 12 19 -41 -23 -57 -26 49 57 15 -65 -14 16 -39 35 6 -20 -30 13 -35 73 48 23 14 -31 38 2 34 -1 6 81 1 4 23
8084 23 70 -2 56 -35 20 12 17 46 26 19 -18 4 -30 51 16 -35 -4 0 -6 31 5 -42 -66 -29 -15 8 -37 22 -7 -10 1 67 -43
8117 -43 55 -27 -26 37 -12 -60 -61 -17 71 16 -42 -55 -25 11 -33 -59 24 15 7 39 -44 15 0 -13 41 -4 52 60 53 -16 57 14 43
8150 43 -23 -25 10 32 -24 20 -21 -32 5 -14 -19 16 -50 -28 -17 -27 7 14 -27 -38 -13 2 -36 -7 -62 -53 6 -87 -68 17 -32 -31 42
8183 42 -24 20 32 52 34 33 85 11
8191A1
##END NTUPLES=NMR FID
##END=
