##TITLE=1H_ADM2506
 CDCl3, 8 sc, 
 26.6.2019
##JCAMPDX= 6.0         $$ Bruker NMR JCAMP-DX V2.0
##DATA TYPE= NMR FID
##DATA CLASS= NTUPLES
##ORIGIN= UXNMR, Bruker Analytische Messtechnik GmbH
##OWNER= root
$$ XWIN-NMR		Version 3.5
$$ Wed Jun 26 15:44:28 2019 Russian Standard Time (UT+4h)  she@DPX200
##.OBSERVE FREQUENCY= 200.13155
##.OBSERVE NUCLEUS= ^1H
##.DELAY= (6, 6)
##.ACQUISITION MODE= SIMULTANEOUS
##.ACQUISITION SCHEME= undefined
##.AVERAGES= 8
##.DIGITISER RES= 18
##SPECTROMETER/DATA SYSTEM= spect
##.PULSE SEQUENCE= zg30
##.SOLVENT NAME= CDCl3
##.SHIFT REFERENCE= (INTERNAL, CDCl3, 0, 15.7039)
##AUDIT TRAIL= $$ (NUMBER, WHEN, WHO, WHERE, WHAT)
$$ ##TITLE= Audit trail, XWIN-NMR		Version 3.5
$$ ##JCAMPDX= 5.01
$$ ##ORIGIN= Bruker BioSpin GmbH
$$ ##OWNER= she
$$ F:/spectra/data/she/nmr/H-F/1/audita.txt
$$ ##AUDIT TRAIL=  $$ (NUMBER, WHEN, WHO, WHERE, WHAT)
(   1,<2019-06-26 15:43:10.60 +0400>,<she>,<DPX200>,
      <created by zg, POWCHK disabled, PULCHK disabled
       configuration hash MD5:
       00 E9 B6 7A A2 85 ED C7 34 08 36 98 17 FE 4E 26
       data hash MD5: 16K
       2B C0 17 BE D1 A1 51 E9 11 4A EF B8 8D B7 2E 18>)
$$ ##END=
$$ 
$$ hash MD5
$$ 70 9F 3D 35 71 99 FB D6 B1 5A 2D 17 5E 7E E0 29
##$RELAX= 
##$RELAX= 
##$RELAX= 
##$RELAX= 
##$RELAX= 
##$RELAX= 
$$ Bruker specific parameters
$$ --------------------------
##$DU= <F:/spectra>
##$EXPNO= 1
##$NAME= <H-F>
##$PROCNO= 1
##$TYPE= <nmr>
##$USER= <she>
##$AMP= (0..31)
100 100 100 100 100 100 100 100 100 100 100 100 100 100 100 100 100 100 
100 100 100 100 100 100 100 100 100 100 100 100 100 100 
##$AQSEQ= 0
##$AQ_mod= 1
##$AUNM= <au_zg>
##$AUTOPOS= <>
##$BF1= 200.13
##$BF2= 200.13
##$BF3= 200.13
##$BF4= 200.13
##$BF5= 200.13
##$BF6= 200.13
##$BF7= 200.13
##$BF8= 200.13
##$BYTORDA= 1
##$CFDGTYP= 0
##$CFRGTYP= 5
##$CHEMSTR= <none>
##$CNST= (0..31)
1 1 145 1 1 1 1 1 1 1 1 1 1 1 1 1 1 1 1 1 1 1 1 1 1 1 1 1 1 1 1 1 
##$CPDPRG= <>
##$CPDPRG1= <>
##$CPDPRG2= <>
##$CPDPRG3= <>
##$CPDPRG4= <mlev>
##$CPDPRG5= <mlev>
##$CPDPRG6= <mlev>
##$CPDPRG7= <mlev>
##$CPDPRG8= <mlev>
##$CPDPRGB= <>
##$CPDPRGT= <>
##$D= (0..31)
0 1.2 0 0 0 0 0 0 0 0 0 0.03 0 0 0 0 0 0 0 0 0 0 0 0 0 0 0 0 0 0 0 0 
##$DATE= 1561549389
##$DBL= (0..7)
120 120 120 120 120 120 120 120 
##$DBP= (0..7)
150 150 150 150 150 150 150 150 
##$DBP07= 0
##$DBPNAM0= <>
##$DBPNAM1= <>
##$DBPNAM2= <>
##$DBPNAM3= <>
##$DBPNAM4= <>
##$DBPNAM5= <>
##$DBPNAM6= <>
##$DBPNAM7= <>
##$DBPOAL= (0..7)
0.5 0.5 0.5 0.5 0.5 0.5 0.5 0.5 
##$DBPOFFS= (0..7)
0 0 0 0 0 0 0 0 
##$DE= 6
##$DECBNUC= <off>
##$DECIM= 24
##$DECNUC= <off>
##$DECSTAT= 4
##$DIGMOD= 1
##$DIGTYP= 9
##$DL= (0..7)
0 120 120 120 120 120 120 120 
##$DP= (0..7)
150 150 150 150 150 150 150 150 
##$DP07= 0
##$DPNAME0= <>
##$DPNAME1= <>
##$DPNAME2= <>
##$DPNAME3= <>
##$DPNAME4= <>
##$DPNAME5= <>
##$DPNAME6= <>
##$DPNAME7= <>
##$DPOAL= (0..7)
0.5 0.5 0.5 0.5 0.5 0.5 0.5 0.5 
##$DPOFFS= (0..7)
0 0 0 0 0 0 0 0 
##$DQDMODE= 0
##$DR= 18
##$DS= 0
##$DSLIST= <SSSSSSSSSSSSSSS>
##$DSPFIRM= 0
$$ [...]
##$SUBNAM2= <"">
##$SUBNAM3= <"">
##$SUBNAM4= <"">
##$SUBNAM5= <"">
##$SUBNAM6= <"">
##$SUBNAM7= <"">
##$SUBNAM8= <"">
##$SUBNAM9= <"">
##$SW= 24.9336996594482
##$SWIBOX= (0..15)
0 0 2 0 0 0 0 0 0 0 0 0 0 0 0 0 
##$SW_h= 4990.01996007984
##$TD= 16384
##$TD0= 1
##$TE= 0
##$TE2= 300
##$TE3= 300
##$TEG= 300
##$TL= (0..7)
0 120 120 120 120 120 120 120 
##$TP= (0..7)
150 150 150 150 150 150 150 150 
##$TP07= 0
##$TPNAME0= <>
##$TPNAME1= <>
##$TPNAME2= <>
##$TPNAME3= <>
##$TPNAME4= <>
##$TPNAME5= <>
##$TPNAME6= <>
##$TPNAME7= <>
##$TPOAL= (0..7)
0.5 0.5 0.5 0.5 0.5 0.5 0.5 0.5 
##$TPOFFS= (0..7)
0 0 0 0 0 0 0 0 
##$TUNHIN= 0
##$TUNHOUT= 0
##$TUNXOUT= 0
##$USERA1= <user>
##$USERA2= <user>
##$USERA3= <user>
##$USERA4= <user>
##$USERA5= <user>
##$V9= 5
##$VALIST= <valist>
##$VCLIST= <CCCCCCCCCCCCCCC>
##$VD= 0
##$VDLIST= <DDDDDDDDDDDDDDD>
##$VPLIST= <PPPPPPPPPPPPPPP>
##$VTLIST= <TTTTTTTTTTTTTTT>
##$WBST= 1024
##$WBSW= 4
##$XGAIN= (0..3)
0 0 0 0 
##$XL= 0
##$YL= 0
##$YMAX_a= 444493
##$YMIN_a= -323740
##$ZGOPTNS= <>
##$ZL1= 120
##$ZL2= 120
##$ZL3= 120
##$ZL4= 120
##$ABSF1= 10
##$ABSF2= 0
##$ABSG= 5
##$ABSL= 3
##$ALPHA= 0
##$AQORDER= 0
##$ASSFAC= 0
##$ASSFACI= 0
##$ASSFACX= 0
##$ASSWID= 0
##$AUNMP= <proc_1d>
##$AZFE= 0.1
##$AZFW= 0.1
##$BCFW= 1
##$BC_mod= 2
##$BYTORDP= 1
##$COROFFS= 0
##$CY= 11.3945322036743
##$DATMOD= 1
##$DC= 2
##$DFILT= <>
##$DTYPP= 0
##$F1P= 18.9103706918063
##$F2P= -1.10871071338519
##$FCOR= 0.5
##$FTSIZE= 0
##$FT_mod= 4
##$GAMMA= 1
##$GB= 0.15
##$INTBC= 1
##$INTSCL= 1
##$ISEN= 128
##$LB= 0.24
##$LEV0= 0
##$LPBIN= 0
##$MAXI= 10000
##$MC2= 0
##$MEAN= 0
##$ME_mod= 0
##$MI= 1.114404
##$NCOEF= 0
##$NC_proc= 0
##$NLEV= 6
##$NOISF1= 3.799351
##$NOISF2= 2.8
##$NSP= 1
##$NTH_PI= 0
##$NZP= 0
##$OFFSET= 15.70392
##$PC= 1
##$PHC0= -8651.288
##$PHC1= 6.200973
##$PH_mod= 1
##$PKNL= yes
##$PPARMOD= 0
##$PSCAL= 0
##$PSIGN= 0
##$REVERSE= no
##$SF= 200.130013532006
##$SI= 16384
##$SIGF1= 3
##$SIGF2= 2
##$SINO= 400
##$SIOLD= 16384
##$SREGLST= <1H.CDCl3>
##$SSB= 0
##$STSI= 0
##$STSR= 0
##$SW_p= 3612.71676300578
##$SYMM= 0
##$S_DEV= 0
##$TDeff= 0
##$TDoff= 0
##$TI= <>
##$TILT= no
##$TM1= 0
##$TM2= 0
##$TOPLEV= 0
##$USERP1= <user>
##$USERP2= <user>
##$USERP3= <user>
##$USERP4= <user>
##$USERP5= <user>
##$WDW= 1
##$XDIM= 8192
##$YMAX_p= 0
##$YMIN_p= 0
$$ End of Bruker specific parameters
$$ ---------------------------------
##NTUPLES= NMR FID
##VAR_NAME=  TIME,          FID/REAL,        FID/IMAG
##SYMBOL=    X,             R,               I
##VAR_TYPE=  INDEPENDENT,   DEPENDENT,       DEPENDENT
##VAR_FORM=  AFFN,          ASDF,            ASDF
##VAR_DIM=   8192,          8192,            8192
##UNITS=     SECONDS,       ARBITRARY UNITS, ARBITRARY UNITS
##FACTOR=    0.0002004,     1,               1
##FIRST=     0,             0,               0
##LAST=      1.6414764,     0,               0
##MIN=       0,             -323740,         0
##MAX=       1.6414764,     444493,          0
$$ Real data points
##PAGE= N=1
##DATA TABLE= (X++(R..R)), XYDATA
0 0 0 0 0 0 -8 8 -8 9 -16 17 -24 32 -40 48 -56 69 -81 96 -118 136 -160 189 -217 249 -288 329 -375 426
28 426 -484 546 -615 691 -775 868 -968 1077 -1200 1334 -1479 1639 -1815 2009 -2225 2463
44 2463 -2728 3027 -3364 3746 -4186 4698 -5299 6023 -6910 8025 -9486 11477 -14375 19008
58 19008 -27597 48892 -208978 -198002 330135 202616 448 -9746 -32201 -238743 -82141
69 -82141 303023 284708 -162014 -287834 -61075 31494 -13785 153716 231143 -74538 -309481
80 -309481 -39329 242628 99527 -107051 -36376 -8888 -134543 -53449 204774 149745 -141583
91 -141583 -141462 107463 121613 -48415 -45289 25239 -74011 -107712 93324 172915 -54198 -183621
103 -183621 -4144 131980 45600 -320 41950 -59965 -199268 -65646 186199 168646 -46870
114 -46870 -130764 -75476 -23054 75289 191702 97011 -173414 -252910 -44635 142718 137248
125 137248 60185 -28161 -138267 -132385 60867 208361 109961 -83695 -155303 -110407 -13321
136 -13321 118848 171889 37704 -139359 -136325 8158 106315 106938 41596 -81787 -164245 -68443
148 -68443 113155 144661 17914 -72411 -63065 -26623 30552 95341 58464 -73382 -115422 -16314
160 -16314 56962 35203 18221 14308 -43604 -70844 27977 111213 28390 -89228 -71609 2608
172 2608 19771 34732 60486 -3581 -100785 -48668 98355 106686 -21235 -82747 -48824 -27075
184 -27075 4912 82972 80295 -49122 -111941 -8037 86246 54486 8260 -144 -53917 -103734
196 -103734 -13832 122509 98108 -39513 -86859 -32856 10285 44903 82986 30989 -97110
207 -97110 -117324 10837 97508 52201 -7427 -20295 -41896 -45476 29930 92242 29989 -67753
219 -67753 -65269 -5266 17834 26544 43185 11085 -55301 -50736 24985 57605 19760 -16415 -30683
232 -30683 -39440 -11451 48937 52828 -17848 -53445 -6079 36219 20908 -769 -5300 -19956 -25946
245 -25946 6267 30775 8004 -13857 -1008 3162 -10581 7117 37373 9190 -45510 -33641
257 -33641 22878 32734 3392 -4119 -4340 -22279 -11963 34582 36803 -19848 -42512 -4933 15821
270 15821 2475 9110 20688 -11161 -37062 1704 38975 6962 -26621 -159 17672 -17845
282 -17845 -27716 20241 35385 -11127 -30434 2621 13102 -6380 2596 19582 -7960 -31453
294 -31453 4631 33041 -4834 -31857 9493 35968 -7259 -35649 1556 26442 -340 -12136
306 -12136 8869 1405 -25755 -5383 35630 18685 -26180 -19896 12600 6795 -8474 11037 20458
319 20458 -14257 -31731 4163 28810 5241 -11943 973 -3223 -24139 -4973 38172 28143
331 28143 -26540 -40805 -1593 25968 18599 4775 -10250 -29295 -20748 22043 41314 6094
343 6094 -30611 -22865 565 7198 11770 18355 -153 -33040 -29111 14155 39773 20442 -11799
356 -11799 -27454 -24501 -1635 31851 37660 -3226 -45762 -36194 12905 45147 32856 -6396 -39135
369 -39135 -36559 3934 43084 35852 -9578 -40980 -29122 5641 31717 34460 10966 -26207 -43720
382 -43720 -17484 30459 48850 15634 -36815 -55173 -18160 39478 58938 18945 -39011 -55830
394 -55830 -17824 34370 51147 17990 -34321 -55649 -22925 33132 57211 26841 -26798 -53807
406 -53807 -30429 21328 52360 30649 -22430 -53625 -33623 16837 53788 46286 -4208 -56414
418 -56414 -54846 7236 65244 52765 -16207 -65753 -47462 15827 63215 51562 -8204 -58203
430 -58203 -48507 7227 49986 43225 628 -42026 -52383 -14307 46659 68001 18694 -51507
442 -51507 -66770 -15434 46256 60871 17860 -45103 -68873 -24149 47887 72467 24820 -43559
454 -43559 -67256 -28674 35776 67162 31586 -39821 -72252 -29785 40799 67438 31568 -26960
466 -26960 -58954 -40093 15749 60330 47607 -15333 -67110 -53294 15658 73069 60825 -11644
478 -11644 -72407 -59180 13318 69765 54409 -13889 -66781 -54299 9835 63479 57147 -141
490 -141 -54385 -58559 -10113 48911 62715 12535 -54157 -67208 -12770 52136 66288 21779 -41757
503 -41757 -70310 -32709 41534 74946 26871 -49863 -72783 -24747 41814 69383 35746 -33684
515 -33684 -73936 -38154 37060 67679 26905 -32405 -56509 -35265 15526 61638 54213 -12778
527 -12778 -70081 -52079 17290 61685 44816 -10486 -58956 -56936 5091 69996 63285 -10327
539 -10327 -67757 -52561 8293 54556 50223 -976 -56470 -59038 227 59744 57466 1698 -49141
552 -49141 -53442 -13000 38771 57288 19901 -42601 -67475 -24737 46004 73173 27028 -45885
564 -45885 -71417 -26532 39616 63970 27905 -35357 -68389 -35300 35453 70068 33343 -29512
576 -29512 -57462 -37261 10187 54107 51992 -10268 -69308 -50080 22068 58830 36133 -3298
588 -3298 -36545 -53564 -20149 51441 69912 -1406 -66768 -45430 13154 38672 37284 18201
600 18201 -32270 -65024 -13882 61624 48805 -22674 -40935 -10578 -4068 1173 42017 44461 -33084
613 -33084 -76084 -8342 60152 34902 -12582 -17657 -26463 -37663 15820 80303 34228 -67163
625 -67163 -65872 16285 40360 12953 17229 9430 -55636 -67387 33439 95650 20024 -59343
637 -59343 -35991 43 -8400 17277 65451 19357 -78326 -64914 35654 60959 11845 -772
649 -772 -1630 -49837 -53249 44240 92871 296 -78775 -28769 31363 11482 2686 36582 11069
662 11069 -59671 -40521 44472 46927 -17716 -22313 10496 -9858 -27320 26376 53495 -16207
674 -16207 -61696 -1584 47439 7114 -24597 3038 5535 -27366 -5243 48526 23942 -45662
686 -45662 -39115 21231 29391 12 1200 2499 -29858 -30198 27792 51860 1746 -35990 -16458
699 -16458 842 -3357 15680 38728 5963 -47139 -37209 18512 40630 20410 -2111 -20090
711 -20090 -32143 -11653 30696 38311 1355 -27150 -20803 -3763 9354 21393 19068 -5029 -24573
724 -24573 -16647 4291 16544 16018 3281 -14725 -18234 -2101 12121 11248 5008 -2788 -13689 -11962
738 -11962 7673 15559 -2217 -11973 3076 8796 -7276 -9792 7647 8938 -5360 -1521 8777
751 8777 -5441 -17596 4725 22484 346 -17003 2855 12507 -10377 -12226 18579 19170 -15787
764 -15787 -18977 10713 10206 -10626 2827 22778 -3495 -30715 -2279 28834 6181 -18264 637
777 637 11575 -12142 -12870 18457 15900 -18013 -12798 18219 5736 -24855 -5391 28038 7841
790 7841 -24809 -8556 14814 -1310 -11942 11720 15973 -14911 -20220 8043 11310 -7509 2203
803 2203 18914 -5867 -32285 -5511 29740 15961 -10371 -6674 -3770 -16456 -2895 31268 23754
816 23754 -19381 -29701 -2495 10792 9214 17150 10423 -23041 -31237 5868 29225 10660 -4680
829 -4680 -1816 -13350 -24752 4709 38998 18107 -25531 -27244 -2303 7434 13318 21070 -660
842 -660 -35171 -21924 22956 26098 -6270 -11424 1751 -9683 -16157 15468 30912 -7411 -34187
855 -34187 -5537 19564 4975 -1852 9940 -5639 -29985 -3158 38768 18912 -27897 -22928
867 -22928 7487 5516 1484 23148 14233 -36261 -39672 22980 49027 3682 -26741 -10575 -6113
880 -6113 -13118 17304 45017 4160 -49211 -29192 20725 23434 8109 13911 -2890 -46975 -34189
893 -34189 39228 59480 -2949 -44429 -21656 15 3094 26407 37915 -12527 -60340 -24417
905 -24417 38571 36572 -996 -10400 -13531 -29832 -10480 42716 43564 -18962 -48906 -12898 18033
918 18033 15515 17562 15486 -22466 -48215 -4498 51391 35480 -19653 -34912 -14070 2052 18140
931 18140 33590 11473 -36834 -40934 9100 40743 20939 -7511 -18399 -24322 -15389 21697 45331
944 45331 12275 -38422 -40286 219 29752 29599 11074 -19204 -41756 -22761 27298 48973 15026
957 15026 -31401 -41423 -14387 21310 39705 23145 -19844 -46518 -24301 22492 42322 19894
969 19894 -16041 -34897 -25627 6221 37130 35260 -4362 -42820 -37283 7199 43368 35371 -5748
982 -5748 -39370 -34810 3018 38993 37743 -1204 -38687 -36365 1497 35132 34598 4106 -29602
995 -29602 -37696 -9203 32146 42540 7683 -34322 -38808 -6477 27094 35220 14134 -21584 -41604
1008 -41604 -20371 25323 45440 17170 -27040 -42566 -18652 21137 42421 22874 -22567 -45971
1020 -45971 -20098 24459 39154 16067 -15953 -32603 -24412 6446 36584 32131 -7936 -40740
1032 -40740 -30358 9442 37766 30748 -4132 -36638 -34734 3461 39307 33966 -4599 -34943
1044 -34943 -30362 689 30964 34564 4945 -32150 -37504 -3531 33063 34536 3116 -28041 -32058
1057 -32058 -7602 23951 34031 11556 -23141 -36066 -14332 20784 36086 16600 -20133 -38772
1069 -38772 -18781 20829 38987 16800 -21714 -37166 -16476 17800 33120 16994 -14298 -31687
1081 -31687 -19338 10749 30572 21499 -8105 -30240 -23791 5890 30172 25203 -4185 -29089
1093 -29089 -25312 3131 28601 26711 -795 -27373 -27117 55 27354 27409 781 -25453 -25864 -1181
1107 -1181 23567 25258 3193 -21095 -24758 -5055 18445 23936 7345 -15689 -24755 -10978 14246
1120 14246 26689 12149 -15880 -27880 -11895 14543 25071 11572 -12183 -25025 -14394 11022
1132 11022 25908 13620 -12533 -24395 -11951 9632 20390 13127 -5586 -19950 -15087 5473
1144 5473 20191 14111 -3823 -15827 -14334 -1389 15307 20540 3825 -19657 -21147 2077 21094
1157 21094 15849 -2344 -14258 -13893 -2533 13137 17677 2757 -14973 -14322 250 10075 10180 5475
1171 5475 -4756 -15638 -10552 9922 18809 3718 -12551 -10802 -1642 2806 7789 10833 -862
1184 -862 -17078 -12244 9294 16288 2806 -7748 -7175 -5358 -305 11240 11953 -6149 -16376 -1757
1198 -1757 11473 3676 -3800 3307 3342 -10241 -8953 11531 15774 -4231 -13467 -1251 5431 787
1212 787 3684 7807 -4576 -14639 627 16209 4107 -11092 -2276 7318 -3530 -7839 8363
1225 8363 11880 -8341 -13838 5814 11538 -5271 -7666 7585 5304 -10690 -5868 10784 5285
1238 5285 -9315 -2530 8396 -1933 -10153 4289 11912 -5289 -12189 6161 11369 -8301 -11857
1251 -11857 9712 13642 -7466 -12679 4067 7733 -3123 -321 7845 -2629 -13416 800 15329
1264 15329 3297 -10561 -1757 6167 -4010 -5951 9814 11366 -8721 -14320 3492 11219 266
1277 266 -3042 3270 -1945 -10790 -358 14714 6886 -10905 -10103 2259 4993 2703 4558 430
1291 430 -11051 -9421 7937 14506 308 -11168 -6130 1537 2029 3776 6848 212 -11760 -10399
1305 -10399 5158 14293 6509 -6195 -10792 -7019 1571 11318 12814 -720 -16936 -14251 5775
1318 5775 17989 9471 -5458 -11571 -9774 -1978 11731 17847 2503 -18723 -16570 4525 15089
1331 15089 8605 1338 -4823 -14726 -12702 10497 25412 6778 -19421 -18254 -16 9509 12037
1344 12037 11046 -4828 -24493 -14825 16952 24747 806 -15225 -10050 -5257 -1340 14601 20589
1357 20589 -5064 -28853 -13038 16430 17560 2213 -3286 -8180 -17072 -5620 22658 23350 -8807
1370 -8807 -25718 -9206 8127 11151 12898 6627 -17234 -26992 1778 30329 16863 -12865 -17777
1383 -17777 -6789 -778 9014 20947 8419 -21494 -25517 2414 21797 15417 1890 -11050 -22501
1396 -22501 -13294 18390 32352 5507 -25378 -23269 -1961 13313 20110 14107 -10742 -31047 -15812
1409 -15812 17958 28013 9248 -11938 -21750 -17052 5343 27785 19954 -11458 -26526 -12618
1421 -12618 6284 16214 18272 4445 -21695 -27063 1805 27653 19194 -5303 -17944 -16922 -4102
1434 -4102 18594 26294 539 -26971 -18393 8646 16747 9747 4293 -8105 -23343 -11257 22504
1447 22504 28658 -2412 -23924 -14365 243 8956 19938 15478 -16380 -34954 -6946 28070 23103
1460 23103 -2045 -12664 -16325 -17076 5954 35426 21307 -24627 -36184 -3274 19894 15744 10108
1473 10108 1238 -23339 -29807 6463 37839 18846 -16601 -22028 -10612 -2923 14307 31067 9437
1486 9437 -33135 -32997 9746 30976 13081 -4072 -9233 -18453 -15055 16386 34730 5903 -28439
1499 -28439 -20971 5253 12698 11032 11417 -3990 -26559 -16520 19484 28199 797 -18039 -12253
1512 -12253 -4578 2202 17671 19384 -9632 -31888 -11523 21647 22624 889 -12061 -14407 -11736
1525 -11736 4544 24350 17071 -13793 -27308 -8869 12919 17785 11488 -1936 -20153 -22557 3163
1538 3163 29009 21071 -9097 -24637 -15108 3389 17846 20765 4735 -20426 -26221 -2556 23798
1551 23798 23414 850 -18363 -19569 -5114 13877 22118 8906 -14575 -22645 -6754 13589 17890
1564 17890 7066 -7077 -16396 -13626 4395 21746 15294 -10205 -23282 -9190 11175 16014 7087
1577 7087 -5046 -14619 -12956 4146 19051 11349 -9117 -16368 -6651 4411 10732 11751 990
1590 990 -16577 -17116 5121 20756 10156 -7839 -12207 -7529 -1299 9905 17288 3974 -17917
1603 -17917 -18026 3589 17198 11312 -469 -9675 -14611 -5852 14208 19708 280 -17211 -11375
1616 -11375 2516 6980 7975 7920 -3036 -17087 -11300 10428 17964 3960 -9506 -10881 -6326 2192
1630 2192 13034 11554 -5907 -17047 -6791 8307 9853 3554 -1196 -7156 -10637 -1137 12762
1643 12762 10653 -4711 -11421 -4512 2772 5138 6265 2719 -6627 -9684 -291 8784 6719 -493
1657 -493 -4621 -5958 -3215 5227 10309 2435 -8855 -7965 2131 7004 4070 69 -3187 -5251 -2057
1672 -2057 4709 6090 365 -4042 -3545 -1512 1170 4685 4108 -2561 -6860 -2459 3815 4204 1166 -1189
1688 -1189 -3446 -4080 457 5577 3542 -2989 -4682 -1023 1649 1825 1792 183 -2702 -2446 1138 2292
1704 2292 140 -303 987 -439 -2648 -429 3288 2199 -1493 -1721 410 518 40 1070 1349 -405
1720 -405 -1125 330 693 -245 550 1897 479 -2011 -1511 755 1402 1169 939 -736 -3250 -2074 2782
1737 2782 4449 448 -3958 -3542 85 2810 2834 294 -2684 -3203 -787 1639 2235 1767 -207 -3522
1753 -3522 -4368 229 5673 4724 -1828 -6215 -4049 2079 6087 4220 -1865 -6019 -3883 1964 5417
1768 5417 4214 69 -4562 -5837 -716 6859 7430 -332 -7013 -5470 866 5509 5756 1785 -4739
1783 -4739 -7460 -2207 5816 7671 2343 -4608 -8003 -4850 4415 11149 5324 -8038 -12189 -2179
1797 -2179 8117 8037 1431 -4422 -7653 -5731 2892 10162 6241 -4971 -10191 -5531 2549 8571 8502
1812 8502 -775 -12275 -10897 4099 13802 7144 -4940 -9267 -6451 -229 8429 12082 1738 -12833
1826 -12833 -12561 2381 12772 9140 -726 -8317 -10570 -3282 10128 14161 1624 -11990 -10841 -391
1840 -391 7119 9686 6647 -5118 -16069 -9240 10521 17810 3801 -11692 -12947 -4228 5725 12662
1854 12662 9147 -6582 -17558 -8508 9335 14249 4968 -5453 -11295 -10543 910 15589 13925
1867 13925 -5411 -18441 -9890 6403 12886 9193 -218 -12359 -15453 -657 17728 15928 -3679
1880 -3679 -16389 -11377 1551 11964 14260 3461 -13957 -17831 -675 16684 14400 -619 -11201
1893 -11201 -12345 -5323 8486 18129 8305 -13067 -20088 -4500 13207 15408 4931 -8233 -16360
1906 -16360 -10582 8124 20538 9661 -11924 -19099 -7073 8464 15033 9997 -4778 -18329 -14051
1919 -14051 6757 20130 10743 -8080 -15962 -9978 2246 13992 15526 300 -18544 -17755 3247
1932 3247 19584 14344 -2821 -15139 -14645 -1265 15702 18623 1005 -17790 -16310 1342 14730
1945 14730 13984 3233 -10822 -17498 -6660 13942 20309 4031 -15063 -16679 -3375 10552 15705
1958 15705 7882 -9144 -19241 -9215 11100 18853 7251 -9806 -17133 -9727 7085 18730 11451
1971 11451 -9056 -20048 -9451 9095 16566 8893 -5333 -15260 -12109 3295 16692 13574 -3254
1984 -3254 -16633 -13993 1987 16793 15800 -1453 -17651 -15214 2269 16419 14512 156 -14192
1997 -14192 -15743 -1613 15037 16563 1772 -13386 -15209 -3658 11501 17421 6150 -12764 -18050
2010 -18050 -3638 12390 14019 4348 -6864 -13888 -10027 6261 18451 9550 -10224 -16741 -5919
2023 -5919 6936 12397 9179 -3648 -16390 -11524 7979 16897 5179 -8051 -9523 -5780 -250
2036 -250 10029 13859 -835 -17412 -11738 7423 13773 5832 -2013 -7867 -11980 -3206 14717 16503
2050 16503 -3361 -16719 -8448 4063 7909 9238 6109 -8502 -18251 -3948 16939 14562 -3387
2063 -3387 -10477 -6366 -3639 2312 13266 10820 -8744 -17951 -3746 11026 9041 2330 -1322 -8494
2077 -8494 -11980 1417 16866 9351 -10004 -12739 -922 4372 3652 6057 3091 -9369 -12343 2942
2091 2942 13675 4759 -6572 -5704 -2021 -1468 3625 9581 2354 -10674 -8966 4334 9012 2838
2105 2838 -1260 -2699 -6283 -4375 6958 11871 299 -11357 -6769 4084 6302 3125 1306 -2379
2119 -2379 -7344 -4224 6072 9201 914 -6540 -5294 -1113 2029 5327 5290 -2146 -9229 -5032 5439
2134 5439 7702 891 -4057 -3444 -2364 -961 3930 6361 -177 -7952 -5190 3786 5689 539 -1994
2149 -1994 -1264 -2296 -2146 2757 5260 -261 -5051 -1698 2497 606 -469 2843 1609 -4995 -4157 5010
2165 5010 6358 -2702 -5628 1456 3750 -1466 -1400 3285 1012 -4548 -1092 5044 1332 -4335 -493
2180 -493 3936 -999 -4152 2365 4761 -3089 -5308 3113 4952 -3486 -4576 3770 3716 -4399 -3419 4435
2196 4435 2547 -4790 -1793 4958 941 -5229 -663 4442 -241 -3360 2118 2939 -4499 -4108 5755
2211 5755 6141 -4422 -6378 2325 4180 -1604 -741 3907 -284 -6210 -985 6495 3177 -3323 -1740
2226 -1740 674 -2049 -821 5799 4489 -5157 -7053 1551 5469 1303 -420 422 -3091 -5240 1630
2241 1630 8250 2877 -5944 -5532 126 2535 3175 3422 -936 -6841 -4618 3975 6500 1483 -2767 -3601
2257 -3601 -3806 -812 5758 7011 -1249 -8375 -5142 2708 6170 4481 -238 -5770 -6700 367 7871
2272 7871 6253 -1535 -6231 -4924 -222 5275 7265 1430 -7048 -7507 573 6799 5794 717 -4555
2287 -4555 -7075 -2958 5897 9127 1952 -6994 -7872 -1875 5078 8319 4036 -5834 -10787 -3394 7660
2302 7660 9211 1560 -5546 -7496 -4613 2982 9795 6538 -5029 -11235 -5043 4773 8778 5659 -2100
2317 -2100 -9674 -8684 2547 11645 7491 -3883 -9513 -6332 913 8017 9476 875 -10764 -10815 1837
2332 1837 11455 8015 -1826 -8176 -7843 -1058 8018 10194 1163 -9369 -9356 -330 7419 8578 2986
2347 2986 -6347 -11469 -4435 8802 12533 2019 -9588 -10269 -1922 6677 9547 4240 -6228 -11780
2361 -11780 -5202 6865 11345 4364 -6101 -10849 -6255 4452 11842 7323 -5521 -12672 -6613 5137
2375 5137 10845 6618 -2830 -10224 -8983 1394 11600 10264 -1990 -12105 -9810 2027 11458 9817
2389 9817 -1126 -10845 -9968 718 10490 9705 -8 -9125 -9692 -1541 8271 10939 2953 -8576 -12119
2404 -12119 -3154 9117 12031 2738 -8801 -11506 -3203 7607 11086 4031 -6991 -11694 -5144 6456
2418 6456 11780 5394 -6410 -11912 -6031 5746 11723 6193 -5353 -11669 -6618 4396 10920 7071
2432 7071 -3195 -10539 -8249 2016 11009 9567 -1774 -11675 -9618 2148 11478 9303 -1402 -10121
2446 -10121 -9252 449 9937 10102 462 -9486 -9864 -744 8794 10058 2260 -8006 -10887 -2865 8468
2461 8468 11303 2619 -8061 -10342 -3218 6456 10433 4893 -6185 -11837 -5225 6872 11401 4257
2475 4257 -6191 -10294 -5172 4549 10559 6292 -4753 -10989 -5833 4404 9428 5901 -2166 -8979
2489 -8979 -8099 1536 10764 8728 -2610 -10424 -7010 2232 8566 7741 237 -8344 -9182 158 9701
2504 9701 8761 -400 -7972 -7591 -932 7014 9270 2231 -7721 -9365 -924 7432 7648 1690 -4728 -7796
2520 -7796 -4295 4531 9950 4510 -6176 -9785 -3224 5380 8121 3692 -4043 -8672 -4832 4297 8778
2535 8778 3878 -4074 -7171 -4122 1919 6766 5947 -1432 -8242 -6112 2660 7982 4974 -1975 -6310
2550 -6310 -5049 648 6297 6254 -229 -6451 -5786 436 5940 6050 707 -5490 -6428 -454 6282 6197 1
2567 1 -5230 -4983 -511 3942 5088 1806 -3329 -5399 -2279 3084 5551 2761 -3012 -6219 -2990 3394
2583 3394 5871 2026 -3338 -4911 -2154 1972 4208 2831 -1674 -4727 -2967 1537 4039 2621 -801
2598 -801 -3693 -3439 574 4402 3155 -1512 -3636 -1606 758 1795 2547 1316 -2267 -3917 -375 3949
2614 3949 3057 -779 -2347 -1523 -370 1580 3097 896 -2982 -2654 1154 2348 227 -158 611 -1197
2630 -1197 -2712 541 3751 1007 -2960 -1889 961 411 -338 1356 1080 -2478 -2742 1527 2686 -759
2646 -759 -1717 768 185 -2165 -235 3028 671 -3092 -955 2457 32 -2501 747 3287 -715 -3622
2662 -3622 123 2944 -23 -1519 1417 1345 -2580 -1859 2898 2517 -1932 -1489 1762 -26 -2779 847
2678 847 4549 221 -4676 -1389 3280 1134 -1505 964 1598 -3019 -3404 2839 4591 -1148 -3992 -356
2694 -356 1287 -731 373 2994 -312 -4854 -1733 4030 2485 -2121 -1335 894 -1556 -2445 2871 4763
2710 4763 -1587 -5949 -1173 4066 2175 -691 -58 -936 -3319 -563 5030 3666 -3011 -4359 22
2725 22 1912 970 2090 2288 -2910 -5778 253 6647 3688 -2950 -3530 -784 -262 908 4493 3074
2741 3074 -4115 -6652 -124 5513 3597 -471 -2235 -3648 -3289 2265 7027 2563 -5725 -6037 539
2756 539 3637 2144 1593 255 -4554 -5752 1563 7910 3642 -4327 -5564 -1615 1424 3651 4805
2771 4805 315 -6708 -5816 2870 7153 2691 -2229 -3318 -3407 -1690 4338 7549 948 -7633 -6055 2368
2787 2368 5839 3191 223 -2615 -5412 -2880 4954 7731 828 -6163 -5258 -359 3210 5195 3543
2802 3543 -3399 -8561 -3278 6302 7534 294 -5063 -4729 -2155 1898 6052 4658 -3471 -8391 -3570
2817 -3570 4428 6516 2806 -2427 -6268 -5225 1925 8263 5404 -3544 -7974 -4122 2473 6350 5574
2832 5574 -402 -7384 -7247 1140 8632 6655 -1401 -7120 -6272 32 6667 7545 840 -6778 -7520 -953
2848 -953 6060 7480 2388 -5313 -8409 -3054 5645 8579 2696 -5384 -7956 -3372 4313 7993 3687
2863 3687 -4579 -8113 -3548 3820 7072 3935 -3142 -7797 -4954 3381 8141 4009 -3998 -7180 -3849
2878 -3849 2378 6783 5353 -1955 -8134 -5778 2800 8042 5201 -2018 -7329 -6292 1120 8564 7382
2893 7382 -1909 -8787 -6024 2001 6940 6187 653 -6295 -8285 -1358 7802 8693 549 -7039 -7326 -1686
2909 -1686 5490 8380 3259 -5998 -9220 -2497 6011 7567 2454 -3976 -7396 -4719 3231 8946 4925
2924 4925 -4943 -9025 -3507 4311 6834 3597 -2502 -7004 -5313 2224 7811 4977 -2780 -7146 -4669
2939 -4669 1447 6480 6162 -631 -7725 -6814 1917 8213 5501 -2001 -6359 -4849 351 5770 6548 834
2955 834 -6467 -6986 13 6562 6272 531 -5155 -6365 -1747 5237 7476 1786 -5760 -6772 -1216 4498
2971 4498 5749 2617 -3011 -6964 -4268 3659 8079 3285 -4715 -6861 -2516 3176 5548 3733 -1992
2986 -1992 -6627 -4498 2612 6363 3383 -1983 -4848 -4108 85 5438 5982 -701 -6949 -4974 2137
3001 2137 5658 3506 -530 -3844 -4746 -879 5172 6010 -66 -5493 -4315 471 3876 4360 1692 -3480
3017 -3480 -5879 -1273 5026 5120 88 -3552 -3460 -1653 1668 4878 3419 -2839 -6261 -2088 3625 4485
3033 4485 1482 -1859 -3960 -3152 1395 5158 2959 -2579 -4472 -1741 1420 2806 2851 196 -3739 -4068
3049 -4068 813 4551 2798 -1353 -3078 -2141 -157 2467 3548 663 -3505 -3482 417 3259 2600 273
3065 273 -2098 -2955 -921 2829 3551 198 -2877 -2281 101 1608 2038 1265 -1055 -2903 -1586 1694
3081 1694 2982 985 -1520 -2422 -1311 942 2377 1430 -1256 -2445 -1065 924 1534 1054 -325 -1687
3097 -1687 -1758 108 1928 1406 -618 -1691 -1010 199 1114 1031 -93 -1007 -898 -111 598 832 556 -352
3115 -352 -1250 -735 945 1395 201 -949 -692 225 494 380 162 -86 -210 -162 -16 30 229 457 78 -690
3135 -690 -486 310 507 -80 -272 -7 -101 -540 -318 555 732 -96 -827 -734 -12 652 563 -41 -681 -710 -228
3156 -228 306 751 581 -256 -1242 -1112 364 1625 1058 -722 -1752 -962 928 1702 827 -743 -1443 -775
3174 -775 335 1315 1375 259 -1445 -1911 -160 2125 2127 -45 -1926 -1935 -7 1846 2202 301 -2053 -2368
3192 -2368 -330 1843 2307 717 -1631 -2870 -1243 1937 3243 864 -2374 -2936 -743 1638 2439 1313
3208 1313 -1322 -3236 -1969 1542 3363 1599 -1436 -3086 -2139 814 3563 2916 -1289 -4303 -2283
3223 -2283 1921 3559 1801 -789 -2728 -2881 10 3840 3818 -757 -4158 -2762 975 3158 2944 615
3239 615 -3045 -4203 -417 4262 3962 -347 -3455 -3037 -796 2314 4359 2099 -3563 -5617 -852 4414
3255 4414 4117 54 -2825 -3494 -2187 1818 5092 2668 -3433 -5364 -1404 2881 3718 2076 -1112 -4649
3271 -4649 -4071 2022 6255 2889 -3354 -4696 -1655 1449 3466 3783 59 -5334 -4917 1885 6263 3036
3287 3036 -2065 -3852 -2870 -149 3966 5266 110 -5818 -4535 1733 4609 2876 277 -2534 -4852
3302 -4852 -2351 4612 6807 406 -6067 -4700 614 3542 3698 1904 -2638 -6163 -2751 4624 6146
3317 6146 643 -4012 -4072 -1902 1389 5170 4342 -2690 -7462 -2931 4466 5420 1308 -1973 -3696 -3886
3333 -3886 161 6063 5417 -2261 -6791 -3113 2636 4435 3294 136 -4540 -5551 566 6739 4691
3348 4691 -2246 -4953 -2633 227 2920 4883 2069 -4789 -6706 -132 6118 4571 -689 -3692 -4000
3363 -4000 -1899 3111 6355 2125 -5271 -6019 -232 4054 3743 1637 -1840 -5523 -3991 3143 7111
3378 7111 2293 -4584 -5230 -1213 2125 3993 3602 -1074 -6058 -4396 2714 6180 2788 -2226 -4343
3393 -4343 -3533 320 5210 5392 -1072 -6631 -4080 2297 4987 3124 -270 -3587 -4710 -858 5082
3408 5082 5653 -256 -5241 -4267 85 3686 4555 1427 -3907 -5741 -1172 4570 4905 554 -3473 -4334
3424 -4334 -2127 2508 5331 2584 -3547 -5692 -1803 3280 4413 1791 -2209 -4591 -2857 1942 4910
3439 4910 2647 -2150 -4501 -2594 1393 4304 3459 -1093 -4871 -3476 1710 4700 2997 -1123 -3901
3454 -3901 -3232 594 4247 3718 -578 -4181 -3400 439 3858 3759 253 -3856 -4146 89 4076 3656 -43
3471 -43 -3194 -3504 -999 2815 4318 1184 -3396 -4449 -1035 3055 3864 1420 -2469 -4479 -2113 2765
3487 2765 4444 1281 -2698 -3395 -1524 1074 3141 2922 -728 -4313 -2959 1666 3862 1863 -975
3502 -975 -2602 -2469 -33 3116 3184 -547 -3317 -1947 920 1966 1790 728 -1623 -3150 -637 3250
3518 3250 2925 -865 -2653 -1075 504 1035 1635 1039 -1581 -2889 -291 2534 1943 -390 -1477 -1460 -1037
3535 -1037 980 2966 1361 -2571 -3176 146 2300 1263 -13 -435 -1610 -1975 486 3051 1616 -1724
3551 -1724 -2368 -569 610 1093 1563 563 -1984 -2239 566 2372 941 -638 -398 -473 -1017 236 2209
3568 2209 1258 -1520 -1899 493 1488 228 -193 366 -372 -1065 108 1360 523 -844 -339 368 -276 -319
3586 -319 917 779 -1058 -1222 639 1157 -355 -873 250 313 -781 -488 935 651 -843 -838 310 289
3604 289 -368 69 679 -177 -1101 -116 897 321 -408 231 221 -870 -712 1079 1527 -373 -1353 -164 713
3623 713 86 66 789 240 -1304 -867 933 1307 88 -594 -352 -477 -279 1084 1437 -415 -1883 -663
3641 -663 1131 937 99 -1 -391 -1406 -650 1518 1742 -649 -2073 -907 576 873 787 388 -955 -2017
3659 -2017 -464 1775 1633 -208 -1226 -1156 -711 583 2188 1486 -1591 -2798 -531 1948 1894 316 -768
3676 -768 -1479 -1384 512 2593 1773 -1072 -2459 -1064 909 1881 1724 -9 -2223 -2267 543 2755 1769
3693 1769 -714 -1998 -1497 -170 1552 2369 579 -2384 -2809 -123 2419 2198 9 -1974 -2289 -728
3709 -728 1811 2505 527 -2117 -2493 -668 1427 2294 1209 -1280 -3110 -1635 1728 3276 1190 -1952
3725 -1952 -2861 -1143 1405 2812 1642 -1240 -3025 -1800 1282 3130 1934 -865 -2922 -2323 791
3740 791 3372 2574 -849 -3209 -2299 764 2892 2544 -81 -2704 -2940 -192 2926 3239 280 -3051
3756 -3051 -3283 -359 2880 3303 405 -2935 -3358 -628 2605 3172 752 -2278 -3298 -1336 1977 3489
3772 3489 1489 -2180 -3791 -1587 2066 3610 1668 -1911 -3621 -1883 1703 3623 2068 -1487 -3631
3787 -3631 -2268 1256 3648 2711 -994 -3825 -2757 1240 3931 2735 -881 -3480 -2686 491 3362
3802 3362 3199 -130 -3437 -3384 16 3398 3443 253 -3265 -3651 -464 3381 3729 294 -3282 -3486 -528
3819 -528 2601 3437 1127 -2587 -3975 -1430 2692 4004 1143 -2645 -3720 -1476 2025 3694 1869
3834 1869 -2077 -4061 -1897 2096 3767 1936 -1485 -3574 -2503 1143 4174 2921 -1614 -4221 -2265
3849 -2265 1562 3496 2388 -526 -3219 -3081 380 3811 3338 -619 -3524 -2855 181 3033 3363 493
3865 493 -3372 -3812 -73 3576 3145 -86 -2753 -2909 -978 2168 3796 1309 -3015 -4144 -803 2909
3881 2909 3152 745 -2000 -3402 -1749 1912 3883 1568 -2397 -3410 -1169 1454 2812 2132 -782
3896 -782 -3680 -2704 1601 4102 1904 -1824 -2974 -1597 693 2734 2749 -336 -3386 -2662 1029 3203
3912 3203 2053 -375 -2242 -2644 -480 2883 3429 -161 -3339 -2517 550 2165 2063 699 -1666 -3234
3928 -3234 -1239 2520 3409 335 -2601 -2492 -642 1352 2621 1456 -1665 -3422 -1124 2266 2601 538
3944 538 -1165 -1905 -1725 376 2874 2347 -1333 -3329 -1332 1562 2212 1202 -303 -1901 -2134 236
3960 236 2793 2060 -951 -2249 -1202 290 1467 2007 652 -2074 -2687 174 2635 1724 -490 -1381
3976 -1381 -1132 -627 931 2280 1025 -1803 -2401 -163 1727 1491 420 -795 -1795 -1338 1047 2374
3992 2374 660 -1631 -1734 -267 606 1024 1174 16 -1896 -1757 668 2170 851 -961 -1228 -795 -62
4009 -62 1131 1529 116 -1653 -1283 510 1299 853 155 -678 -1188 -535 1270 1680 -46 -1458 -960 234
4027 234 667 681 517 -298 -1160 -729 755 1246 358 -564 -834 -554 241 1036 731 -552 -1153 -354 478 575
4047 575 359 -41 -614 -813 -84 775 691 -86 -700 -595 -45 523 698 66 -571 -500 14 211 372 450 41
4068 41 -584 -538 263 810 354 -205 -289 -255 -111 350 585 103 -398 -175 -21 -83 244 698 275 -872 -813 388
4090 388 753 18 -238 16 -262 -650 52 887 334 -681 -571 -11 -29 103 583 230 -985 -949 555 930
4110 930 -102 -553 107 -78 -775 85 1412 496 -1327 -1081 603 909 154 31 46 -758 -782 855 1552
4129 1552 -53 -1320 -426 346 109 502 1192 -35 -1923 -1164 1528 1837 -163 -1010 -531 -443 -316 1175
4147 1175 1806 -366 -2329 -1142 1076 1322 483 124 -748 -1836 -597 2054 2038 -678 -2100 -757 372
4164 372 354 992 1269 -746 -2554 -925 2041 1971 -328 -1252 -878 -616 296 1935 1512 -1277 -2468 -217
4182 -217 1645 1110 126 -131 -1025 -1558 245 2552 1590 -1529 -2240 -184 1143 1020 899 186 -1637 -2016
4200 -2016 585 2696 1259 -1256 -1732 -865 -67 1329 2130 260 -2661 -2382 884 2525 1051 -639
4216 -639 -1091 -1487 -899 1512 2678 574 -2499 -2306 250 1689 1518 678 -969 -2337 -1270 1924 2803
4233 2803 292 -1901 -1686 -342 722 1806 1708 -709 -2866 -1430 1803 2625 662 -1219 -1701 -1208
4249 -1208 313 2183 1948 -756 -2655 -1405 1046 2013 1311 -208 -1845 -2348 -52 2622 2189 -798
4265 -798 -2510 -1526 335 1563 1725 395 -1762 -2483 -362 2215 2138 54 -1780 -1931 -506 1500 2348
4282 2348 742 -1859 -2349 -311 1714 1889 505 -1044 -1935 -1105 1185 2540 1194 -1452 -2435 -801
4298 -801 1412 2189 1067 -993 -2174 -1187 1069 2342 1326 -864 -2151 -1468 625 2190 1808 -475
4314 -475 -2417 -1979 500 2463 1811 -542 -2224 -1867 111 1920 2083 190 -2034 -2366 -369 1995
4330 1995 2261 399 -1836 -2321 -609 1604 2311 803 -1578 -2234 -725 1342 2106 952 -985 -2098
4346 -2098 -1288 1014 2386 1253 -1205 -2180 -892 1120 2017 1111 -589 -1951 -1261 791 2088 1296
4362 1296 -723 -1819 -1344 401 1912 1705 -413 -2307 -1612 645 2022 1347 -418 -1691 -1732 -146
4378 -146 1879 1969 -30 -2042 -2042 -150 1683 1938 353 -1694 -2222 -457 1677 1990 375 -1368 -1803
4395 -1803 -790 938 2075 1253 -1015 -2236 -1004 1187 2063 1017 -815 -1782 -1129 770 1949 1136
4411 1136 -679 -1625 -1044 416 1539 1428 -119 -1786 -1520 424 1824 1245 -390 -1488 -1195 50
4427 50 1378 1449 21 -1467 -1405 -28 1191 1337 239 -1293 -1664 -389 1391 1633 61 -1396 -1290
4444 -1290 -190 860 1210 566 -791 -1544 -668 861 1351 601 -661 -1272 -733 725 1509 867 -696
4461 -696 -1345 -567 694 1088 739 -66 -1011 -1040 207 1322 1066 -334 -1145 -758 229 883 851 8 -912
4480 -912 -1041 84 858 766 27 -563 -816 -431 569 1079 366 -883 -1031 -119 697 598 101 -427 -724 -465
4500 -465 323 780 313 -374 -650 -272 135 511 543 -80 -724 -478 283 682 284 -166 -219 -239 -214 275 665
4521 665 250 -469 -621 137 500 296 101 -47 -344 -319 206 546 188 -200 -117 -133 -224 147 569 288 -546
4542 -546 -550 166 441 78 -204 -31 -170 -390 -122 470 331 -305 -494 -116 -41 122 385 207 -473 -505 79
4563 79 516 216 -66 -15 -189 -414 -12 757 530 -386 -677 -82 452 362 275 73 -397 -541 73 606 513 -146
4585 -146 -384 -275 -135 286 768 364 -757 -811 17 789 498 -33 -266 -448 -456 236 845 457 -514 -876 -312
4606 -312 355 630 419 -249 -920 -640 359 902 370 -362 -630 -504 -74 550 829 130 -933 -933 131 946
4626 946 813 -15 -761 -816 -106 766 944 180 -661 -791 -243 627 975 483 -552 -1115 -498 729 1126 436
4646 436 -554 -1026 -430 524 1030 583 -403 -1009 -683 283 1162 848 -324 -1249 -959 328 1056 721 -266
4665 -266 -1031 -936 -55 974 1045 -42 -1026 -1064 -97 887 1109 320 -1026 -1441 -225 1187 1296 86 -971
4684 -971 -1029 -309 644 1240 727 -758 -1465 -593 1010 1367 494 -622 -1190 -718 560 1609 958 -737
4702 -737 -1427 -524 601 1104 831 -44 -1266 -1354 236 1723 1144 -604 -1462 -864 251 991 1218 148
4720 148 -1381 -1461 82 1432 1059 -139 -993 -1247 -537 1036 1708 326 -1569 -1587 24 1204 984 304
4738 304 -622 -1399 -934 958 1953 651 -1228 -1483 -380 761 1387 958 -476 -1809 -1022 1029 1741
4755 1741 588 -775 -993 -759 50 1376 1490 -252 -1963 -1206 788 1582 733 -302 -1056 -1202 -159
4772 -159 1453 1509 -270 -1687 -1043 329 959 1047 364 -1032 -1865 -399 1712 1629 -354 -1486 -972 -93
4790 -93 632 1341 921 -972 -2063 -473 1405 1477 246 -737 -1166 -940 491 1994 1177 -1161 -1878 -305
4808 -305 1078 975 611 72 -1138 -1474 250 1952 1178 -896 -1473 -511 245 833 1158 205 -1499 -1560
4826 -1560 447 1612 641 -504 -702 -767 -521 794 1678 214 -1743 -1395 565 1185 548 74 -414 -1202
4844 -1202 -762 1050 1736 106 -1363 -968 -61 541 984 944 -434 -1721 -825 1195 1515 130 -735 -665
4862 -665 -562 -82 1119 1287 -420 -1634 -690 747 976 507 -39 -743 -1110 6 1406 1058 -545 -1084
4880 -1084 -407 186 460 897 470 -907 -1423 -27 1202 886 -251 -778 -696 -344 410 1029 421 -860
4898 -860 -1060 -156 596 626 442 -252 -1000 -799 539 1159 470 -626 -746 -358 140 681 709 -16 -757 -624
4918 -624 258 764 567 29 -541 -679 10 815 694 -187 -668 -346 34 398 496 178 -465 -728 -164 520
4938 520 558 133 -454 -669 -280 506 709 104 -624 -519 28 239 399 357 -88 -743 -587 365 802 295 -339
4959 -339 -463 -444 6 646 695 -163 -741 -350 210 355 370 318 -236 -787 -332 621 824 36 -560 -327 -101
4980 -101 70 462 508 -122 -628 -244 267 265 243 73 -131 -612 -264 501 540 -156 -474 -121 38 -65 145 303
5002 303 -58 -469 -188 250 282 61 -115 -160 -243 29 382 224 -270 -281 3 166 16 45 151 -151 -343 -4
5024 -4 353 390 -198 -352 -159 44 290 289 22 -335 -302 27 300 319 225 -123 -388 -340 190 592 325 -269 -582
5047 -582 -330 117 280 304 20 -349 -492 -195 364 523 190 -375 -571 -227 274 555 276 -241 -479 -281
5067 -281 211 497 323 -73 -422 -452 13 566 552 -55 -563 -491 144 522 427 -32 -438 -414 -43 429 565 129
5089 129 -450 -584 -63 450 649 174 -459 -676 -219 473 669 248 -474 -663 -317 251 615 394 -250 -729
5109 -729 -475 273 844 486 -341 -726 -426 245 658 488 -109 -687 -654 25 716 661 -131 -708 -657 43 730
5130 730 721 3 -759 -689 161 708 647 32 -552 -677 -241 642 998 322 -655 -929 -169 746 793 282 -513 -904
5152 -904 -388 573 1015 334 -513 -787 -465 289 820 708 -286 -1048 -684 437 975 478 -409 -784 -574 109
5172 109 803 763 -119 -893 -736 90 782 673 124 -722 -963 -42 951 835 -101 -845 -654 16 604 707
5192 707 283 -505 -919 -264 772 898 246 -632 -807 -326 615 956 350 -623 -902 -308 494 783 507 -226
5212 -226 -856 -612 352 1022 607 -428 -953 -625 311 896 580 -290 -875 -631 170 839 598 -143 -740 -737
5232 -737 -88 922 829 -25 -847 -745 35 738 799 152 -668 -771 -182 620 863 315 -518 -828 -325 551
5252 551 993 323 -616 -848 -235 496 741 402 -348 -855 -508 382 871 554 -406 -813 -485 149 854 654
5272 654 -250 -996 -633 283 777 545 -118 -657 -769 -167 773 878 -56 -881 -749 29 679 730 176 -624
5292 -624 -876 -106 723 813 96 -508 -650 -276 431 898 526 -513 -1056 -309 730 814 220 -353 -645 -465
5312 -465 283 926 624 -378 -819 -489 284 644 521 -11 -773 -868 128 998 560 -389 -676 -403 -78 408
5332 408 749 170 -814 -1008 -29 842 625 -79 -518 -646 -212 497 894 171 -799 -720 37 491 415 363 -187
5353 -187 -769 -635 503 1114 359 -597 -649 -76 298 514 584 -93 -854 -526 435 819 241 -199 -405 -454 -50
5374 -50 670 819 -63 -868 -529 444 569 260 21 -290 -574 -368 582 770 -25 -704 -480 49 279 390
5394 390 373 -310 -867 -254 646 579 -144 -413 -244 -218 -60 475 573 -202 -851 -354 519 537 69 -87 -223 -405
5416 -405 -63 648 636 -303 -626 -93 233 192 336 243 -313 -713 -92 755 467 -304 -369 -17 -78 -54 420 444
5438 444 -320 -700 -75 441 275 -35 -35 -210 -492 -77 583 337 -391 -454 -28 146 22 204 188 -205 -608
5459 -608 8 514 303 -263 -185 -116 -242 -9 408 364 -307 -453 86 266 180 126 129 -134 -300 96 549 228
5481 228 -278 -251 -12 34 16 262 121 -259 -346 35 387 286 -19 -159 -218 -117 134 312 100 -328 -328 -21
5503 -21 146 145 129 -69 -301 -379 85 431 224 -202 -423 -187 56 210 208 9 -214 -390 -126 280 409 159
5525 159 -237 -394 -185 214 433 230 -293 -395 -72 312 383 101 -61 -211 -244 66 439 373 -78 -370 -335
5546 -335 224 412 270 -60 -387 -324 57 352 289 -34 -405 -377 -167 269 422 156 -349 -608 -181 362 443
5567 443 103 -335 -428 -248 71 372 224 -50 -441 -380 69 507 345 -62 -397 -391 123 450 394 -62 -339 -212
5589 -212 45 389 368 90 -202 -370 -56 414 549 49 -370 -351 76 422 375 38 -261 -473 -133 331 463
5610 463 56 -365 -508 -197 202 583 365 -355 -731 -255 431 512 127 -297 -441 -486 34 561 635 -157 -712
5631 -712 -453 130 480 526 129 -471 -740 -72 688 543 -33 -490 -376 -192 262 675 450 -380 -756 -103
5651 -103 566 449 101 -140 -403 -405 175 796 382 -447 -515 -30 213 375 379 28 -712 -581 388 832 174 -473
5673 -473 -369 -239 26 420 594 -10 -857 -521 286 618 270 -83 -496 -653 -96 755 754 -196 -771 -484 73
5694 73 342 481 299 -397 -925 -237 757 878 43 -496 -443 -234 295 785 400 -532 -731 -154 456 472 354
5715 354 -11 -589 -632 170 929 446 -422 -703 -212 142 470 541 -109 -707 -636 210 685 280 -123 -457 -546
5736 -546 -106 629 695 -138 -807 -426 189 539 367 89 -391 -653 -117 590 641 -37 -561 -472 -170 393 704
5757 704 296 -554 -766 -13 576 522 53 -175 -430 -371 290 705 337 -351 -486 -254 294 476 346 -214 -630
5778 -630 -360 318 579 143 -267 -359 -376 19 490 495 -127 -677 -406 251 514 328 -45 -457 -470 30 524 483
5800 483 -91 -340 -335 -112 320 459 230 -381 -664 -109 452 510 68 -323 -365 -167 253 545 225 -253 -403
5821 -403 -201 226 341 276 -59 -431 -306 156 496 201 -213 -294 -158 20 268 251 -46 -282 -297 100 257
5842 257 193 12 -268 -302 -23 304 280 -39 -267 -217 -10 165 283 123 -190 -322 -164 238 337 17 -103 -330
5864 -330 -157 248 328 188 -121 -235 -114 43 240 315 26 -339 -289 85 309 272 -101 -224 -215 -69 141 285
5886 285 24 -209 -247 -28 116 232 97 -79 -325 -199 174 281 76 -205 -210 -85 -9 115 231 -33 -245
5907 -245 -253 87 195 152 -86 -142 -205 -69 260 340 -31 -188 -168 51 79 120 161 11 -321 -227 145 288 100 -245
5931 -245 -141 2 37 172 161 -37 -272 -170 17 228 174 63 -76 -312 -93 304 404 -82 -425 -160 52
5952 52 126 100 114 -78 -304 -207 190 406 13 -166 -169 -152 50 255 327 -110 -406 -160 212 195 97 28 -60 -287
5976 -287 -138 291 415 -35 -358 -148 85 141 246 164 -232 -385 -100 355 229 -15 -143 -113 -215 -37 379
5997 379 384 -127 -551 -196 259 261 135 -16 -178 -378 -75 438 301 -170 -368 -213 27 86 248 161 -327 -464
6019 -464 19 467 348 -80 -229 -129 -159 93 469 284 -385 -483 -78 372 343 46 -66 -319 -334 217 451
6040 451 276 -305 -428 -121 101 342 277 -12 -454 -426 144 522 200 -183 -392 -297 -19 325 370 27 -518
6061 -518 -460 69 419 388 21 -369 -473 -22 392 427 87 -405 -404 -22 289 372 135 -233 -485 -200 350 578
6083 578 129 -315 -417 -101 299 478 289 -224 -430 -186 230 453 295 -155 -445 -318 129 481 384 -165
6103 -165 -512 -347 159 418 290 -78 -366 -370 1 352 399 24 -398 -472 -41 401 322 25 -441 -443 -28 391
6125 391 384 71 -384 -337 8 259 336 159 -278 -381 -245 331 496 139 -341 -377 -60 263 459 186 -162 -457
6147 -457 -198 279 416 246 -135 -396 -298 106 403 318 -163 -476 -237 257 329 198 -59 -240 -328 -16 327
6168 327 340 -39 -376 -322 -1 275 355 66 -379 -397 -61 340 262 24 -245 -237 -9 166 310 212 -256 -442 -160
6191 -160 236 363 73 -203 -262 -97 160 376 161 -119 -382 -139 163 305 252 -14 -192 -261 87 387 264
6212 264 -64 -276 -179 101 189 143 5 -199 -335 -99 328 317 -63 -217 -175 -83 86 260 189 -247 -405 -55
6234 -55 261 103 -32 -108 -225 -198 89 333 214 -271 -390 21 222 137 69 -27 -188 -214 95 450 187 -184
6256 -184 -246 -30 54 198 318 117 -319 -331 161 327 97 -108 -23 -163 -220 134 446 111 -309 -302 68 202
6278 202 138 104 35 -342 -302 128 391 55 -199 -100 -158 -170 90 362 0 -381 -336 180 182 -31 4 6 -160 -141 119
6303 119 262 38 -177 -52 75 34 50 169 -61 -329 -17 265 280 -100 -192 -7 48 35 158 160 -72 -281 -64
6326 -64 208 140 49 -86 -195 -192 10 352 169 -224 -201 -56 97 43 192 94 -126 -288 -122 285 267 -55 -227
6349 -227 -225 -121 136 186 82 -122 -250 -123 35 110 92 34 -162 -246 66 285 205 -14 -237 -101 63 171 164
6372 164 50 -132 -149 -11 136 241 14 -99 -93 -36 126 241 149 -177 -206 -38 191 168 62 -14 -178 -146 48
6395 48 201 165 -95 -260 -164 24 114 196 17 -217 -160 28 180 130 -13 -144 -189 -61 162 226 123 -203 -225
6418 -225 -71 142 210 124 -96 -290 -107 101 264 189 -86 -151 -57 146 333 171 -110 -269 -99 142 269 195
6440 195 13 -201 -273 -61 279 265 -98 -246 -187 50 239 262 44 -285 -373 13 307 200 -28 -204 -258 -198
6462 -198 127 391 154 -269 -379 -108 225 226 134 -132 -239 -252 70 387 117 -73 -280 -147 0 274 358 -46
6484 -46 -339 -246 182 332 139 -46 -184 -182 3 316 225 8 -258 -217 20 222 268 110 -292 -375 25 363 257
6507 257 -84 -188 -164 -65 144 276 120 -215 -324 -138 174 318 143 -158 -380 -229 220 360 31 -229 -309
6528 -309 -118 9 254 243 -23 -350 -297 69 336 278 -24 -291 -345 73 306 270 -59 -250 -117 2 177 298
6550 298 169 -117 -348 -89 208 327 29 -98 -246 -105 106 318 110 -211 -183 -19 62 146 200 -33 -298
6571 -298 -203 173 319 124 -155 -279 -72 -12 169 252 -59 -326 -218 81 179 187 73 -85 -273 -118 295 296 -36
6594 -36 -302 -90 16 96 155 127 -83 -295 -91 203 309 17 -187 -108 -159 79 232 151 -169 -320 -25 200
6616 200 153 17 -6 -148 -230 13 327 236 -127 -269 -104 46 134 196 47 -188 -282 6 283 228 -76 -210 -159
6639 -159 -67 176 291 92 -258 -237 53 224 134 78 -46 -165 -149 79 259 86 -220 -240 -26 92 226 120
6661 120 -95 -268 -139 106 208 51 -6 -128 -128 52 148 231 21 -264 -230 80 232 136 -16 -189 -141 -2 207
6684 207 136 -49 -167 -162 30 151 165 124 -134 -314 -16 188 184 -3 -156 -92 15 111 77 94 -101 -97 -62 119 173
6709 173 141 -149 -214 -69 126 174 56 -86 -123 19 121 115 123 -43 -50 -113 27 152 207 32 -155 -104 143 244
6733 244 84 -50 -112 -80 43 114 47 92 -79 -126 -38 97 109 2 -75 -124 -42 88 174 35 -131 -174 31 57 0
6758 0 51 10 -112 -133 64 74 53 -64 -103 -57 -25 41 89 4 -73 -106 18 124 26 4 -21 -18 -79 97 153 112 -124 -118
6786 -118 24 37 -57 25 73 -78 -98 98 186 -22 -62 -43 -7 -42 30 138 32 -91 -94 6 81 -56 -16 100 -56
6811 -56 -215 32 125 77 -132 -101 37 -23 -49 87 48 -108 -101 48 150 -9 -49 57 -65 -55 109 169 -11 -115
6835 -115 -22 79 127 -33 113 103 -141 -145 62 232 -18 -156 -41 3 -51 35 135 16 -194 -121 91 79 -73
6858 -73 29 52 -102 -123 116 214 -15 -199 -82 56 69 80 18 -3 -153 -97 173 193 23 -27 -33 -52 -76 154 220
6883 220 -57 -297 -111 177 150 -47 -39 -107 -79 -13 115 153 -68 -171 -88 34 108 163 96 -205 -141 73 143 114 -93
6908 -93 -143 -159 -23 92 171 110 -111 -153 -67 256 231 129 -185 -215 -59 130 207 160 -110 -177 -129 59 194 164 -13
6933 -13 -223 -117 50 300 182 -45 -190 -150 125 195 192 -11 -84 -166 -82 105 172 60 -212 -161 -33 162 157 103
6957 103 -118 -236 17 202 180 -8 -96 -130 -124 119 215 121 -166 -287 -87 124 136 117 -77 -246 -119 145 352
6980 352 100 -198 -209 -69 128 167 289 -37 -324 -185 100 361 164 -36 -183 -219 -38 247 296 -28 -343
7001 -343 -282 13 193 219 62 -234 -310 -64 260 217 -34 -135 -223 -130 82 266 133 -240 -290 -94 207 189 45
7024 45 -127 -260 -169 134 338 78 -206 -243 -113 126 141 232 -31 -335 -189 231 373 88 -237 -227 -64 15
7046 15 258 252 -53 -359 -201 77 226 144 65 -213 -360 -44 345 303 -76 -273 -158 67 59 241 89 -171 -300
7069 -300 -13 288 121 -46 -168 -237 -128 201 300 57 -315 -297 56 292 84 3 -105 -215 -131 128 376 168
7091 168 -209 -220 -52 122 326 244 -123 -356 -185 203 331 95 -58 -191 -161 -7 299 308 -90 -302 -254 104
7113 104 234 172 -69 -184 -246 106 209 115 -80 -203 -120 -39 155 173 80 -232 -242 46 222 220 -85 -143 -185 50
7137 50 207 192 -7 -167 -148 38 164 160 -10 -169 -210 -28 184 218 39 -181 -183 19 220 119 22 -95 -241
7160 -241 -5 69 192 67 -94 -195 -113 108 197 106 -40 -134 -112 96 210 101 -82 -145 -121 59 103 75 -28
7183 -28 -101 -139 20 98 76 -63 -102 -60 15 20 75 -12 -146 -64 -13 39 58 39 -120 -83 76 31 -5 -56 -101 16 36 173
7211 173 81 37 -82 -57 -35 102 67 -7 -52 -170 4 149 96 57 -75 -47 36 35 79 -20 -22 -79 2 90 121 11 -100
7238 -100 -84 -33 -18 57 -17 -68 -15 23 -41 29 -7 39 -78 -35 -29 8 -53 -79 -48 24 54 17 -28 -88 31 4 22 -31 58
7267 58 -14 6 45 -20 62 110 14 -66 19 57 70 -36 -35 10 42 39 39 -38 -60 -6 57 1 -9 -18 -19 -65 -25 55 21 -95 -153 29
7299 29 87 82 18 -63 9 -30 65 70 -31 -79 -72 -45 36 60 80 -14 -93 -83 92 66 74 -68 -42 18 73 110 67 -111 -45 -58
7329 -58 70 196 72 -12 -175 -87 53 162 109 -55 -162 -88 47 127 98 -3 -195 -68 40 109 97 61 -163
7352 -163 -215 -99 184 85 -43 -111 -190 -12 187 94 10 -164 -149 -31 143 170 -41 -68 -191 -45 117 225 181
7375 181 -152 -279 10 146 145 16 -50 -224 -96 202 197 60 -221 -173 -28 136 194 155 -27 -222 -106 108 274
7398 274 90 -95 -202 -130 49 232 223 -82 -277 -144 152 207 139 -64 -109 -235 -37 235 185 -103 -314 -195
7420 -195 19 156 171 65 -297 -297 -24 268 188 -72 -155 -130 1 136 286 126 -212 -302 -49 231 216 18 -79
7443 -79 -197 -105 189 246 108 -190 -248 -38 185 238 148 -62 -289 -218 209 273 65 -266 -217 -79 56 232 176
7466 176 -32 -348 -212 144 249 67 -35 -255 -196 14 259 254 -59 -334 -210 139 161 134 -22 -203 -255 -85
7488 -85 277 263 -5 -272 -146 79 189 192 20 -208 -240 -12 349 231 15 -157 -158 -69 42 259 138 -200 -257
7511 -257 7 230 241 22 -109 -201 -96 164 275 75 -105 -295 -64 59 178 108 -28 -226 -181 50 214
7532 214 148 -129 -155 -76 28 161 119 -32 -260 -177 153 90 174 -33 -160 -94 45 231 183 -101 -125 -157 85 206
7556 206 158 -3 -104 -192 -63 168 225 4 -120 -119 71 151 178 78 -100 -234 -40 180 120 7 -152 -87 -42
7579 -42 78 121 107 -103 -143 6 122 111 43 -108 -83 -112 112 218 98 -76 -180 -60 88 165 66 -88 -158 -74
7603 -74 54 155 107 -52 -125 -79 51 140 147 -14 -144 -112 7 198 161 -36 -127 -141 52 167 114 -43 -105 -89 -40
7628 -40 115 155 86 -121 -219 -56 143 91 53 -147 -147 -24 58 171 0 -87 -41 -49 -50 103 117 -9 -134 -106 148 140
7654 140 59 -89 -145 -69 74 117 89 -129 -140 -22 81 138 35 27 -133 -148 91 188 115 -97 -160 -41 99 142 157
7679 157 -3 -149 -36 24 82 36 -69 -108 -98 -48 58 212 -7 -179 -28 109 123 60 -5 -109 -31 -16 113 32
7703 32 -14 -59 -30 12 127 117 -37 -151 -157 49 146 101 -45 -103 -34 -42 91 131 27 -107 -115 -11 81 95 84 -140 -189
7730 -189 14 142 37 7 -54 -24 -21 -26 101 61 -103 -125 -46 54 35 -12 47 -36 -100 63 148 0 -52 -10 89 -10 84
7757 84 68 -5 -119 -14 97 88 -79 -62 53 34 39 130 135 -170 -117 67 128 7 37 34 -97 -56 110 113 75 -111 -82
7784 -82 67 55 -33 41 39 -163 -61 64 99 26 -25 15 -9 -41 57 142 14 -125 24 136 95 -65 -7 28 -54 -64
7810 -64 83 50 -106 -112 11 77 28 29 -17 -41 -15 50 218 -23 -148 -6 83 39 52 68 -100 -115 -78 123 134 -4
7836 -4 -113 -99 -93 48 157 47 -103 -104 -5 34 74 4 8 -108 -161 53 144 120 -27 -105 -69 -25 105 49 28 -131 -90
7863 -90 100 77 33 -52 -49 -118 38 107 129 19 -213 -87 68 84 127 -6 -110 -99 57 196 87 51 -85 -56 -89
7888 -89 95 189 57 -143 -179 -24 208 159 -10 -135 -93 -14 110 159 16 -146 -126 -75 35 59 99 -52 -232 -85
7912 -85 94 166 15 -56 -173 -41 116 142 124 7 -142 -39 64 240 144 -5 -140 -112 57 151 137 -36 -212
7935 -212 -126 14 187 185 -78 -82 -159 43 155 185 -4 -145 -182 -40 133 155 -8 -147 -178 -14 164 215 89 -160
7959 -160 -238 -48 144 190 57 -72 -229 -108 113 231 76 -197 -249 -87 78 221 15 -143 -223 -145 171 188
7981 188 87 -140 -274 -114 27 215 143 -95 -256 -87 78 258 142 -62 -132 -137 45 285 274 -47 -278 -151
8003 -151 95 228 194 21 -149 -192 38 152 247 -31 -158 -201 -66 186 227 6 -286 -210 2 183 82 9
8025 9 -120 -203 -76 69 283 80 -239 -251 -9 207 244 9 -225 -226 -117 96 229 6 -196 -255 -103 132 256
8048 256 157 -128 -279 -84 163 306 156 -172 -193 -144 115 216 167 -112 -297 -166 139 240 119 -83 -212
8069 -212 -211 47 271 236 -69 -307 -193 132 212 179 -74 -209 -183 -28 264 241 1 -295 -145 17 211 155 -7
8092 -7 -227 -208 77 239 140 -42 -163 -90 0 134 196 89 -194 -253 -8 240 219 6 -138 -178 -22 165 288
8115 288 20 -165 -217 -50 87 160 106 -162 -266 -73 199 284 96 -200 -254 -66 107 190 101 -150 -197 -137 81
8138 81 248 114 -142 -157 -155 41 231 136 -1 -203 -120 94 190 62 -10 -145 -179 0 286 131 -55 -119 -165 1
8162 1 172 190 -14 -148 -176 28 200 153 -68 -124 -111 31 186 227 -1 -198 -205 30 192 88 9 -137 -206 1
8186 1 170 203 6 -166 -178
8191a78
$$ Imaginary data points
##PAGE= N=2
##DATA TABLE= (X++(I..I)), XYDATA
0 0 0 0 0 0 0 0 0 0 0 0 0 -4 8 -4 8 -8 8 -8 12 -12 16 -19 19 -22 28 -28 31 -36 42 -45 50 -56 63 -70 78 -85
36 -85 95 -105 114 -127 139 -155 171 -188 211 -238 264 -297 338 -383 446 -522 623 -759 956 -1255
56 -1255 1754 -2689 4799 -11553 74044 444493 239736 -139259 -128413 -46552 -130480 -9327
68 -9327 293794 187544 -260884 -323740 34324 181854 68647 100446 132121 -130683 -291065
79 -291065 14469 288439 79372 -182749 -89170 31084 -48658 -3820 192069 111668 -177714
90 -177714 -154253 121342 131923 -81613 -94274 24853 -17758 -56915 99370 150055 -75480
101 -75480 -183708 26560 167174 31438 -74035 -25216 -55952 -131304 10311 218536 133933
112 133933 -120306 -164699 -20387 67809 100145 119961 -3650 -214842 -197547 72323 230371
123 230371 122041 -33738 -99216 -119670 -54524 117969 190693 24400 -169606 -160314 -20964
134 -20964 91673 148898 115497 -42999 -174630 -100255 79810 139000 59326 -42449 -118010
145 -118010 -120681 9873 159218 125897 -44986 -121169 -53829 20887 55244 68685 10763
156 10763 -97381 -98294 29342 98816 39974 -13349 -13711 -36968 -44045 39820 93770 -5327 -112639
169 -112639 -59716 47242 57043 28329 25152 -21815 -83156 -17754 109756 83394 -65799 -108361
181 -108361 -23003 31528 41229 69028 41383 -72859 -103708 21450 107829 37939 -43139 -41529
193 -41529 -45032 -54018 32511 130942 65428 -85383 -103361 -1780 54349 48860 38724 -17482
205 -17482 -106673 -83465 59208 121472 30750 -54080 -46434 -25958 -12542 43349 74959 -2566
217 -2566 -89851 -56101 31651 50641 26608 17212 -11382 -56220 -33925 43256 58813 -2684
229 -2684 -43409 -33113 -14322 14131 52211 37228 -33875 -55893 5702 47996 16549 -18768
241 -18768 -16919 -13712 -11278 16006 32513 2979 -23276 -6781 7187 -4379 2574 22629 -3098
254 -3098 -46109 -22959 37171 38025 -7157 -19536 -6604 -10346 -2245 30698 23831 -31646 -45173
267 -45173 4764 30441 6662 -1908 7595 -13390 -31244 6622 39840 3650 -33913 -5812
279 -5812 20294 -8950 -20841 21610 33086 -16431 -35029 5393 21929 -3451 -5010 11690
291 11690 -7426 -26957 6367 33438 -3454 -31551 7964 34260 -8766 -36317 4765 32415
303 32415 205 -19483 3014 5226 -17442 -1842 32109 11616 -33447 -22044 18505 14560
315 14560 -8724 2747 13214 -14833 -27180 10273 32418 1639 -21687 -5063 1998 -12310
327 -12310 1680 33185 15308 -36545 -38221 12202 36029 12284 -11582 -18063 -19693 -3794 30284
340 30284 34781 -8338 -39759 -17918 15661 18321 8858 5604 -9180 -28896 -14084 27876 39138
353 39138 4035 -29500 -28970 -7766 16618 33692 21834 -20409 -46104 -16985 34418 47329
365 47329 12264 -30003 -42702 -18157 24511 45172 17871 -30163 -44420 -12094 27019 36997
377 36997 17774 -13452 -37341 -32148 5702 42802 37125 -9557 -49610 -40020 11756 55080 44199
390 44199 -12523 -57340 -44395 10770 51365 39903 -9427 -49408 -41902 8077 53152 47771
402 47771 -2902 -49023 -47689 -2679 43690 48258 5571 -43075 -48487 -5514 42772 52483 16966
415 16966 -35343 -60396 -28617 37018 68382 25727 -45969 -67192 -17395 47784 64924 21179
427 21179 -41813 -64992 -25524 36108 56826 21383 -29324 -51275 -30894 18130 58718 46705
439 46705 -17874 -69919 -50234 19666 64804 44187 -16693 -61861 -49653 13356 68317 55970
451 55970 -13577 -68030 -54898 7520 59612 55510 -2659 -61528 -58961 6640 66299 57972 -3944
464 -3944 -55525 -54698 -8524 44113 58799 17782 -44616 -66038 -20491 49232 73521 25386 -50002
477 -50002 -77998 -28525 48321 73861 23989 -47901 -70219 -23530 44726 69224 28076 -37850
489 -37850 -67146 -36058 24878 62282 41446 -22219 -67985 -45759 24494 69868 46442 -18266
501 -18266 -64647 -54799 5266 64598 61353 -8664 -71293 -57206 14541 67392 55828 -3787
513 -3787 -61106 -64598 -3420 62965 61046 -4253 -57282 -49376 -1438 44533 58071 21429 -44544
526 -44544 -72221 -23270 49341 65654 16631 -41959 -60715 -25789 38791 73619 32806 -46568
538 -46568 -76202 -26364 42296 62220 24938 -32458 -62029 -32699 33770 69199 33656 -33506
550 -33506 -63276 -34332 20156 54239 40780 -12106 -58498 -49489 12053 66579 56478 -11456
562 -11456 -69234 -57766 10154 64056 53165 -6298 -57844 -55595 1084 61160 61831 -264 -57952
575 -57952 -54929 -6120 40374 54555 23603 -37729 -68640 -21948 52368 64274 11108 -36059
587 -36059 -45528 -29751 12045 60980 50069 -29508 -75940 -25980 44101 50540 17013 -13144
599 -13144 -42301 -46594 11270 69923 35737 -44066 -50552 2728 21168 12399 27441 19969 -43936
612 -43936 -65201 13508 74007 26019 -38061 -32445 -10948 -7466 28481 64590 7629 -81041
624 -81041 -55910 43047 60185 4355 -12264 -8131 -42074 -37190 52530 89461 -5870 -84209
636 -84209 -35632 28222 19858 16765 39957 -3380 -79058 -44519 62594 72085 -7019 -34199
648 -34199 -14675 -29653 -23480 54818 78916 -23233 -92109 -19068 56810 26508 -9043 12291
660 12291 -991 -53458 -26780 55713 48067 -30091 -37342 10903 5634 -16349 21276 40985 -24088
673 -24088 -61021 6526 56527 6272 -36254 -4048 13665 -13981 -2251 40124 13469 -50515
685 -50515 -33603 35026 38007 -8263 -15337 -2248 -17419 -14110 34054 45006 -13721 -48231 -12887
698 -12887 18784 10899 12261 22299 -8342 -47640 -22549 37113 44896 3500 -24367 -26004 -18421
711 -18421 6196 36562 28399 -16096 -37601 -14947 11859 18774 16116 4973 -16896 -26374 -7849
724 -7849 15862 19632 7435 -8007 -18659 -13219 6572 17470 8517 -3892 -9187 -11732 -5345
737 -5345 11537 15254 -4233 -14070 1932 9965 -5116 -8826 8286 10318 -6182 -5646 6293 -2440
751 -2440 -12781 6390 21540 -1571 -20296 324 14356 -6253 -11479 15258 15517 -18475 -20453
764 -20453 12846 15537 -9415 -3313 15650 -5190 -28280 493 30611 4645 -24536 -4628
776 -4628 13268 -7041 -11951 15767 14205 -19312 -15828 16816 8545 -21716 -5116 26912 6182
789 6182 -27694 -9404 19622 4461 -12286 6953 13187 -14742 -19091 11951 17403 -6073 -3985
802 -3985 12155 -5885 -26453 1678 33801 12530 -20823 -13919 1367 -4205 3471 26702 13367
815 13367 -28306 -30069 7870 22837 9067 3937 -2040 -24061 -22944 15894 33571 4076 -18748
828 -18748 -10081 -7469 -11506 11917 34598 6222 -36082 -26587 10914 19902 10635 6922 -9927
841 -9927 -31670 -11696 31255 26957 -13949 -20686 1587 177 -7374 14911 24654 -12623 -34577
854 -34577 462 28697 7682 -9827 1309 -3503 -20075 3261 37009 11626 -35371 -23190
866 -23190 17849 16988 -92 9227 3799 -32855 -27309 32749 47919 -9340 -41492 -11302 9181
879 9181 1742 15822 30384 -9875 -52141 -18940 37345 30999 -3959 -7288 -11014 -34207 -14252
892 -14252 48413 50779 -22581 -57545 -13777 23011 17568 17820 17024 -24408 -54131 -6020 54374
905 54374 35738 -18908 -27357 -10847 -10500 5550 41605 28877 -34060 -50935 1720 36969 19542
918 19542 2151 -2433 -24616 -33684 12014 54960 22355 -38183 -40015 707 21263 21069 18126
931 18126 -5834 -40071 -28512 25456 45493 8066 -26803 -24946 -11364 3548 27968 33330
943 33330 -6970 -47451 -29889 21019 40256 18247 -11168 -30280 -30767 -528 40281 40537 -7060
956 -7060 -45771 -33024 9180 37013 32250 681 -35079 -40082 -2156 39972 39157 -336 -33555
969 -33555 -32729 -5660 25251 37430 16357 -24723 -44905 -18284 29211 46922 16822 -28108
981 -28108 -43407 -17010 24712 43078 20051 -23406 -44440 -20729 22910 41709 19870 -18155
993 -18155 -38140 -24589 12136 40484 29317 -14524 -44527 -27595 15285 38466 24828 -7942
1005 -7942 -34146 -32581 1387 38763 37425 -5005 -41921 -34966 4651 37347 35827 787 -37578
1018 -37578 -39464 1294 40331 34898 -3660 -32124 -29478 -4841 24062 36262 14505 -26006
1030 -26006 -41727 -12583 29135 39965 12729 -24441 -39342 -17432 23485 42859 17895 -24886
1042 -24886 -40114 -15629 20589 36193 19651 -15692 -39088 -24626 16345 40522 22233 -17002
1054 -17002 -36750 -21369 11460 32756 24194 -7746 -33923 -28030 5074 33115 29325 -2669
1066 -2669 -32959 -32130 1015 34444 33237 -2145 -34784 -31414 2652 31942 29458 228 -27453
1079 -27453 -28433 -2874 25187 29715 6614 -22420 -30134 -8895 21522 31810 11521 -19807 -31388
1092 -31388 -12188 18906 31635 13930 -16931 -31501 -15375 15897 31604 15934 -15184 -30700
1104 -30700 -15772 13708 28629 15521 -11863 -27349 -16759 8989 25185 17043 -6599 -23527
1116 -23527 -19102 2758 22773 21686 -1590 -24757 -23170 2154 24636 21722 -1367 -21572 -21228
1129 -21228 -1007 21174 23464 1804 -21742 -21936 112 19876 19505 2777 -14911 -19088 -5220
1142 -5220 15088 20904 5542 -13636 -17591 -6218 9016 17927 12579 -7018 -22892 -13863 12262
1155 12262 23884 8371 -12936 -17898 -7391 6789 15921 11474 -6153 -18766 -10317 8017 14146
1168 14146 6308 -2937 -9612 -12298 -2810 14499 16296 -3258 -17522 -9059 5409 8406 6385 4155
1182 4155 -5723 -15527 -5773 14798 16107 -2738 -13117 -6311 1153 4928 10021 6684 -9558 -15198
1196 -15198 2123 15065 4203 -7062 -658 2710 -7114 -5460 12082 12956 -8427 -15749 919
1209 919 10011 2112 -387 2963 -5310 -11849 2927 16230 2074 -14205 -4172 8506 -616 -7061
1223 -7061 6198 9576 -9170 -13618 6907 12980 -5255 -9772 5945 5922 -9405 -5550 11022 5785
1237 5785 -10150 -4241 8612 348 -9122 3359 11239 -4861 -12183 5685 11863 -7029 -11248
1250 -11248 9367 12900 -8821 -13639 5762 10820 -2949 -3891 4958 -1807 -10812 2267 15237
1263 15237 1452 -13542 -3407 7833 -902 -5364 7252 8155 -10396 -13643 6059 13419 -1035
1276 -1035 -7594 344 -562 -7188 1495 13368 3304 -14008 -9604 6413 8329 858 -618 -2342
1290 -2342 -8923 -4978 10474 12815 -4104 -14051 -4220 6472 5212 2212 2395 -2984 -10542 -5267
1304 -5267 9809 13811 810 -11621 -10140 -532 7682 11036 6053 -7524 -16781 -7165 12881 18295
1318 18295 2537 -13260 -12929 -3019 6221 12997 10841 -5945 -20794 -10893 12589 18118 3250
1331 3250 -8043 -9308 -9816 -3481 14872 20798 -2637 -25181 -14720 9976 16241 7916 207 -11106
1345 -11106 -20136 -4935 23147 21987 -8247 -22428 -7856 4920 6630 12285 11199 -11932 -27240
1358 -27240 -4286 24870 18026 -6515 -12309 -7613 -7449 3327 22674 15463 -17444 -27192 -1007
1371 -1007 18855 13069 3507 -3861 -17877 -17946 11264 31691 8732 -23446 -20217 1894 10146 10806
1385 10806 12107 -1873 -24333 -18689 13301 26722 8276 -11435 -16724 -14369 -65 23842 25216
1398 25216 -7646 -32618 -17093 12483 21760 13846 -161 -18943 -25821 -2207 28033 25252 -4221
1411 -4221 -23198 -18908 -2890 16761 26246 8256 -22160 -26654 -1402 19079 18172 7564 -7784
1424 -7784 -23335 -17065 13809 31109 10534 -17989 -21730 -7261 8628 21166 16994 -10429 -29681
1437 -29681 -11028 19300 20605 2176 -7594 -11881 -15581 -347 25904 21674 -13882 -29562 -7920
1450 -7920 13206 14811 11835 2033 -21720 -27734 5668 34983 17545 -16056 -21573 -10004 -1582
1463 -1582 14804 29417 7336 -33625 -32059 10866 31700 13186 -4498 -10332 -20351 -16013 18190
1476 18190 38077 7444 -29918 -24328 1766 12175 16742 19069 -4345 -35992 -23124 23438
1488 23438 36117 3946 -19067 -14847 -9385 -1641 20904 27334 -6229 -35055 -16003 17497 19839
1501 19839 5132 -1289 -10572 -21546 -6089 25643 24586 -9859 -25974 -8989 6790 9688 13403
1514 13403 8202 -16395 -28254 -848 29472 19496 -10667 -20169 -10095 421 12315 20789 6271
1527 6271 -21690 -24901 2506 23060 16515 -187 -12305 -18963 -10843 14449 29358 10122 -21326
1540 -21326 -26408 -4285 16318 20280 10421 -8412 -24265 -17400 10541 28621 15114 -12805 -24533
1553 -24533 -12657 7389 19879 15997 -3176 -21482 -18495 3980 20651 14756 -3406 -15081
1565 -15081 -14469 -3677 12507 20025 5788 -18149 -21897 -14 19171 14892 -1690 -12394 -13143
1578 -13143 -4240 11296 18244 4093 -15691 -15943 934 12185 11018 4373 -6336 -16290 -9483
1591 -9483 12608 21355 3386 -15778 -13317 -434 6968 11110 10372 -4227 -19936 -12093 12110
1604 12110 20120 5032 -9930 -12921 -8482 2921 16700 14220 -7947 -20815 -7522 10320 11161
1617 11161 4145 -23 -7544 -14471 -4084 15586 16287 -3319 -15553 -9324 1399 8174 11468 4902
1631 4902 -11005 -16140 -706 14085 10031 -1857 -6623 -6858 -5131 4153 13350 6604 -9406 -12305
1645 -12305 -281 8025 6271 2575 -1719 -7504 -6726 3821 10620 4402 -4910 -6658 -3342 1117
1659 1117 6721 7556 -1653 -10660 -5872 5825 8410 1607 -3847 -4554 -3392 704 5685 4552 -2470
1674 -2470 -5933 -2659 1257 2903 3552 1455 -4363 -6243 -98 5869 3890 -1305 -3298 -2930 -1623
1689 -1623 2436 5472 1757 -4711 -4611 933 3641 2010 309 -976 -2444 -1343 2153 2859 -106
1704 -106 -1187 381 -177 -1721 311 3346 1511 -2423 -2093 938 1285 46 428 711 -936 -1534 231
1721 231 891 -230 3 935 -305 -2283 -1257 1454 1609 163 -652 -1515 -2507 -622 3240 3277 -1549
1738 -1549 -4839 -2406 2093 3595 1599 -1558 -3368 -2185 1056 2951 1976 35 -1717 -3123 -2057
1753 -2057 2496 5764 2414 -4256 -6073 -1082 4895 5899 1389 -4523 -5930 -1099 4699 5624 1405
1768 1405 -3245 -5230 -3254 2426 7248 4487 -4177 -8342 -3225 4394 6390 2875 -2503 -6490 -5498
1783 -5498 1404 7536 5551 -2313 -7609 -6328 -12 7270 8760 -68 -11099 -9940 2937 11308
1797 11308 5976 -3598 -7479 -5773 -670 6407 9164 1673 -8741 -9440 -485 7583 8528 3349 -5788
1812 -5788 -11829 -5318 9404 14097 2148 -10392 -9750 -1274 5748 9242 6846 -4249 -14162 -7861
1826 -7861 8628 14504 4116 -7682 -10511 -5939 3244 12096 9710 -5118 -15102 -7613 6180 10718
1840 10718 6163 -877 -9470 -13020 -1916 15066 14846 -3797 -16850 -10258 3784 11097 10121 1513
1854 1513 -11554 -15171 -1024 15240 13232 -2005 -11563 -9921 -2768 7830 15255 7041 -11979
1867 -11979 -18151 -2616 14120 13761 2273 -7825 -12819 -8267 7356 19010 9404 -11896 -18456
1880 -18456 -4888 10340 14162 7569 -5334 -16475 -11928 7599 19623 8946 -9650 -15203 -7458
1893 -7458 3528 12615 13243 -830 -18035 -16108 4640 18872 11755 -4586 -14266 -12772 -1020
1906 -1020 14517 17658 687 -18493 -16582 2468 16002 13382 1015 -11810 -16431 -4851 14713
1919 14713 19759 2631 -15848 -15604 -1359 11079 14705 7747 -8285 -19382 -9834 12676 21456
1932 21456 6880 -12498 -17343 -7047 8416 17990 11356 -8532 -20824 -10021 10815 18222 7829
1945 7829 -6802 -15016 -12085 2879 18179 15183 -5688 -20217 -12361 6212 16007 11454 -1813
1958 -1813 -14981 -15770 201 17536 16093 -2090 -16634 -14368 -4 14322 16576 2379 -15948
1971 -15948 -17952 -310 16674 15525 430 -12689 -14309 -3759 11309 17008 5983 -11483 -17451
1984 -17451 -6124 11052 18078 8051 -10568 -19127 -7884 11494 18553 7398 -9355 -16897 -9216
1997 -9216 7382 17949 10586 -7594 -17598 -10181 5605 15663 12190 -3485 -17563 -14049 4911
2010 4911 17358 10612 -4375 -12671 -11177 -1599 11928 16157 1622 -16274 -15204 1949 13599
2023 13599 11043 1323 -9678 -14703 -4188 13839 16157 -1010 -13892 -9154 869 6086 9843
2036 9843 7620 -6591 -17367 -5830 13868 14769 -70 -9092 -8652 -5609 3587 15349 10688 -10106
2050 -10106 -18633 -3498 11457 10206 3610 -1928 -10938 -13434 2928 19580 10539 -10896 -14624
2063 -14624 -2967 3777 6018 9790 3882 -12836 -16223 2469 15938 7759 -4416 -6736 -7052 -5596
2077 -5596 6214 15938 4246 -14671 -12542 4158 9659 3716 1210 -1143 -9051 -8095 7097 14309
2091 14309 1467 -10774 -6370 1919 2970 4101 6139 -1185 -11126 -6076 8242 10232 -202 -5564
2105 -5564 -3815 -2987 -217 7889 8724 -3947 -12759 -4163 8166 7660 95 -3115 -3916 -5038 -614
2120 -614 7723 7339 -2962 -8895 -3963 2746 4437 3987 1505 -4658 -8223 -1568 8046 7172 -2197 -6603
2136 -6603 -3020 614 1859 4047 3969 -2512 -7830 -2676 6383 6193 -1211 -4066 -1388 -292 3 3140
2152 3140 4106 -1541 -5548 -862 4064 1725 -1130 1111 758 -4119 -2751 5383 5543 -3923 -6293 1862
2168 1862 4773 -1268 -2529 2238 971 -4096 -1004 4856 1206 -4869 -1198 3970 -360 -4064 1640
2183 1640 4310 -2912 -5186 3027 5130 -3317 -4833 3535 4185 -4091 -3601 4397 3149 -4525 -2122
2198 -2122 4844 1384 -4995 -756 5005 467 -3816 1061 3085 -3161 -3161 5444 5293 -5221 -6458 3402
2214 3402 5683 -1565 -2369 2535 -106 -5202 -47 6761 2165 -5100 -2980 1650 10 -215 4169
2229 4169 2345 -6157 -6307 3413 6697 176 -3218 -1181 -1918 -2855 2873 7150 346 -7847 -4887 3134
2245 3134 4621 2022 334 -2747 -5858 -1870 6088 6315 -1181 -5202 -3328 -599 2120 5635 4202
2260 4202 -4127 -8557 -2145 6247 6696 1247 -3815 -6038 -3516 3791 8320 3445 -5303 -7265 -2116
2275 -2116 3608 6153 4304 -2541 -8326 -5054 4262 8164 3084 -3629 -6288 -4687 1045 7434 6638
2290 6638 -2446 -9328 -5920 2720 7578 5805 -900 -8366 -8493 1346 10301 7214 -3352 -8693 -5652
2305 -5652 533 6394 8312 1705 -8574 -10169 -43 9247 8249 661 -6553 -9011 -3477 7257
2319 7257 11669 3005 -8776 -9963 -1613 6246 8638 4828 -4473 -11655 -6379 7224 12671 3802
2333 3802 -7415 -9609 -3770 4216 9326 6416 -4151 -11271 -6200 5000 9749 5291 -2882 -8995
2347 -8995 -8343 1303 11486 9396 -3967 -12657 -7335 4205 10008 6872 -1549 -9439 -9359 657 10844
2362 10844 9590 -1382 -10207 -9030 10 9083 10604 1582 -9995 -11455 -619 10284 10381 1089
2376 1089 -7980 -9938 -3383 7158 12036 5014 -7797 -12820 -4541 8171 12495 4676 -7276 -12014
2390 -12014 -5137 6773 11964 5350 -5999 -11127 -5881 4421 10668 7229 -3260 -11541 -8683 3235
2404 3235 12242 8724 -3682 -12114 -8331 3120 11169 8418 -2149 -10676 -9168 1173 10563 9885
2418 9885 -591 -10514 -10122 278 10369 10352 472 -9811 -10334 -698 9504 10450 1772 -8238 -10336
2433 -10336 -2808 7614 11386 4457 -7305 -12074 -4383 8126 12288 4324 -7313 -11357 -4558 6214
2447 6214 11318 5703 -5454 -11431 -6056 5069 10953 6405 -3877 -10617 -7724 2974 11212 8199
2461 8199 -3400 -11197 -7671 2812 9905 8045 -1057 -9760 -9645 680 10775 9591 -1394 -10164
2475 -10164 -8576 490 8698 9357 1064 -8840 -9992 -618 8970 9154 1178 -6760 -8814 -3222 6481
2490 6481 11026 4196 -7586 -10918 -2485 7366 9367 3384 -4885 -9404 -5360 5052 10963 5084
2504 5084 -5750 -9745 -4379 4047 8635 5885 -2892 -9918 -6729 3762 9540 5100 -3255 -7493
2518 -7493 -5799 381 7294 8076 -217 -9321 -8285 1548 8623 6648 -940 -7217 -7331 -438 7505
2533 7505 7860 -109 -7288 -6494 -152 5492 6598 2311 -4841 -8056 -2556 6242 8266 1621 -5570
2548 -5570 -6607 -1898 4160 6784 3238 -3845 -7294 -3261 3947 6860 3345 -3136 -6771 -4131 2866
2563 2866 7236 3833 -3565 -6674 -3183 2537 5189 3233 -1446 -5129 -4376 603 4902 4490 -395
2578 -395 -5169 -5274 -155 5363 5008 -771 -5383 -4142 577 3976 3810 564 -3437 -4378 -821 3669
2594 3669 4155 762 -2755 -3695 -1513 2611 4518 1593 -3227 -3864 -269 2485 2216 1215 -402 -2824
2610 -2824 -2967 1208 4437 1981 -2546 -3106 -671 1059 1918 1944 -466 -3441 -2133 2096 2740 -362
2626 -362 -1473 -122 -831 -1700 1010 3318 173 -3672 -1741 1841 1287 -511 425 510 -2177 -1982 2166
2643 2166 2944 -1098 -2279 588 892 -1357 -56 2790 454 -3155 -870 2883 685 -2218 572
2658 572 2928 -835 -3503 471 3471 116 -2145 651 1312 -1988 -1441 3007 2271 -2504 -2221 1659
2674 1659 642 -2172 609 3716 -527 -4896 -1036 4061 1419 -2366 -317 1190 -2286 -2487 3106
2689 3106 4130 -2199 -4674 134 2682 54 -282 1830 -719 -4212 -701 4812 2393 -3106 -2117
2704 -2117 1356 28 -1311 2559 3808 -2418 -5654 304 5407 2141 -2209 -1402 -424 -1566 583
2719 583 4672 2223 -4337 -4465 1481 3570 983 263 285 -3022 -4250 1868 6780 1942 -5229 -4293
2735 -4293 744 1865 1335 2582 636 -5054 -5328 2186 6675 2238 -3357 -3704 -2153 -389 3574 5645
2751 5645 -15 -7138 -4876 3242 5488 1400 -1065 -1589 -3707 -3035 3838 7530 1202 -6614 -5236
2766 -5236 1313 4141 3501 2029 -2162 -6489 -3232 5403 7350 271 -5134 -3752 -828 1383 4712
2781 4712 4971 -2205 -8465 -3890 5578 6758 732 -3303 -3838 -3327 180 6022 5838 -2492 -7962 -3751
2797 -3751 3012 5042 3390 -178 -5336 -6805 179 8288 6028 -3264 -7243 -3288 1600 4129 4849
2812 4849 1317 -5653 -7342 9 7280 5893 -679 -5274 -5334 -1490 5035 7824 1958 -6684 -7614 -438
2828 -438 6110 6290 1886 -4037 -7489 -3762 5092 9136 3186 -5688 -8137 -2906 4258 7680 4339
2843 4339 -3514 -8458 -4947 3342 7877 4968 -2339 -7609 -6296 1327 8171 6602 -1801 -8145 -6330
2858 -6330 1103 7161 6527 -424 -7301 -6923 515 6829 6338 133 -5953 -6779 -971 6514 7489 465
2874 465 -6852 -6468 2 5654 6351 1709 -5162 -7642 -2012 6431 8093 1482 -5776 -7262 -2338 5048
2890 5048 8646 3558 -5998 -9317 -2474 6154 7693 2696 -3851 -7427 -5112 2989 9248 5710 -4126
2905 -4126 -9157 -4875 2996 7655 5763 -1425 -8437 -7274 1881 8764 5948 -1926 -6895 -5932 -362
2920 -362 6290 7848 894 -7929 -8054 695 7664 6251 -170 -5479 -6169 -1511 5510 7667 1675 -5993
2936 -5993 -6946 -1075 5154 6620 2736 -4205 -7943 -3385 5651 8667 2209 -5689 -6920 -1775 3984
2951 3984 6313 3601 -2957 -7500 -4444 3690 7782 3741 -3488 -6818 -4133 2017 6777 5251 -2082
2966 -2082 -7633 -5043 2442 6494 4191 -1116 -5304 -5604 -709 6161 6979 -306 -7302 -5968 1137
2981 1137 5789 4955 469 -4502 -5953 -1384 5435 6366 669 -4702 -4850 -1246 3100 5728 3375 -3562
2997 -3562 -7206 -2365 5199 6178 1055 -3580 -4422 -2416 1926 5696 3878 -3035 -6542 -2526 3369
3012 3369 4798 2362 -1410 -4759 -4327 1226 6150 3734 -2682 -5119 -2423 1052 3145 3811 752
3027 752 -4697 -5489 378 5465 3850 -1238 -3817 -3294 -745 3160 4727 881 -4334 -4263 300 3436
3043 3436 2867 942 -1697 -3817 -2282 2652 4985 1254 -3257 -3359 -563 1751 2898 2154 -1210 -3980
3059 -3980 -2353 2108 3786 1393 -1638 -2809 -1916 683 3231 2504 -1496 -3735 -1660 1456 2291 1135
3075 1135 -252 -1942 -2490 -358 2544 2479 -430 -2675 -2129 -26 1859 2065 154 -2105 -2238 47
3091 47 1832 1546 107 -1136 -1701 -826 1139 2157 765 -1420 -1693 -290 1109 1317 455 -688 -1071
3108 -1071 -543 566 1020 666 -41 -748 -1004 -115 1319 1245 -366 -1329 -568 604 604 121 -158 -286 -303 -150
3128 -150 195 82 92 100 -224 -733 -384 479 519 -255 -575 -75 -83 -327 -101 620 464 -447 -864 -322 493 838
3150 838 283 -351 -730 -367 318 715 610 144 -573 -993 -430 1051 1587 363 -1313 -1625 11 1557
3168 1557 1587 65 -1433 -1334 -65 1105 1306 589 -734 -1728 -1171 843 2301 1230 -1316 -2490 -1219
3185 -1219 1005 2200 1322 -955 -2574 -1542 921 2350 1435 -710 -2361 -2124 222 2715 2497 -663
3201 -663 -3308 -2262 1018 2746 1944 -139 -2265 -2638 -284 2748 3136 57 -2778 -2666 -281 2408
3217 2408 3462 1154 -2817 -3898 -477 3589 3475 96 -2459 -2728 -1148 1840 3918 2081 -2669
3232 -2669 -4501 -1222 2930 3497 1264 -1717 -3534 -2681 1610 4782 2499 -2676 -4386 -1773 1550
3247 1550 3259 2956 -323 -4626 -4358 1467 5633 2887 -2378 -4072 -2267 437 3275 4150 344 -4798
3263 -4798 -4526 1045 4793 3204 -342 -2932 -3906 -1422 3982 5924 563 -5346 -4366 764 3648 3240
3279 3240 1399 -2155 -5179 -2650 4192 6308 827 -4644 -4140 -680 2259 4159 3031 -2392 -6330
3294 -6330 -2581 4143 5245 919 -2592 -3515 -2997 339 5424 4936 -2366 -7280 -3074 3580 4807 1966
3310 1966 -1089 -3906 -4618 109 6085 5101 -2120 -5827 -3056 1204 3524 4212 1515 -4505 -6559 -103
3326 -103 6639 4918 -1474 -4255 -3147 -1074 2604 5755 2815 -4687 -6773 -501 5315 4573 592
3341 592 -2697 -4696 -3066 3024 6898 2388 -5014 -5602 -513 3048 3460 2641 -857 -5698 -4852 2637
3357 2637 7115 2798 -3797 -4968 -2255 1045 4354 4635 -857 -6641 -4676 2691 5666 2632 -1378
3372 -1378 -3556 -4176 -989 5040 6226 -403 -6553 -4361 1747 4427 3363 871 -3155 -5397 -1704
3387 -1704 5021 6118 235 -4744 -4267 -713 2965 5132 2833 -3734 -6662 -1706 4916 5241 640
3402 640 -3121 -4148 -2599 1828 5662 3549 -3172 -6313 -2517 2973 4777 2673 -1509 -5039 -4188
3417 -4188 1548 5864 3579 -2203 -4895 -3110 781 4087 4253 -116 -5153 -4730 890 5153 3637
3432 3637 -702 -3901 -3730 -383 3893 4533 438 -4078 -4099 -241 3422 4125 1239 -3060 -4726 -1288
3448 -1288 3849 4747 872 -3357 -4036 -1220 2705 4338 1888 -2754 -4556 -1682 2566 4093 1955
3463 1955 -2139 -4507 -2597 2228 4667 2057 -2455 -4116 -2148 1247 3739 3050 -993 -4521 -3428
3478 -3428 1301 4292 2881 -896 -3775 -3484 256 4178 3835 -750 -4119 -2807 588 2712 2910 1094
3494 1094 -2330 -4065 -1169 3471 3978 317 -2724 -2673 -817 1628 3308 1873 -2053 -3713 -965 2263
3510 2263 2438 730 -818 -2126 -2140 676 3524 1922 -2192 -3195 -371 1656 1419 731 -262 -1964
3526 -1964 -2209 776 3004 1283 -1679 -2070 -829 178 1515 2242 107 -3156 -2602 1464 3135 879
3542 879 -1175 -1217 -1100 -734 1333 2843 632 -2618 -2259 574 1813 1159 629 -371 -2016 -1453 1418
3559 1418 2579 329 -1562 -923 -130 -260 626 1812 498 -2103 -1695 1055 1763 -55 -744 -95 -306
3576 -306 -746 267 1280 108 -1246 -507 497 34 -289 498 417 -1071 -1103 753 1248 -350 -1142 160
3594 160 558 -583 -425 895 625 -1001 -810 575 668 -263 -47 594 -137 -919 48 1098 392 -550 -50
3613 -50 251 -509 -382 1073 1166 -777 -1504 93 1184 281 -191 283 -82 -1137 -506 1217 1151 -560 -1030
3632 -1030 -332 -79 120 833 837 -936 -1873 -168 1545 856 -567 -625 -413 -749 -13 1603 1222 -1240 -2083
3651 -2083 -208 1424 1047 197 -332 -1174 -1245 429 2100 1271 -1050 -1646 -579 343 1237 1745 460 -2100
3669 -2100 -2311 629 2705 1478 -850 -1509 -1149 -277 1288 2304 707 -2012 -2350 -97 1901 1801
3685 1801 444 -1186 -2339 -1251 1648 2778 670 -1998 -2293 -589 1062 1860 1415 -670 -2757 -1975
3701 -1975 1258 2959 1353 -1381 -2455 -1405 785 2453 1833 -794 -2694 -1703 885 2303 1775 -116
3717 -116 -2103 -2387 -24 2857 2848 -301 -2863 -2314 494 2566 2352 193 -2265 -2666 -337 2584 2908
3734 2908 491 -2353 -2845 -834 2243 3327 1051 -2394 -3487 -876 2306 3041 975 -1907 -3134
3749 -3134 -1635 1463 3389 1898 -1669 -3690 -2147 1465 3557 2216 -1414 -3607 -2280 1313 3422
3764 3422 2179 -1054 -3185 -2394 581 3086 2796 -327 -3285 -3022 324 3485 3068 -193 -3191 -2998
3780 -2998 48 3210 3255 251 -2965 -3231 -397 2809 3506 936 -2769 -3818 -989 2880 3899 895
3796 895 -2810 -3665 -1082 2284 3578 1578 -2079 -3873 -1884 1984 3909 1937 -1929 -3929 -2314
3811 -2314 1656 4023 2383 -1771 -4033 -2253 1561 3614 2324 -1009 -3530 -2933 644 3944 3176
3826 3176 -880 -3771 -2804 763 3444 3164 -57 -3346 -3382 102 3566 3337 -33 -2987 -3221 -501
3842 -501 2844 3901 985 -3258 -3967 -452 3284 3465 583 -2477 -3329 -1453 2210 3970 1621 -2600
3858 -2600 -3969 -1357 2122 3386 1879 -1626 -3948 -2591 1889 4249 1881 -2203 -3547 -1804 931
3873 931 3109 2752 -620 -3870 -3099 1221 3916 2432 -1068 -3044 -2446 220 3132 3283 -287 -3458
3889 -3458 -2793 635 2881 2505 377 -2149 -3333 -936 3108 3919 270 -3257 -2868 -38 2153 2622
3905 2622 1134 -1864 -3482 -1333 2527 3355 669 -2075 -2635 -1415 1158 3225 2086 -1732 -3799
3920 -3799 -1424 2025 2776 1047 -975 -2324 -2299 274 3278 2635 -1221 -3425 -1765 1056 2295 1917
3936 1917 7 -2481 -2745 342 3201 2231 -785 -2216 -1417 -264 1489 2654 1119 -2351 -3136 -37
3952 -37 2791 2120 -64 -1445 -1842 -1027 1325 2857 1066 -2065 -2493 -301 1474 1639 937 -583 -2397
3969 -2397 -1890 1251 2930 855 -1758 -1888 -555 363 1285 1621 -10 -2397 -1974 791 2308 1073
3985 1073 -739 -1482 -1387 -301 1640 2115 -114 -2205 -1410 680 1387 910 349 -608 -1798 -864 1578
4002 1578 2182 146 -1653 -1229 10 836 1171 947 -645 -1789 -783 1211 1623 232 -692 -917 -744
4019 -744 166 1478 1200 -693 -1745 -586 805 920 322 -112 -698 -1035 -182 1082 995 -235 -997 -680
4037 -680 -67 640 959 209 -925 -1088 105 898 592 -109 -395 -515 -496 286 899 476 -472 -805 -243 398
4057 398 709 491 -185 -647 -304 267 487 324 144 -203 -616 -289 594 836 80 -512 -441 -60 191 364
4077 364 349 -211 -634 -246 180 141 174 346 -59 -804 -578 558 823 -175 -575 -155 -101 -334 209 838 76
4098 76 -848 -540 430 363 30 297 63 -833 -693 833 1087 -229 -730 -12 224 -331 220 1139 203 -1425
4118 -1425 -799 1120 1135 -114 -409 -76 -460 -386 993 1268 -554 -1500 -267 898 428 216 537 -355
4136 -355 -1694 -596 1858 1682 -804 -1630 -422 250 241 929 1077 -946 -2288 -487 1791 1398 -314
4153 -314 -805 -887 -1043 234 2168 1428 -1514 -2253 -94 1359 789 467 323 -1040 -1954 31 2458 1596
4171 1596 -1157 -1809 -459 376 881 1487 681 -1736 -2113 547 2263 911 -737 -802 -798 -763 887 2289
4189 2289 744 -2311 -2168 621 1869 859 -112 -660 -1596 -1212 1311 2577 365 -2200 -1776 40
4205 40 1054 1339 1205 -724 -2771 -1426 1923 2781 188 -1700 -1387 -626 254 1685 1995 -542 -2870
4222 -2870 -1506 1530 2312 879 -604 -1557 -1729 -38 2528 2291 -822 -2603 -1201 887 1576 1394
4238 1394 437 -1591 -2501 -345 2704 2358 -593 -2244 -1435 -14 1301 1994 828 -1846 -2635 -426
4254 -426 2061 2024 193 -1253 -1917 -1183 1095 2759 1263 -1991 -2701 -531 1668 1864 860 -775 -2047
4271 -2047 -1588 867 2589 1403 -1147 -2243 -1143 720 2086 1734 -413 -2433 -1738 882 2411 1346
4287 1346 -616 -1757 -1443 87 1943 2099 6 -2286 -1996 403 2168 1786 -221 -1922 -1847 -118
4303 -118 1854 2040 153 -1939 -2086 -347 1595 2130 641 -1627 -2538 -813 1724 2550 706 -1740
4319 -1740 -2383 -852 1310 2272 1189 -1104 -2379 -1467 991 2514 1537 -916 -2431 -1582 733 2344
4335 2344 1782 -505 -2208 -1711 549 2153 1646 -138 -1702 -1753 -161 1845 2193 141 -2048 -2001 120
4352 120 1864 1666 42 -1500 -1795 -299 1538 1863 249 -1650 -1846 -439 1278 1897 707 -1443
4368 -1443 -2305 -724 1623 2050 381 -1427 -1878 -791 904 2071 1173 -1088 -2303 -1218 1096 2148
4384 2148 1211 -831 -2127 -1490 722 2302 1471 -688 -1929 -1256 406 1719 1716 126 -1814 -2006 91
4401 91 2035 1773 -48 -1647 -1661 -147 1529 1762 228 -1543 -1639 -158 1271 1506 613 -1068 -1858 -784
4419 -784 1201 1811 463 -1304 -1655 -562 870 1465 736 -844 -1770 -848 824 1524 713 -606 -1504
4436 -1504 -1153 526 1764 1057 -771 -1643 -748 664 1253 931 -168 -1135 -1157 148 1436 1245 -159
4453 -159 -1182 -1072 -91 1163 1377 227 -1299 -1320 69 1168 929 126 -732 -1014 -542 649 1381 495
4471 495 -947 -1276 -291 760 985 353 -549 -1102 -598 584 1058 410 -609 -856 -528 65 808 828 -213
4490 -213 -1130 -757 387 969 461 -321 -563 -563 -35 654 788 99 -699 -635 59 555 588 210 -265 -715 -261
4511 -261 605 745 59 -465 -279 -89 48 353 562 8 -713 -516 322 561 167 -279 -282 -277 -149 332 444
4532 444 -35 -469 -238 10 -47 109 298 67 -655 -477 336 535 -25 -353 -166 -62 -210 97 486 224
4552 224 -463 -462 78 273 214 156 67 -418 -310 345 597 123 -221 -126 -42 -196 216 642 332 -656 -689 144 637
4575 637 322 -85 -181 -386 -321 265 676 265 -486 -545 -140 117 344 475 -71 -882 -693 409 916 298 -410
4596 -410 -465 -365 -96 461 715 116 -830 -772 15 713 599 20 -563 -790 -202 776 921 70 -695 -657 -45
4617 -45 377 773 562 -270 -935 -602 540 1146 464 -547 -891 -435 386 873 577 -383 -918 -605 336 832
4637 832 652 -104 -902 -928 90 1015 888 -167 -1045 -860 41 865 880 11 -872 -1001 -209 751 1058 333
4657 333 -867 -1181 -327 950 1196 203 -852 -1047 -391 581 1129 615 -638 -1173 -610 617 1170 772
4675 772 -354 -1228 -933 469 1445 930 -605 -1232 -622 389 1045 975 13 -1185 -1231 184 1397 1142
4693 1142 -234 -1143 -995 -27 994 1261 156 -1354 -1333 49 1143 878 156 -663 -1223 -756 902 1717
4711 1717 450 -1380 -1466 -170 914 1127 563 -585 -1506 -912 903 1668 582 -851 -1223 -659 359
4728 359 1350 1354 -375 -1837 -1129 947 1627 655 -422 -1041 -990 -30 1388 1614 -107 -1683 -1173 487
4746 487 1354 1040 52 -1084 -1566 -298 1594 1604 -169 -1397 -1052 -41 749 1207 696 -955 -2054 -606
4764 -606 1462 1660 33 -1204 -1180 -487 569 1491 876 -1054 -1803 -448 1103 1219 440 -371 -1223 -1247
4782 -1247 441 1982 1175 -1086 -1765 -376 783 1008 907 106 -1330 -1641 286 1991 1232 -723 -1332
4799 -1332 -842 -120 1071 1662 312 -1738 -1590 435 1564 838 -100 -579 -1154 -829 797 2037 519
4816 519 -1576 -1456 87 901 854 525 -442 -1510 -1000 1053 1723 166 -1196 -862 -170 189 890 1176
4834 1176 -395 -1845 -945 1291 1464 78 -738 -757 -769 -61 1342 1409 -485 -1712 -659 729 978 637
4852 637 207 -817 -1549 -203 1706 1403 -594 -1269 -468 49 436 968 635 -859 -1635 -211 1318 978
4870 978 -94 -591 -741 -674 430 1385 596 -1032 -1317 -14 668 587 411 -105 -1052 -1024 429 1460 536
4889 536 -817 -972 -313 283 710 839 -15 -1139 -821 400 997 522 -120 -564 -819 -210 882 1156 -12
4908 -12 -978 -691 124 571 641 317 -410 -867 -332 597 766 207 -415 -652 -429 356 812 389 -467 -802 -228
4929 -228 308 509 221 -132 -579 -504 209 720 349 -327 -618 -429 68 632 587 -239 -798 -389 290 432 257
4950 257 52 -349 -590 -183 672 765 9 -574 -420 -90 374 714 341 -418 -720 -139 524 468 90 5 -333
4971 -333 -583 -33 836 677 -307 -759 -284 177 201 309 174 -350 -668 -113 401 299 -20 -151 -251 -456
4991 -456 -24 577 393 -407 -553 6 269 111 86 150 -96 -448 -79 424 296 -111 -182 -34 -93 95 381
5012 381 170 -254 -213 150 207 61 -42 24 -142 -208 109 437 185 -320 -383 -25 276 230 111 -91 -381 -205
5034 -205 173 308 229 -89 -267 -348 -91 264 530 105 -496 -546 -103 314 399 70 -208 -479 -308 115 469
5055 469 354 -95 -545 -430 47 490 471 15 -527 -431 -7 464 515 68 -342 -540 -176 231 597 289 -332
5076 -332 -655 -223 476 526 193 -308 -431 -237 244 528 282 -190 -516 -391 138 659 427 -227 -697 -552
5096 -552 129 648 471 -155 -666 -555 47 515 462 45 -526 -733 -113 611 756 58 -648 -649 -27 598 623
5117 623 90 -443 -649 -229 475 789 373 -431 -786 -348 443 859 477 -391 -850 -424 498 880 263 -395
5137 -395 -647 -443 211 733 674 -131 -956 -713 355 893 550 -215 -785 -710 49 818 766 -160 -912 -675 42
5158 42 683 707 180 -676 -1012 -271 931 1004 -54 -881 -712 -48 540 831 373 -488 -908 -357 605 895
5178 895 380 -424 -804 -502 463 1086 607 -545 -899 -262 472 779 506 -198 -782 -676 222 1015 661 -295
5198 -295 -816 -575 198 803 755 -148 -923 -765 181 760 660 -79 -654 -766 -212 726 921 165 -880 -925
5218 -925 -87 750 849 226 -657 -907 -214 674 920 290 -481 -806 -366 453 940 544 -454 -958 -451 459
5238 459 919 512 -327 -880 -525 337 885 581 -176 -846 -649 106 773 754 -85 -874 -791 143 814 649 -80
5259 -80 -632 -763 -135 703 740 28 -822 -805 -208 570 795 269 -707 -995 -254 683 777 117 -512 -754 -378
5280 -378 390 934 536 -462 -968 -335 507 856 467 -278 -749 -519 283 880 647 -298 -795 -475 185 636
5300 636 673 90 -777 -847 168 966 601 -210 -669 -523 -102 506 783 234 -774 -844 -3 692 608 135 -454
5321 -454 -813 -515 518 1086 269 -758 -832 -32 387 537 388 -223 -923 -615 402 966 355 -548 -674
5340 -674 -363 183 673 683 -178 -892 -469 415 691 358 -45 -365 -560 -226 803 934 -11 -933 -592 284
5360 284 636 426 142 -454 -815 -253 648 757 32 -610 -502 -148 233 640 482 -482 -1089 -269 635 600
5380 600 -59 -328 -347 -394 -41 604 707 -347 -904 -299 441 428 302 -32 -452 -705 57 859 494 -321 -616
5401 -616 -42 104 175 509 420 -367 -803 -5 811 504 -249 -329 -257 -129 172 665 329 -550 -608 84 497 253
5423 253 47 41 -332 -615 118 799 260 -623 -551 13 189 89 252 196 -474 -608 132 624 211 -227 -208 -183
5445 -183 -254 154 618 173 -538 -503 164 326 83 40 130 -256 -452 127 663 214 -345 -268 67 74 58 304 201
5468 201 -323 -285 269 441 85 -83 -25 -146 -287 237 473 60 -418 -266 169 155 62 34 14 -273 -271 169 373
5491 373 174 -316 -273 -146 -13 205 325 -38 -354 -206 140 321 113 -42 -127 -279 -198 279 487 164 -288
5512 -288 -325 6 304 231 166 -152 -305 -156 149 421 258 -58 -246 -228 76 436 304 -18 -365 -399 138 393
5534 393 293 -8 -253 -245 -86 211 410 141 -240 -462 -163 302 380 40 -312 -394 -160 238 408 154 -277
5555 -277 -422 -194 100 280 292 -115 -424 -458 119 557 363 -202 -452 -277 54 363 332 135 -307 -472 -83
5576 -83 318 490 110 -323 -499 -152 383 530 160 -234 -394 -51 261 370 137 -189 -345 -264 102 417 336
5597 336 -259 -546 -258 227 473 191 -193 -399 -302 74 461 317 -174 -528 -323 109 376 437 -2 -499 -653
5618 -653 18 641 506 -142 -467 -463 -102 349 621 335 -439 -720 -165 509 565 229 -220 -576 -428 260 824
5639 824 408 -410 -614 -202 77 389 520 80 -666 -632 189 705 364 -236 -346 -334 -112 406 623 100 -692
5660 -692 -525 168 406 286 51 -234 -666 -257 613 718 -64 -711 -320 94 273 368 252 -276 -777 -241
5680 -241 671 665 -13 -435 -468 -228 307 849 434 -527 -890 -147 447 511 270 -56 -566 -660 153 987 570 -347
5702 -347 -684 -341 145 469 594 11 -729 -690 195 675 332 -82 -389 -538 -315 461 861 99 -774 -659
5722 -659 41 427 368 193 -384 -684 -239 514 688 96 -386 -423 -222 192 671 425 -427 -844 -193 616 602
5743 602 88 -242 -501 -338 217 749 494 -353 -607 -302 181 548 519 -96 -717 -592 274 751 266 -254
5763 -254 -445 -322 59 392 532 45 -610 -508 16 526 411 80 -462 -578 -159 525 524 -58 -524 -385 -70
5784 -70 233 522 286 -289 -643 -178 477 528 126 -347 -459 -211 323 612 309 -301 -521 -190 182 467 367
5805 367 -78 -515 -380 112 601 368 -112 -417 -240 14 388 394 37 -420 -380 83 332 315 124 -256 -451
5826 -451 -134 335 428 35 -342 -327 -58 181 320 134 -191 -405 -176 195 291 92 -177 -312 -198 154 399
5847 399 236 -249 -302 -112 108 263 159 -12 -255 -230 65 410 290 -77 -285 -213 73 255 295 27 -275
5868 -275 -236 -20 247 216 132 -163 -375 -176 215 356 89 -227 -286 -106 31 165 145 -133 -335 -187 76 237
5890 237 188 -46 -256 -266 -50 287 317 -73 -300 -132 96 109 104 78 -107 -237 -152 158 342 30 -108 -141 -163
5913 -163 136 318 224 -129 -294 -93 198 177 -6 35 -120 -269 -119 228 360 6 -350 -176 45 135 108 101
5935 101 -152 -304 -131 171 198 15 -95 -142 -231 11 315 328 -221 -414 -101 249 230 71 1 -58 -242 -100
5957 -100 270 296 -47 -263 -148 11 121 246 135 -182 -331 15 389 199 -48 18 -45 -161 -37 299 319
5978 319 -135 -419 -137 256 180 38 -84 -205 -296 12 378 265 -144 -240 -115 6 52 309 175 -358 -516
5999 -516 0 467 221 -110 -163 -162 -180 117 384 247 -279 -442 1 257 215 126 -3 -343 -234 101 575 224
6021 224 -235 -365 -97 88 194 358 -11 -385 -444 173 461 246 -129 -260 -255 -90 268 462 14 -443 -401
6042 -401 90 280 322 48 -177 -475 -239 346 445 73 -418 -345 -71 227 339 230 -149 -488 -230 332 471
6063 471 188 -209 -417 -274 155 440 347 -180 -486 -231 229 435 269 -70 -298 -365 53 532 464 -124 -464
6084 -464 -347 76 500 355 -3 -375 -405 -41 409 388 31 -334 -380 -87 354 556 144 -424 -537 -166 421
6105 421 403 92 -335 -377 -202 208 402 235 -235 -535 -299 226 494 279 -200 -511 -245 196 459 322 -182
6126 -182 -409 -243 219 378 259 -29 -333 -356 12 453 397 -63 -546 -334 192 346 264 -75 -305 -398 21
6147 21 421 372 -39 -358 -284 -47 334 405 126 -372 -543 -99 410 413 1 -313 -260 -163 131 428 190 -248 -422
6170 -422 -200 242 358 176 -160 -387 -308 144 434 177 -255 -408 -118 85 314 217 28 -283 -384 68 385
6191 385 365 -74 -292 -204 50 273 311 70 -193 -301 -61 347 294 -48 -259 -271 -138 256 353 139 -270 -390
6213 -390 -83 225 228 54 -79 -165 -279 100 313 148 -282 -336 -61 72 202 150 -10 -297 -249 110 363 119
6235 119 -130 -167 -51 -84 167 276 85 -299 -245 147 348 105 -87 -58 -145 -190 202 342 95 -264 -152 115
6257 115 129 92 179 -48 -361 -234 292 434 -64 -204 -88 -72 -121 146 371 -67 -494 -243 258 321 31 18
6279 18 -68 -223 -153 285 315 -63 -299 -95 4 3 186 296 -29 -370 -161 275 273 -17 -132 -6 -23 -7 202 262
6303 262 -111 -257 -11 158 99 66 44 -74 -245 -24 336 220 -188 -242 104 58 50 114 87 -139 -210 37 243
6326 243 102 -54 -140 -201 -60 105 277 72 -301 -206 78 120 128 70 -8 -187 -220 39 282 174 -160 -242 -129
6349 -129 183 224 180 -34 -197 -166 65 125 176 75 -66 -169 -64 139 312 126 -135 -218 -96 105 135 50 19
6372 19 -98 -38 40 186 133 -109 -117 -49 22 179 236 -7 -213 -139 50 225 93 -141 -154 -97 -95 98 237 51 -215
6397 -215 -321 -36 226 197 102 -97 -223 -72 109 250 49 -46 -188 -97 -3 218 114 -57 -163 -94 59 214
6419 214 239 -17 -172 -187 22 265 239 -7 -187 -118 113 160 243 57 -298 -268 18 292 202 -67 -185 -210 -102
6442 -102 113 342 121 -249 -366 -81 155 290 221 -82 -382 -210 243 378 220 -122 -267 -206 -11 304 405
6463 405 65 -399 -365 85 314 211 32 -211 -237 -90 272 330 21 -262 -155 -74 120 263 191 -167 -402 -186
6485 -186 323 342 14 -191 -196 -123 95 269 172 -96 -313 -130 123 268 161 -61 -312 -258 86 316 159 -264
6507 -264 -318 -167 92 189 205 47 -346 -310 100 322 255 -85 -325 -293 12 283 310 20 -343 -243 42 193
6529 193 236 146 -172 -327 -135 248 360 128 -124 -281 -174 217 294 143 -209 -287 -113 142 169 150 11 -294
6551 -294 -241 11 324 233 -149 -238 -188 -42 202 262 -11 -294 -164 101 214 83 7 -176 -302 -128 265 356
6573 356 -46 -274 -190 28 172 168 55 -92 -255 -120 215 286 72 -168 -209 -115 0 318 276 -99 -321 -66
6595 -66 197 240 76 39 -142 -228 -30 301 261 -112 -238 -71 71 86 227 111 -151 -235 7 254 168 -116 -109
6618 -109 -154 -122 126 261 138 -233 -238 -8 110 161 69 -110 -212 -174 81 266 105 -160 -221 -67 132 175 249
6641 249 -85 -292 -209 163 289 89 -72 -61 -108 15 157 207 -18 -258 -182 86 235 156 -30 -120 -238 -14
6663 -14 199 242 -82 -159 -86 40 56 148 170 -129 -262 -60 78 220 -22 -161 -148 -27 135 172 64 -97 -186
6686 -186 -70 44 116 57 -54 -194 -183 21 241 134 -90 -165 -37 72 134 162 -11 -172 -99 23 178 225 38
6709 38 -157 -191 -24 171 163 94 -223 -116 23 172 140 -8 -79 -98 -50 -3 156 51 -83 -162 -87 41 187 102
6733 102 -129 -192 -28 39 129 61 -22 -68 -136 -46 111 99 -25 -102 -122 65 110 200 -78 -202 -96 114 137 -30 -29
6758 -29 -26 -50 -89 86 145 61 -101 -135 54 77 40 62 -82 -66 -61 143 108 -6 -121 -53 -19 -18 8 155 26 -135 -83
6785 -83 121 47 -33 7 -36 -34 -90 32 54 -16 -58 0 55 16 63 38 -43 -154 -160 -36 76 -21 -77 35 -114 -74 0 165
6813 165 -1 -174 -35 45 -17 -48 80 104 -126 -90 72 137 -10 -37 -12 -26 -28 61 172 -34 -178 -33 126 64
6837 64 -76 45 90 -63 -101 12 183 -33 -184 -45 15 4 33 110 -34 -203 -46 179 94 -72 -141 27 -87
6860 -87 -50 122 266 -11 -267 -98 190 159 34 11 -66 -160 -17 128 178 -25 -139 -60 -9 37 130 64 -185 -245
6884 -245 12 183 82 -55 -122 -14 -110 8 119 59 -53 -145 -61 89 163 52 -74 -212 -34 107 219 -28
6906 -28 -149 -187 -26 85 133 138 -31 -107 -216 140 234 170 13 -246 -120 6 209 106 -69 -217 -163 69 150
6929 150 195 9 -122 -200 -126 64 284 101 -82 -304 -113 156 158 27 -85 -126 -153 13 150 213 -109 -249 -154
6952 -154 78 167 92 -67 -244 -147 46 302 111 -94 -130 -105 61 146 245 49 -179 -277 111 274 139 -30 -162
6975 -162 -120 31 231 285 -3 -295 -203 110 144 198 78 -172 -337 -93 240 291 -47 -246 -274 -76 127 292
6997 292 164 -209 -348 -102 209 224 160 -62 -244 -275 45 335 234 -175 -331 -142 43 132 258 49 -308
7018 -308 -242 90 270 170 -112 -156 -174 -38 228 239 -41 -348 -185 139 208 144 63 -167 -287 -107 313 363 -26
7041 -26 -221 -217 -32 130 287 130 -187 -330 -72 241 214 20 -168 -193 -263 97 360 198 -246 -319 -59 145
7063 145 181 60 -86 -270 -198 153 364 143 -160 -211 -129 95 227 237 -61 -392 -149 242 277 48 -97 -125
7085 -125 -155 14 253 324 -32 -329 -245 104 235 243 71 -277 -308 94 326 283 -17 -213 -196 -82 121 219 141
7108 141 -220 -316 -106 177 191 58 -162 -219 -165 125 297 26 -207 -187 -28 88 112 94 -22 -145 -65 160 285
7131 285 63 -135 -190 17 144 192 120 -141 -195 -59 123 161 39 -132 -164 -114 176 230 111 -169 -240 -181 94
7154 94 244 160 -46 -161 -143 89 167 145 -23 -224 -149 49 204 161 -48 -157 -113 -31 116 119 -34 -171 -108 -44
7178 -44 38 103 -23 -118 -146 -80 53 169 9 -143 -69 -46 66 148 -27 -92 -88 -6 97 67 26 -74 -73 37 51 103
7204 103 72 -86 -67 18 82 104 47 14 -61 -96 14 145 20 -67 -93 32 66 95 17 -46 -90 -21 66 24 -18 -64 -50
7231 -50 -86 15 106 43 -53 -91 -97 80 54 39 -48 -3 42 -7 18 -14 19 -46 14 -63 40 88 -7 -90 8 37 67 13 -28
7260 -28 5 49 71 4 -48 -54 39 25 -47 6 69 34 -48 -100 23 138 25 -35 -64 0 42 -9 1 -25 -61 21 39 14 -78
7289 -78 -51 21 47 24 54 -47 -79 -19 89 133 58 -43 -52 -35 30 99 23 -6 -44 -64 68 85 54 83 -117 -111 -18 171
7317 171 171 48 -99 -32 22 152 107 17 -25 -77 -67 49 94 40 -65 -159 -68 137 166 -4 -78 -178 -70 101 114
7342 114 29 -160 -113 -40 95 137 45 14 -185 -79 63 227 71 -111 -204 -25 69 133 88 -98 -176 -189 82 161
7366 161 123 -52 -152 -97 0 217 217 -27 -198 -171 114 227 43 -23 -189 -175 -27 218 263 -5 -200 -126 108
7389 108 200 104 36 -172 -240 -12 177 235 54 -215 -167 -81 178 248 67 -181 -248 -17 225 192 59 -107 -169 -76
7413 -76 114 291 115 -235 -340 -65 251 218 95 -91 -252 -191 160 275 198 -214 -188 -59 122 113 197 -50 -285
7436 -285 -179 113 300 116 -120 -238 -169 11 223 221 -43 -258 -197 102 276 154 -11 -80 -231 -100 262 346
7458 346 -42 -308 -156 57 187 97 58 -191 -275 -72 192 262 37 -166 -167 -105 144 296 151 -269 -302 -54 292
7481 292 246 11 -148 -113 -106 60 280 203 -157 -242 -115 162 264 123 -79 -260 -142 110 301 148 -158 -257
7503 -257 -53 2 214 182 58 -231 -238 82 195 117 -19 -226 -121 18 172 190 -52 -251 -125 26 159 97
7525 97 65 -95 -227 -30 201 276 30 -251 -139 57 161 180 87 -93 -113 -83 164 211 39 -85 -153 -75 131
7548 131 218 147 -69 -244 -64 153 162 49 -124 -157 -66 57 206 130 -62 -223 -60 149 178 108 -56 -186 -100
7571 -100 6 187 117 -74 -185 -160 63 110 166 -3 -195 -182 -26 226 117 -31 -143 -90 -34 82 127 39 -156
7594 -156 -121 51 125 203 88 -119 -97 23 225 162 -17 -64 -128 -11 86 232 35 -44 -166 -104 161 114 12 -56
7618 -56 -81 -41 119 220 25 -106 -126 -24 1 88 113 -77 -196 -113 88 166 110 -52 -75 -119 20 172 91 -11
7642 -11 -126 -64 32 95 126 40 -101 -136 -51 191 134 -76 -116 -99 -22 99 89 -65 -102 -31 -25 90 91 31 -79 -77 -53 59
7670 59 279 -12 -130 -102 128 102 31 -57 -123 -149 -85 112 107 -16 -52 -125 -25 46 177 46 -94 -155 -36 82 79
7695 79 -41 -52 -50 -4 94 130 84 -13 -88 -72 59 126 86 17 -193 -104 84 128 21 -73 -83 -69 69 69 76 -19 -116 1
7723 1 43 101 161 -1 -84 -83 -4 92 70 -98 -173 -62 -33 -9 127 -28 -141 -128 37 20 7 63 -10 -52 -2 110 151
7750 151 -10 -80 6 86 56 29 24 -33 -63 -10 130 52 -145 -9 29 33 33 64 -46 -88 -154 62 145 -76 -83 -56 -3 -53
7778 -53 100 86 8 -184 -112 115 41 -95 10 -51 -133 -127 93 100 -2 -120 -13 64 7 54 78 -48 -113 30 137
7803 137 3 -113 -59 37 -8 -6 31 108 -59 -56 111 132 -4 -16 -3 -14 5 73 84 -80 -154 -47 78 44 14 -42 -69
7830 -69 -151 13 90 83 -69 -173 -86 32 115 70 -27 -188 -138 20 145 -21 -14 -84 -80 -54 -41 124 46 -173 -157 33
7856 33 90 66 47 3 -151 -49 133 121 2 -86 -88 -16 45 168 123 -53 -151 -51 123 171 23 -76 -117 -44 65 137
7882 137 12 -75 -84 -86 135 102 126 -12 -164 -113 24 228 61 -62 -182 -44 -9 110 81 -35 -119 -112 -13 108 117
7907 117 38 -96 -162 -71 203 117 -29 -178 -91 46 122 153 30 -76 -171 -40 152 174 16 -127 -183 -75 172
7930 172 174 109 -201 -163 -14 105 155 71 -37 -166 -98 78 194 97 -64 -171 -65 51 255 108 -116 -208 -115
7953 -115 74 165 121 -102 -177 -170 75 234 110 -81 -183 -148 3 170 187 -11 -231 -148 83 198 110 32 -184
7976 -184 -191 10 247 288 -20 -253 -203 17 191 186 1 -171 -291 33 227 174 3 -183 -213 -124 219 265 80
7999 80 -207 -306 -24 190 192 25 -80 -251 -178 104 184 163 -123 -257 -59 113 181 147 -105 -276 -89 156 292
8022 292 133 -104 -233 -128 32 218 247 -54 -332 -292 147 267 174 -112 -225 -125 32 268 182 -44 -200
8043 -200 -145 92 212 219 38 -180 -270 -67 253 311 -56 -293 -216 31 139 180 10 -180 -266 -27 190 233 -28
8066 -28 -233 -238 -80 235 252 111 -273 -164 -91 256 193 6 -145 -252 -134 140 262 126 -195 -303 -67 159
8088 159 216 136 -141 -238 -106 166 282 149 -135 -172 -95 144 180 153 -32 -262 -198 106 269 122 -102 -160 -176
8111 -176 41 238 125 -81 -244 -208 82 223 78 -17 -174 -214 -66 211 191 -80 -274 -196 1 195 143 10
8133 10 -186 -203 19 144 256 -50 -185 -184 -94 190 184 138 -153 -204 -62 207 182 15 -167 -215 -39 58 196 129
8157 129 -85 -186 -55 148 186 -3 -120 -202 -123 134 252 114 -60 -126 -40 98 179 106 -101 -204 -145 113 227
8180 227 101 -85 -168 -145 0 133 108 -35 -150 -170 62
8191F2
##END NTUPLES=NMR FID
##END=
