##TITLE=1H_ADMO504
 CDCl3, 8 sc, 
 8.4.2019
##JCAMPDX= 6.0         $$ Bruker NMR JCAMP-DX V2.0
##DATA TYPE= NMR FID
##DATA CLASS= NTUPLES
##ORIGIN= UXNMR, Bruker Analytische Messtechnik GmbH
##OWNER= root
$$ XWIN-NMR		Version 3.5
$$ Mon Apr  8 13:54:02 2019 Russian Standard Time (UT+4h)  she@DPX200
##.OBSERVE FREQUENCY= 200.1315
##.OBSERVE NUCLEUS= ^1H
##.DELAY= (6, 6)
##.ACQUISITION MODE= SIMULTANEOUS
##.ACQUISITION SCHEME= undefined
##.AVERAGES= 8
##.DIGITISER RES= 18
##SPECTROMETER/DATA SYSTEM= spect
##.PULSE SEQUENCE= zg30
##.SOLVENT NAME= CDCl3
##.SHIFT REFERENCE= (INTERNAL, CDCl3, 0, 15.7039)
##AUDIT TRAIL= $$ (NUMBER, WHEN, WHO, WHERE, WHAT)
$$ ##TITLE= Audit trail, XWIN-NMR		Version 3.5
$$ ##JCAMPDX= 5.01
$$ ##ORIGIN= Bruker BioSpin GmbH
$$ ##OWNER= she
$$ F:/spectra/data/she/nmr/H-F/1/audita.txt
$$ ##AUDIT TRAIL=  $$ (NUMBER, WHEN, WHO, WHERE, WHAT)
(   1,<2019-04-08 13:52:53.59 +0400>,<she>,<DPX200>,
      <created by zg, POWCHK disabled, PULCHK disabled
       configuration hash MD5:
       00 E9 B6 7A A2 85 ED C7 34 08 36 98 17 FE 4E 26
       data hash MD5: 16K
       ED 90 3A 73 38 B1 14 83 EB FB 6E 21 62 26 4E 34>)
$$ ##END=
$$ 
$$ hash MD5
$$ 82 67 52 1D 09 26 98 86 FB F9 56 1A 10 44 CC 0E
##$RELAX= 
##$RELAX= 
##$RELAX= 
##$RELAX= 
##$RELAX= 
##$RELAX= 
$$ Bruker specific parameters
$$ --------------------------
##$DU= <F:/spectra>
##$EXPNO= 1
##$NAME= <H-F>
##$PROCNO= 1
##$TYPE= <nmr>
##$USER= <she>
##$AMP= (0..31)
100 100 100 100 100 100 100 100 100 100 100 100 100 100 100 100 100 100 
100 100 100 100 100 100 100 100 100 100 100 100 100 100 
##$AQSEQ= 0
##$AQ_mod= 1
##$AUNM= <au_zg>
##$AUTOPOS= <>
##$BF1= 200.13
##$BF2= 200.13
##$BF3= 200.13
##$BF4= 200.13
##$BF5= 200.13
##$BF6= 200.13
##$BF7= 200.13
##$BF8= 200.13
##$BYTORDA= 1
##$CFDGTYP= 0
##$CFRGTYP= 5
##$CHEMSTR= <none>
##$CNST= (0..31)
1 1 145 1 1 1 1 1 1 1 1 1 1 1 1 1 1 1 1 1 1 1 1 1 1 1 1 1 1 1 1 1 
##$CPDPRG= <>
##$CPDPRG1= <>
##$CPDPRG2= <>
##$CPDPRG3= <>
##$CPDPRG4= <mlev>
##$CPDPRG5= <mlev>
##$CPDPRG6= <mlev>
##$CPDPRG7= <mlev>
##$CPDPRG8= <mlev>
##$CPDPRGB= <>
##$CPDPRGT= <>
##$D= (0..31)
0 1.2 0 0 0 0 0 0 0 0 0 0.03 0 0 0 0 0 0 0 0 0 0 0 0 0 0 0 0 0 0 0 0 
##$DATE= 1554717172
##$DBL= (0..7)
120 120 120 120 120 120 120 120 
##$DBP= (0..7)
150 150 150 150 150 150 150 150 
##$DBP07= 0
##$DBPNAM0= <>
##$DBPNAM1= <>
##$DBPNAM2= <>
##$DBPNAM3= <>
##$DBPNAM4= <>
##$DBPNAM5= <>
##$DBPNAM6= <>
##$DBPNAM7= <>
##$DBPOAL= (0..7)
0.5 0.5 0.5 0.5 0.5 0.5 0.5 0.5 
##$DBPOFFS= (0..7)
0 0 0 0 0 0 0 0 
##$DE= 6
##$DECBNUC= <off>
##$DECIM= 24
##$DECNUC= <off>
##$DECSTAT= 4
##$DIGMOD= 1
##$DIGTYP= 9
##$DL= (0..7)
0 120 120 120 120 120 120 120 
##$DP= (0..7)
150 150 150 150 150 150 150 150 
##$DP07= 0
##$DPNAME0= <>
##$DPNAME1= <>
##$DPNAME2= <>
##$DPNAME3= <>
##$DPNAME4= <>
##$DPNAME5= <>
##$DPNAME6= <>
##$DPNAME7= <>
##$DPOAL= (0..7)
0.5 0.5 0.5 0.5 0.5 0.5 0.5 0.5 
##$DPOFFS= (0..7)
0 0 0 0 0 0 0 0 
##$DQDMODE= 0
##$DR= 18
##$DS= 0
##$DSLIST= <SSSSSSSSSSSSSSS>
##$DSPFIRM= 0
$$ [...]
##$SUBNAM2= <"">
##$SUBNAM3= <"">
##$SUBNAM4= <"">
##$SUBNAM5= <"">
##$SUBNAM6= <"">
##$SUBNAM7= <"">
##$SUBNAM8= <"">
##$SUBNAM9= <"">
##$SW= 24.9337058887773
##$SWIBOX= (0..15)
0 0 2 0 0 0 0 0 0 0 0 0 0 0 0 0 
##$SW_h= 4990.01996007984
##$TD= 16384
##$TD0= 1
##$TE= 0
##$TE2= 300
##$TE3= 300
##$TEG= 300
##$TL= (0..7)
0 120 120 120 120 120 120 120 
##$TP= (0..7)
150 150 150 150 150 150 150 150 
##$TP07= 0
##$TPNAME0= <>
##$TPNAME1= <>
##$TPNAME2= <>
##$TPNAME3= <>
##$TPNAME4= <>
##$TPNAME5= <>
##$TPNAME6= <>
##$TPNAME7= <>
##$TPOAL= (0..7)
0.5 0.5 0.5 0.5 0.5 0.5 0.5 0.5 
##$TPOFFS= (0..7)
0 0 0 0 0 0 0 0 
##$TUNHIN= 0
##$TUNHOUT= 0
##$TUNXOUT= 0
##$USERA1= <user>
##$USERA2= <user>
##$USERA3= <user>
##$USERA4= <user>
##$USERA5= <user>
##$V9= 5
##$VALIST= <valist>
##$VCLIST= <CCCCCCCCCCCCCCC>
##$VD= 0
##$VDLIST= <DDDDDDDDDDDDDDD>
##$VPLIST= <PPPPPPPPPPPPPPP>
##$VTLIST= <TTTTTTTTTTTTTTT>
##$WBST= 1024
##$WBSW= 4
##$XGAIN= (0..3)
0 0 0 0 
##$XL= 0
##$YL= 0
##$YMAX_a= 119740
##$YMIN_a= -91003
##$ZGOPTNS= <>
##$ZL1= 120
##$ZL2= 120
##$ZL3= 120
##$ZL4= 120
##$ABSF1= 10
##$ABSF2= 0
##$ABSG= 5
##$ABSL= 3
##$ALPHA= 0
##$AQORDER= 0
##$ASSFAC= 0
##$ASSFACI= 0
##$ASSFACX= 0
##$ASSWID= 0
##$AUNMP= <proc_1d>
##$AZFE= 0.1
##$AZFW= 0.1
##$BCFW= 1
##$BC_mod= 2
##$BYTORDP= 1
##$COROFFS= 0
##$CY= 11.3945322036743
##$DATMOD= 1
##$DC= 2
##$DFILT= <>
##$DTYPP= 0
##$F1P= 18.9103706918063
##$F2P= -1.10871071338519
##$FCOR= 0.5
##$FTSIZE= 0
##$FT_mod= 4
##$GAMMA= 1
##$GB= 0.15
##$INTBC= 1
##$INTSCL= 1
##$ISEN= 128
##$LB= 0.24
##$LEV0= 0
##$LPBIN= 0
##$MAXI= 10000
##$MC2= 0
##$MEAN= 0
##$ME_mod= 0
##$MI= 1.114404
##$NCOEF= 0
##$NC_proc= 0
##$NLEV= 6
##$NOISF1= 3.799351
##$NOISF2= 2.8
##$NSP= 1
##$NTH_PI= 0
##$NZP= 0
##$OFFSET= 15.70392
##$PC= 1
##$PHC0= -9008.497
##$PHC1= 11.20026
##$PH_mod= 1
##$PKNL= yes
##$PPARMOD= 0
##$PSCAL= 0
##$PSIGN= 0
##$REVERSE= no
##$SF= 200.130013532006
##$SI= 16384
##$SIGF1= 3
##$SIGF2= 2
##$SINO= 400
##$SIOLD= 16384
##$SREGLST= <1H.CDCl3>
##$SSB= 0
##$STSI= 0
##$STSR= 0
##$SW_p= 3612.71676300578
##$SYMM= 0
##$S_DEV= 0
##$TDeff= 0
##$TDoff= 0
##$TI= <>
##$TILT= no
##$TM1= 0
##$TM2= 0
##$TOPLEV= 0
##$USERP1= <user>
##$USERP2= <user>
##$USERP3= <user>
##$USERP4= <user>
##$USERP5= <user>
##$WDW= 1
##$XDIM= 8192
##$YMAX_p= 0
##$YMIN_p= 0
$$ End of Bruker specific parameters
$$ ---------------------------------
##NTUPLES= NMR FID
##VAR_NAME=  TIME,          FID/REAL,        FID/IMAG
##SYMBOL=    X,             R,               I
##VAR_TYPE=  INDEPENDENT,   DEPENDENT,       DEPENDENT
##VAR_FORM=  AFFN,          ASDF,            ASDF
##VAR_DIM=   8192,          8192,            8192
##UNITS=     SECONDS,       ARBITRARY UNITS, ARBITRARY UNITS
##FACTOR=    0.0002004,     1,               1
##FIRST=     0,             0,               0
##LAST=      1.6414764,     0,               0
##MIN=       0,             -91003,          0
##MAX=       1.6414764,     119740,          0
$$ Real data points
##PAGE= N=1
##DATA TABLE= (X++(R..R)), XYDATA
$$ [...]
1649A012K64m82n69j019p08Q79J914O54j385j343p8M38K58Q37J082o52j990o92
$$ 1012 1276 794 225 -794 -1502 -623 1291 1945 560 -783 -861 -423 -165 672 1754 1102 -888 -1580
1667a580J341J221m6k86L5p89j058K47J761Q88j059j189J36K74j29L57J039lj339
$$ -1580 -239 982 936 650 685 -104 -1162 -915 846 1734 675 -514 -378 -104 -233 124 1163 1160 -179
1686a79r48Q27R41j12k57J36o1q48k67Q60Q94m15p85M6K94l04j34N32L79m25o86
$$ -179 -1127 -300 641 529 272 408 347 -501 -768 92 986 571 -214 -168 126 -178 -312 220 599 174 -512
1707e12K30M29j0k86J61K88k78l59N7L02Lk26J20K41k84k55k8L03R3j23J39r5
$$ -512 -282 147 137 -149 12 300 22 -337 -280 22 25 -201 -81 160 -124 -379 -407 -104 -11 -134 5 -90
1729i0l03k16K92L83J20j89k58k63p7L12L81L59m20n03k21J02M22M91J46l08p43
$$ -90 -393 -609 -317 66 186 -3 -261 -524 -601 -289 92 451 31 -472 -693 -591 -169 322 468 160 -583
1750e83l59K83P57N41j04n14p41k09L27R07O02k56r60o70LP22Q34M09l61r16q05
$$ -583 -942 -659 98 639 535 21 -720 -929 -602 305 907 651 -309 -979 -976 -254 580 989 628 -288 -1093
1771a093J38R78J007J79p96j005n54L71J089R45Q5j028j278k83P86J290O39l17
$$ -1093 -955 23 1030 1209 413 -592 -1146 -775 314 1259 1344 316 -962 -1245 -459 831 1470 1153
1789A153j092j114k73J088J463N92q79j415p88K61J177J222M42r20j722q88Q25
$$ 1153 61 -1053 -1326 -238 1225 1817 938 -477 -1265 -1004 173 1395 1837 917 -805 -1693 -868
1806h68J669J031l75j127j295n97P59J757J216n63j921j320K74J171J391O50n24
$$ -868 801 1832 1457 330 -965 -1562 -803 954 2170 1607 -314 -1634 -1360 -189 1202 1852 1328
1823A328j803j621M83J928J591j61j275j409q59L03J787J813n2k070j958j0J425
$$ 1328 -475 -2096 -1613 315 1906 1745 470 -939 -1798 -1495 292 2105 2053 -17 -1975 -1985 -560
1840e60J472Q20j36j589k179l81K038K400K43j603j596p69J0J277K198R89j887
$$ -560 912 1732 1596 7 -2172 -2553 -515 1885 2128 525 -1071 -1840 -1830 -553 1645 2634 747
1857G47k800p18J744J885P02p9j038k112j355J503L145J156j767k216q13K18R19
$$ 747 -2053 -2771 -1027 858 1560 1481 443 -1669 -3024 -1521 1624 2780 1013 -1203 -2016 -1798 -879
1874h79J917J733j089l269j698J504K670J057l75r44j712j759N61L168K294j203
$$ -879 1038 2771 1682 -1587 -3285 -1781 889 1946 1571 627 -1085 -2844 -2283 885 3179 1976
1890A976k782j467L62R53J684J843j32l038k643P46K973J781k82j061j409j846
$$ 1976 -806 -2273 -1911 -958 726 2569 2437 -601 -3244 -2498 475 2256 1974 913 -496 -2342
1906b342k09K711K898k02k836k098J65R05J472J957N09k521l079j47K731K260
$$ -2342 -2551 160 3058 2856 20 -2078 -1913 -1008 464 2421 2930 409 -2670 -2817 -86 2174
1922B174K31j027j399j909o63K212L138N72k518k496m55R53J520J834P86j973
$$ 2174 2405 1378 -21 -1930 -2593 -381 2757 3329 811 -1685 -2140 -1187 333 2167 2953 980
1938I80l111r42K302K626P16r09j628j824q48J761L053J107j924k692j048P34
$$ 980 -2131 -3073 -771 1855 2571 1662 34 -1790 -2638 -877 2176 3283 1359 -1333 -2381 -1647
1954a647J619J965R01j546l014j381J529K669J370n48j592k015j063J297K765
$$ -1647 -28 1937 2838 1292 -1722 -3103 -1574 1095 2465 1917 325 -1690 -2753 -1456 1309
1969A309J591j134k534j632J38J558K193J120j134k677j608Q04K114J718L04j365
$$ 1309 2900 1766 -768 -2400 -2262 -704 1489 2609 1475 -1202 -2810 -2006 108 1826 2130 765
1985G65k309j241R74K490J515n57j714j653p80J166K348J462j074k378j413N34
$$ 765 -1544 -2785 -1811 679 2194 1637 -77 -1730 -2510 -1344 1004 2466 1392 -986 -2399 -1865
2001a865J495J569P82p34k354j640R46K481J306n13j327j312r64M24K297J892
$$ -1865 -370 1199 1981 1247 -1107 -2747 -1801 680 1986 1473 146 -1166 -2130 -1706 591 2483
2017B483o75k527j420M56J324J180J045k42j923k232L92K496J694l22j352j097
$$ 2483 1808 -719 -2139 -1683 -359 821 1866 1624 -299 -2531 -2139 357 2051 1729 377 -720
2033g20r24j07J713K306K10k209k063P8J168J233R34K34j249k148o82J796K092
$$ -720 -1644 -1751 -38 2268 2478 269 -1794 -1716 -548 685 1619 1853 604 -1544 -2226 -430 1662
2050A662M17j099j255q38k51Q55J922Q97j170k082p65R25J294P60R9o30j319r88
$$ 1662 2079 980 -275 -1113 -1364 -509 1413 2310 1140 -942 -1707 -782 512 1272 1371 741 -578 -1566
2068a566O03J821R84o64j510p01K48N49Q92P38j41j503j356N60J631P21m32p88
$$ -1566 -963 858 1842 1178 -332 -1033 -785 -236 656 1394 1253 -250 -1606 -1046 585 1306 874 86
2086H6m92n12k25J248J555j97j874j185O09J051L36L09L62q52j771l46J875J522
$$ 86 -406 -918 -1143 105 1660 1463 -411 -1596 -987 64 400 709 1071 219 -1552 -1898 -23 1499
2104A499m22j335j96j33o60L42J899R51j679j990L27J442J41k32P24L89j726j630
$$ 1499 1077 -258 -454 -587 -1247 -905 994 1945 266 -1724 -1397 45 186 -46 678 1067 -659 -2289
2122b289J290K228j21j567p2P57p69j028J294K008o97k447m4J712K22j152M40
$$ -2289 -999 1229 1108 -459 -531 226 -543 -1571 -277 1731 1034 -1413 -1457 255 477 -675 -235
2139b35J313n84k102K86K243K99j770m30J456J41j605J20K023L7k112o37J971
$$ -235 1078 494 -1608 -1322 921 1220 -550 -980 476 617 -988 -868 1155 1192 -920 -1557 414
2156D14P76j411n64J309L51j696n44J978R65j614j123J272Q06j171o23J522P94
$$ 414 1190 -221 -785 524 875 -821 -1365 613 1578 -36 -1159 113 919 -252 -875 647 1441
2173A441j566j205J257J232r24r34J072P80j215j074J188J302r30j146P37J049
$$ 1441 -125 -1330 -73 1159 235 -699 373 1153 -62 -1136 52 1354 424 -722 15 1064
2189A064r89j099J072J170p79j117O54J008q21j064Q06J286n75j232L40Q36m08
$$ 1064 75 -1024 48 1218 439 -678 -24 984 163 -901 -95 1191 616 -616 -276 560 152
2206A52p56O04J128n02j357J12R30%n32L42O78o98j043J98J176K59o02k15J39
$$ 152 -604 0 1128 626 -731 -619 311 311 -221 121 799 101 -942 -744 432 691 89 -126 13
2225A3l04m02M60R20L7q45n47J90K72J03M09J79m73p38n1N44M92J32j57m27n34
$$ 13 -291 -693 -233 687 724 -121 -668 -478 -206 -103 306 485 12 -726 -777 -233 259 391 234 -193 -727
2246g27k6O81M83j06l41l75l21L3O26P47q0q54n78L01L40K57L72J13p64r19O2
$$ -727 -753 -72 411 305 -36 -411 -732 -699 -73 674 594 -260 -838 -537 -197 60 432 545 -219 -1138 -1076
2267a076J204P04l47m92k57m71l21Q00J383L6j322j014L24O70L31N79K71p04j373
$$ -1076 128 832 485 -7 -264 -735 -1056 -256 1127 1163 -159 -1173 -849 -179 152 731 1002 298 -1075
2286a075l13J117J359k8o16n79n51m18O77J453O37j040j403k57M62P20O72N33
$$ -1075 -1388 -271 1088 1060 444 -135 -686 -1104 -427 1026 1663 623 -780 -1037 -575 145 817 1350
2304A350n39j515p84R39J406L84m72n48p20o63M84J520Q91p05j436o27K99O86
$$ 1350 811 -704 -1488 -549 857 1241 769 221 -499 -1162 -678 842 1733 1028 -408 -1035 -736 -50
2322e0Q99M80m02j396r50N90J291Q25j89p50r75o66N19J397R81m92j308r85O9
$$ -50 849 1329 927 -469 -1419 -829 462 1287 1098 348 -627 -1293 -774 623 1604 1112 -196 -1181 -1112
2341a112P90J210O27n28j424j079L41J272J112J43p68j334q36M27J476J133q1
$$ -1112 -322 888 1515 987 -437 -1516 -1175 97 1209 1352 584 -750 -1586 -1159 317 1450 1369
2358A369j273j197m98P32J492R10l56j497j253L6J074J263N97m72j509j187K06
$$ 1369 96 -1101 -1599 -867 625 1535 1179 -318 -1571 -1535 -461 802 1399 927 -582 -1769 -1563
2375a563J493J367Q9q92j400q88L93J560J325j21j363j361l13P96J271J047j92
$$ -1563 -70 1297 1386 494 -906 -1794 -1401 159 1484 1363 0 -1361 -1674 -878 393 1440 1248
2392A248j516j424k8J390J391K89o54j248j117J00J506J610N3j342j396m34O89
$$ 1248 -268 -1692 -1720 -330 1061 1350 696 -552 -1669 -1569 -63 1547 1600 258 -1138 -1572 -883
2409h83J182J110K8j267j697k75J215J640N99o09j232j153j23J187J567N14q90
$$ -883 299 1409 1437 170 -1527 -1802 -587 1053 1652 1043 -189 -1342 -1465 -278 1289 1803 913
2426I13j751o96M40J414J180J50j059j542n95P38J575R80l00j355j295k90J070
$$ 913 -838 -1534 -1094 320 1500 1650 591 -951 -1546 -808 767 1747 1447 92 -1203 -1493 -423
2443d23J532O74n38j421j223J24J233J425L91r37j528p72M05J295J228J71j101
$$ -423 1109 1783 1245 -176 -1399 -1275 -42 1383 1774 837 -691 -1463 -1058 237 1465 1636 535
2460E35j592m58Q40J395R01l33j205j259l02R33J558O16p22j358r38J78J067J256
$$ 535 -1057 -1515 -675 720 1621 1288 83 -1176 -1478 -545 1013 1629 907 -451 -1389 -1211 -144 1112
2478A112M59q69j539p25N84J238R82r4q55j262p19P59J539Q75m29j347j051m0
$$ 1112 1571 702 -837 -1562 -978 260 1242 1148 293 -969 -1688 -929 610 1485 1056 -291 -1342 -1382
2496a382Q65J186O92m19j453j148L23J333J034Jo24j011q44J53J271J279n2j357
$$ -1382 -517 669 1361 942 -511 -1659 -1336 -3 1031 1032 408 -603 -1447 -1294 -23 1256 1204 -153
2514a53j069j30P62Q65P62R5j189j298j93J249J171K27o34q68o61j61Q65J398
$$ -153 -1222 -1352 -590 275 1037 1132 -57 -1355 -1548 -299 872 1099 465 -403 -1064 -1225 -360 1038
2532A038L81j173j280k40O97P99N13L16p20j197n10Q04J349M22o16p66o24j24
$$ 1038 1419 246 -1034 -1274 -577 222 735 1051 331 -866 -1376 -572 777 1199 583 -183 -807 -931
2550i31N86J090N66o21j165o18M58R17N62J70m65q80p27M62J016P48k61q08o48
$$ -931 -345 745 1311 690 -475 -1093 -635 282 844 1014 549 -331 -1058 -596 420 1168 907 99 -549
2569e49k77M29Q75O41k56r39o98L6P69P50J91l77q17n30K21P04N96J17n43p76
$$ -549 -826 -397 478 1119 863 -76 -774 -738 31 781 972 595 -222 -752 -531 173 769 886 343 -433
2589d33l52M17O91N17j96n16n65k21L81P29M54l61p44m12J69M29M22J00j11n54
$$ -433 -785 -368 323 840 644 128 -437 -658 -277 452 906 545 -199 -611 -442 -13 409 509 398 -156
2609a56n99J76P50M11j82m63k64p0L8K58O04P1o79n82K45M53J06l7J56j75n12
$$ -156 -755 -579 171 582 400 -63 -327 -397 -359 -101 503 574 -105 -687 -442 11 117 80 236 61 -451
2630d51l35O45N42j62n36lJ29r6q7M15L45m00n98J62M55qj88J51J91l42l93K75
$$ -451 -786 -141 401 239 -297 -300 -171 -267 -354 61 406 6 -592 -430 25 17 -171 -20 171 -171 -564 -289
2652b89N85j52m89N9L56o4l14N2M43l3m56q9N51Q3n06o4M06K08l73k81N29J12
$$ -289 296 144 -345 -286 70 6 -308 -256 187 154 -302 -391 160 243 -263 -327 79 287 -86 -367 162 274
2674B74l94l01M91M40m99l93L01M18k22l64L75L37m11n30K92P44j30o09j6M50
$$ 274 -120 -421 70 510 11 -382 -81 337 115 -249 126 463 52 -478 -186 558 428 -181 -197 253
2694B53j37l43L02O26j72q70j91O82L63l88n6L86l04o37K0J013M13p24p05K40
$$ 253 116 -227 75 701 529 -341 -532 150 513 125 69 455 151 -486 -466 547 960 236 -469 -229
2714b29K93k50J81P76J58j024q79M78J013P3m15J22l3p18m62Q86J184k46j182
$$ -229 64 -186 -5 771 929 -95 -974 -496 517 590 175 297 264 -454 -916 -30 1154 908 -274
2733b74l76M22J17q4N83O17o22j321k07J304P26n65k50Q7m33p47L47J446M40j231
$$ -274 -650 -228 -111 -195 388 1005 383 -938 -1145 159 885 320 70 157 -276 -1023 -676 770 1210 -21
2753b1q76L06N07j10K70P03k14j384o87J086J248k72o70p1j62n50k0J377R00r25
$$ -21 -897 -591 -84 -194 76 779 565 -819 -1506 -420 828 556 -114 -185 -347 -897 -917 460 1360 435
2773D35j511j68R36M40R3N13mj255j160P11J747M62q63o87k02m29n9J230J312
$$ 435 -1076 -1244 -308 132 225 738 734 -521 -1681 -970 777 1239 376 -311 -513 -942 -1001 229 1541
2792A541l15j908q24P01Q87N02K97P7j040j433J19J627J206l81r94n88l80m0Q82
$$ 1541 1226 -682 -1506 -805 82 584 881 958 -82 -1515 -1396 231 1437 1056 62 -526 -906 -946 -64
2811f4J338K84j461j317Q1R71Q42L39l6p39j251l99J211J394K37r60r33n07J78
$$ -64 1274 1558 97 -1220 -1139 -168 674 1013 977 238 -1013 -1412 -201 1193 1430 470 -463 -970 -792
2830g92P27J191L86j013j402l30Q71J056N36j95r50j090k51Q78J434N07q11j172
$$ -792 -65 1126 1512 499 -903 -1233 -362 694 1230 1035 85 -1005 -1256 -378 1056 1563 752 -420
2848d20q33K64J093J061L35q53j383q08O20J428J007k44j014j287n04Q02J392
$$ -420 -1253 -989 104 1165 1500 647 -736 -1544 -924 504 1511 1267 253 -1034 -1538 -736 656
2865F56Q97k79j434j237n8J078J276O09o77j366j031J76J211J407K23r50j383
$$ 656 1553 1274 -160 -1397 -1455 -377 899 1508 831 -535 -1566 -1390 -179 1228 1451 501 -882
2882h82o41M52J286J110m6j141j253m81Q20J335P56l86j209j096q4J008J332M30
$$ -882 -1523 -1071 215 1325 1279 138 -1115 -1596 -776 559 1315 929 -280 -1376 -1460 -452 880 1310
2900A310p67j172p88K79J141J013K05r63j223n51N93J352Q35l01j137j009k03
$$ 1310 543 -629 -1417 -1138 3 1016 1221 258 -965 -1516 -923 429 1264 963 -174 -1183 -1386
2917a386Q61J240P26n97j394q67J87J144J146L10q06j198q60L92J358J159j1j243
$$ -1386 -525 715 1441 844 -550 -1417 -1230 -86 1060 1370 564 -634 -1494 -1102 256 1415 1404 161
2935A61j097m47P38J170Q39j28j159j314k10J070J414L92o42j097p30MQ29J270
$$ 161 -936 -1383 -645 525 1364 1236 77 -1237 -1447 -377 1037 1429 787 -310 -1040 -1036 -207 1063
2953A063N17r71j336n29N96R63O96J57o11j153p21P35J365O41n77j067n08j22
$$ 1063 1580 609 -727 -1256 -660 303 999 1156 545 -608 -1329 -594 771 1412 835 -232 -740 -862
2971h62N05J095O24m26j359p93M34J115O05N6m76r54o91K53J269R42l32j109o71
$$ -862 -357 738 1362 936 -423 -1216 -782 333 938 994 518 -436 -1127 -874 395 1337 1005 -104 -775
2990g75m0L63Q32P58j47j245r91K94J034O50J16k94p34q63j91J197J142j24r73
$$ -775 -815 -452 380 1138 991 -254 -1245 -951 83 733 849 555 -179 -1042 -1233 -36 1106 982 9
3009Ip48j17K73N94Q20J33q23j229j03Q84Q36J16k74m22p47k99O28J150K75p38
$$ 9 -739 -856 -583 11 831 964 141 -1088 -1191 -307 529 645 371 -51 -798 -1097 -469 681 956 218
3029B18q58k25K79M64N77K53m31q97m25N68Q65K38k79n14m32k00L66P70M81m44
$$ 218 -640 -865 -586 -122 455 708 277 -620 -1045 -477 388 626 347 -167 -599 -799 -433 337 818 374
3049C74o68l86R8N42M69K47l58o14m36K82O53M33j40l75n25j48K74N42L70j61
$$ 374 -294 -680 -582 -40 429 676 318 -296 -732 -450 203 636 496 121 -404 -552 -278 264 634 473
3069D73n25m12L0L16M99K12k61m52l40J66L64L58K9k41l73k17J54L41L82%l81
$$ 473 -52 -464 -434 -118 381 593 332 -120 -460 -294 70 428 457 216 -157 -374 -220 121 503 503 122
3090A22l50l3J68M13J33j76k26j96j6J64K55K03j55l65j44J52J94J53j47J0q9
$$ 122 -228 -261 -93 320 453 277 51 -145 -161 3 258 461 306 -59 -203 -51 143 296 149 159 70
3111G0k38J6K84J73j33k00m6Q0J4n7J40P0j33k09J17j1J78j42J1P1m6o6o8M0N7
$$ 70 -168 -152 132 305 172 -28 -74 6 20 -37 103 173 40 -169 -52 -63 115 -27 -16 55 9 -57 -125 -85 -28
3136b8j4m6M1M7%k13P2Q2Q8o9qj00j08J01Q4P5P9j15k16o8J64K50R1j43k27j27
$$ -28 -42 -88 -47 0 0 -213 -141 -59 29 -40 -48 -148 -256 -155 -71 4 83 -32 -248 -316 -152 98 189 46 -181 -308
3162c08j8J76K37O8p6k86k41J65L28K18kk59l16j32R3L78L66r6l80m08R6L38L40
$$ -308 -326 -150 87 155 79 -207 -448 -283 45 263 261 2 -314 -446 -353 25 391 295 -85 -493 -397 -59 281
3185B81J06j96k85l63QM34M25J58l43m98k28K49M21L39j2l44n78j53L68N73L70
$$ 281 387 191 -94 -457 -449 -15 410 568 225 -273 -501 -252 169 508 496 152 -426 -579 -211 362 732
3206G32k48n45m33j7M57N18J87j97n75n25J58O18O13M4o07n85j62K83N42M42Q5
$$ 732 484 -61 -494 -511 -54 464 651 454 -121 -646 -488 130 743 787 180 -405 -567 -284 258 700 785
3227G85n54p54k29N44Q32K29l38o13m35j16M99P73M36n68r73l65M15P01L98N7
$$ 785 231 -523 -752 -208 624 853 515 -98 -533 -649 -150 623 1059 491 -482 -847 -432 269 667 724
3247G24l38q02n94M31R94N38l10p79n56j31M06P84O20k27j046p75K10Q31O27J67
$$ 724 386 -416 -1010 -579 415 953 643 -136 -692 -823 -417 367 987 760 -286 -1061 -851 -20 607 774
3267G74l76p72p48J74J124P78j27r53p02j27K89P70Q50M3j210r89O3R94Q31N1
$$ 774 398 -374 -1122 -948 176 954 827 -126 -828 -955 -666 104 954 997 -213 -1202 -1139 -145 686 737
3287G37k92o70q62j54J003J279R5j043r02j69L41O21P72L83q41j365m23J067J117
$$ 737 445 -225 -1087 -1241 -238 1041 1136 93 -809 -978 -637 -16 756 1139 298 -1067 -1490 -423 694
3306F94K24l23o94p10k97N01J388O40p98j380m39O00O56O43L47l62j266q89O38
$$ 694 918 595 -99 -809 -1106 -605 783 1423 625 -755 -1194 -594 62 705 1052 690 -576 -1465 -827
3325h27J381P08m61p89o22l75L29J147R73l49j503q28M21P55P83L85k90j037j172
$$ -827 554 1262 801 12 -610 -985 -656 491 1464 1115 -388 -1216 -795 -40 743 1128 838 -199 -1371
3344a371L42J316J000j89r95o45m52K61R91J126p9j350j141K61R40O33M03r9r46
$$ -1371 -1029 287 1287 1098 103 -542 -994 -733 258 1384 1305 -45 -1186 -925 15 648 1051 952 6
3363Fj131j52J307J247r0r11p58m04pQ27J154M16j214j410j25R39R35K88o0o41
$$ 6 -1125 -1277 30 1277 1187 276 -482 -886 -893 -66 1088 1504 290 -1120 -1245 -306 629 917 857 216
3383B16j104n02Q45J450M80q35j125m94K14N51J013N36o76j403o30P22J090O17
$$ 216 -888 -1390 -545 905 1385 550 -575 -1069 -855 -304 709 1245 569 -834 -1464 -742 348 965
3401I65j79o33r19n00M41J280P49m76j078p22M3P11Q51N54m23j128q69L56J012
$$ 965 786 153 -766 -1266 -825 455 1204 728 -350 -1072 -1029 -318 533 1087 664 -464 -1333 -977 35
3420C5Q30L6o92p81o36L59J046Q42j46r62q45o8N08Q93N82k13q53j025n7R77R87
$$ 35 865 901 209 -572 -1208 -849 197 1039 893 -69 -914 -982 -474 419 1001 788 -65 -1090 -1147 -170 817
3441H17J54n33p96o19J00P90R78J97p63j009l79N74Q35N44p7o92p75l17N91R69
$$ 817 971 438 -358 -977 -877 -87 891 1088 325 -684 -1063 -489 346 890 813 121 -654 -971 -380 589
3461E89M98n13p40n80M6O39Q05K03l97r27n47L64Q70N39k5n85o47l13L02P94O28
$$ 589 1087 574 -166 -746 -700 -61 744 947 550 -377 -924 -560 310 849 824 239 -408 -721 -419 375 1003
3482A003l09o88o54K0M66O60L98k75p73n99J20O53O16J91m64o67m11K10O44N27
$$ 1003 694 6 -648 -628 -162 498 896 621 -152 -751 -631 22 638 829 365 -302 -713 -503 141 668
3502F68N5n31o88k54M03O29M06j73n41m94j08L42O53L05k79n83m23Q1M62N18J10
$$ 668 723 192 -496 -750 -347 282 688 515 -26 -520 -628 -286 367 672 393 -190 -613 -532 -70 448 558
3523E58k91n28m42J51O54L90j42m24k81r9P8L95M26j0o40m02J13M27L03J9q2k18
$$ 558 267 -261 -703 -552 102 492 350 -74 -355 -454 -376 19 445 435 -205 -607 -494 -67 236 255 173 -45
3545d5m11l9L56N26l2m62k68J00R4N3L38J32k87n37j7M33K60j25p0Kj75k47J87
$$ -45 -456 -495 -139 387 355 -107 -375 -275 -181 -128 210 342 55 -482 -499 -66 194 69 -1 1 -174 -421 -234
3568b34N07J11l52l09Q0J40l2R3K37l7l93k18L23L21o7j73J03L2k98j25M20J91
$$ -234 273 384 32 -277 -197 -57 -89 4 241 204 -189 -407 -84 237 170 -3 100 132 -166 -291 129 320
3590C20k27j98J18J19j27j47K29K72k55l10J40L24j28k27J53K21j14k85L2L04
$$ 320 93 -105 13 132 5 -142 87 359 104 -206 -66 258 130 -97 56 277 163 -122 -90 214
3610B14K6l23P5K86p9l71K9K73J70k68l0J66l6l10J8M18J35l14k27O3J28j05L
$$ 214 240 -83 -8 278 199 -172 -143 130 300 32 2 168 132 -178 -160 258 393 79 -148 -85 43 -62 -59
3633e9L31k5m37j84K47L53Pj86j5r2k21o6L99L35j61m37j64K36Q6RK91J0l67l61
$$ -59 272 247 -190 -374 -127 226 233 47 32 -60 -281 -347 52 387 226 -211 -375 -139 -53 -44 247 257 -110 -471
3657d71J08M45K03j07j73j40k42j3M15M17r2m62l76J05K22K87J56j0m38l53n5
$$ -471 -363 82 285 178 5 -135 -377 -390 25 442 350 -112 -488 -383 -161 126 282 272 -166 -519 -574
3678e74M44M24J05k58l80k72L2M00M53J09m42m48k06K90M03L95nn24m16j07K70
$$ -574 -130 294 399 141 -239 -511 -479 -79 374 483 41 -407 -613 -323 80 475 470 -54 -470 -577 -307
3699c07O17K26j79m80m38M4L86M87K08k13o11l41O8O00M78rm15m84j91J80O61
$$ -307 310 536 357 -123 -561 -517 -131 356 564 351 -260 -601 -533 67 545 536 121 -363 -554 -374 287
3720B87M00j01n73m92r7M18N80L04j61o61n15RO37N79J49m23o04l56J57N86O42
$$ 287 687 586 13 -479 -576 -158 422 726 565 -96 -611 -602 35 614 763 340 -264 -620 -463 123 765
3741G65L9o23o38k38M56O08M02j75o12o17j28N30Q26K76l65o96n00N4O04O70K19
$$ 765 804 181 -457 -695 -239 369 771 596 -16 -633 -761 -231 595 871 506 -190 -690 -636 -32 638 857
3762H57m60q04m59L58O71N63Rn46p38k69L48P70N45k69o06p51K9N24P79K71m09
$$ 857 397 -407 -866 -508 163 726 735 189 -549 -818 -470 300 845 576 -30 -781 -752 -228 551 822 413
3783D13o87n47Q7O45O99K12n69p37m67L01Q51N49j01o46p35j69M76Q20M43k86
$$ 413 -274 -821 -734 -89 610 822 253 -484 -951 -650 201 750 649 3 -732 -901 -425 395 838 552
3803E52p16o63P4N56O94K80l24q96n53K58Q10P17j05n38p40l67L75P82N85j12
$$ 552 -164 -827 -753 -197 497 777 453 -443 -996 -738 72 789 684 146 -594 -961 -586 196 781 669
3823F69p44o66j35N68O92M55k41p88o75N9P06P30K24n46o87m54K04P16P21L6o36
$$ 669 -75 -741 -876 -308 384 839 598 -190 -865 -806 -100 630 854 308 -379 -833 -629 87 808 844 208
3844B08p95k52M79P24M89k19o04o99j43O21Q46L28m70p62m82J31O15O59K48n56
$$ 208 -587 -839 -360 364 853 634 30 -669 -812 -191 655 983 513 -249 -731 -600 15 674 922 366
3864C66p40l96K68P84N17j55m36o13l13L52P92M78k64p60n72K3N50O22L29l34
$$ 366 -374 -770 -502 282 799 644 208 -405 -718 -366 426 904 640 -120 -692 -669 -119 503 832 498
3884D98p04n49O9P53O98k3m91o73k53K55N35O59r3o73o87N9M03N39L49j56n63
$$ 498 -206 -755 -686 67 765 742 251 -422 -675 -420 115 774 681 8 -679 -620 -217 322 671 515 -48
3905d8o39p0O22P35R2m40n99l03P7M71O58J63n52p48k03M70N55K25n3l54n56l33
$$ -48 -687 -757 -135 600 692 252 -347 -650 -573 -102 556 719 167 -581 -784 -314 241 466 413 59 -497 -830
3927h30M49Q03K03l20n63k62n7L89M49L90l68p09l04K46N85K35j2j83n17l35K69
$$ -830 -381 422 625 305 -258 -520 -577 -188 261 651 283 -426 -730 -484 101 336 324 141 -376 -711 -442
3948d42O21M33j91n90k84mK86K90M32j56o01m38J53O26K59k0j81l45k85JM37N47
$$ -442 179 612 421 -169 -453 -457 -171 119 551 395 -206 -644 -491 135 394 374 193 -152 -437 -436 1 548
3970E48j1n19m38J09J14L12L01J09m69m79n0N12L81m1j91k24k41j22L71N21L6
$$ 548 537 18 -420 -311 -197 115 416 525 56 -423 -473 39 420 379 188 -36 -277 -399 -28 493 529
3991E29l74m38KJ90J73K95N4k56m63j45L40L65Q3k13j11j55j27J19L80J46j96
$$ 529 155 -283 -281 -91 82 377 431 175 -288 -433 -93 272 355 142 31 -124 -251 -132 248 394 198
4012A98l51j12J94J75N7R0o7k96j80K22J86J50j28j60p3q8M0K03K80r9l25j66
$$ 198 -153 -265 -71 104 161 251 184 -112 -292 -70 116 266 138 -22 -95 -183 -143 60 340 241 -84 -250
4034b50R0J41J28N4l0k23j04oK06J70p0j51n2j28J32O6J20mp1j96L5R4k6R6jo4
$$ -250 -160 -19 109 163 133 -90 -194 -200 6 176 106 -45 -97 -225 -93 -27 93 89 18 -178 -143 -49 -75 21 20 -44
4060d4j00pK8N0R9r8j07P6PL8J4L5r1N7J9q4J3J00r0M2O4M6j33o7K7J23K0rl1
$$ -44 -144 -151 -123 -73 26 -72 -179 -103 -96 -58 -44 -9 -100 -43 -24 -108 -95 5 -85 -43 21 67 -66 -133 -106 17 37 28 -3
4089com1j5O1J00P9k11k1q3J41M7OP5p7p8j99J78J78L6m4p9r4n9P1J56J48q7k66
$$ -3 -9 -50 -65 -4 96 175 -36 -57 -140 1 48 54 129 52 -26 -225 -47 131 167 123 44 -50 -109 -38 118 266 179 -87
4117h7k7J3J77P9J02q2k03j36L7J95K84j23j49j78n8K8K15K32j7k63k27k1J62
$$ -87 -114 -101 76 155 257 175 -28 -164 -127 68 352 229 80 -98 -156 -128 87 319 302 39 -188 -209 -47
4140d7J92J38n2j86k49r9L29K46L7j55k86m5m4J82K88J54l22m59qL05K76R0j17
$$ -47 145 283 231 45 -204 -303 26 272 309 154 -132 -177 -221 -39 249 403 81 -378 -386 -81 195 285 168
4163A68j30l41j36K49M38K05k99l89j41R9J42L05K00j70m11l09J56N61J06l2k49
$$ 168 38 -303 -439 -190 248 453 154 -235 -376 -277 -135 170 370 200 -211 -520 -364 197 303 271 22
4184B2k81k03R0N13M04k67m67k84Q0K43K96K80j00n63m64J74N95L24r3k63k15
$$ 22 -259 -462 -372 141 545 278 -189 -473 -393 -150 146 426 326 -237 -701 -527 68 392 299 36 -179
4205a79k98k6N83M50o6n66m56J39J69L57L17J2m66n10r1O12N17n2k68l39j79j73
$$ -179 -477 -503 80 530 464 -102 -558 -419 -250 107 424 436 -30 -540 -631 -19 498 446 178 -161 -340 -513
4227e13L72O15J79n44n38n2K80L62K29N8k19o25k47M20O57J84l47l26l25p3K79
$$ -513 -141 474 653 109 -429 -481 -201 161 390 448 229 -396 -643 -223 434 618 271 -55 -380 -453 -174
4248a74O02L06m13o10k89L22M42K56J00k50n55l95K62P01L38j99m73l23j62K83
$$ -174 428 734 321 -289 -578 -256 186 442 542 292 -263 -658 -396 305 643 444 -29 -352 -514 -231
4268b31N42L73k06o20m61J77M47M35J29k84m75m36J75N43M98j22l67m63j69K70
$$ -231 311 684 478 -142 -603 -426 21 456 585 301 -174 -610 -435 108 606 484 117 -346 -515 -245
4288b45M70M02j23n65n17k8N23L82L01k24n77l59j1M90N05J09k97o07k71K46M20
$$ -245 225 627 504 -61 -578 -606 -83 299 600 376 -201 -560 -571 -81 424 533 236 -371 -642 -396 24
4309B4M24N2m32n63j51L64N24K67j31n01l69p0L59M80L10l17o34k63J06M91L97
$$ 24 448 500 68 -495 -646 -282 242 509 378 -123 -492 -562 -203 277 587 270 -364 -627 -521 -30 367
4330C67J41l34n36k48J57O05L76p7m34m48q1K32M24M17j09o00m17J6M67N17L6
$$ 367 508 174 -362 -610 -453 152 528 451 17 -431 -512 -280 144 561 452 -148 -565 -549 -82 435 471
4351D71j82m38l35Q0M22M44J33m24m64j81K00L53M62L7n69m86rL57L40L12j50
$$ 471 289 -149 -484 -404 18 462 595 171 -293 -474 -274 79 541 578 9 -477 -486 -129 211 523 373
4372C73l64m56rL49N21P7j80m52l12P0M69L76N8l79m24k08L17L58K61n6l29l81
$$ 373 9 -447 -456 -107 414 491 311 -141 -453 -383 86 462 520 141 -283 -491 -174 184 445 389 60 -321
4394c21q2K41M53K66k82l34k71PL08L34J92l59l22k25J16L95K24R1k72m31j65
$$ -321 -403 -162 291 557 275 -59 -330 -323 -15 319 511 152 -170 -395 -279 116 340 431 159 -272 -437
4415d37K63L61K38p3m00k47r0K41L54J76j63l88k03O5K66K66R3k23k79k46R1L38
$$ -437 -174 187 425 352 -48 -295 -385 -144 210 386 223 -165 -368 -303 -37 229 322 99 -180 -426 -335 3
4437CK34o6j55k00k14J67K83K45j08k64l08Q1J34L13O2n6k73k83K1L36K07L5r4
$$ 3 237 171 16 -184 -398 -231 52 297 189 -75 -383 -302 -168 145 207 151 -122 -405 -384 -48 159 194 100
4460A00k55j92J08J92K68m4k11j94r6K75J27J54o5j58j91n0J35K55Q3j18k11j00
$$ 100 -155 -347 -239 -47 221 177 -34 -228 -324 -49 78 232 167 9 -182 -232 -97 158 241 123 -88 -188
4482a88mJ84K00Qj03k41J8L6J35J25k2j49j38J4J06J30M8N7j86j46j9J92J5M7
$$ -188 -192 -8 192 200 97 -144 -126 -90 45 170 148 -1 -139 -125 -19 111 159 216 30 -116 -135 57 72 119
4506A19K2q0r6p6J08J54jj24K7m2q0M8J37J7k5j37m6N5J43m7k5K4o3r7Q1N9N0
$$ 119 141 61 -35 -111 -3 151 150 26 53 11 -69 -21 116 133 108 -29 -75 -20 123 76 51 75 12 -85 -4 55 105
4533A05l4j21R4p8k8P4L1N0o8l3r9R7k2k0J20L0j12r5K8J01m1m6J09j8q6o3O6
$$ 105 71 -50 44 -34 -62 12 43 93 25 -8 -107 -10 -32 -52 68 98 -14 -109 -81 20 -21 -67 42 24 -62 -125 -59
4560e9J51o6r6p7P7m9L8M3J08m6j01o3M2K6P2J9p%j82K4Q9J04Ok6j15j04K2J32
$$ -59 92 26 -70 -147 -70 -119 -81 -38 70 24 -77 -140 -98 -72 0 19 12 12 -170 -146 -57 47 53 27 -88 -192 -170 -38
4588c8J34N4j42j46J2L9P0R2kk8k33j1J79J29O5r6j34j03NL1J74K11r1k38j13
$$ -38 96 150 8 -138 -126 -87 -17 75 73 45 -188 -199 -20 109 174 78 -56 -159 -154 -123 51 262 171 -67 -180
4613a80R9J26J35j7Kj96k04O6K90Q0J6j96k07mJ18J86J14r4j01k12k2K21J64R9
$$ -180 -81 45 180 163 165 -31 -235 -169 121 201 217 21 -186 -190 -72 114 228 134 33 -179 -201 20 184 283
4637B83j32j44j48l7K67P2J02j88k11n3P8K38J27J2j80k00q5J39K55Q3j03k14
$$ 283 151 7 -141 -178 89 161 263 75 -136 -189 -111 127 254 266 86 -114 -199 -60 195 278 175 -39
4659c9j76jJ76L28l0j02j85k49R6J56L03J9k51k49m0N9K58K22o5j65l05j17K37
$$ -39 -215 -216 -40 288 258 156 -29 -278 -182 -26 277 296 45 -204 -244 -185 73 295 230 65 -240 -357 -120
4682a20J94J89p4k01k81J8K53K30J38l05k54j42O4K56K33L9j78l77n5J43K20K31
$$ -120 74 263 189 -12 -293 -275 -22 208 346 41 -213 -355 -291 -35 198 237 59 -318 -373 -230 -10 221
4704B21Kk32l16j06K77L49R4j22l15j69%K27L02J21j70m13j53J23K83K80L0k63
$$ 221 223 -9 -325 -431 -154 195 289 167 -148 -317 -317 -90 212 333 163 -250 -403 -280 3 283 313 50
4726E0k97j55J70M16J66p8l13k69N8R7L48K27j36m08l18J75K57L01k2p8l40j87
$$ 50 -247 -402 -232 184 350 272 -41 -310 -252 -155 193 420 284 -124 -442 -267 -10 291 269 191 -149 -336
4748c36P1L34L53p3k93l10l5K08K38K19r5k70l51K9K65L97O8k26k52k21M6K01
$$ -336 -265 69 422 349 56 -254 -289 -81 157 376 281 11 -340 -311 -46 351 419 193 -59 -280 -234 -33
4770c3M58L2k98l90n6J75J79L10k1k03l63k25K92M38J34k18k80j42JJ34L68J60
$$ -33 425 457 159 -231 -287 -112 67 377 356 153 -210 -435 -143 295 429 211 -69 -211 -210 -76 292 452
4792D52k07m64j98K75K78Q0J39k20k83k37J26M39K09j48l16r3q2L1L12K88j05
$$ 452 245 -219 -417 -142 136 216 355 135 -148 -385 -259 180 389 241 -75 -168 -250 -219 93 381 276
4813B76l68k98J41K69J89Q8j55k01k87m3L87L10r0k92j45q2J70J82K41L4l52l47
$$ 276 -92 -390 -249 20 209 297 142 -59 -346 -389 -2 308 218 -74 -219 -301 -131 51 292 326 -26 -373
4835c73R5K77K01L4q5j92l32j3L15K50J35k97k74p0J44J57J62J75k62l85o7K76
$$ -373 -278 -1 200 234 149 -43 -375 -388 -73 177 312 15 -259 -329 -185 -28 134 309 47 -338 -405 -129
4857a29K25J35q1j81j62j16J39L70P8j60l11o8J3K30J30J75j73k99j06J51K14
$$ -129 96 231 150 -31 -193 -309 -170 200 278 118 -193 -261 -248 -18 112 287 114 -185 -291 -140 74
4878G4K05r7j61j25j96J71J82K20m5k71j58R5P4K00J02j33j56k15J19J96J79n7
$$ 74 279 182 21 -104 -300 -129 53 273 228 -43 -201 -106 -32 168 270 137 -19 -234 -115 81 260 203
4900B03p5j29j68N3J60J99m4j46j86nJ26J75L8m1k44r7oJ81K04K4q3j90r0M4J05
$$ 203 128 -1 -169 -116 44 243 199 53 -133 -138 -12 163 201 160 -84 -181 -187 -6 198 222 139 -51 -141 -97 8
4925HJ46Kn2j67j77Q9K33O0l3o7j63p6J03J15L2nj28r0K0O4J41L1k4j17j31O0
$$ 8 154 156 104 -63 -240 -151 82 142 109 42 -121 -197 -94 21 53 48 -80 -170 -150 -86 55 86 62 -55 -186 -126
4951a26R9J12Pj60n0L2o0R0J68l3r5j43P2JO3OJ35j82r9J8J15J64n1j07k0m4J4
$$ -126 -27 85 92 -68 -118 -86 -146 -56 112 79 -16 -159 -87 -86 -23 -17 118 -64 -163 -145 -30 134 83 -24 -44 -88 -74
4978g4LJ29J6j00q2LK8J50n2K4l8j48M8oJ51qj6m4j3m2K7P6O8j02N0q8k0N3Q2
$$ -74 -71 58 74 -26 -108 -105 -77 73 21 45 7 -141 -93 -99 52 44 28 -16 -29 -71 -44 32 100 -2 48 -40 -60 -7 75
5007G5l6NJ4p7mK6k5Q5k3m6K0mM6o6P8Jlpl6m4O1M0m6R5p2m9QK2J15j5j47O8o7
$$ 75 39 44 58 -19 -23 3 -22 63 40 -6 14 10 56 -10 68 69 66 59 23 -21 40 80 34 129 57 8 16 38 153 138 -9 59 -8
5040hk5qJ20%o3n2l2L4Q3k1O1n3p9m4PR3J30q4k3k6o3j2J31O9r0n9j18N1O5k0
$$ -8 -33 -41 79 79 16 -36 -68 -34 49 28 89 36 -43 -87 -80 13 143 59 36 10 -53 -65 66 135 45 -14 -132 -81 -16 -36
5070c6J41m7r0q1J1J18rL6r9M5j31k1J63J62q8q7j49K0K6J46Q1Km6k34M6R8R1
$$ -36 105 58 -32 -113 -102 16 7 43 -56 -11 -142 -163 0 162 74 -13 -162 -142 -116 30 111 113 67 -167 -121 -23 68
5097F8O9p3q1j19KJ35N1M4j13j20k8P0P6R7N0j22j34j09J21K04K4J4j53j75K4
$$ 68 137 64 -17 -136 -134 1 52 96 -17 -137 -165 -95 -19 78 128 6 -128 -237 -116 88 112 126 -27 -202 -178
5122a78O4K41Rrj87j49K3J24J49L7o1j76m1J2J74J08J2r6j38mn2K70P0n4j12k09
$$ -178 -114 127 136 127 -60 -209 -186 -62 87 124 63 -113 -154 -142 32 140 152 56 -82 -86 -138 132 202 148 36 -173
5148a73j7J68J25J59o2j99j98N6J92J24Mo1k33m5pK47J12J7j10j91m0J13Q1J72
$$ -173 -190 -22 103 262 200 1 -197 -141 51 175 179 118 -115 -160 -167 80 192 209 99 -92 -132 -19 62 234
5172B34m1j96j35l1J44J64qk1k09j25J02J29J47J1j76r8n9J3J87J48M6k16j69
$$ 234 193 -3 -138 -169 -25 139 131 110 -99 -224 -122 7 154 165 -11 -109 -168 -155 32 180 226 10 -159
5195a59q2J16J87J52k4k46j56j1J65J91Q6p6k69r6k1K35J94K3j26k05j50J57J24
$$ -159 -241 -125 62 214 190 -56 -212 -223 -58 133 219 143 -126 -222 -243 -8 186 209 83 -122 -272 -115 9
5218IJ85m5j23k12n0O9K15J63p6j80j66OJ13K27R5o5k63j70O9K69L5J07j53j87
$$ 9 194 149 26 -186 -236 -167 48 211 135 -45 -211 -205 -92 135 230 165 -98 -268 -199 70 105 212 59 -128
5242a28p8K8J97K09k6k34j63k1P3K52N9k3k31j07K6J02J59M0pj79j20M2J12K04
$$ -128 -206 -178 19 228 202 -32 -195 -216 -143 109 168 145 -86 -193 -167 -65 94 134 127 -52 -172 -130 -18 186
5266A86K8j17j49j18J31J31J62m8j70j74k0Q4K07J19p7j82j22QJ27J32J03q0j92
$$ 186 214 97 -52 -170 -39 92 254 206 36 -138 -158 -74 133 252 175 -7 -129 -121 6 138 241 161 -31
5289c1j39jJ88J74pr2k02l7Q2J73Q5pj17j71k7J33J76pJ2j91j37l4K15J89jj74
$$ -31 -170 -171 17 191 184 92 -110 -147 -65 108 193 186 69 -102 -129 4 180 173 185 -6 -143 -177 38 227 226 52
5315E2r5p5p5J39J57M5p7j74j02J45J04P1N0j59j00j60J44K57P9p8j37j46m4J74
$$ 52 -43 -118 -193 -54 103 148 71 -103 -205 -60 44 115 165 6 -94 -254 -110 147 226 148 11 -135 -179 -5
5339eM9R9q3r5k09Q6R9J86Qj00j11p4J1K42J0Lj98j30L3J24L8J37j16j7q6j01
$$ -5 44 143 60 -35 -244 -158 -59 127 135 35 -76 -150 -139 103 113 116 -82 -212 -179 -55 -17 120 4 -13 -99 -200
5365b00J43J10M4j08l7j00R9j7J46Q0j75j48L2J7J57M9k5j2j37nM8J55k0k3j30
$$ -200 -57 53 97 -11 -48 -148 -49 -66 80 160 -15 -163 -131 -114 43 92 67 55 -82 -87 -39 116 96 73 -57
5390e7m4M9N3P9J32j15j32o8N2P7M5P0l6n5j35P9R6O3j6j55k3k7J16j2J15k5j37
$$ -57 -101 -52 1 80 212 97 -35 -103 -51 26 71 141 105 50 -85 -6 90 153 137 -18 -41 -68 48 36 151 126 -11
5417a1j06K5J74l8PL1r2l8L2j4J94q1p7k7J8J6o7J06M5k9j14l9M7R7o2nN1m5o9
$$ -11 -117 -92 82 44 51 82 -10 -48 -16 -30 164 83 6 -21 -3 13 -54 52 97 68 -46 -85 -38 59 -3 -8 43 -2 -71
5446g1L6N6M4K2j11L4o6%K3J42n9r4r9J02J22j7k1Rk6q5%L4O8m0k3NL5m0j5k5
$$ -71 -35 21 65 87 -24 10 -56 -56 -33 109 50 -44 -143 -41 81 64 43 52 26 -59 -59 -25 43 3 -20 -15 20 -20 -35 -60
5476f0J05j41M5m0Q2k8L6k8N4m1j45R4P9Ko9K4M9n9j7L9J19n2j39J21n7MK7j7
$$ -60 45 -96 -51 -91 -9 -37 -1 -29 25 -16 -161 -67 12 14 -55 -31 18 -41 -58 -19 100 48 -91 30 -27 -23 4 -13
5504a3L8l7n5K5PRN1nm0Jp7R0J3M0k6n0j4J2L2K6K0Rl5p9O5Q8j01M7J07j41j6
$$ -13 25 -12 -67 -42 -35 -26 25 20 -20 -19 -96 -6 7 47 21 -29 -43 -31 1 27 47 56 21 -58 7 95 -6 41 148 7 -9
5535iJ5JR2o4J8nj09M9L0N6K7m0m0m8k4O9M8N5q6l2k4N0j4L8O9j01r9M7N7M7O
$$ -9 6 7 99 35 53 48 -61 -12 18 74 101 61 21 -27 -51 18 66 121 35 3 -21 29 15 53 122 21 -78 -31 26 73 79
5566G9m1o8j5n6J20J1L6n8m9o6Q4P9KL6p0j14L6M5O4K6p3Q6j11j09J07N2L4n2
$$ 79 38 -30 -45 -101 19 30 66 8 -41 -107 -23 56 58 94 24 -90 -54 -9 55 81 8 94 -17 -126 -19 33 67 15
5594A5q1l8m3R0J01J6K6j79o4O0J00N0q2L5o7q9QJ61P7n7j40NJ3O9m5J09rj22
$$ 15 -66 -104 -147 -57 44 60 86 -93 -157 -97 3 53 -29 6 -61 -150 -142 19 96 39 -101 -96 -83 -14 -59 50 41 -81
5622h1j11N6R9K4Q2r9K4q5%J15qj6Pq3j2j8Q4J09O0j98o4Q3P6M1K3l7j37n0J2
$$ -81 -192 -136 -37 -13 69 -30 -6 -91 -91 24 16 0 7 -76 -88 -106 -22 87 147 -51 -115 -32 44 85 108 71 -66 -116 -104
5651a04J58L5o3j0jj13nJ10J34n0Kj44k2O5mJ56k4j07j17J3Q5J13K2r9l0o9K3
$$ -104 54 89 26 16 15 -98 -103 7 141 91 93 -51 -73 -8 -12 144 120 13 -104 -91 -6 107 129 30 0 -69 -46
5678d6L8J01Q4j56m0p8O6J20l1J10j63m0p9Q5J06j9j0n8k6o0M2J24P2n5j02K6
$$ -46 -8 93 177 21 -19 -97 -31 89 58 168 5 -35 -114 -29 77 58 48 -10 -36 -96 -54 70 142 87 -15 11
5704A1r7P4J23ok9j68M3l3J26qJ2Nj67l4M2J48Q8j29m9J5l0q5J42R2L2j93m8K3
$$ 11 -86 -12 111 105 76 -92 -49 -82 44 36 48 53 -114 -148 -106 42 130 1 -48 -33 -63 -148 -6 86 118 -75 -123 -100
5732a00P4P5J5l6m6j47L0J31O2m6j5m2p1O0J1R7j7n0j34P0J4P6k1N2p3j44Q4M6
$$ -100 -26 49 64 28 -18 -165 -135 -4 58 12 -3 -45 -116 -56 -45 52 35 -15 -149 -79 -65 11 -10 42 -31 -175 -91 -45
5760d5J32m5k6nm9j8P4O3j1m6j28L7JP6M8K4o6j37J7J28M8o3M3l8r1N3N1N7Ll5
$$ -45 87 42 16 11 -38 -56 18 81 70 24 -104 -67 -66 10 58 82 16 -121 -104 24 72 9 52 14 -77 -24 27 84 87 52
5790E2j4p8JQ3K1LJ0j40kM6J09kj3n9m3m1P3O0O3k6o7r5O0o3Q1J03q0k7q9nJ06
$$ 52 38 -40 -39 44 65 68 78 -62 -64 -18 91 89 76 17 -26 -67 6 66 129 103 36 -59 1 -62 19 122 42 15 -74 -79 27
5821B7K3L9p9Jk5k6J07M2pr4p7Oj5J31Qnr5j1MN8%L2N9j21n3M3K0M6jn6p9J8m
$$ 27 50 89 10 11 -14 -40 67 109 102 8 -69 -63 -78 53 61 56 -39 -50 -46 12 12 44 103 -18 -71 -28 -8 38 37 -19 -98 -80 -84
5854h4O9O7Op9j30M6K4P9lQ3j68mO3qM9jk5p8J0J9M3N8j6%q1m7P2m7P6L8k7j07
$$ -84 -15 52 58 -21 -151 -105 -81 -2 -5 78 -90 -94 -31 -39 10 9 -16 -94 -84 -65 -22 36 20 20 -61 -108 -36 -83 -7 31 4 -103
5886a03N6K2J3N5m3L7j01j5J07k2N2l1j2m4J2LM4L1l2l0Kn4J17p1O3N6j16J0l1
$$ -103 -47 -25 -12 43 0 37 -64 -79 28 6 58 27 15 -29 -17 -14 30 61 29 -1 1 -53 64 -7 56 112 -4 6 -25
5915b5P6k8L7j22M5LN3jj9K2o1L0J6L9k7M1m1m9j8l9Q3J9rM5l1q5K1J8MP5m5n
$$ -25 51 23 60 -62 -17 -14 39 38 19 41 -20 10 26 65 38 79 38 -11 -29 -68 15 34 25 70 39 -46 -25 -7 -3 72 27 22
5947B2j0o6R8RJ7n5J7l7J9p1O9K3m1k2K0L2L0P0j0j22qL1m5O5k7l6L4pl8M8j1
$$ 22 12 -54 44 53 70 15 32 -5 14 -57 12 35 -6 -28 -8 24 54 124 114 -8 -16 15 -30 35 8 -28 6 -1 -39 9 -2
5978bk5%Kqn0L6pL4l1K9%%k3n2O4J8mo9P8l0P6n0mo8O0Rj1N2j2k8kj1l6qR3j6
$$ -2 -27 -27 -25 -33 -83 -47 -54 -20 -51 -22 -22 -22 -45 -97 -33 -15 -19 -88 -10 -40 36 -14 -18 -86 -26 -17 -28 24 12 -16 -18 -29 -65 -73 20 4
6014Dn8M3q4P8J8p6J30p7O0q8K0L0M2m1rmK1J2m3J3O2rq7j4L6P9j9l5j3j9J5M2
$$ 4 -54 -11 -95 -17 1 -75 55 -22 38 -50 -30 0 42 1 -8 -12 9 21 -22 -9 53 44 -43 -57 -21 58 39 4 -9 -28 -13 29
6046B9j5M6Kj04L9m%L7LJ9l1mm6J21j1jl1j2n6M0O7KK5j11J1j0KKJ12p6m7PM5
$$ 29 14 60 62 -42 -3 -7 -7 30 33 52 21 17 -29 92 81 80 49 37 -19 21 88 90 115 4 15 5 7 9 121 45 -2 5 50
6079E0J8n1jP2m3r2L6K5ML2j0j00M1L8Q9p0P2o6j23j1P1N8n1L5k6p6J4J8J30P
$$ 50 68 17 16 88 45 -47 -11 14 18 50 40 -60 -19 19 108 38 110 44 -79 -90 -19 39 -12 23 -3 -79 -65 -47 83 90
6109I0j34o7P8j0N5J9nm1p4k7O1N6j3M4m9oq2Q3J1J0l6M9p4m5O6K2N2Rr5k2J5
$$ 90 -44 -111 -33 -43 12 31 26 -15 -89 -116 -55 1 -12 32 -17 -23 -105 -22 -11 -1 -37 12 -62 -107 -41 -19 33 42 -53 -75 -60
6140f0J01L6l3l4n5k9n0J02O4J8l9r2M8N6n5M1Rk6Ql9J9Q4jo5n5j5KL0J22k3n6
$$ -60 41 77 44 10 -45 -74 -124 -22 42 60 21 -71 -23 33 -22 19 28 2 10 -29 -10 74 73 8 -47 -62 -60 -30 92 69 13
6171A3p7J2J5P7O7j07j7K4K0m4Q3q2L1n4PK0K6O1Ml4k4k8L8rQ6m8j4r0J5qP0J1
$$ 13 -64 -52 -37 40 107 0 -17 7 27 -17 66 -16 15 -39 -32 -12 14 75 79 45 21 -7 31 22 108 60 46 -44 -29 -37 33 44
6203D4j8J7n8ML8M1j4nq8K4NJ3K6L4Qq5n5N5m4J03ok1l8l3PP1l0P2l3r5rN3j1
$$ 44 26 43 -15 -11 27 68 54 49 -39 -15 -10 3 29 63 71 -14 -69 -14 -58 45 39 18 -20 -53 -46 25 -5 67 34 -61 -70 -17 -28
6236b8L6L4m1q2rK6J02Rm1l0j7j3J10j9k6j2k5p7N9N0O0k7j10L1o8J00K7J7j0
$$ -28 8 42 1 -81 -90 -64 38 47 6 -24 -41 -54 56 37 11 -1 -26 -103 -44 6 66 39 -71 -40 -108 -8 19 36 26
6265B6q5P4j23J28j9l1N7j17N2Pm0R8J6l5o2l7Q6J2m0P8q9n0Q3o4O3J11o3j11
$$ 26 -59 15 -108 20 1 -30 27 -90 -38 -31 -71 27 43 8 -54 -91 -5 7 -33 45 -44 -94 -11 -75 -12 99 36 -75
6293g5O6k7nK2K5M1mp0l3j4J15ml0j1l2K3L3L8k6k2m2O0r9J06k8J7m6M0q7L7P3
$$ -75 -9 -36 -41 -19 6 47 43 -27 -60 -74 41 37 7 -4 -36 -13 20 58 32 10 -32 28 -71 35 7 24 -22 18 -69 -32 41
6324D1l8k1P8n4P9k1k2QK5m3KL7k0l1J9L2r1l0R0l3P9r2M7ll3Nj4L6KL0r5K8N4
$$ 41 3 -18 60 6 85 64 42 50 75 32 34 71 51 20 39 71 -20 -50 40 7 86 -6 41 38 5 10 -4 32 34 64 -31 -3 51
6357E1Qj00N8j2j00P4n2J22j5m8P2j02J5k5O5m1J0k4L7n3M5m0N4Ql7l4N9L8Jl8
$$ 51 59 -41 17 5 -95 -21 -73 49 34 -14 58 -44 -29 -54 11 -30 -20 -44 -7 -60 -15 -55 -1 7 -30 -64 -5 33 34 -4
6387dLm7J8QK1Nk6R9r6L9pj5l0O7Kj37P3J0K7K7k3l3J9k9L5j1j3L0l7P6j33P6
$$ -4 -1 -48 -30 -22 -1 4 -22 77 -19 20 13 -2 -32 35 37 -100 -27 -17 10 37 14 -19 0 -29 6 -5 -18 12 -25 51 -82 -6
6419fLO1p3l9J12k1k2Pk8K0o3K6L1J8M9k3l7o1P4J8L9p7mj2N7mQo3%Q2L6j25l1
$$ -6 -3 58 -15 -54 58 37 15 22 -6 14 -49 -23 8 26 75 52 15 -46 28 46 85 8 4 -8 49 45 53 -10 -10 72 108 -17 -48
6452d8K5P8J4o5J1O6o4j7j4P4j6j4k9P9n6l6L1l7L5ql7N8n1O0J3m8k7K2K2k8K4
$$ -48 -23 55 69 4 15 81 17 0 -14 60 44 30 1 80 24 -12 19 -18 17 9 -28 30 -21 39 52 4 -23 -1 21 -7 17
6483A7J7p7K1l4J11m6K0l7j0J2%M8q4Q0p0N7k8j9pK8M7m6Kk5pRJ5K3n8J05j25
$$ 17 34 -43 -22 -56 55 9 29 -8 -18 -6 -6 42 -42 38 -32 25 -3 -22 -29 -1 46 0 2 -23 -30 -21 -6 17 -41 64 -61
6514f1N5n2JN1Pm8L5L9p8O9Lo7L3o0O2M5p8R3j6j11L8P2l8Nj8K2l5K4M1J8q5M6
$$ -61 -6 -58 -57 -6 1 -47 -12 27 -51 18 21 -46 -13 -73 -11 34 -44 49 33 -78 -40 32 -6 -1 -19 3 -32 -8 33 51 -34 12
6546A2o2N4NJ4p6M6l4M1n0JR2op7kJ9J03m8P7n5p1L5j08O8J11l6m4k8j6Q5j3P3
$$ 12 -50 4 9 23 -53 -7 -41 0 -50 -49 43 37 -40 -42 -23 80 32 109 54 -17 18 -90 -22 89 53 9 -19 -35 50 37 110
6577A10p1K5l1j7K5m%LL5o3k7L9k0J9L2j35O8M1lQ6q6l5m6K4%N8nm9J4M6r0J3
$$ 110 39 64 33 16 41 37 37 40 75 12 -15 24 4 23 55 -80 -12 29 26 112 26 -9 -55 -31 -31 27 22 -27 -13 33 -57 -44
6609d4R3Mkq4N6n9M5J2lk9J6l6L8j8j7J23r0j1l0j0J32m3p8m2P0J9p5J10qKp6
$$ -44 49 53 51 -33 23 -36 9 21 18 -11 5 -31 7 -11 -28 95 5 -6 -36 -46 86 43 -35 -77 -7 12 -63 47 39 41 -35
6640c5J2k3L1K7N9k7o7rJP2jk7J3m1p8M4L6N4k1m4J7m8m4Q0M3J0p1N9j53J33K5
$$ -35 -23 -46 -15 12 71 44 -23 -32 -31 41 40 13 26 -15 -93 -49 -13 41 20 -24 -7 -55 -99 -19 24 34 -37 22 -131 2 27
6671B7L2n3o4N7jn7N4j7N3q7p8P8Q2n0p5J02%QJ6Jl4M6m7L0lj1O2l8N1r0p0Q0
$$ 27 59 6 -58 -1 -2 -59 -5 -22 31 -56 -134 -56 26 -24 -99 3 3 11 27 28 -6 40 -7 23 20 9 71 33 84 -6 -76 4
6703DJ1J7QJ7q0N5o2m7R8l2lm4M5P0o2L5J1n8J5p4J19m5O7rm0k0NL4j8N1o8Qr3
$$ 4 15 32 40 57 -23 32 -30 -77 21 -11 -14 -58 -13 57 -5 30 41 -17 -2 -76 43 -2 65 56 16 -4 1 35 17 68 0 8 -85
6736h5PJ41pl6n3j9rrR3p6J05l2n5l8Q4J7oRr5k5j5J2R1Om1P6p8L4K0L3J6r0R
$$ -85 -78 63 56 20 -33 -52 -61 -70 23 -53 52 20 -35 -73 11 28 22 31 -64 -89 -104 -92 -1 5 -36 40 -38 -4 16 49 65 -25 -16
6769a6k1K1J02m9lJ7j17K4K8O3lo8K9q2m2R5R8o3kq7NQ1l9PM5o6Jj0K5M3O2j02
$$ -16 -37 -16 86 37 34 51 -66 -42 -14 49 46 -22 7 -75 -117 -22 76 13 11 -76 -71 10 -29 -22 23 -43 -42 -52 -27 16 78 -24
6801b4o4N1j4k7J18k5J0k7j6L1j5J3L3k0m0k4LP9JP1p9m2j7Pk2J18njq5O3n5L0
$$ -24 -88 -37 -51 -78 40 15 25 -2 -18 13 -2 11 44 24 -16 -40 -37 42 43 114 35 -7 -24 -17 -39 79 74 73 -12 51 -4 26
6833B6P2Mk1o5Kj5N6l5J6j4k9oK5n1N0Kj7j7k4J12k0m0L2k3r6K0J25mn0m4NK2
$$ 26 98 102 81 16 18 3 59 24 40 26 -3 -9 16 -35 15 17 0 -17 -41 71 51 11 43 20 -76 -56 69 65 15 -29 -24 -2
6865bJ7pj5J2M8o2K9l1M9N9r3j8KOK4pj7R2r1j3N5o8L3Q2o6m5J4K2l1O4k5ln3
$$ -2 15 8 -7 5 53 -9 20 -11 38 97 4 -14 -12 -6 18 11 -6 86 -5 -18 37 -31 2 84 18 -27 -13 9 -22 42 17 14 -39
6898c9OL2R2j19J04q3j9j0R3j5o5J18j71O4J1r0J16K4m1mk5kj8R1o0O1q2J9l2
$$ -39 -33 -1 91 -28 76 -7 -26 -36 57 42 -23 95 -76 -12 -1 -91 25 49 8 4 -21 -23 -41 50 -10 51 -31 -12 -44
6927d4K2kl2N7r0O7J5M2j6J6q2M9Kn0N4%L7l5l8%K6J6M8j2l2n7M7M3J3r9N8l1
$$ -44 -22 -24 -56 1 -89 -22 -7 35 19 35 -47 2 4 -46 8 8 45 10 -28 -28 -2 14 62 50 18 -39 8 51 64 -35 23 -8
6959hK6K1j12Q5k6L0jm9P3m7JM6ro7K6K5L4j3n9L9o1nJ6J19m1m2Rk0J1n5K9L7
$$ -8 18 39 -73 12 -14 16 15 -34 39 -8 -7 39 30 -37 -11 14 48 35 -24 15 -46 -51 -35 84 43 1 10 -10 1 -54 -25 12
6991A2j2k4l3P3L5P7j28J7j4l8K3Q9o1K6p7J4M2n1nP0l3M8l1k2k7O2n3NK0k8O7
$$ 12 0 -24 -57 16 51 128 0 17 3 -35 -12 77 16 42 -35 -21 21 -30 -35 35 2 50 19 -3 -30 32 -21 -16 4 -24 43
7022D3q8L4M1jNn4j5m6Q4j8K1L4j19O1K1rK2J5lj03nj5Q2jl0Mj4M4p7N3Q0l3n1
$$ 43 -45 -11 30 29 34 -20 -35 -81 3 -15 6 40 -79 -18 3 -6 16 31 28 -75 -80 -95 -13 -14 -44 -40 -54 -10 -87 -34 46 13 -38
7055c8N2m1M7l7J2nk3l7P3L0l9j8Ql7JK0N5k2k5mM5o0j1P0O7n8o7l1L0M8P0jo0
$$ -38 14 -27 20 -17 -5 -10 -33 -70 3 33 -6 -24 -16 -53 -52 -32 23 1 -24 -28 17 -43 -54 16 83 25 -42 -73 -43 5 75 74 14
7088A4N1o2j0N2k9k0nj2kN5rj0L7m7o9J2P6%M3j01KK5l6N3N2l4m0j1j5Q7on6k0
$$ 14 65 3 -7 45 16 -4 -9 -21 -23 32 23 13 50 3 -66 -54 22 22 65 -36 -34 -9 -45 8 60 26 -14 -25 -40 47 41 -15 -35
7121c5M9J5m2N8l0j9K2l9m2K6P1L0p3L9Pn5m3N5M6J7pm7Mo1L7OJ1k8j4m3N9M6
$$ -35 14 29 -13 45 15 -4 18 -21 -63 -37 34 64 -9 30 37 -18 -61 -6 40 57 50 3 7 -54 -17 -11 0 -28 -42 -85 -26 20
7153B0Q0j04J2k0m7J05r8P4q3Q3p7K4QO1j0m3j7m5P4r5J38k2Lm3m2M4O7j2q2k6
$$ 20 100 -4 8 -12 -59 46 -52 22 -61 22 -55 -31 -23 38 28 -15 -32 -77 -3 -98 40 18 21 -22 -64 -20 47 35 -47 -73
7183g3RN9j1K5J6m4lJmRM2K7k5J6m1lrO4J1j03l3N9J2l8J10q5K9n0mJ0K8P0j42
$$ -73 -64 -5 -16 9 25 -19 -22 -21 -25 -16 26 53 28 44 3 0 -9 55 66 -37 -70 -11 1 -37 73 -12 17 -33 -37 -27 1 71 -71
7216g1Q8rk8N4L5k9n8Oq5N1Q3j6J3m7L6o2O8n8O7j0q6M7jl9J34Kq0P0j00J4j8
$$ -71 17 8 -20 34 69 40 -18 -12 -97 -46 37 21 34 -13 23 -39 29 -29 38 28 -58 -11 -12 -51 83 85 5 75 -25 -11 -29
7247b9R6K8k6j64K0K4R9K8r6P0k8L2j05m1J93n2k3q8O5j1K9lJ1l9KnJ2l3K0M6
$$ -29 67 95 69 -95 -75 -51 48 76 -20 50 22 54 -51 -92 101 49 26 -62 3 -8 21 18 29 -10 -8 -13 -1 -34 -14 32
7277C2p7L3K5L2Ll2J0m2j4oL9k5J1lL8m1NO3r8M8k9jLNM2j3j3l2oN4%JJm2kL9
$$ 32 -45 -12 13 45 48 16 26 -16 -30 -36 3 -22 -11 -14 24 -17 -12 51 -47 1 -28 -29 -26 -21 21 8 -5 -37 -43 11 11 12 13 -29 -31 8
7313Hrl4O6P5m9o4n1P0KN3n4nn1L3%Q1l6m1m0M0J3l7M7m1P6mp3K8j9J4L1l6oj2
$$ 8 -1 -35 31 106 57 -7 -58 12 14 67 13 8 -43 -10 -10 71 35 -6 -46 -6 7 -30 17 -24 52 48 -25 3 -16 -2 29 -7 -13 -25
7347b5O5m5N0k7j1m2l4Q6K4m0k4O7j7p1J30n0m0j3N1o8L8K2j9N0j7k8M2n6N2p2
$$ -25 40 -5 45 18 7 -35 -69 17 41 1 -23 44 27 -44 86 36 -4 -17 34 -34 4 26 7 57 40 12 54 -2 50 -22
7377b2O4m7k4J04r8P4m1k6Q6o5O2q1N1rK7p7J3n1N2J0k7%L2l9MQK4j5JQ0o7K6
$$ -22 42 -5 -29 75 -23 51 10 -16 70 5 67 -14 37 28 55 -22 -9 -60 -8 2 -25 -25 7 -32 -28 -20 4 -11 -10 70 3 29
7409B9j14R4l5J0M9n0j0O5j7k8j6jn3Q1K4j7J0rpL5q0j5M3nK9k7J8lm5J19o3J6
$$ 29 -85 9 -26 -16 33 -17 -27 38 21 -7 -23 -24 -77 4 28 11 21 12 5 40 -40 -55 -12 -17 12 -15 3 0 -45 74 11 27
7441B7Rl7o5L2M8NJ2j10J28n7nj8P6o8j5J8OP6n5N3p2P2j18N2N0j2j3Jp7P9k4
$$ 27 36 -1 -66 -34 14 19 31 -79 49 -8 -13 -31 45 -23 -38 -20 -14 62 7 60 -12 60 -58 -6 44 32 19 20 -57 22 -2
7472bM2n4k1O2j7K7o5oO1l8k8m7J62j11O0Lm6N4l3N3k6rRl8mM5k1M2J8j1n6m0
$$ -2 40 -14 -35 27 10 37 -28 -34 27 -11 -39 -86 76 -35 25 28 -18 36 3 56 30 21 30 -8 -12 33 12 54 72 61 5 -35
7504c5K5M2L9m3J3l6M1l5j6J6M2l8j2j0N9n2K2j9oL0m3PN4l4j8RJ4m7K9kP9m5
$$ -35 -10 32 71 28 41 5 46 11 -5 11 53 15 3 -7 52 0 22 3 -3 27 -16 -9 45 11 -7 2 16 -31 -2 -4 75 30
7536C0n8l9K5l0J00Lp5K2l8J0M1j6k8K2l6K3j5J9j7J03p6N2mq0J33o3nnm5M7M9
$$ 30 -28 -67 -42 -72 28 31 -44 -22 -60 -50 -9 -25 -53 -31 -67 -44 -59 -40 -57 46 -30 22 18 -62 71 8 3 -2 -47 0 49
7567D9k8Qj5k8Mn1J40m5k2ko4K7K0LM1m7n2P3K4n7J07Jp3m8j5k7N0Q3J7j50L1
$$ 49 21 29 14 -14 -10 -61 79 34 12 10 -54 -27 -7 -4 37 -10 -62 11 35 -22 85 86 13 -35 -50 -77 -27 56 73 -77 -46
7598d6O9n8J9RJ01p1p1J7mJ08q6J1L7n1l6J10j7oJ0n8%m2N9N3K1j01P8r9J7O0
$$ -46 23 -35 -16 -7 94 23 -48 -31 -35 73 -13 -2 35 -16 -52 58 41 35 45 -13 -13 -55 4 57 78 -23 55 -44 -27 33
7628C3J1n3J6J0r9J49l2Lkl3l8o1J42O3j29K3j0jj2K9RL2n2j5p0Q0j6Q7m6m1L2
$$ 33 44 -9 7 17 -82 67 35 38 36 3 -35 -96 46 109 -20 3 -7 -8 -20 9 18 50 -2 -17 -87 -7 -23 64 18 -23 9
7659Il8K9L7l8M5m6p3J6Q2lk0K8l2J7LK1L9qp4n0Q0pl3%J%kK8l4Q9j09P7j8k1
$$ 9 -29 0 37 -1 44 -2 -75 -59 23 20 0 28 -4 13 16 37 76 68 -6 -56 24 17 -16 -16 -15 -15 -17 11 -23 66 -43 34 16 -5
7693ek2L8m7N1J8ko8N5J0J5ok7J5o6K5M0k8l0J2Pm7P8J0L9n2k5K4j7J0k2N5l9
$$ -5 -27 11 -36 15 33 31 -37 18 28 43 37 10 25 -41 -16 24 -4 -34 -22 -15 -62 16 26 65 13 -12 12 -5 5 -17 38 -1
7725aL1o7K9k6P4j2n4On8P8n0J17l1n8J5pL1L5l2M8n7%o6R5K9K9r1pKK3l7k5P3
$$ -1 30 -37 -8 -34 40 28 -26 -20 -78 0 -50 67 36 -22 -7 -14 17 52 20 68 11 11 -55 40 69 98 7 0 2 25 -12 -37 36
7758C6l9ml0J00p2J01j09K9M3q3R7omlm3l7R9n4N8Qj15j3o3Q4M9k4J7J3r6O0L2
$$ 36 -3 -7 -37 63 -9 92 -17 12 55 -28 69 63 59 56 13 -24 75 21 79 87 -28 -41 -104 -20 29 5 22 35 -61 -1 31
7789C1J3l7O0m9j6j1j0K3L7m6j11J64r5K4K4j5J4J5m2n3R1J8k1K6Nn9oK6L2o9
$$ 31 44 7 67 18 2 -9 -19 4 41 -5 -116 48 -47 -23 1 -14 0 15 -27 -80 11 29 8 34 39 -20 -26 0 32 -37
7819c7J6L0n0M1P9q1L7o4O5mj02O3N2l4j7Nn0K0Q3l3L0k8j4RJ4k8K0m1k0Qk7O0
$$ -37 -21 9 -41 0 79 -2 35 -29 36 32 -70 -7 45 11 -6 -1 -51 -31 52 19 49 21 7 16 30 2 22 -19 -39 -31 -58 2
7851BL4o5J2k0O6j02J8O8M9k0N9q5pl9j0N9l8N7L5o6L8o8P2n4N8q0M1N7m8M3q0
$$ 2 36 -29 -17 -37 29 -73 -55 13 62 42 101 16 9 -30 -40 19 -19 38 73 7 45 -23 49 -5 53 -27 14 71 23 66 -14
7882a4K1o9J31K6j03K2L7p4K6JK5K7K6j32J31n9n4J1N3n1%R7q9QK4Lp2R0o2j3
$$ -14 7 -62 69 95 -8 14 51 -23 3 4 29 56 82 -50 81 22 -32 -21 32 -19 -19 78 -11 -3 21 24 -48 42 -20 -33
7912c3QpR6n8j6L1p5R3l7L5j7k1J4m2L0Qk1k9J8J2j0nM9pm4J5r9J88n1k2oJ3l
$$ -33 -25 -32 64 6 -10 21 -54 39 2 37 20 -1 13 -29 1 9 -12 -41 -23 -11 -21 -26 23 16 -28 -13 -112 76 25 3 -3 10 7
7945Gr7J06kn5N9L7k1j16K8O5M4l2n8o6M6L8N6m1Nn8P3n1%J6Q2j08p7P6K8J7%
$$ 7 -90 16 14 -41 18 55 34 -82 -54 11 55 23 -35 -101 -55 -17 39 -2 3 -55 18 -33 -33 -17 65 -43 -120 -44 -16 1 1
7976AL8j06Q4m9K2N8j0k2o3K1L8L2loo7M6L0o4P4Lo7kL2KqM4K3m2jm9M8rl5O1
$$ 1 39 -67 17 -32 -10 48 38 16 -47 -26 12 44 41 35 -32 14 44 -20 54 57 -10 -12 20 22 14 58 81 39 38 -11 37 28 -7 54
8010E4l1o0R0j20J21j4K0p0qk8K3M8K6K4q5jJ5jO4rr5N3k3L4l4J5M4o6l7M9M9
$$ 54 23 -37 53 -67 54 40 60 -10 -18 -46 -23 25 51 75 -10 -11 4 3 67 58 -37 16 -7 27 -7 8 52 -14 -51 -2 47
8041D7q5Q8j6K8j18P6j0QJ2L4o6j1J6M0k2j1J7J1p2J9J2JK2No3M3J1K6O3k8m5
$$ 47 -38 50 34 62 -56 20 10 18 30 64 -2 -13 3 43 21 10 27 38 -34 -15 -3 -2 20 25 -38 5 16 42 105 77 32
8072C2o8l2K8M2L6n3K3lq1K3M0L2m4L1j00Q0m2L3K3l4k3M6j5K7O1r2K2m7M3jm5
$$ 32 -36 -68 -40 2 38 -15 8 5 -76 -53 -13 19 -25 6 -94 -14 -56 -23 0 -34 -57 -11 -26 1 62 -30 -8 -55 -12 -13 -58
8103e8P0j3lj5K0M8p3O8j0K8j31R0n5P7j6j4Qo3LL2M4k1k9M5qOL8j0KRo9%J0J1
$$ -58 12 -1 -4 -19 1 49 -24 44 34 62 -69 21 -34 43 27 13 21 -42 -39 -7 37 16 -13 32 24 30 68 58 60 69 0 0 10 21
8137B1J6j3k9p8J05j3L1L8o5K5j01M0P8m1Nn5K8k7MM5K0k6m3j6R8r6K7N5j2j1
$$ 21 37 24 -5 -83 22 9 40 78 13 38 -63 -23 55 14 19 -36 -8 -35 -31 14 34 8 -35 -51 47 -49 -22 33 21 10
8167A0mk7L0J7oro8N3j6R1n5L1j1qj0oK8j9l9N1k6k4N4m3
$$ 10 6 -21 9 26 20 11 -57 -4 -20 71 16 47 36 28 18 12 40 21 -18 33 7 -17 37 -6
8191f
$$ Imaginary data points
##PAGE= N=2
##DATA TABLE= (X++(I..I)), XYDATA
0@%%%%%%%%%%%%%%%%%%%%%%%%kNoPqJ0j3J4j7K1k3K4k6L0l3L7m3M7n2N7o2P0p6
$$ 0 0 0 0 0 0 0 0 0 0 0 0 0 0 0 0 0 0 0 0 0 0 0 0 0 -2 3 -3 4 -4 6 -7 7 -10 11 -12 12 -14 16 -17 20 -23 24 -28 29 -33 37 -39
47c9Q2r0R8j03J09j17J19j13R4l9j00M92j926J3994J07279l6154j12525J941M1493
$$ -39 43 -47 51 -52 57 -60 59 -54 40 1 -99 393 -1533 12461 119740 83586 -28939 -26998 14495
66A4495m3513m0604Q4012Q5834o1425j06397J5256P1240p822l1783M6415M0706
$$ 14495 -29018 -69622 14390 100224 38799 -67598 -52342 18898 11076 -20707 25708 66414
78F6414o8837p8210M3046Q2988j0747n1068J8036L2837m2252m6174M5880O0745
$$ 66414 -2423 -80633 -37587 45401 34654 -16414 1622 34459 -7793 -53967 -8087 52658
90E2658l2364o0523K0685N1219j6550l8698K4108L3876l6788m4205L7868N6887
$$ 52658 20294 -40229 -19544 31675 15125 -23573 535 34411 -2377 -46582 -8714 48173
102D8173k4498n6588R377L9667j2006k4322L4261L7166m2507o3840J5679N9279
$$ 48173 23675 -32913 -23536 16131 4125 -20197 14064 51230 8723 -55117 -39438 19841
114A9841Q715k4017Q730J0565m2454l9824L8117O4381j400m3991j2065P020j7252
$$ 19841 28556 4539 13269 23834 -18620 -58444 -20327 44054 42654 -1337 -13402 -6382 -23634
127b3634o317M5889M0198l1290n6412n373K7136P035M153K8251R038m4252m0595
$$ -23634 -29951 15938 56136 24846 -31566 -36939 -9803 -2768 1385 29636 38674 -5578 -46173
140d6173J9966M0592L751j2580N716k777l1876j3332L6915L4239j6817l0220K446
$$ -46173 -26207 14385 18136 5556 11272 8495 -23381 -36713 202 34441 17624 -12596 -10150
153a0150J0570j1257k893K7648J4865k8904k7588J5447K4519o301j2540R974N814
$$ -10150 420 -10837 -13730 13918 28783 -121 -27709 -12262 12257 5956 -6584 3390 9204
166I204k0376j0253K5847K1626j8185k4454N982J3054o661k539J9842P386k6819
$$ 9204 -11172 -21425 4422 26048 7863 -16591 -10609 2445 -4216 -6755 13087 20473 -6346
179f346k0541J8350K4447m651j1972M818r23k0577n322K8920K2102j6031k3306
$$ -6346 -26887 -8537 15910 11259 -713 4105 3182 -17395 -22717 6203 28305 12274 -11032
192a1032J484O774o932K486K3389Q145k6222k2236J2188K0204n36m314P429j884
$$ -11032 -9548 -2774 -9706 -7220 16169 24314 -1908 -24144 -11956 8248 7712 3398 10827 8943
206H943k2144j0064K1517K1616o684j5332m75J518q701m62J8496J1099j4797j7511
$$ 8943 -13201 -23265 -1748 19868 13184 -2148 -2623 -1105 -9806 -10268 8228 19327 4530 -12981
220a2981L884J1628L67j627O954J349j3859r559R993J3079j822p630K13Q02n618
$$ -12981 -9097 2531 2898 1271 8225 9574 -4285 -13844 -3851 9228 7406 -224 -11 791 -4827
235d827r00R971N920q611r075L064O197m69p6M564j003r683l957Q312P207l213
$$ -4827 -5727 4244 10164 1553 -7522 -4458 1739 1270 1194 5758 4755 -4928 -8885 -573 6634 3421
251C421m379J385o53m792J425R014K643q485o149L302L460j268J574N005j798
$$ 3421 -958 427 -226 -5018 -3593 5421 8064 -421 -6570 -3268 192 -1076 498 5503 3705
266C705q832k454P193M494k879j708K362j965n552J018P909K010o006k943L218
$$ 3705 -5127 -7581 -388 4106 1227 -481 1881 -84 -5636 -4618 3291 5301 -705 -3648 -430
281d30L69l430J409N921k55o593j410N093J055m543m8N305J77n743o18N492R42
$$ -430 -61 -3491 -2082 3839 3584 -3009 -4419 674 1729 -2814 -2862 2443 2620 -3123 -3741 1751 2693
298B693n419n54N980P67o306j908N491J845m649o50N790O98p130k582O705M242
$$ 2693 -2726 -3280 2700 3467 -2839 -4747 744 2589 -2060 -2710 3080 3778 -3352 -5934 771 5013
314E013m298l184L274J200n058j511O816M325n264n923J825L915r28q41L527J291
$$ 5013 715 -2469 805 2005 -3053 -4564 2252 6577 1313 -4610 -2785 1130 202 -639 2888 4179
330D179n620m609M031O427K60l649j091k69k580n51N342M904k693o558k003K840
$$ 4179 -1441 -6050 -2019 4408 4668 1019 -72 -341 -2921 -3472 1870 6774 4081 -2477 -4480 -1640
346a640K480J655J957n87n471m702K625O433K925j914k748k928k754Q28O181N333
$$ -1640 840 2495 4452 3865 -1606 -6308 -3683 2750 5675 3761 1013 -1915 -4669 -3841 2340 7673
362G673k237o809l786J224L200L763L175j201o620n737J694O907M642l02l284
$$ 7673 5436 -1373 -5159 -3935 -735 3028 6203 5002 -1618 -7355 -5661 1246 5888 5586 2302
377B302m729m127R00O873O483j139o868n492m77L365N729M618j135p411o900N17
$$ 2302 -2427 -6554 -5654 1219 7702 6563 -305 -5797 -6274 -2909 2820 7438 6303 -1108 -8008 -7491
393g491O445O042J770k792o289n906M45P690P519K5o476o500k379K626O598O463
$$ -7491 -1046 4996 6766 3974 -2315 -8221 -7776 -86 7433 7458 982 -5518 -7897 -5271 1327 7790
409G790N7p643q136j006N852O941L457j714o804p277o94P580Q461J472n505p129
$$ 7790 7847 204 -7932 -8938 -3086 3855 7312 5598 -1206 -8483 -9177 -1597 6864 8336 2831 -4298
425d298m228J256O808Q151J563p230r119k455M732P274N293p2o746q942k220P239
$$ -4298 -8526 -7270 -462 7689 9252 2022 -7097 -9552 -4820 2454 7747 7675 929 -8013 -10233 -2994
441b994R369K909m453p052n707q95O486R898L703o846j0156l948L914P169O188
$$ -2994 6375 9284 4831 -2221 -7928 -8823 -2337 7561 11264 4418 -5738 -9686 -5772 1397 7585
456G585J545n784r907m478O077J0460M996l349p548p105k093N808J0247N460n072
$$ 7585 9130 3346 -6561 -11039 -4962 5498 10494 7145 -403 -7508 -9601 -3793 6454 11914 6842
471F842j0160o066J924P323P840K815n545j0094n594M223R689O779o20p203q961
$$ 6842 -3318 -9384 -7460 -137 7703 10518 4973 -5121 -10715 -6492 3197 9976 9356 2153 -6808
486f808l973N347J0651O233l468r005p202p75O143R313N125m701j0743o762K814
$$ -6808 -10781 -5434 5217 11450 7982 -1023 -8225 -9000 -2857 6456 11581 6880 -3863 -10625 -7811
501g811Q486P347J902n115r643o550L761J0823P213k140p837p180k626L789R479
$$ -7811 675 8022 9924 4809 -4834 -11384 -7623 3200 10413 8273 436 -6744 -9370 -5581 3898
516C898P334k884j1022p830J935P684O784K990k855r079q350J952J1052Q436j862
$$ 3898 11232 8348 -2674 -10504 -8569 -885 5899 8889 6034 -3045 -11395 -9443 1609 10045 8183
531H183p652o663l009K277Q524Q840p77j1053r502R04P965P085L203j804q063
$$ 8183 531 -6132 -9141 -6864 1660 10500 9723 -1330 -10832 -9928 -1963 5122 8325 6521 -1542
546a542r172l65J0279J0228M10p640p626l873J357P587R499J802q999j0890k264
$$ -1542 -10714 -11079 -800 9428 9838 2198 -5428 -9301 -7944 -357 9142 10944 1945 -8945 -11209
561a1209O651Q328M723p37o788r187k988P256J0547L849m992q224n439L0O094
$$ -11209 -4558 3770 8493 7756 968 -8219 -11207 -3951 6596 10445 5453 -2771 -8210 -8180 -2086
576b086Q506L754n355r510m862L513P870N840K2n658p348k989L944P708N134j609
$$ -2086 6420 10174 4819 -4691 -9553 -6040 1830 7670 7692 2034 -5314 -8303 -4359 3349 8483 6874
592F874p402o671o3O266O706J703l419n815m840K66O873P775M8p666o760M4L920
$$ 6874 -528 -7199 -7262 -996 5710 7413 3994 -1821 -6661 -6395 478 8253 8301 635 -6125 -6081 -2161
609b161M351M276J361o197r547j510R005Q264o05m757l517l765k886M600J0990
$$ -2161 2190 6466 7827 1630 -7917 -9427 -422 7842 7237 2480 -1037 -4802 -7688 -3088 7902
624G902M036r222j0308R5N464K923K823M709j881j1743p519P642J1874J276n706
$$ 7902 11938 2716 -7592 -7497 -2033 890 3713 8422 6541 -5202 -12721 -5079 6795 8071 2365
639B365k060j071n944j907J0453J0415n209j2663j952O176J036j575N675N492
$$ 2365 305 -766 -6710 -8617 1836 12251 7042 -5621 -7573 -1397 -361 -1936 3739 9231
653I231q030j2026K911J2446K146p412q53M522l951p469N263J1917j651j2640
$$ 9231 1201 -10825 -7914 4532 6678 -734 -1587 2935 -1016 -8485 -3222 8695 7044 -5596
667e596k169R173K015o535J386P789l157j1695R04J3118L393j0126m337O300O52
$$ -5596 -7765 1408 3423 -3112 -1726 6063 2906 -8789 -7885 5233 8626 -1500 -5837 463 1115
682A115o688K434J1418J70j3689n518R344O162m449r13O156k029j1834k160J2656
$$ 1115 -5573 -3139 8279 8449 -5240 -10758 -1414 4748 299 -614 5542 3513 -8321 -10481 2175
697B175P678o833o284L103K59o687Q71J1963M698j0362q347M325N011k896k38
$$ 2175 9853 3020 -3264 -161 98 -6589 -5718 6245 10943 581 -7766 -3441 1570 -1326 -1564
712a564P590J549j0543o524P289P584k881l641L771J239p268l750P325O440m103
$$ -1564 6026 7575 -2968 -9492 -2203 5381 2500 -1141 2630 3869 -3399 -7149 176 6616 2513
727B513n304K752K911m224k865N280M226m104m199L099L140l536l083L497L435
$$ 2513 -2791 -39 2872 -1352 -4217 1063 5289 1185 -3014 85 3225 -311 -3394 103 3538
742C538k513k491K528J455l683k185L640L184k004k150J391j02l085m7M541K076
$$ 3538 1025 -1466 1062 2517 -1166 -3351 289 3473 1469 -681 710 608 -2477 -2524 2017 4093
758D093l124k420J234K2k048J362M469J05m805j957K807P66k165J305M151r04
$$ 4093 969 -1451 -217 -195 -2243 -881 3588 3693 -1112 -3069 -262 504 -1661 -356 3795 2891
774B891n438j131M106J016k939P48M171j021n560p52M670Q66l314P57M496j201
$$ 2891 -2547 -3678 428 1444 -1495 -747 3424 2403 -3157 -3909 761 1627 -1687 -930 3566 2365
790B365o287q16N364J887l180K67L424k035o242J36O699K655l771j419J841k119
$$ 2365 -3922 -4738 626 2513 -667 -400 3024 989 -5253 -5117 1582 4237 466 -953 888 -1231
806a231m339K350P550J340n908l358J868L26j774K929N809j192p378k820M348
$$ -1231 -5570 -3220 4330 5670 -238 -3596 -1728 -1402 -3176 -247 5562 4370 -3008 -5828 -1480
821a480K917j044P53K450k486o006k09O177L305k983k443J030m73k416J348M951
$$ -1480 1437 393 1146 3596 1110 -4896 -5105 1072 4377 1394 -1049 -19 -492 -2908 -1560 3391
837C391O96m810k744K349K047m15K16J240j495l401O39M093J623k327j860k59
$$ 3391 4087 -723 -3467 -1118 929 514 730 1970 475 -2926 -2287 1806 3429 1102 -758 -1017
853a017o89K55L320K771k377m729j134K421J894J540K017r82n554l706L305N782
$$ -1017 -1706 -1451 1869 4640 2263 -2466 -3600 -1179 715 2255 4272 3290 -2264 -5970 -2665 3117
869C117J562j832j535k631l677O23O675N037k753n975k247L90P65L267N240L05
$$ 3117 4679 2847 1312 -1319 -4996 -4373 2302 7339 4586 -1389 -3636 -3246 -2481 786 6026 6331
885F331p052n835J969N367K161M49O51l001o343j409O798O123j705m664j698n29
$$ 6331 -721 -6556 -4587 780 2941 3390 4041 1040 -5303 -6712 86 6209 4504 -160 -1858 -2387
901b387j695K128O625K389o679o726J849N074J172l14J842j040o589l154O390
$$ -2387 -4082 -1954 4671 7060 381 -6345 -4496 578 1750 1436 3278 2238 -4351 -7505 -1115
916a115P531j502n978j828P74j306P73O375L699o036q209L72O218L026k93O63
$$ -1115 6416 4914 -1064 -2892 -2118 -3424 -2651 3724 7423 1387 -6822 -6450 -232 2794 2501 3164
932C164j249o125m012N390Q530R47n649m045q78n71J750O248M332m548q501k286
$$ 3164 1915 -4210 -8222 -2832 5698 6645 996 -3049 -3927 -4498 -2748 3500 7832 3284 -5217 -7503
948g503M729M586J805J016j647o153m974L365Q478L438l737m795k178j135J013
$$ -7503 -2774 1812 3617 4633 2986 -3167 -8141 -4776 3702 7140 3403 -1392 -3570 -4705 -3692
963c692N726N610k136q307m339L193M929K307J039m77m918n823J064P779N247
$$ -3692 2034 7644 5508 -2799 -7138 -3945 984 3291 4330 3853 -1065 -6888 -5824 1955 7202
978G202k319n159k948q51O97M387N356p9o845n811J272N283L913J034j384m416
$$ 7202 4883 -276 -3224 -4075 -3378 1009 6365 6286 -559 -6370 -5098 185 4098 5132 3748 -668
994f68m856j61N855O017J37m837m886j756J764M618M648K97n184n795j255M024
$$ -668 -5524 -5685 170 6187 6324 1487 -3399 -5155 -3391 1227 5875 6172 988 -4807 -6062 -2038
1010b038N418K662j678m818m619n20M401N613J940l157n409l469J053M819M868
$$ -2038 3380 6042 4364 -454 -5073 -5593 -1192 4421 6361 3204 -2205 -5674 -4621 198 5066
1025E066O97l949n443k287K385N064L805l67m388n207j213L417N341K555j737
$$ 5066 5763 1814 -3629 -5916 -3531 1533 5338 4971 583 -4624 -5837 -2420 2921 5476 3739
1040C739m721m102l07M054N239J615l277n095k630J329M254M127Q08l638n266
$$ 3739 -982 -5084 -5391 -1337 3902 5517 2240 -2855 -5485 -4156 98 4225 5033 1395 -3871
1055c871k079K673N111K960r80m020m235j058L283N037K400k233m738l279N06
$$ -3871 -5950 -3277 1834 4794 3814 -206 -4441 -5499 -2216 2821 5221 2988 -1750 -5029 -4523
1070d523L658M316J424k775m942k617J825M469L431j31l253m209j792K405M628
$$ -4523 -865 3451 4875 2100 -2842 -5459 -3634 835 4266 4135 882 -3327 -5119 -2714 1914
1085A914K809j278l927l424l98K787M068K256j774m502k953Q65L514L417Q46k216
$$ 1914 4723 3445 -482 -3906 -4304 -1517 2551 4807 3033 -1469 -4422 -3557 -43 3374 4220 2004
1101B004m029k335J445M145K875n29k867l172j324J638L984K722j140l954k913
$$ 2004 -2025 -4360 -2915 1230 4105 3576 709 -2463 -3787 -2149 1835 4557 3417 -537 -3450
1116c450L75K510K902J678j166l715k979Q30L745K710k2k179k616j671N91L219
$$ -3450 -3075 -565 2337 4015 2849 -866 -3845 -3015 730 3440 3418 1239 -1377 -3048 -2457 762
1132G62L154k49l466k929l2J871K371J673k80k765l064q5K857K850K33j547k074
$$ 762 3916 3667 201 -2728 -2760 -889 1482 3155 2875 110 -2954 -3039 -182 2668 2901 1354 -720
1149g20j669k25K298L195M26k733k691k89J279J550J542N16j848k969p32K251
$$ -720 -2389 -2614 -316 2879 3305 572 -2119 -2408 -1129 421 1963 2479 631 -2338 -3070 -819
1165h19K531L65j124j337j294p06J210K772J018j823k512n11J011J196R43P31
$$ -819 1712 2077 953 -384 -1678 -2384 -1174 1598 2616 793 -1719 -2230 -1219 -23 920 1651
1181A651q77k186j342J228K493P62j010j229o76m05L18J601J496o29k155j197
$$ 1651 774 -1412 -2754 -1526 967 1729 719 -510 -1186 -1591 -1273 328 1824 1195 -960 -2157
1197b157Q80J479N31j34j53p07j248j55J578J584l91j574o85L97L65Q5P21Q46
$$ -2157 -1277 202 733 599 446 -261 -1509 -1664 -86 1498 1107 -467 -1152 -755 -390 -305 416 1262
1215A262q94j613j36J478R77p51n54N13l7j194q2J681Q70j369j228R35J020j039
$$ 1262 368 -1245 -1381 97 1074 323 -231 282 245 -949 -1031 650 1520 151 -1077 -142 878 -161
1233a61p61J356J151j280j581J223J462j050j599J213J875j026k197Q19K046p11
$$ -161 -922 434 1585 305 -1276 -53 1409 359 -1240 -27 1848 822 -1375 -556 1490 779
1249G79j890J043K192j115k793N92K862j05k346K74K202p74k805O79L601l3l449
$$ 779 -1111 -68 2124 1009 -1784 -1192 1670 1565 -781 -507 1695 921 -1884 -1205 2396 2363 -1086
1266a086o62K839K57k632L36L387k50m085q09L950J434l033j227K683M20l493
$$ -1086 -1748 1091 1348 -1284 -948 2439 2189 -1896 -2705 1245 2679 -354 -1581 1102 1522 -1971
1282a971m05M387J592m225k716K963K276k410r92L212R42m393k592M034L818k285
$$ -1971 -2376 2011 3603 -622 -3338 -375 1901 -509 -1501 1711 2653 -1740 -4332 -298 3520 1235
1298A235l010J501J224k815j368M232L503l451m676J049L241m19j114K312J533
$$ 1235 -1775 -274 950 -1865 -3233 999 4502 1051 -3625 -2576 665 246 -868 1444 2977
1313B977l845l899K334M750K47k605l44M99k226j423L456M117j513m420j044J861
$$ 2977 -868 -4767 -2433 2317 2564 -41 -385 114 -2112 -3535 -79 4038 2525 -1895 -2939 -1078
1329a078O40O7K031J283k955l807Q50L675J503j135n77o32j885q27K644L339n41
$$ -1078 -438 -371 1660 2943 -12 -3819 -2969 706 2209 1074 497 -135 -2020 -2847 -203 3136 2595
1346B595l167j602N43Q11J148J891L16k701k947P93K756J639J7p48j829k355J25
$$ 2595 -572 -2174 -1631 -820 328 2219 2535 -166 -3113 -2320 436 2075 2092 1344 -485 -2840 -2715
1363b715L426K837q22k727j687n34M03K455L072o5l904l180P41K686J698J270
$$ -2715 711 3548 2726 -1 -1688 -2222 -1819 636 3708 3643 -261 -3441 -2700 -14 1684 2954
1379B954J6k627l974k66M241L599n35k396j844j603q40K687M687Q04m227l779
$$ 2954 2970 343 -3631 -3897 344 3943 3408 1012 -832 -2435 -3275 -588 4099 4903 676 -3103
1395c103R2J931J616K161J488k696m955j302L970L892M4j621j300k201j960K073
$$ -3103 -3011 -1080 536 2697 4185 1489 -3466 -4768 -798 3094 3138 1517 217 -1984 -3944 -1871
1411a871N032J655l633l913k37J463J290K058J978j892m914j798L299L923N84
$$ -1871 3161 4816 1183 -2730 -2967 -1504 -214 1844 3822 1930 -2984 -4782 -1483 2440 3024
1426C024j587j472k068j677J535M708K204l033m186j155J520J947K379J450j751
$$ 3024 1437 -35 -2103 -3780 -2245 2463 4667 1634 -2552 -3707 -2187 -240 2139 3589 1838
1441A838m541k320K486M311J761r53k354l037j670J917M667K510k005l887k552
$$ 1838 -2703 -5023 -2537 1774 3535 2582 228 -2809 -4479 -2562 2105 4615 2610 -1277 -3829
1456c829M5K389L776K079k062m503k460J429L188K766J149k078m404k458K233
$$ -3829 -3784 -1395 2381 4460 2398 -2105 -4565 -3136 52 2818 3967 1889 -2515 -4973 -2740
1471b740M353K108r28k174k871k058J550M769K907k331m179j546Q42J237K440
$$ -2740 1613 3721 2793 619 -2252 -4310 -2760 2009 4916 2585 -1594 -3140 -2298 -1061 1379
1486A379K740r06m931l194K539M199J178r80p52j904l111K70N328L546k677m527
$$ 1379 4119 3213 -1718 -4912 -2373 1826 3004 2024 1272 -632 -3743 -3473 1855 5401 2724 -1803
1502a803q97J208N05J465L555L26n321m412K491N191R70j535l22j077l832j080
$$ -1803 -2700 -1492 -987 478 4033 4359 -962 -5374 -2883 2308 3278 1743 1421 344 -3488 -4568
1518d568N325N198j968n509j490J651J05P58L959J908m957n938J379N474J779
$$ -4568 757 5955 3987 -1522 -3012 -1361 -1256 -498 3461 5369 412 -5526 -4147 1327 3106
1533C106j532j1j65l978k821M226O251m51n372k091J568j03j91L365L296l261
$$ 3106 1574 1563 1398 -2580 -5401 -1175 5076 4625 -747 -2838 -1270 -1373 -1564 1801 5097 1836
1549A836o094l53M711K372j352j35N16k799l359K318N557J063m205k636R90N18
$$ 1836 -4258 -4611 100 2472 1120 985 1501 -1298 -4657 -2339 3218 4281 76 -2560 -1570 -1052
1565a052n22K213L046j487n151j501L551K895n50p36J15j808k715J107M567J902
$$ -1052 -1574 639 3685 2198 -2953 -4454 -903 1992 1442 706 821 -987 -3702 -2595 1972 3874
1581C874k932k877j82O36L59J795K458j001l943j985K036K812P51k87m51k117
$$ 3874 942 -1935 -2117 -1481 -1122 673 3131 2130 -1813 -3798 -1762 1050 1801 1514 1063 -1054
1597a054k157P21L585K098j446k358j116k39N23K169K068n34k930j961P90J744
$$ -1054 -3211 -2490 1095 3193 1747 -611 -1727 -1966 -1443 726 2794 2260 -670 -2631 -1841 -97
1613i7J450P21m59k129j937N55K314J665j55j266j386j071L83J948J696m15j725
$$ -97 1353 2074 1615 -514 -2451 -1896 418 2083 1928 662 -724 -1795 -1412 536 2232 1817 92
1630I2j291j79Q08J381J214l14j919j443N53J318J020K09l33j290j309K25J858
$$ 92 -1199 -1378 -570 811 2025 1711 -208 -1651 -1098 220 1240 1449 1116 -174 -1483 -1258 600
1647F00J191n86j086o59k95M5J116J536k80j874j263P12J040L59L22K88r70j688
$$ 600 1791 1205 119 -540 -835 -790 326 1862 1582 -292 -1555 -843 197 556 878 1166 196 -1492
1665a492L5J792J136n79r31k56k52m86O19J593L02j625j125N57P35M2R1P06l49
$$ -1492 -1457 335 1471 892 -39 -295 -547 -1033 -414 1179 1481 -144 -1269 -712 23 65 156 862 513
1684E13j372n39J165J013k97o92n8J06n61j0R01O32o81q92J45N46k7k32L96K58
$$ 513 -859 -1398 -233 780 483 -209 -267 -161 -722 -732 169 801 120 -772 -627 -81 -108 -340 56 314
1704C14n93m90L46N04K3l65MK63j25l36R1M02p4l16J78J43j39k75J89K56J77j59
$$ 314 -279 -769 -423 81 104 -261 -257 6 -119 -455 -364 38 -36 -352 -174 -31 -170 -445 -256 0 177 18
1726A8p4p2k51K6L15M02q4l44k87m2J37L16M73Jo56m15P3M62L87K47j38n16n37
$$ 18 -56 -128 -379 -353 -38 364 280 -64 -351 -393 -256 60 533 534 -122 -537 -464 -2 385 632 494 -22 -559
1749e59J2O02P63O1m71o40l78J45O75P55J14o96r31k67O04Q67M87j82p44q74k69
$$ -559 -547 55 818 879 408 -232 -610 -465 210 965 1079 383 -548 -815 -211 656 1143 961 217 -657 -926
1770i26O79J130N37n65j111o92J24R30R62M24p47j219p89M11J298R48p4j027j140
$$ -926 -247 883 1420 855 -256 -948 -824 106 1068 1492 745 -474 -1263 -852 446 1394 1320 293 -847
1789h47m66O37J325R48k44j406j304j3J085J227N64n14j294j271OJ524J490J94
$$ -847 -1313 -676 649 1597 1353 -53 -1357 -1370 -285 942 1506 992 -302 -1573 -1567 -43 1447 1641
1807A641j203j466o27L58J390J443J24j509j803l97J316J552P16l78j232j588
$$ 1641 438 -1028 -1655 -1297 93 1536 1660 151 -1652 -2049 -733 819 1535 1157 -75 -1663
1823a663n06J313K202P54j361j768q73K40J217J621Q42j147k350j094J109K027
$$ -1663 -2169 -856 1346 2100 739 -1029 -1902 -1662 -445 1176 2018 871 -1479 -2573 -1464 563
1839E63J042j74j172j659j051Q01K519J663j020k322j313L87J139J485J232m63
$$ 563 1605 1431 259 -1400 -2451 -1650 869 2532 1512 -810 -2123 -1736 -597 888 2120 1657
1855A657k396k090O40K635J656m24j231j379j157N0K274K536k36k720k101K61
$$ 1657 -739 -2829 -2189 446 2102 1678 447 -932 -2089 -2039 235 2771 2535 -185 -2286 -2025
1871b025J545J353J161K18j917k868l32K769K606j51j538j506j013l15J719K769
$$ -2025 -480 873 2034 2252 335 -2533 -2865 -96 2510 2359 821 -685 -1698 -2013 -294 2475
1887B475Q81k492l020k34J682J618J051L98j279k918j361K247L284O62j655j888
$$ 2475 3356 864 -2156 -2390 -708 910 1961 2359 1080 -1838 -3199 -952 2332 2994 1339 -549
1903e49j052m82J081K799J711j766l407j169J564J885J208N16q99k655k073J399
$$ -549 -1601 -2083 -1002 1797 3508 1742 -1665 -2834 -1270 615 1823 2339 1440 -1215 -3288 -1889
1919a889L463J486j311k134j188n44P38K487K126j002l403j876J147K120J383
$$ -1889 1574 3060 1749 -385 -1573 -2117 -1379 1108 3234 2232 -1171 -3047 -1900 220 1603
1934A603N98o97k418k214P90L031K201q15k244j535p00P49K210K229m43k927k328
$$ 1603 2201 1504 -914 -3128 -2338 693 2894 2079 -165 -1700 -2400 -1651 559 2788 2345 -582 -2910
1951b910M40K111J743Q18o27k272k256J68K775K438o4j970j936r87N13K029K322
$$ -2910 -2470 -359 1384 2202 1575 -697 -2953 -2785 -10 2428 2364 394 -1542 -2529 -2016 13 2335
1968B335J74k430k366m47J548K075J340k84k169k295k32K133K295N84j042j989
$$ 2335 2509 79 -2287 -2734 -1186 889 2229 1945 -224 -2519 -2751 -618 1677 2261 1219 -770
1984g70j635J51K084K273K95j772k042p75O90J798J896R1j980k304k78J697J815
$$ -770 -2405 -2254 -170 2103 2398 626 -1416 -2191 -1501 297 2193 2284 304 -2000 -2278 -581 1234
2001A234P29l79j489j956m67J992K460K78j720j631o67K54J206J968Q24j765k698
$$ 1234 1963 1584 95 -1861 -2328 -336 2124 2402 682 -949 -1616 -1362 -156 1812 2636 871 -1827
2018a827l95J674J805O05l31j012j754j111J481K673Q64j518j935p09J74Q33J739
$$ -1827 -2222 -548 1257 1862 1531 519 -1235 -2346 -865 1808 2672 1154 -781 -1490 -1316 -483 1256
2035A256J358j036k648j379J315J950R06k39p07j414j391L88K388J662p61j916
$$ 1256 2614 1578 -1070 -2449 -1134 816 1722 1483 776 -638 -2029 -1641 747 2409 1648 -268
2051b68j065m3O93J141J274o1j767j756J37J767J218O4p21r96r20j38J222J589
$$ -268 -1333 -1376 -683 458 1732 1671 -96 -1852 -1715 52 1270 1334 613 -383 -1303 -1441 -219 1370
2069A370K45j435j503o7R25Q56M30O3p41j338n69J158J776K21j225j022j19J44
$$ 1370 1615 180 -1323 -1390 -465 391 821 884 143 -1195 -1764 -606 1170 1391 166 -856 -975 -831
2087h31K30J174R23q79j928n91J339J311M4m05k33p25j159L99K096J142j316j643
$$ -831 -601 573 1496 617 -1311 -1902 -563 748 792 387 154 -571 -1730 -1331 765 1907 591 -1052
2105a052n5N36N6L57J412K40k008j657J095J842J78q05J50J60j394r65J722K093
$$ -1052 -1107 -571 -515 -158 1254 1494 -514 -2171 -1076 766 944 139 289 449 -945 -1910 -188 1905
2123A905o52j958j90J008j83o78J068J493j061k322K62K062L54j319L3J223o84
$$ 1905 1253 -705 -895 113 -70 -748 320 1813 752 -1570 -1308 754 1108 -211 -178 1045 361
2140C61j724N21K306Q0k054m87J495L90j441L5J775pk219l39J966Q65j619p06
$$ 361 -1363 -842 1464 1544 -510 -997 498 888 -553 -518 1257 1250 -969 -1308 658 1523 -96 -802
2158h02J376K93j436m28J922O93j807j112J441R41j193n88J276O83j738r02J459
$$ -802 574 867 -569 -997 925 1618 -189 -1301 140 1081 -112 -700 576 1259 -479 -1381 78
2175G8J298j119j139J051Q14j187r17J259J209j156j216Q36J002q08r74R91J134
$$ 78 1376 257 -882 169 983 -204 -1121 138 1347 191 -1025 -189 813 5 -969 22 1156
2192A156r08j219O00J096o42j006P76J127o71j330M08J104l58q08N60R20p27j224
$$ 1156 248 -971 -371 725 83 -923 -147 980 309 -1021 -613 491 133 -675 -115 805 78 -1146
2210a146L47J173%o91J64N05n30r01M91J184O6r25l94M03nl41N22P45k37j058
$$ -1146 -799 374 374 -317 -153 352 -178 -1079 -588 596 662 -263 -657 -254 -259 -600 -78 667 430 -628
2230f28m03P10L60J36O6q2n01m57K66O97M07l13l55m00j94K57P64L66m33o12j14
$$ -628 -1031 -321 39 175 241 159 -342 -799 -533 164 571 258 -97 -497 -691 -434 330 696 263 -349 -463
2251d63%L39N63M03m37r43l41O92O10O2l7j95n94o47N98J251L26p97p75j7M0R0
$$ -463 -463 -124 439 842 405 -538 -879 -187 423 485 448 253 -341 -988 -390 861 1187 390 -385 -402 -362 -272
2273b72P52R07m97j540o44R39R92K25q3j95p33j005K60J554R86p20j100n08oK57
$$ -272 480 1387 890 -650 -1294 -355 637 862 779 584 -149 -1154 -894 660 1646 926 -174 -682 -688 -431
2293d31P88J005n1j460j147M42R95P37J34j48r19j149q6J398J274j44j080p34
$$ -431 357 1362 1311 -149 -1296 -854 141 878 1012 864 -55 -1204 -1290 108 1382 1238 158 -576
2311e76k80J2Q91J201K00j327j340j0J028Q08L67j02q95j197k01J208J287K32
$$ -576 -856 -844 47 1248 1448 121 -1219 -1229 -201 607 974 872 -23 -1220 -1421 -213 1074 1306
2329A306r23j020o42J54R74J226K07j081j410l77Q02J251O51r3j047j370l18J097
$$ 1306 383 -637 -1279 -1125 -151 1075 1282 201 -1209 -1586 -784 467 1118 1025 -22 -1392 -1710 -613
2347f13J413N80o52j317r52L4J255J362L55r47j512o75M65J277J228J49j160j554
$$ -613 800 1380 728 -589 -1541 -1507 -252 1110 1465 518 -994 -1669 -1204 73 1301 1450 290 -1264
2365a264n12Q67J518P64k92j099j299l80J078J648O14p17j493r23J13J108J500
$$ -1264 -1776 -909 609 1373 1081 -18 -1317 -1697 -619 1029 1643 926 -567 -1490 -1377 -269 1231
2382A231M55r40j633p65O93J298J110J19j080j500p82R69J664R26n77j313j054
$$ 1231 1686 746 -887 -1652 -959 339 1449 1568 488 -1012 -1794 -825 839 1765 1188 -125 -1179
2399a179j68Q59J651Q53q17j782j005N02J355J061K27p51j554r23O34J666J173
$$ -1179 -1347 -488 1163 2016 1199 -583 -1588 -1086 269 1330 1557 806 -748 -1671 -1037 629 1802
2416A802l11j286j282l96P71J540J034m59j607j289L1J344J377L74o37j488j085
$$ 1802 1491 205 -1077 -1473 -702 838 1872 1413 -194 -1483 -1452 -108 1269 1643 1006 -482 -1567
2433a567K99J458J346J24j111j550o39N86J594J038p7j341j417l78R04J531Q75
$$ -1567 -1268 190 1536 1660 549 -1001 -1640 -1054 540 1578 1501 160 -1257 -1635 -731 800 1675
2450A675n38j512j167R4J160J330N65q67j458r94L83J393J215O3j033j363o21
$$ 1675 1137 -375 -1542 -1448 -288 1042 1607 740 -718 -1712 -1329 64 1279 1342 309 -1054 -1675
2467a675N97J326J185j86j343j391j56J004J361O18l45j427j212P5J341J288K24
$$ -1675 -1078 248 1433 1247 -96 -1487 -1643 -639 722 1340 995 -432 -1644 -1569 -228 1060 1284
2484A284p99j218p91K54J217J313J07j130j482l20P98J130Q01n0r92j380l01J024
$$ 1284 485 -733 -1524 -1270 -53 1260 1367 237 -1245 -1565 -767 363 1164 1114 122 -1258 -1559 -535
2502e35J448M56p01j062p73k9Q58J317N90r01j494n98O86J099P06J39p47j077
$$ -535 913 1369 668 -394 -1167 -1196 -338 979 1569 668 -826 -1424 -738 361 1067 1206 459 -618
2520f18q59O63J532Q49o34j133o10r4M62J071Q60l57j430j013M39J150P07J2l32
$$ -618 -1477 -814 718 1567 933 -200 -810 -904 -442 629 1489 1132 -298 -1311 -872 278 985 997 665
2539F65q92q25J11J178J194j70j156q69q5M90P14P68Oj038j092LR50R56J97m88
$$ 665 -227 -1052 -941 237 1431 1261 105 -764 -849 -359 355 1123 1129 91 -1001 -998 -48 908 1105 617
2559F17p48o77r2Q27J002K39q07r75k44M08O41P00J9o56r82k48N75Q33M49l47
$$ 617 -131 -808 -900 -73 929 1168 361 -614 -858 -450 191 891 910 254 -728 -976 -401 432 881 534
2579E34o74n45j72O25P69K55l25p70o31K00O76O45O6n28o77k65K84N38N42K3o21
$$ 534 -140 -685 -857 -232 537 792 467 -303 -934 -734 -58 587 653 125 -552 -817 -533 5 547 570 -51
2600e1p19r5N73N99R6j23l58n45j81M70P38K18o00n63K8J58J26L37L23j97p43
$$ -51 -770 -865 -292 307 403 280 -78 -623 -804 -334 404 622 22 -541 -513 -355 -229 108 431 234 -509
2621e09l49N80N57kk39q3q1l87L9O26M66m24n41l3K27J08q9M05R7m60m81K91O26
$$ -509 -858 -278 279 277 38 -45 -126 -513 -474 152 618 194 -347 -380 -153 -45 -134 271 368 -92 -573 -282 344
2644C44o0k99q7L02k65k55K88N16j94n23P8L84k3l23M4L98n4m24l0M93J01m70
$$ 344 284 -15 -102 200 -65 -320 -32 484 290 -233 -155 229 206 -117 -73 325 271 -153 -183 310 411 -59
2666e9j09M25J99m71j72M09K23n02j14N14J64m19l76L22M11j79m49L21L26m13
$$ -59 -168 257 456 -15 -187 222 445 -57 -171 343 507 88 -288 34 445 266 -183 138 464 51
2686E1m60M55N83k40p13O1M54l2l67L71L76l39p77M5Q80K87n58k94K78q2m82J45
$$ 51 -409 46 629 389 -324 -263 191 159 -208 163 539 200 -577 -532 348 635 77 -217 61 -21 -503 -358
2708c58R14K80r83o39M17M78q3o9M26M9j002m82O86J110j83p67j53J66l06k13
$$ -358 556 836 -147 -786 -369 109 26 -43 383 432 -570 -1052 -366 744 561 -206 -359 -193 -499 -712
2728g12Q95R39p27j231j81Q61L77k54K98L28p90j067K63J487N68r01o46K06q4
$$ -712 183 1122 395 -836 -1017 -156 221 -33 265 593 -197 -1264 -1001 486 1054 153 -493 -287 -371
2747c71l92N86J125L1j533p27P51Q98q8j27L33l47j149j66J303J103n58j126j93
$$ -371 -763 -177 948 979 -554 -1281 -530 368 280 153 486 139 -1010 -1176 127 1230 672 -454 -647
2766f47L22j94L13J017M51j293j328L18J388M20l16Pk47r79o19J209J615m8j434
$$ -647 -325 -519 -206 811 1262 -31 -1359 -1041 347 767 451 458 211 -768 -1387 -178 1437 1389 -45
2785d5q19K54K69K71R64O41r13j747l75J360J110mk52l74q94q51P32J817O61j081
$$ -45 -864 -610 -341 -70 894 1535 622 -1125 -1500 -140 970 966 714 340 -554 -1405 -673 1144 1805 724
2805G24j389l20M10M75Q78P11m87j627q79Q16J332N30k77o21p89o68K97J508R63
$$ 724 -665 -985 -575 -100 778 1489 1002 -625 -1504 -688 644 1174 897 276 -513 -1181 -884 624 1587
2824A587n60j398p70L21O73P99N66l23j303j107M40J360R39j65q46r52n87M83
$$ 1587 1027 -371 -1141 -820 -147 652 1218 895 -408 -1515 -1075 285 1224 1059 213 -739 -1326 -843
2842h43J144J074k62j342j153K7R59J135M93m14j251j056Q9J233J304K43r40j323
$$ -843 301 1375 1113 -229 -1382 -1355 -396 739 1232 818 -433 -1489 -1400 -167 1137 1380 440 -883
2860h83p74M71J327J150K8j099j377n09P47J463R04l16j300j184k59R70J445P47
$$ -883 -1657 -1186 141 1291 1319 220 -1157 -1666 -919 544 1448 1132 -168 -1352 -1611 -641 804 1551
2878A551n93j446r66L6J156J364L07q41j328q07N10J217J103j7j062j141m45O27
$$ 1551 958 -488 -1454 -1418 -262 1102 1409 568 -760 -1567 -1057 160 1263 1246 184 -957 -1402 -775
2896g75J330Q28l48j214j086K5R57J257L79o04j158q97K16J207J145N7r54j120
$$ -775 555 1383 1035 -179 -1265 -1240 -283 974 1353 749 -409 -1306 -1090 117 1262 1319 365 -755
2914g55n03N34J197R40r9j110j332k45J043J301N32n51j169r78k5J055J335M23
$$ -755 -1258 -724 473 1413 1314 204 -1128 -1373 -330 971 1503 952 -217 -1195 -1220 -165 1170 1593
2932A593p53j466p83M88J260R39O6p84j236p01N38J440R83l54j226r78j59P18
$$ 1593 840 -626 -1409 -921 339 1278 1344 560 -676 -1377 -839 601 1584 1230 4 -974 -1133 -415
2950d15J009P53k46j329j152J58J222J021O2n26q67p80L4J071J187N6j165j085
$$ -415 594 1347 1101 -228 -1380 -1222 0 1021 1083 557 -310 -1090 -1056 15 1202 1258 93 -992
2968i92j10N30Q03O45J29q79j374o6J018J147J53n90q05n62j35P28J222M51j074
$$ -992 -1102 -572 231 876 1005 126 -1248 -1314 -296 851 1004 414 -391 -953 -1088 -360 862 1313 239
2987B39j146k67O01O49O13K23n91j213n54Q71J183M02n30p24n29k81M36J269N79
$$ 239 -907 -1174 -573 76 689 912 321 -892 -1446 -575 608 1010 480 -244 -773 -1054 -618 651 1230
3006A230n90j379m31M59O96N84K72l05j152p41M72J335N74m36o52m39k68J31Q92
$$ 1230 640 -739 -1170 -711 -15 569 841 536 -616 -1357 -885 450 1024 588 -64 -503 -771 -640 252
3025B52P35k59r73o94K31P38N28J65k54n84o53N5Q28P52j54o02m68k36K29N28
$$ 252 987 728 -245 -939 -708 30 558 723 469 -115 -768 -713 115 867 713 111 -357 -593 -364 164
3045A64O39K0p18o58k1N56N05J80j56m97n26l0O09N85P5l87n11l57J95N26L76
$$ 164 803 823 105 -553 -574 -18 487 667 511 14 -512 -542 67 652 727 340 -171 -528 -333 193 569
3066E69Q6m20o20q4L24M91K60o8n10m05n7K73N53J05k26m04k16M1L29K94R2j81
$$ 569 655 235 -385 -469 -145 346 606 538 28 -377 -434 -161 392 497 271 -133 -349 -308 21 315 407 226
3088B26m67j06P1L67K72mm40r0p7N6K14J90P0l26l03k1K90K40m4j32r5j29o9J32
$$ 226 -241 -347 -276 91 363 359 -81 -171 -248 -192 22 212 282 -44 -347 -368 -78 162 118 -14 -109 -238 -307 -175
3112a75K13J93l03k55R5J86k3J4mM8l3k31R3J52J24k23o0Q5K6Nj61J63L3n0j9
$$ -175 38 231 -72 -327 -232 -46 -69 -55 -59 -11 -44 -275 -182 -30 94 -129 -189 -104 -78 -73 -234 -71 -38 -88 -107
3137a07J27j15J2l3NJ27J4j5j19m3J5R7J11Q1j00j98n6N9J84J51P2l22j77l5K17
$$ -107 20 -95 -83 -116 -111 16 30 15 -104 -147 -132 -35 76 157 57 -141 -197 -138 46 197 269 -53 -230 -265 -48
3162d8J87J82j08j61l68R3K29L64mk42k13j60J14J87L55J34l28m74j92L37M70
$$ -48 139 321 213 52 -316 -223 6 370 366 124 -89 -249 -135 52 407 541 213 -261 -453 -116 354
3183C54J68j11l19l27r7K19M73L25k38n25l34J02L82M11J45l37n36k59J40O08
$$ 354 522 411 92 -235 -332 -113 360 685 447 -78 -412 -310 72 483 628 291 -245 -504 -364 244
3203B44M21j09l86o40p6K89N68L07j73n04m30p6L23P23K73l03p55l82J80N75M96
$$ 244 665 556 170 -470 -546 -257 311 618 445 -59 -489 -565 -242 481 754 451 -304 -686 -506 69 565
3224E65N0l36o20n35L36P95M51j10o58n72j25K82P55M82j17q00p79N1Q20O89Q8
$$ 565 615 279 -341 -876 -540 255 706 596 -62 -634 -759 -477 278 760 643 -157 -936 -885 -65 624 712
3245G12m08o36n28m1P68Q80J68p40r26j96M27N99O03O8o62j025k11Q00R18L10
$$ 712 304 -332 -860 -901 -133 747 915 175 -751 -947 -520 79 682 750 88 -937 -1148 -348 570 880
3265H80m29o66o58q9O45R99L96o90j058m29L95P33P01J76m84j140n66O65J256
$$ 880 451 -215 -873 -962 -317 682 1078 388 -670 -1099 -704 29 730 906 422 -718 -1284 -619 637
3284F37M06m15p21n77l24L99J197O79n06j265o89N32P73N67L23k82j045r13K44
$$ 637 1043 628 -93 -670 -994 -595 602 1281 775 -490 -1179 -647 126 693 1016 734 -311 -1224 -980
3303i80J437Q88l71r74o13k38K74Q24J068K3j399j220K89J074P48J83k67p45r83
$$ -980 457 1345 974 0 -613 -851 -577 247 1315 1338 -61 -1281 -992 82 830 1013 746 1 -982
3322i82j99J141J318L0j025j012r4K95O35R52L02r59j448l22J053J063K95l07
$$ -982 -1181 -40 1278 1308 283 -729 -823 -528 107 1059 1361 402 -1046 -1368 -315 748 1043 736
3340G36p00r24l21Q05J382M16r00j187m32L62O28R07N56p40j508m71P22J322M17
$$ 736 36 -888 -1209 -404 978 1394 494 -693 -1125 -763 -135 772 1328 588 -920 -1391 -669 653 1070
3359A070l44o28q10o23N33J458Q21o94j399n75L40O24P90N63k82j373j106M97
$$ 1070 726 98 -712 -1335 -802 656 1477 783 -616 -1191 -851 -227 563 1126 844 -529 -1635 -1138
3377a138J440P69k58o98p12n99J74J179J157k32j318j018J56Q18O96M87j21r25
$$ -1138 302 1071 813 115 -597 -1196 -1022 157 1314 1082 -236 -1254 -1098 -280 416 903 782 -143
3395a43j077o2J171J106M1q02p83m88J55Q63J016K05j026j179j59O56R27N90j74
$$ -143 -1220 -1282 -111 995 1036 234 -549 -1037 -882 -19 997 1202 176 -1003 -1162 -506 421 1011 837
3414H37q86r65j45Q96J059L77o05q98o17P7Q10R74K64o97j121m25M80R78N72k8
$$ 837 -49 -1014 -1159 -263 796 1173 568 -330 -947 -870 -60 914 1178 481 -640 -1065 -585 393 965 937
3434I37o97q86m51N55J172N79l74j001o04k6N79Q51M96l63j002p06K36Q94O88
$$ 937 240 -646 -1097 -542 630 1209 835 -166 -770 -796 -217 634 1130 767 -235 -941 -705 189 877
3453H77O5n53p90m72K46Q26P98j4r29p48j32N35P74L70j34o74q88L9P19Q24J90
$$ 877 942 389 -401 -873 -627 199 997 983 54 -694 -826 -291 483 853 719 45 -843 -804 -85 739 929
3474I29n42p28m39J47O02Q05M2n69q59k94L90Q00N03k29n14o87k12N06P37L65
$$ 929 387 -341 -780 -633 -31 774 816 247 -612 -906 -516 284 787 558 44 -643 -855 -349 388 753
3494G53k52p31n31P0O03N85J68l14p30m22J85O15N22R4n51n42k74K58N30N54j00
$$ 753 501 -230 -761 -691 -88 497 665 351 -379 -801 -616 -1 521 615 64 -478 -752 -494 36 590 490
3515D90n79n77o2M57N74J69j72m44m55j17M12O88J97m56n01k06K35L14L21J87
$$ 490 -89 -666 -728 -271 303 472 300 -144 -599 -716 -304 384 581 125 -376 -582 -347 -33 288 475
3535D75k85n19l01L38N26J70k02k62j51j85J58N33K39k13n60j61K48K99M7N2P4
$$ 475 190 -329 -630 -292 234 404 202 -60 -211 -396 -238 295 534 321 -239 -400 -152 147 194 246 320
3556C20l74m42K05N70K40l34k81N2r0o2K56M42p0m92l12K60K64j9M4J23j46l75
$$ 320 -54 -496 -291 279 519 185 -96 -44 -134 -196 60 502 432 -60 -372 -112 152 133 177 300 154 -221
3578b21r9M52K84j64l00R4K9j92rL15K34l17l72J37K70q1j41J28K52k06l42K08
$$ -221 -320 132 416 252 -48 46 75 -117 -126 189 423 106 -266 -129 141 60 -81 47 299 93 -249 -41
3600d1K56j15k49J79K27j94l58J57L30l3k14pK67j24l11M1L84N6l05p0J08K5k86
$$ -41 215 100 -149 30 257 63 -295 -138 192 159 -55 -62 205 81 -230 -189 195 251 -54 -124 -16 9 -277
3623b77J74L78l9m10j96K74J43r0rJ61j08l93j5M08L22k03k09m7J9j80J12L53
$$ -277 -103 275 236 -174 -370 -96 47 -43 -52 109 1 -392 -407 1 323 120 -89 -136 -117 -297 -185 168
3645A68J55l50m35P2L22J54l9R0q1l83j70K96N35J5k95l12p7N2J32L79K34l31
$$ 168 323 -27 -462 -390 -68 86 47 137 56 -327 -497 -201 334 349 54 -258 -335 -283 -151 228 462 131
3667A31m52j10K33L55J40J2k13l57k84K92N69K58k49m39k42K5K61M08K63j85n85
$$ 131 -321 -431 -198 157 297 309 96 -261 -545 -253 316 574 325 -114 -356 -331 -70 338 601 416 -169
3688a69k98O8M75L71J51l10n38k55K28M72L79nm06m94j73K87N57K49q9n34m84
$$ -169 -467 -399 76 447 598 288 -250 -505 -277 195 574 569 163 -331 -504 -217 340 589 500 -34 -518
3709e18J7M47N12K77l90n53l14J5N91M79J24n11m69l38K90N94L89k6n24n69k01
$$ -518 -501 -54 458 735 345 -208 -522 -507 84 563 687 176 -293 -631 -341 253 642 616 92 -477 -678
3730f78M13O04M01k51p16m28J01M28N64K88k99p68m37K36O96M61P4n22o24l65
$$ -678 -265 339 740 489 -227 -655 -554 -126 438 726 427 -341 -778 -542 154 615 689 167 -457 -822
3750h22L14P14M95n4p95n32n5M39N59M83k43p43o06O2O63O61J98m50p52m06K02
$$ -822 -508 206 701 647 -148 -680 -735 -296 263 746 503 -240 -846 -784 -121 540 738 288 -464 -870 -668
3771f68P16N89P2o03o86l03L62P44N23j71o71p00j10O64P10K85l14p23o46J36
$$ -668 48 637 709 106 -580 -883 -521 223 746 575 -96 -796 -906 -242 468 753 439 -284 -930 -794
3791g94O62P56J93n58p31m16L26O79P04l2o62p87j75M60Q33L76k09o71p18m9O71
$$ -794 -132 624 817 259 -472 -888 -562 117 821 789 127 -660 -835 -375 458 834 625 -46 -764 -813 -142
3812a42P87L17n32o89n14J25O99O20K86o55q00l30L91P60N24j08n92o55l16M78
$$ -142 645 962 430 -259 -773 -648 51 671 957 302 -498 -828 -437 323 847 739 147 -508 -824 -346
3832c46P63N66l60p64n71Q4N29P24K91m19p95n35K35P89N97k8m79p42k92K80P35
$$ -346 417 983 623 -141 -712 -628 -99 625 916 497 -298 -833 -598 191 788 760 281 -461 -753 -473 262
3853B62O17j14p95o44k0M66O29M10k64p15o25J5P19P05J41n26o58l92K25O78N92
$$ 262 879 765 -30 -674 -694 -228 401 811 547 -168 -793 -778 -59 646 787 261 -397 -789 -564 114 706
3874G06P5p06o99k18L83P30M69j85o39o50l7M43Q30K81m45o95m38J20N67N23K81
$$ 706 781 75 -624 -842 -459 271 740 555 -84 -734 -771 -328 502 783 338 -357 -795 -675 -108 415 696
3895F96n06p45l04L34P20L81p7m41n44l09K60P94M30k36o87m56O3M08M64L81k20
$$ 696 190 -555 -859 -525 195 576 499 58 -486 -795 -535 259 689 453 -234 -690 -627 -219 245 626 406
3916D06o30o81L40P06M10Ll74n03k92P2P11M66m6o28n42O2L24M63K95k8n45n82
$$ 406 -224 -905 -565 141 551 554 180 -323 -615 -543 168 634 588 -40 -582 -520 -196 267 562 534 -11 -593
3938e93q3O38N31L9l52l36k88J5L99O10J59o32n55p7M18K78K93L2l23n99j36M37
$$ -593 -676 -38 493 532 180 -156 -444 -429 -30 580 739 107 -448 -525 -107 171 464 496 173 -426 -562 -125
3960a25N93Q9k61l39k08j11K09N90K04l40n74k20L22K78K14J25j63n17k43K34
$$ -125 468 557 296 -43 -251 -362 -153 437 641 301 -273 -493 -171 107 321 446 283 -234 -477 -243
3980b43N82K11l17l60j76O1R4L08L76j42n91k75K50L16J84o9L2l45l18J10L69
$$ -243 339 550 233 -127 -303 -242 -148 160 536 394 -197 -472 -222 94 278 209 241 -104 -422 -312 57
4001E7L70j71l56j55N6L8J39K94L2l62l59J66K29J96n3j1j69k77p5K38L73Pk93
$$ 57 427 256 -100 -255 -199 -161 -22 272 304 -58 -417 -251 -22 174 121 110 -59 -336 -411 -173 200 207 -86
4024h6j37Kk1J57J77R7k39k69LJ71J79K0j0m2j36j07J07K51N4j73p1o7L5M3P7
$$ -86 -223 -221 -242 -85 92 189 -50 -319 -316 -145 34 54 44 2 -134 -241 -134 117 171 -2 -73 -140 -105 -62 15
4049A5J36j31j49J0mJ65L8m2l9l7j04P1N3O8L7m9r0MP6m7J21k0Nm8o4JRP3k2J1
$$ 15 151 20 -129 -119 -123 42 80 38 -1 -38 -142 -71 -18 50 87 38 -52 -48 28 -19 102 82 87 39 -25 -24 -15 58 36 47
4079D7N6l8M4j79Q9J06J2o0o7M3Nq2L2J39oj59l2rR9K6N4O7j54j48k7J27K19L6
$$ 47 103 65 109 -70 19 125 137 77 10 53 58 -24 8 147 141 -18 -50 -59 40 66 120 187 33 -115 -142 -15 204 240
4107B40j37j38j04J06P6J13Q1k06j50p1J25K33rk9j23j31q2J02L21J38k64k48
$$ 240 103 -35 -139 -33 43 156 237 31 -119 -190 -65 168 159 130 7 -124 -206 -104 217 355 91 -157
4129a57q8K7J92J91M3j12l49r1J75L50M0m1j68k53q9M7M03J88j47l38j95P2K07
$$ -157 -245 -218 -26 165 208 96 -253 -344 -169 181 221 180 12 -241 -330 -283 120 308 161 -177 -372 -300 -93
4152i3J53Q6L0l18l54J19M17K13m3j59k34j95J5L78L78o7m00l46J0K47K69J85
$$ -93 60 146 176 -142 -496 -377 40 253 210 51 -183 -378 -363 15 393 326 -74 -420 -410 -163 106 291
4174B91o4k48m38l1M38M09rk96l02q8l3K98M33K19m25n60n5L33L33J17Qk26m82
$$ 291 227 -21 -459 -490 -52 357 348 52 -250 -338 -371 -73 360 579 154 -406 -461 -128 205 322 330 104 -378
4197c78k51M05O38K25l93l90j75q5K87M92K92l65o06k97L71N04J06M4k26m47l43
$$ -378 -629 -224 414 639 246 -144 -319 -404 -117 375 667 302 -304 -601 -230 274 380 424 198 -249 -592
4218e92K15Q07K82k84n65k38P4J36M15L93j08o85m48J94O10L50j15k13l67l80
$$ -592 -377 430 712 428 -137 -375 -301 -165 250 643 535 -150 -598 -404 206 556 441 228 -139 -519
4238e19Q5N72N97k67m79l41p8J84M74L46m6n92m75j0N49L82R7k30m45l36k1N57
$$ -519 -434 138 735 468 -11 -352 -430 -246 228 574 528 -64 -539 -549 0 382 479 249 -196 -532 -553 4
4260DN76m4m50n28j31K47M39L43M1m66n91j91N74M65K07j88m57l84j08N20N29
$$ 4 580 536 86 -442 -573 -326 113 456 497 31 -560 -751 -177 288 495 307 -150 -534 -642 -122 407
4281D07J97l94n41k72J40M67M79ll54n30k88L08N43L54j35m49m13o0K17O20K97
$$ 407 604 210 -331 -603 -463 4 483 480 126 -404 -692 -384 159 513 378 -71 -484 -544 -327 293 590
4302E90k54n59m53J20M64N23O4k81m75l45R2N83M80l2m51n17r2K32M89L39j5n72
$$ 590 336 -223 -676 -556 -92 431 495 214 -261 -606 -514 69 549 517 66 -451 -543 -311 178 517 502 -70
4324g0m40p2M38N22J58j58n54l52N2M38N14J26l96n17k59K70M96L36k2m28m26
$$ -70 -510 -582 -144 378 536 378 -176 -528 -476 -38 476 602 206 -311 -570 -300 196 532 510 82 -344
4345c44j69L04N16K75j30m77k98j42L56N08K20k83m73l47J02M88L73R5l31n15
$$ -344 -513 -209 307 582 452 -25 -323 -465 -109 399 619 336 -137 -484 -382 106 479 574 243 -272
4365b72k73K79M63K58j5l16m19j51K30M68K68j69m75k84K5K77L87K23k70m30l11
$$ -272 -545 -266 197 455 440 124 -295 -446 -216 252 520 351 -124 -408 -383 -106 281 504 234 -196 -507
4386e07R2M81K98N0k80m32j74J14M19L31m4l98l62j00L74L48J52q8m38k85K3L38
$$ -507 -415 66 364 414 134 -298 -472 -358 61 392 348 -50 -412 -512 -138 210 362 274 -164 -449 -426 -88
4408h8L47J45k63l42k52R9L53L43l3k31m02m7R0K93K90k8k50l78n5J69L68J94
$$ -88 259 404 141 -201 -453 -354 -1 342 309 78 -324 -371 -281 12 302 274 24 -354 -409 -240 128 322
4430C22j28l24k64L6K78L62O3k16l48j25K0K75L18j5q0l84n8J76J92K39j64j77
$$ 322 194 -130 -394 -358 -80 282 345 129 -219 -344 -324 -49 269 254 174 -210 -268 -92 100 339 175 -2
4452bk22j17K57K77J51j56k99j37N4J55K11J00j28k72j26Q0K26J78L4r0l03l5
$$ -2 -224 -341 -84 193 344 188 -111 -248 -194 -39 172 272 144 -128 -254 -174 52 230 264 174 -129 -164
4474a64k0L20K06j52j73j20n7J13K26J33j36k51m9M0J38J02M4j17j89l7K4K04
$$ -164 -184 136 342 190 17 -103 -160 -47 179 312 176 -75 -124 -84 54 156 200 83 -106 -143 -119 85
4496H5R2O3j33k13l4J7K68Jl8nj40j19K1J34J62j13j00l6k0Q6m5R5L0p6j05J6
$$ 85 177 240 107 -106 -140 -123 145 146 108 103 -37 -156 -135 -1 161 48 -52 -88 -108 -22 -67 28 58 -18 -123 -107
4522a07R8J29j22j5L5r7j2j5J47rq6k8J6l0L1n0J12P1j67q5J04L9NL5l3J9j17
$$ -107 -9 120 -2 -17 18 -79 -91 -106 41 32 -54 -82 -66 -96 -65 -115 -3 68 -99 -184 -80 -41 -36 -1 -34 -15 -132
4549a32M5pJ10l4Qj9j5n4j22J82Q9p6r0J8M8L6k4R8M9r1j40L2N4M9K4ko5l2p0
$$ -132 -87 -94 16 -18 -10 -29 -44 -98 -220 -38 51 -25 -115 -97 -49 -13 -37 61 110 19 -121 -89 -35 14 38 36 -29 -61 -131
4578a31M2K11m9n8kr0L9pP8J66q5k00m3O4P6J23N3j28q3j09N8J63J34o1j96j7
$$ -131 -89 122 73 15 13 -77 -38 -45 33 199 114 -86 -129 -65 11 134 187 59 -24 -133 -75 88 222 161 -35 -52
4604e2j5Q4N3R0J5j08j99l5J48K03M3k1k35p3l4J14K44N3j03k10p5JJ90J27j0
$$ -52 -67 17 70 160 175 67 -132 -167 -19 184 227 206 -29 -102 -136 -22 222 275 172 -38 -113 -112 78 205 195
4629A95p9k66j00K11K20L9k3k23j55m1J46K04J13q3k68p2o4K16J70J26j79k33
$$ 195 116 -150 -250 -39 181 220 197 -26 -181 -222 -76 128 241 158 -110 -182 -246 -30 140 266 87 -146
4651a46j73K9L41J37Lj74k65m1R5L10J47j08k48j75nK31J65J54k00k60j20N7K11
$$ -146 -319 -290 51 188 191 17 -248 -289 -194 116 263 155 -93 -268 -273 -42 123 277 77 -183 -303 -246 -35
4674c5K36M7k47j95k03J98K50K13m1j92k87j34K02L12J14p7k05k87J9K19L28R5
$$ -35 201 248 1 -194 -397 -199 51 264 223 31 -256 -390 -188 124 238 161 -44 -331 -312 -93 235 330
4696C30j90l15j79P4L25K31L4k69k52j30Q5L34K65m4k75l18l5K01L21J42l4l30
$$ 330 140 -175 -354 -280 45 276 310 41 -211 -341 -256 78 343 299 24 -294 -329 -128 193 335 301 -29
4718b9l13L7L15J85J45k13k70j63O3K70L42Lk44k87j79J85L12J97J9k99l18j00
$$ -29 -342 -305 10 195 340 127 -143 -306 -243 27 369 372 128 -159 -338 -153 159 356 375 76 -242 -342
4740c42L14L12J41j80l02j63o3K58L31J00k77l53j72J75L96P2J11k40l04k01J37
$$ -342 -28 284 425 245 -57 -220 -283 -25 306 406 129 -224 -396 -221 175 247 358 118 -186 -387 -250
4761b50M42K13j43k64k74m0J18L74K10q5m47k12M3M05K55m6k27k23j86J0L66L94
$$ -250 192 405 262 -2 -276 -316 -198 176 386 301 -146 -358 -315 90 345 299 72 -151 -337 -327 39 433
4783D33j11l98k58K2J73J02K83N7l44l70j7L87L24K8j62k33k36m9L11M06N1m00
$$ 433 322 -76 -334 -312 -139 -37 246 303 -41 -411 -428 -41 283 311 149 -84 -320 -369 -58 348 399 -1
4805al09o8J97K11K40L4l19k97j72L36L63N0j30k64j76o8K05M25J68l01l81m7
$$ -1 -310 -378 -181 30 270 304 -15 -312 -484 -148 215 265 135 -129 -305 -373 -168 257 425 124 -257 -304
4827c04J11K16J44J84k70l21j43J54M11J47o5k97j57n4L7M46J60j64l21j82N7
$$ -304 -193 23 167 351 81 -240 -383 -229 182 329 264 -33 -190 -244 -207 239 399 235 -86 -268 -211
4848b11K71J44J00p9l19j66QL68K17r4j83j70q4O7K48K53J7m25j87R1J51Q4J51
$$ -211 60 204 304 225 -94 -260 -252 116 333 239 56 -114 -198 -131 117 370 387 -38 -225 -134 17 101 252
4871B52k5k30k85K2L00K73Lk40j14j68P6J84J76P7k01l03qJ74J58P1K3k06k16
$$ 252 227 -3 -288 -266 34 307 310 70 -44 -212 -136 48 224 301 100 -203 -211 -37 121 192 215 9 -207
4894b07m1J76K17O1m4k53j16K0J94J24J10k03j89n5K4K45P4kj33j27p7M9K81P3
$$ -207 -248 -72 145 206 162 -91 -207 -187 7 131 241 38 -151 -206 -182 63 137 135 2 -125 -202 -153 128 201
4918B01j03j61j65K8R5K12L1p2j89j06N9J32J95k8j00j70n9J30O3J15N3j56j75
$$ 201 98 -63 -228 -200 -105 107 138 66 -123 -229 -170 -38 157 129 29 -141 -200 -70 -7 108 161 5 -170
4941a70j6R6J19J8L0j58p1%M7J85Ml4j45%LM8R7J62j42j90p8J18L0J26J4o1j06
$$ -170 -186 -90 29 47 77 -81 -152 -152 -105 80 84 50 -95 -95 -92 -44 53 215 73 -117 -195 -77 -47 79 93 32 -74
4968g4n9Q1J46J4k5j49j9J5L4L4R8Nj16j0l0N1Q9M9r9j6p4j6J42N5N8j31k9j8
$$ -74 -133 -52 94 108 83 -66 -85 -70 -36 -2 96 101 -15 -25 -55 -4 85 134 35 19 -55 -71 71 126 184 53 24 6
4996Fl4Q1K6J2k8m6n9R0k6LP3r6m5j9J32n9k4P7k3q3l0L7O4n2N3O0m1m2p1N5R1
$$ 6 -28 53 79 91 63 17 -42 48 22 25 98 2 -43 -62 70 11 -13 64 41 -42 -72 -35 29 -23 30 90 49 7 -64 -9 82
5027H2k6l5o0M3r1M3Q9L9k7p3MML1j1P4l1q1n4k3R9Nj8lo3J0k8K7J34j5m4p6J3
$$ 82 56 21 -39 4 -87 -44 45 84 57 -16 -12 -8 23 12 86 55 -26 -80 -103 -4 1 -17 -20 -83 -73 -101 -74 60 45 1 -75 -62
5059f2mL3N2K0J6j61o7J27N5JL7n8o2m6N0R3Q7q7j46o0R5N8P2L7k9j28n1P9O3
$$ -62 -66 -33 19 39 55 -106 -173 -46 9 10 47 -11 -73 -119 -69 24 111 24 -122 -182 -87 -29 43 80 51 -77 -128 -49 14
5088A4K7R7j31o6j06L1J92P7j7r2j24O7K3N4Q8l6m7j59J5J16J05m0k3j55l1L8
$$ 14 41 138 7 -59 -165 -134 58 135 118 26 -98 -31 -8 46 134 98 51 -108 -93 23 128 88 65 -90 -121 -83
5114h3Q1K08o3j05j08k5L5Q1J44J6k37o0K2J38Q4Rk2j84r8R6M8J95P9j70j62o1
$$ -83 -2 206 143 38 -70 -95 -60 21 165 181 -56 -116 -94 44 128 137 115 -69 -167 -71 -23 172 251 81 -81 -142
5140a42O2J36J05J25k08k06k9J12P0J32K9j85j87L2J44J58P2j09j20j35j4J10
$$ -142 -80 56 161 286 78 -128 -157 -45 25 157 186 1 -186 -154 -10 148 220 111 -9 -144 -158 -48
5162d8J91Q1r8k12j40J26J22J33L3j46j96o7N1K11P4K9j75j82k9J05J95J16j10
$$ -48 143 224 126 -86 -226 -100 22 155 188 42 -154 -221 -170 41 115 144 -31 -213 -242 -137 58 174 64
5185F4j90r9L8Q5K31O8p5k88j47J16J84J15N9j00k36q9J11J77J64k3k46p2p5J21
$$ 64 -126 -225 -187 -102 129 197 122 -166 -313 -197 -13 102 161 61 -175 -264 -153 24 188 165 -81 -153 -228 -107
5209a07J18J27Q0l14j32J2J95J89Q9j75j30j92N5J77K09n3j46n7j32J08J69J66
$$ -107 11 138 218 -96 -228 -216 -21 168 257 82 -48 -240 -185 -8 201 148 2 -55 -187 -79 90 256
5231B56j23j07k43%J75K13N2j27j29j33NJ45J74Nr7j86l6Q2J24J77j5j57j91j7
$$ 256 133 26 -217 -217 -42 171 223 96 -33 -166 -161 -16 158 163 66 -120 -156 -74 50 227 212 55 -136 -153
5255a53P8K13J00r4j20j72L2M9K24R7j50j30j29K7J03K55k3r9k02j38J17J82J56
$$ -153 -75 138 238 144 24 -148 -116 -67 157 254 104 -26 -155 -128 -25 230 207 108 -94 -232 -115 67 223
5278B23n6j11k36oQ9J97Q5lj61j21j15J45J88J34j85j64j12NJ99J48L5j62j15
$$ 223 167 56 -180 -186 -97 100 185 182 21 -100 -215 -70 118 252 67 -97 -209 -204 -5 143 178 16 -99
5301i9j25J02K28P9o7n1k20n4Q2J52J34o6j39j85L6J52Q4O7l6j85j10J4J85J50
$$ -99 -224 -122 106 185 118 67 -153 -207 -125 27 161 95 -44 -229 -193 -41 43 110 74 -111 -221 -207 -22 128
$$ [...]
8191G
##END NTUPLES=NMR FID
##END=
