##TITLE=1H_ADM0406
 CDCl3, 8 sc, 
 5.6.2019
##JCAMPDX= 6.0         $$ Bruker NMR JCAMP-DX V2.0
##DATA TYPE= NMR FID
##DATA CLASS= NTUPLES
##ORIGIN= UXNMR, Bruker Analytische Messtechnik GmbH
##OWNER= root
$$ XWIN-NMR		Version 3.5
$$ Wed Jun  5 14:03:27 2019 Russian Standard Time (UT+4h)  she@DPX200
##.OBSERVE FREQUENCY= 200.13155
##.OBSERVE NUCLEUS= ^1H
##.DELAY= (6, 6)
##.ACQUISITION MODE= SIMULTANEOUS
##.ACQUISITION SCHEME= undefined
##.AVERAGES= 8
##.DIGITISER RES= 18
##SPECTROMETER/DATA SYSTEM= spect
##.PULSE SEQUENCE= zg30
##.SOLVENT NAME= CDCl3
##.SHIFT REFERENCE= (INTERNAL, CDCl3, 0, 15.7039)
##AUDIT TRAIL= $$ (NUMBER, WHEN, WHO, WHERE, WHAT)
$$ ##TITLE= Audit trail, XWIN-NMR		Version 3.5
$$ ##JCAMPDX= 5.01
$$ ##ORIGIN= Bruker BioSpin GmbH
$$ ##OWNER= she
$$ F:/spectra/data/she/nmr/H-F/1/audita.txt
$$ ##AUDIT TRAIL=  $$ (NUMBER, WHEN, WHO, WHERE, WHAT)
(   1,<2019-06-05 14:02:16.42 +0400>,<she>,<DPX200>,
      <created by zg, POWCHK disabled, PULCHK disabled
       configuration hash MD5:
       00 E9 B6 7A A2 85 ED C7 34 08 36 98 17 FE 4E 26
       data hash MD5: 16K
       35 34 68 05 FE F5 B5 EE 6D CE BB F0 D3 18 FE F2>)
$$ ##END=
$$ 
$$ hash MD5
$$ 5B C0 29 24 63 DB 97 05 5F 42 A8 6C A8 C1 46 E9
##$RELAX= 
##$RELAX= 
##$RELAX= 
##$RELAX= 
##$RELAX= 
##$RELAX= 
$$ Bruker specific parameters
$$ --------------------------
##$DU= <F:/spectra>
##$EXPNO= 1
##$NAME= <H-F>
##$PROCNO= 1
##$TYPE= <nmr>
##$USER= <she>
##$AMP= (0..31)
100 100 100 100 100 100 100 100 100 100 100 100 100 100 100 100 100 100 
100 100 100 100 100 100 100 100 100 100 100 100 100 100 
##$AQSEQ= 0
##$AQ_mod= 1
##$AUNM= <au_zg>
##$AUTOPOS= <>
##$BF1= 200.13
##$BF2= 200.13
##$BF3= 200.13
##$BF4= 200.13
##$BF5= 200.13
##$BF6= 200.13
##$BF7= 200.13
##$BF8= 200.13
##$BYTORDA= 1
##$CFDGTYP= 0
##$CFRGTYP= 5
##$CHEMSTR= <none>
##$CNST= (0..31)
1 1 145 1 1 1 1 1 1 1 1 1 1 1 1 1 1 1 1 1 1 1 1 1 1 1 1 1 1 1 1 1 
##$CPDPRG= <>
##$CPDPRG1= <>
##$CPDPRG2= <>
##$CPDPRG3= <>
##$CPDPRG4= <mlev>
##$CPDPRG5= <mlev>
##$CPDPRG6= <mlev>
##$CPDPRG7= <mlev>
##$CPDPRG8= <mlev>
##$CPDPRGB= <>
##$CPDPRGT= <>
##$D= (0..31)
0 1.2 0 0 0 0 0 0 0 0 0 0.03 0 0 0 0 0 0 0 0 0 0 0 0 0 0 0 0 0 0 0 0 
##$DATE= 1559728935
##$DBL= (0..7)
120 120 120 120 120 120 120 120 
##$DBP= (0..7)
150 150 150 150 150 150 150 150 
##$DBP07= 0
##$DBPNAM0= <>
##$DBPNAM1= <>
##$DBPNAM2= <>
##$DBPNAM3= <>
##$DBPNAM4= <>
##$DBPNAM5= <>
##$DBPNAM6= <>
##$DBPNAM7= <>
##$DBPOAL= (0..7)
0.5 0.5 0.5 0.5 0.5 0.5 0.5 0.5 
##$DBPOFFS= (0..7)
0 0 0 0 0 0 0 0 
##$DE= 6
##$DECBNUC= <off>
##$DECIM= 24
##$DECNUC= <off>
##$DECSTAT= 4
##$DIGMOD= 1
##$DIGTYP= 9
##$DL= (0..7)
0 120 120 120 120 120 120 120 
##$DP= (0..7)
150 150 150 150 150 150 150 150 
##$DP07= 0
##$DPNAME0= <>
##$DPNAME1= <>
##$DPNAME2= <>
##$DPNAME3= <>
##$DPNAME4= <>
##$DPNAME5= <>
##$DPNAME6= <>
##$DPNAME7= <>
##$DPOAL= (0..7)
0.5 0.5 0.5 0.5 0.5 0.5 0.5 0.5 
##$DPOFFS= (0..7)
0 0 0 0 0 0 0 0 
##$DQDMODE= 0
##$DR= 18
##$DS= 0
##$DSLIST= <SSSSSSSSSSSSSSS>
##$DSPFIRM= 0
$$ [...]
##$SUBNAM2= <"">
##$SUBNAM3= <"">
##$SUBNAM4= <"">
##$SUBNAM5= <"">
##$SUBNAM6= <"">
##$SUBNAM7= <"">
##$SUBNAM8= <"">
##$SUBNAM9= <"">
##$SW= 24.9336996594482
##$SWIBOX= (0..15)
0 0 2 0 0 0 0 0 0 0 0 0 0 0 0 0 
##$SW_h= 4990.01996007984
##$TD= 16384
##$TD0= 1
##$TE= 0
##$TE2= 300
##$TE3= 300
##$TEG= 300
##$TL= (0..7)
0 120 120 120 120 120 120 120 
##$TP= (0..7)
150 150 150 150 150 150 150 150 
##$TP07= 0
##$TPNAME0= <>
##$TPNAME1= <>
##$TPNAME2= <>
##$TPNAME3= <>
##$TPNAME4= <>
##$TPNAME5= <>
##$TPNAME6= <>
##$TPNAME7= <>
##$TPOAL= (0..7)
0.5 0.5 0.5 0.5 0.5 0.5 0.5 0.5 
##$TPOFFS= (0..7)
0 0 0 0 0 0 0 0 
##$TUNHIN= 0
##$TUNHOUT= 0
##$TUNXOUT= 0
##$USERA1= <user>
##$USERA2= <user>
##$USERA3= <user>
##$USERA4= <user>
##$USERA5= <user>
##$V9= 5
##$VALIST= <valist>
##$VCLIST= <CCCCCCCCCCCCCCC>
##$VD= 0
##$VDLIST= <DDDDDDDDDDDDDDD>
##$VPLIST= <PPPPPPPPPPPPPPP>
##$VTLIST= <TTTTTTTTTTTTTTT>
##$WBST= 1024
##$WBSW= 4
##$XGAIN= (0..3)
0 0 0 0 
##$XL= 0
##$YL= 0
##$YMAX_a= 195757
##$YMIN_a= -119777
##$ZGOPTNS= <>
##$ZL1= 120
##$ZL2= 120
##$ZL3= 120
##$ZL4= 120
##$ABSF1= 10
##$ABSF2= 0
##$ABSG= 5
##$ABSL= 3
##$ALPHA= 0
##$AQORDER= 0
##$ASSFAC= 0
##$ASSFACI= 0
##$ASSFACX= 0
##$ASSWID= 0
##$AUNMP= <proc_1d>
##$AZFE= 0.1
##$AZFW= 0.1
##$BCFW= 1
##$BC_mod= 2
##$BYTORDP= 1
##$COROFFS= 0
##$CY= 11.3945322036743
##$DATMOD= 1
##$DC= 2
##$DFILT= <>
##$DTYPP= 0
##$F1P= 18.9103706918063
##$F2P= -1.10871071338519
##$FCOR= 0.5
##$FTSIZE= 0
##$FT_mod= 4
##$GAMMA= 1
##$GB= 0.15
##$INTBC= 1
##$INTSCL= 1
##$ISEN= 128
##$LB= 0.24
##$LEV0= 0
##$LPBIN= 0
##$MAXI= 10000
##$MC2= 0
##$MEAN= 0
##$ME_mod= 0
##$MI= 1.114404
##$NCOEF= 0
##$NC_proc= 0
##$NLEV= 6
##$NOISF1= 3.799351
##$NOISF2= 2.8
##$NSP= 1
##$NTH_PI= 0
##$NZP= 0
##$OFFSET= 15.70392
##$PC= 1
##$PHC0= -8657.59
##$PHC1= 14.80018
##$PH_mod= 1
##$PKNL= yes
##$PPARMOD= 0
##$PSCAL= 0
##$PSIGN= 0
##$REVERSE= no
##$SF= 200.130013532006
##$SI= 16384
##$SIGF1= 3
##$SIGF2= 2
##$SINO= 400
##$SIOLD= 16384
##$SREGLST= <1H.CDCl3>
##$SSB= 0
##$STSI= 0
##$STSR= 0
##$SW_p= 3612.71676300578
##$SYMM= 0
##$S_DEV= 0
##$TDeff= 0
##$TDoff= 0
##$TI= <>
##$TILT= no
##$TM1= 0
##$TM2= 0
##$TOPLEV= 0
##$USERP1= <user>
##$USERP2= <user>
##$USERP3= <user>
##$USERP4= <user>
##$USERP5= <user>
##$WDW= 1
##$XDIM= 8192
##$YMAX_p= 0
##$YMIN_p= 0
$$ End of Bruker specific parameters
$$ ---------------------------------
##NTUPLES= NMR FID
##VAR_NAME=  TIME,          FID/REAL,        FID/IMAG
##SYMBOL=    X,             R,               I
##VAR_TYPE=  INDEPENDENT,   DEPENDENT,       DEPENDENT
##VAR_FORM=  AFFN,          ASDF,            ASDF
##VAR_DIM=   8192,          8192,            8192
##UNITS=     SECONDS,       ARBITRARY UNITS, ARBITRARY UNITS
##FACTOR=    0.0002004,     1,               1
##FIRST=     0,             0,               0
##LAST=      1.6414764,     0,               0
##MIN=       0,             -119777,         0
##MAX=       1.6414764,     195757,          0
$$ Real data points
##PAGE= N=1
##DATA TABLE= (X++(R..R)), XYDATA
0 0 0 0 0 0 0 0 0 8 -8 8 -8 16 -16 24 -24 32 -40 48 -56 64 -72 88 -98 113 -131 152 -171 195 -222 250
30 250 -282 317 -356 398 -444 496 -551 612 -678 752 -832 923 -1021 1131 -1253 1390 -1543
47 -1543 1719 -1923 2156 -2432 2764 -3171 3684 -4352 5266 -6595 8722 -12657 22424 -96598
61 -96598 -90669 139668 60593 -34002 -2381 22252 -100631 -95674 72521 130916 -27845 -105275
73 -105275 -23142 22264 -20676 24775 95251 16509 -114792 -65452 65280 60915 -19471 -233
85 -233 38743 -16816 -54827 27687 78452 -3120 -64421 1238 53329 8747 -14161 29606 17812
98 17812 -49320 -28755 60734 51396 -41981 -53338 13626 23001 -7532 18539 39220 -32594 -89016
111 -89016 -19613 64541 38463 -17993 -14900 -18055 -55203 -25925 65194 67606 -33209 -78910
123 -78910 -24898 15546 12451 30423 40967 -20219 -78752 -35247 46289 55807 17149 -3959
135 -3959 -22424 -43321 -12772 53287 58652 -3894 -38798 -17518 3232 13078 38087 42017 -9442
148 -9442 -50917 -18734 32118 30659 6472 3961 -3211 -26415 -15541 30520 36580 -11575 -36474
161 -36474 -9744 10030 1724 4092 12915 -9121 -34627 -12957 23029 13665 -16437 -16132 -5159
174 -5159 -12829 -8064 21018 19674 -24156 -39931 -2293 23758 8875 -1048 4788 -9326 -26995
187 -26995 -1732 35764 23841 -13618 -17329 -713 253 6733 31669 28276 -15565 -33357 2060
200 2060 30627 19304 7359 9913 -3669 -22209 -3092 32325 26127 -8943 -17819 -3369 -918
213 -918 -715 16289 20352 -9560 -30939 -10460 15227 9445 -4899 -3998 -5518 -16412 -11316 9267
227 9267 10231 -10709 -18555 -7444 -3072 -5353 2268 6594 -9089 -20938 -5640 11390 3517 -9188
241 -9188 -4127 1661 -4109 -1979 11762 10815 -6401 -9723 4743 9872 3349 5175 10011 770 -7801
256 -7801 3819 17093 9348 -3826 -1706 4736 3088 3900 10370 6942 -4952 -5648 3519 4215 -888
271 -888 2223 4623 -5770 -12653 -1095 9148 -334 -11220 -5623 706 -5445 -8592 -68 2004
285 2004 -8311 -11062 -1681 91 -7568 -6136 2332 -1286 -10784 -5432 5779 1667 -7572 -1670 7922
300 7922 1683 -7057 84 8807 3249 -2087 4792 7551 -1476 -2442 9773 12222 -394 -3625 6993
315 6993 8696 -503 1217 11685 8003 -5582 -4694 7762 8741 -461 -2280 736 -2893 -4671 3824
330 3824 7782 -3224 -11614 -4576 1943 -3162 -5266 1711 386 -12327 -13777 1633 8737 -3357
344 -3357 -13347 -8245 -1984 -2883 -1107 4228 450 -10112 -9946 1665 8026 3935 -1070 -3076 -4565
359 -4565 -2157 6408 11816 6243 -3173 -5470 20 7807 12715 9312 -1332 -7346 -764 9460 11073
374 11073 6528 2751 -1962 -6777 -2069 10905 14213 1299 -10930 -8948 120 5736 7134 3038
388 3038 -7885 -15714 -8367 5753 8061 -1280 -8212 -9888 -10832 -6099 6521 10954 -4006 -19922
402 -19922 -15111 1975 9306 4302 -2383 -7768 -11654 -6943 6639 14055 5410 -8237 -11527 -3113
416 -3113 8039 14189 10486 -1410 -10120 -6221 6259 15178 13944 3712 -8195 -9798 3070 17217
430 17217 15696 1740 -7653 -6412 -743 6279 13336 11115 -4758 -17537 -9970 8279 14463 4797
444 4797 -7354 -13620 -12212 -2054 10338 10265 -4558 -17008 -14285 -3201 5189 8294 3249 -10529
458 -10529 -20229 -10867 8901 14893 2477 -11026 -13481 -7490 2815 12834 12543 -1435 -14509
471 -14509 -11008 4254 15105 13950 4149 -7443 -11044 -793 14566 18530 7458 -6114 -10430
484 -10430 -3511 9765 18911 12794 -4310 -14211 -6849 6934 13110 9892 1117 -9972 -14560 -4374
498 -4374 11962 14740 114 -14912 -16199 -6216 5596 10765 3672 -10878 -18321 -10563 2564 8474
512 8474 4877 -4402 -14755 -16485 -3230 12851 12124 -4119 -15525 -11748 -1418 7189 11559 6586
526 6586 -7467 -15094 -4541 12105 15784 6405 -3288 -7901 -6406 4030 16736 15945 -81 -12176
540 -12176 -7549 5577 13653 13109 4511 -8095 -12769 -1703 13302 14553 3003 -7451 -10476 -7109
554 -7109 2390 12429 9980 -6357 -18466 -12395 2918 10624 6634 -3508 -13172 -15344 -5604 7721
568 7721 9984 -305 -11300 -13617 -7396 3058 10673 7382 -5877 -15103 -9459 4535 12575 8992
582 8992 -1030 -8657 -7573 1678 10790 11579 4328 -4292 -7447 -1561 9568 14587 7047 -4061 -6426
597 -6426 -451 6163 10107 9467 574 -9638 -6621 7705 13224 3579 -4878 -4113 -3752 -4475 3469 11915
613 11915 2731 -14788 -14432 1655 8023 1228 -2705 -4177 -11592 -13064 2384 14099 2570 -13868
627 -13868 -11750 -1878 -966 822 9170 5525 -12957 -17206 2098 14984 6232 -2638 -694 -3373
641 -3373 -8763 1967 18461 11771 -8398 -9096 5342 6742 883 7973 13640 -1823 -14682 464
655 464 18088 8907 -6013 -732 6278 -2730 -5649 8937 12258 -5865 -12532 3106 8994 -4250
669 -4250 -7021 4534 1968 -12132 -7102 9703 4777 -13907 -12066 3926 3240 -7027 -2950 3893
683 3893 -6030 -14296 -1150 11297 1607 -10070 -4685 1222 -4113 -2667 9871 8975 -7859 -12139
697 -12139 2163 9426 3667 2937 6221 -1363 -9209 832 14408 9200 -2740 -871 4071 -1856
711 -1856 -3232 9682 14221 -1329 -11374 -499 8681 1578 -2901 4389 4687 -6473 -8267 2840
725 2840 5733 -3089 -5326 623 -724 -7150 -4595 2573 7 -6514 -4332 281 -2970 -7244 -3223
740 -3223 1677 -509 -3678 -2347 -1576 -3447 -2167 1830 2158 -656 -1328 -303 -566 510 3922 4490
756 4490 1421 -138 1126 1356 1920 5559 6702 1539 -2021 1900 5291 2140 652 5228 5620 -2008
772 -2008 -4797 2567 6868 1477 -2317 844 1156 -3721 -3360 2816 3165 -2401 -3583 -1072 -3073 -5548
788 -5548 -1016 3144 -1925 -7373 -4057 -468 -3184 -3699 2058 2264 -5814 -8148 -822 2866 -618 -240
804 -240 3047 -958 -7133 -2281 7424 6406 -1039 -1624 1894 334 -383 5832 9032 2199 -3775 -223
820 -223 4411 3821 3981 5806 2110 -4229 -1651 6515 6535 -557 -1984 1566 385 -2790 645 4938
836 4938 766 -5966 -4229 1360 1062 -2308 -2587 -2512 -4274 -3228 1005 671 -4631 -6060 -2638 -1163
852 -1163 -1765 -196 173 -4368 -6972 -1537 4248 2467 -1657 -2289 -2429 -3231 948 7421 5826 -2523
868 -2523 -5252 -31 4134 4717 5762 4531 -1979 -5194 1071 8271 7518 3130 669 -2356 -4177 1654
884 1654 10206 7642 -3577 -7331 -1311 2465 1517 3165 4016 -3299 -10477 -4991 5516 5616 -2264
899 -2264 -5798 -4956 -5394 -3094 3896 4536 -5094 -11439 -5380 1974 1547 -608 -196 -3375 -8488 -4344
915 -4344 6207 7298 -1915 -6704 -3023 203 1670 5944 6813 -1601 -8256 -1692 8320 8212 2539
930 2539 756 -451 -3350 212 9549 10768 480 -6550 -2848 2891 4882 6342 5352 -2710 -9430
945 -9430 -3589 7437 7953 -102 -4509 -4372 -5204 -3114 4794 7626 -2074 -12042 -8849 912 4156 1629
961 1629 -932 -4979 -9744 -6827 3585 7770 345 -7535 -6997 -2906 488 4504 6276 -85 -8365
976 -8365 -6782 3238 8889 5880 572 -3052 -4296 -430 7471 10340 3588 -4200 -4183 1120 5471
991 5471 7687 6824 545 -6151 -4330 4714 9743 5411 -1861 -5371 -4312 35 5331 6342 423
1006 423 -7070 -7917 -1972 3753 4227 281 -5115 -8377 -6007 755 5249 2318 -5088 -9374 -6556 135
1022 135 4520 2933 -2437 -6619 -6137 -1272 3965 5461 1709 -4417 -6407 -1696 5125 7183 3484
1037 3484 -1746 -4146 -2203 3526 8335 6649 -219 -4300 -1442 3961 6290 5507 3009 -1475 -4506
1052 -4506 -1121 6139 8049 1799 -4458 -4471 -541 2666 3844 2524 -2090 -6456 -5265 519 4148
1067 4148 1832 -3158 -6060 -5508 -2369 1467 2466 -1051 -5899 -6953 -3012 1856 3140 -20 -4294
1082 -4294 -5680 -2739 1599 3432 1869 -1180 -3204 -2721 807 4815 5109 1111 -2721 -2027 1891 5100
1098 5100 5259 2797 -521 -1650 981 4659 5320 2838 188 -996 -572 1685 4681 4460 74 -3774
1114 -3774 -2403 1539 2841 1323 -692 -2644 -3778 -2251 1085 2026 -1087 -4317 -4413 -2612 -771 358
1130 358 -137 -2752 -5080 -3900 -522 1182 46 -2022 -3406 -3191 -792 2076 2269 -488 -2266 -1024
1146 -1024 843 1680 2291 2656 944 -1450 -425 3470 5076 2654 119 121 1518 2512 3185 3314 1751
1163 1751 -110 -12 1617 2432 2241 1363 -432 -1832 -972 1588 2057 -470 -2614 -2050 -894 -842 -826 -443
1181 -443 -1542 -3581 -3538 -1167 193 -1327 -2928 -2707 -2085 -2119 -1295 80 -354 -2458 -2893 -747 1409
1198 1409 833 -705 -719 129 276 636 1866 2362 989 -12 1078 2400 2496 2210 2303 1640 568 1316
1216 1316 3441 3398 939 27 1753 2437 787 352 1985 1815 -806 -1468 885 1538 -655 -1846 -616
1233 -616 -493 -1816 -1753 -471 -1146 -2802 -2223 -876 -1674 -3019 -1862 -615 -1899 -2983 -1325 -249 -1964
1250 -1964 -2449 -39 574 -1708 -1727 1118 1298 -1346 -513 2871 2153 -1452 -361 3875 3212 -638 178
1267 178 3937 2941 -479 1109 4488 2544 -924 1001 4042 1964 -741 1440 3211 -32 -1793
1282 -1793 1818 3337 -1078 -3554 375 2412 -1263 -3032 41 488 -3510 -3810 488 1210 -3118 -4403
1298 -4403 -1438 -641 -2580 -1582 551 -1466 -4817 -3001 1352 1206 -1477 -1463 -303 -1424 -1544 1672
1314 1672 3420 425 -2089 -591 1839 1902 2262 3233 1600 -1440 -527 3675 4789 1942 22 841
1330 841 1132 845 2141 3682 2065 -1297 -1870 683 2562 1789 31 -1344 -1942 -1422 158 1023 -156
1347 -156 -2520 -3710 -2453 -410 266 -970 -2641 -3416 -3206 -2079 221 1009 -1464 -4483 -4016 -404
1363 -404 1860 742 -941 -1770 -2287 -1758 1279 3921 2364 -1595 -2410 174 2484 3451 3644 2061 -1193
1380 -1193 -1993 1884 5741 4481 732 -818 -172 874 2801 4555 3159 -1179 -2979 -329 2626
1395 2626 2921 1651 -595 -3245 -3501 164 3224 1398 -2653 -4115 -3137 -1676 184 1642 -370 -4596
1411 -4596 -5512 -1990 1078 765 -718 -2168 -4055 -4074 -190 3533 1890 -2634 -3887 -1304 849 1993
1427 1993 2812 1688 -1545 -2763 537 4345 4356 1741 -308 -973 83 3174 5424 3703 -350 -2037
1443 -2037 148 2742 3899 3395 995 -2247 -2639 836 4000 3148 -215 -2723 -3392 -1814 1433 3326
1459 3326 671 -3917 -5077 -2515 345 1399 738 -2197 -5320 -4862 -610 2311 907 -1975 -3445
1474 -3445 -3756 -2454 1240 3614 790 -3862 -3761 109 2455 2244 1720 460 -1829 -1797 2299 5265
1490 5265 3192 -188 -840 319 1436 3424 4819 2351 -1960 -1893 2246 4198 2620 1158 258 -1689
1506 -1689 -2064 1580 4624 1958 -2880 -3441 -1011 187 569 1458 -32 -4310 -5308 -1050 2364 617
1522 617 -2380 -3181 -3427 -3217 -536 2428 536 -3925 -4341 -1229 549 604 1296 423 -3185 -3902 930
1539 930 4938 2395 -1494 -1152 531 473 1526 4422 3791 -892 -2711 1315 4618 3494 1510 1078
1555 1078 102 -1063 1265 4624 3514 -826 -2193 48 1307 1032 1349 1102 -1717 -3630 -1234 2024
1571 2024 1242 -1705 -2788 -2255 -2069 -1305 497 228 -2689 -4433 -2468 36 235 -807 -1765 -2405 -2411 -918
1589 -918 1127 1162 -544 -1851 -1755 -302 1715 2687 1180 -1122 -1263 942 2610 2529 1853 1123 36 -166
1607 -166 1725 3886 3284 790 -695 67 1576 2535 2406 1145 -557 -1101 48 1448 1621 479 -1157
1624 -1157 -2006 -1322 98 611 -325 -1843 -2524 -2172 -1227 -240 -364 -1717 -2901 -2521 -1007 -262 -579 -1279
1642 -1279 -1819 -1983 -1194 113 516 -300 -1205 -839 -206 435 1159 1369 398 -622 160 2067 2398 1352
1660 1352 660 1036 1273 1345 1896 2424 1694 421 351 1415 1968 1618 973 260 -154 217 991 872 -23 -624
1680 -624 -662 -723 -760 -281 -154 -1201 -2150 -1758 -839 -934 -1504 -1487 -1390 -1864 -1937 -1016 -493 -1240 -1941 -1311 -500 -581
1702 -581 -894 -407 35 -304 -507 195 923 589 186 600 1238 1191 988 1251 1396 1176 1318 1725 1695 1212 1050
1723 1050 1489 1720 1286 974 984 852 607 642 808 626 -15 -373 -349 -25 -118 -418 -958 -1277 -1178 -895 -825 -1013
1745 -1013 -1453 -1839 -1740 -1293 -849 -1014 -1495 -1789 -1529 -1110 -681 -432 -577 -1043 -1343 -641 397 772 229 -404
1765 -404 -206 406 1001 1461 1520 1003 375 532 1531 2305 2059 1250 538 706 1264 2051 2177 1258 148 -65
1785 -65 682 1406 1461 792 -259 -1075 -786 282 780 131 -1176 -1864 -1719 -867 -101 -82 -1234 -2533 -2583 -1331
1805 -1331 -134 -336 -1300 -2069 -2203 -1622 -456 409 142 -1267 -2158 -1206 559 1407 949 -172 -947 -593
1823 -593 835 2165 2267 1064 -166 -77 1011 2351 2776 1950 479 -314 604 2187 2887 1977 361
1840 361 -505 -257 973 2110 1877 108 -1574 -1426 61 1132 822 -351 -1738 -2487 -1814 -33 884
1857 884 -378 -2541 -3177 -1999 -552 100 -175 -1635 -3053 -2623 -546 1028 441 -1023 -1857 -1788 -846
1874 -846 970 2219 1047 -1505 -1940 342 2390 2393 1385 605 -254 -307 1354 3508 3208 609 -983
1891 -983 -5 1896 2583 2432 1517 -244 -1295 -30 2281 2762 763 -1360 -1648 -810 482 1357 725
1908 725 -1330 -2887 -2293 -376 739 183 -1361 -2838 -3121 -1508 528 758 -1178 -2899 -2840 -1390 168
1925 168 860 196 -1508 -2490 -1478 741 1915 1221 -405 -1460 -932 944 2656 2540 602 -907 -327
1942 -327 1360 2475 2713 1832 188 -771 335 2532 3278 1631 -481 -816 77 1186 1845 1635 26
1959 26 -1830 -1837 176 1639 854 -1024 -2144 -2116 -1247 43 573 -462 -2347 -3081 -1932 -190 476 -436
1977 -436 -1944 -2711 -2050 -312 730 245 -992 -1807 -1441 -234 1039 1447 464 -930 -1089 399 1973
1994 1973 2136 1120 24 -132 594 1831 2598 1974 550 -116 466 1568 2372 1940 636 -441 -367 755
2012 755 1753 1446 202 -898 -1085 -358 543 841 -118 -1526 -2040 -1333 -194 47 -698 -1639 -2163 -1880 -991
2031 -991 -251 -403 -1334 -2136 -1975 -829 182 129 -733 -1447 -1181 -228 415 662 468 -96 -630 -114 1179
2050 1179 1897 1221 287 197 790 1378 1784 1890 1291 393 337 1249 2020 1654 833 457 205 311 813 1224
2070 1224 758 -326 -770 -270 195 64 -258 -555 -1190 -1431 -873 -245 -599 -1447 -1564 -1204 -1127 -1236 -737 -734
2090 -734 -1483 -1855 -1027 -104 -432 -944 -868 -497 -472 -190 521 645 -292 -491 391 1129 934 849 1016 675 299
2111 299 893 1978 1779 745 487 1132 1237 1011 1363 1553 647 -128 441 1253 883 63 196 210 -413 -543
2131 -543 150 372 -750 -1310 -762 -430 -993 -1183 -783 -851 -1562 -1460 -676 -766 -1377 -1255 -695 -827 -1244 -757
2151 -757 -169 -515 -1016 -358 363 3 -365 173 763 360 72 719 1293 716 448 1036 1480 995 802 1308
2171 1308 1370 842 740 1271 1424 792 508 896 950 502 396 487 275 -64 -142 -38 -252 -332 -498 -587 -835 -923
2193 -923 -677 -878 -1195 -1210 -947 -1125 -1260 -1276 -1001 -1031 -1022 -882 -828 -954 -915 -497 -331 -337 -326 -196 -190 -31 396 724
2217 724 550 277 335 729 1069 1120 1174 909 696 819 1196 1441 1346 938 533 511 812 1217 1063 572 172 145
2239 145 66 164 543 355 -506 -1104 -634 -1 -363 -948 -988 -866 -1251 -1433 -701 -328 -1059 -1951 -1436 -528 -641
2260 -641 -972 -861 -814 -1125 -987 -54 257 -355 -762 -423 131 253 633 936 431 -217 189 1203 1709 1175
2280 1175 771 674 583 862 1610 1923 1180 261 160 852 1240 1304 942 271 -291 -226 393 889 483 -358 -1001
2301 -1001 -1069 -496 142 -4 -860 -1622 -1521 -1035 -520 -424 -706 -1344 -1877 -1497 -460 -26 -598 -1338 -1476 -941
2321 -941 -265 188 141 -373 -802 -614 216 927 1020 588 -215 -95 788 1604 1568 984 571 388 680 1382 1908
2342 1908 1526 483 -65 457 1211 1507 1094 406 -167 -423 150 922 776 -73 -991 -1082 -670 -53 246 -385
2362 -385 -1401 -1782 -1266 -464 -288 -638 -1191 -1628 -1617 -984 -128 -1 -920 -1590 -1324 -511 223 223 -122 -618 -759
2383 -759 -196 731 1122 933 71 -145 233 1085 1638 1458 707 203 431 1112 1642 1618 1002 280 29 692
2403 692 1411 1409 717 -99 -290 -47 477 749 341 -434 -1087 -940 -269 221 -135 -885 -1540 -1508 -802 -352 -445
2424 -445 -867 -1450 -1650 -1200 -532 -71 -433 -1105 -1446 -921 -67 404 170 -374 -719 -437 289 888 973 463
2444 463 -49 37 731 1375 1507 1016 533 288 787 1347 1631 1309 616 178 414 1070 1318 1007 331 -261
2464 -261 -172 268 594 475 -87 -764 -1022 -594 -25 27 -617 -1343 -1468 -1136 -600 -415 -614 -1226 -1585 -1344 -693
2485 -693 -312 -397 -758 -1206 -1084 -596 182 296 -171 -618 -447 130 678 782 696 230 2 378 1092 1445 1147
2506 1147 655 474 685 1052 1401 1434 891 231 307 800 1195 998 459 49 -155 80 435 436 -12 -551 -739
2527 -739 -727 -348 -120 -369 -1022 -1485 -1262 -649 -474 -773 -1091 -1262 -1227 -1087 -447 -244 -713 -1216 -1026 -379 -85
2548 -85 -64 -80 -183 -397 -240 400 907 681 168 117 597 877 1025 1076 924 602 489 927 1356 1239 833 507
2570 507 533 637 764 936 742 168 -204 35 402 351 -59 -351 -488 -608 -601 -357 -295 -734 -1172 -1245 -839 -505
2592 -505 -719 -1010 -1160 -973 -1002 -800 -476 -443 -853 -1062 -631 -158 -63 -294 -306 -158 -83 100 415 643 477 247
2614 247 371 856 947 953 841 766 739 929 1049 1102 973 818 676 627 598 806 778 386 37 108 345 189 -53
2637 -53 -218 -206 -493 -703 -546 -419 -579 -954 -931 -821 -824 -855 -850 -839 -1053 -1073 -837 -716 -804 -676 -542 -559 -671 -367
2661 -367 -33 -84 -237 -111 182 328 200 390 679 657 381 594 979 984 690 773 1031 963 717 749 1049 986 619
2684 619 481 670 610 453 365 286 195 -4 0 -1 -234 -323 -334 -436 -744 -709 -451 -556 -921 -1059 -820 -731 -948 -869
2708 -869 -673 -809 -1084 -1001 -436 -343 -587 -643 -400 -284 -336 28 350 213 -123 21 443 708 668 724 714 467
2730 467 566 985 1191 904 625 813 799 754 871 1107 826 290 200 657 714 338 126 153 -51 -400 -237 77
2752 77 -133 -689 -776 -600 -615 -696 -570 -723 -1101 -1221 -810 -523 -716 -928 -909 -844 -890 -563 -101 -171 -704 -806 -308
2775 -308 96 138 152 224 -11 -122 417 1008 994 642 302 497 747 1008 1192 1070 657 382 613 957 1219
2796 1219 1032 494 105 175 624 807 500 74 -257 -346 -252 122 150 -202 -872 -1128 -800 -399 -291 -604 -1006
2817 -1006 -1285 -1140 -582 -363 -522 -848 -1113 -1026 -619 -137 27 -435 -762 -567 -180 192 342 363 31 -271
2837 -271 140 768 1157 704 431 379 499 873 1193 1394 716 141 346 1017 1235 1000 640 250 -145 121
2857 121 858 1023 207 -645 -563 -177 -24 133 105 -530 -1326 -1251 -416 109 -370 -1045 -1290 -1260 -931 -354 -112
2878 -112 -611 -1314 -1311 -729 -203 56 -181 -670 -909 -423 325 646 333 -23 -122 -88 449 1071 1105 523 25 426
2900 426 1006 1124 1072 967 516 162 507 1263 1365 611 82 116 294 481 745 555 -150 -747 -447 136 213
2921 213 -71 -544 -864 -1033 -731 -128 -205 -765 -1378 -1225 -866 -449 -209 -453 -1067 -1300 -840 -208 82 -89
2941 -89 -513 -835 -658 1 629 537 -67 -231 83 464 684 1017 945 223 -22 651 1423 1269 629 473 573
2962 573 430 705 1217 1077 260 -247 186 672 600 353 55 -337 -573 -213 275 98 -599 -903 -743 -631
2982 -631 -472 -310 -469 -1016 -1358 -898 -299 -367 -715 -839 -948 -1004 -676 20 49 -539 -812 -450 -11 321 416
3003 416 259 -29 -147 273 855 995 624 482 355 430 822 1225 1071 499 271 539 912 924 813 611 296
3024 296 30 287 694 635 178 -361 -428 -158 109 -83 -364 -658 -940 -727 -491 -250 -505 -928 -1118 -978 -628
3045 -628 -406 -484 -835 -967 -900 -572 -184 -96 -317 -528 -543 -213 261 448 295 -4 -15 337 555 720 702 563
3067 563 408 395 687 1118 1098 631 352 466 803 852 783 562 388 173 277 407 485 253 -168 -298 -179 -35
3089 -35 -26 -253 -524 -767 -676 -561 -450 -475 -684 -981 -1015 -739 -466 -585 -699 -791 -769 -606 -388 -175 -238 -420 -382
3112 -382 -217 123 204 224 108 38 265 483 715 674 475 567 657 618 744 832 857 612 464 677 827 757 482
3135 482 388 445 322 292 270 145 133 -36 -123 -184 -169 -284 -527 -592 -510 -453 -567 -715 -753 -681 -665 -782 -709 -670 -667 -716
3161 -716 -574 -389 -420 -587 -440 -264 -101 -132 -143 35 114 132 222 423 480 376 290 474 725 739 744 650 627 697 703
3186 703 796 832 633 476 340 493 603 603 296 86 -19 -26 117 216 -66 -446 -611 -439 -236 -348 -425 -633 -865
3209 -865 -929 -717 -297 -412 -790 -1097 -779 -513 -391 -317 -358 -637 -809 -476 21 295 11 -295 -231 42 328
3230 328 534 577 336 64 252 632 996 1012 653 301 343 732 1050 1027 636 303 244 332 686 945 593 -73
3252 -73 -341 -64 344 397 78 -251 -613 -734 -481 55 -15 -670 -1144 -1027 -652 -392 -305 -508 -948 -1259 -898
3273 -898 -180 -11 -367 -752 -843 -615 -145 380 386 -222 -663 -291 425 799 640 351 102 3 343 1030 1309
3294 1309 746 101 92 622 999 1113 935 429 -39 25 615 1069 712 112 -258 -281 48 410 545 -132 -785
3315 -785 -928 -387 86 -10 -375 -873 -1215 -1026 -359 95 -345 -1066 -1250 -903 -404 -134 -50 -391 -891 -1024 -390
3336 -390 497 500 -137 -495 -443 24 624 887 638 136 -274 200 917 1209 1016 465 88 213 758 1332 1114
3357 1114 508 -86 82 509 914 915 553 -238 -643 -201 615 680 -37 -666 -916 -646 -187 194 48 -667 -1301
3378 -1301 -1158 -398 12 -177 -712 -1109 -1113 -813 23 201 -288 -933 -927 -466 144 463 263 -211 -636 -311 512
3399 512 970 700 80 -107 181 632 980 1118 740 53 -137 553 1269 1271 589 74 -7 308 716 964 632
3420 632 -67 -590 -325 357 628 376 -437 -854 -827 -239 191 7 -558 -1032 -1138 -735 -144 24 -421 -1083
3440 -1083 -1326 -687 -58 31 -246 -672 -942 -726 -163 529 432 -274 -681 -342 343 773 697 374 -24 -89 448
3461 448 1029 1198 712 250 46 406 873 1180 963 227 -128 179 682 877 589 87 -339 -318 52 445
3481 445 367 -114 -713 -711 -385 70 40 -424 -873 -996 -613 -282 -176 -349 -779 -1195 -1001 -298 165 -193 -757
3502 -757 -823 -498 -206 178 319 199 -421 -616 108 773 763 366 68 1 212 707 1112 897 339 127 412
3523 412 714 864 930 575 60 -23 466 839 526 101 43 -38 -173 110 361 61 -643 -686 -212 9 -334 -513
3545 -513 -499 -683 -896 -527 -33 -341 -953 -976 -506 -316 -467 -249 -210 -641 -854 -204 372 97 -304 -139 133
3566 133 -105 31 610 811 219 -86 408 797 633 521 655 651 307 368 808 905 476 341 383 407 382 317 413
3589 413 152 -86 -43 78 72 -98 -176 -272 -458 -406 -301 -332 -606 -713 -488 -489 -636 -626 -540 -590 -676 -551 -340 -413 -549
3614 -549 -487 -216 -161 -245 -160 -122 -15 82 150 307 165 215 252 459 561 472 447 454 416 587 656 707 484 423 388 543
3640 543 581 531 352 188 170 141 276 328 38 -239 -269 -150 -3 -75 -315 -495 -589 -611 -414 -256 -404 -780 -816
3663 -816 -609 -449 -323 -382 -497 -622 -667 -403 -61 -23 -179 -302 -315 -170 222 515 312 -46 -53 251 594 625
3685 625 683 523 285 201 573 969 948 417 168 224 503 634 768 549 39 -174 -14 459 548 261 -258 -558
3707 -558 -484 -65 152 -50 -516 -841 -757 -518 -121 -36 -482 -1052 -1118 -565 -52 -49 -465 -735 -829 -605 -57 313
3729 313 223 -400 -739 -420 264 589 514 61 -206 -172 368 923 977 472 0 33 417 913 1128 796 180 -114
3751 -114 216 782 1032 731 71 -298 -197 269 618 523 -79 -644 -786 -202 353 265 -388 -861 -990 -612 -141
3772 -141 42 -227 -840 -1237 -952 -230 343 -57 -711 -1069 -695 -199 287 359 -131 -677 -774 -37 595 883 251
3793 251 -351 -426 193 843 1100 776 212 -154 79 796 1232 1024 288 -254 46 641 1090 919 355 -293
3813 -293 -414 109 739 716 80 -592 -774 -382 214 480 36 -755 -1155 -841 -179 160 -105 -714 -1150 -1080 -478
3834 -478 199 168 -449 -1084 -983 -313 273 404 -16 -586 -776 -254 519 793 447 -32 -416 -84 616 1123
3854 1123 921 175 -222 90 657 1061 1074 563 -14 -263 324 1087 1099 407 -356 -366 62 470 597 374 -287
3875 -287 -891 -679 97 534 29 -700 -1006 -713 -346 74 45 -436 -1100 -1166 -551 134 185 -347 -829 -985 -552
3896 -552 91 424 157 -508 -677 -222 294 590 529 76 -308 -222 382 1045 932 389 -87 34 526 892 1085
3917 1085 626 32 -190 231 802 967 574 39 -308 -67 421 725 449 -275 -591 -460 -130 221 192 -323
3937 -323 -823 -952 -522 101 -16 -540 -865 -885 -625 -321 31 -62 -662 -997 -651 44 296 -23 -329 -464 -339
3958 -339 -5 495 624 190 -186 -131 399 720 741 532 202 -18 337 815 1053 646 172 101 320 443 756
3979 756 749 279 -295 -138 349 480 296 -100 -280 -389 -363 -36 262 -172 -743 -808 -486 -251 -151 -301 -521
4000 -521 -790 -786 -355 -45 -172 -581 -677 -624 -317 -12 150 3 -391 -351 1 371 329 205 118 46 222 487 756
4023 756 583 319 142 372 636 730 651 466 268 259 424 596 557 289 165 33 74 209 305 99 -228 -299 -138
4046 -138 -104 -155 -282 -225 -490 -644 -410 -243 -267 -575 -690 -443 -375 -419 -423 -293 -366 -526 -407 -130 -3 -200 -262
4069 -262 -29 144 91 75 125 298 188 225 353 541 436 356 399 560 560 441 391 419 553 479 384 313 356 233 149
4094 149 248 349 183 -101 -79 -15 48 -101 -262 -272 -414 -488 -191 -134 -318 -600 -567 -409 -417 -423 -228 -327 -713 -743 -251
4119 -251 61 -181 -501 -359 -221 -265 -16 311 281 -219 -326 156 560 475 377 266 105 162 451 803 675 238
4141 238 108 292 470 626 763 491 -134 -167 459 633 386 43 -42 -159 -438 -33 525 220 -705 -882 -315
4162 -315 73 -170 -188 -307 -830 -1022 -424 195 -5 -612 -793 -672 -543 -131 267 82 -688 -886 -183 464
4182 464 312 157 13 -238 -348 249 982 851 6 -304 131 524 737 836 658 -3 -308 254 1061 1012 414
4203 414 -54 -171 -79 461 879 511 -366 -644 -171 344 289 198 -139 -834 -995 -315 557 177 -603 -1062 -826
4224 -826 -410 -143 175 -84 -826 -1233 -692 94 463 -3 -503 -772 -533 106 616 524 -78 -516 -450 172 832
4245 832 923 434 -189 -281 271 777 1046 743 83 -260 5 735 1109 787 110 -371 -250 276 892 728 -20
4266 -20 -667 -643 78 352 393 -20 -618 -1039 -670 284 436 -205 -927 -1062 -694 -179 186 176 -583 -1159 -995
4287 -995 -58 408 229 -301 -722 -853 -258 641 864 80 -596 -468 25 525 873 771 -13 -535 -191 888
4307 888 1178 773 80 -62 -36 267 916 1135 438 -415 -367 273 724 599 280 -227 -744 -473 311 652 92
4328 92 -678 -818 -677 -284 243 359 -434 -1246 -1054 -227 224 -52 -311 -735 -980 -727 160 693 81 -793
4348 -793 -932 -271 332 542 484 -64 -589 -516 363 1070 850 204 -245 -164 269 945 1172 614 -195 -240 290
4369 290 806 975 673 11 -526 -235 548 923 481 -200 -612 -462 -50 378 430 -178 -839 -923 -268 178 137
4390 137 -193 -703 -1006 -784 -59 386 -146 -849 -910 -570 -146 145 258 -200 -788 -772 19 735 510 -48 -311
4411 -311 -244 -9 528 872 652 -110 -419 66 848 994 685 176 -151 30 525 939 767 296 -228 -342
4431 -342 146 686 753 208 -438 -576 -244 187 244 123 -442 -805 -748 -98 296 -24 -600 -838 -705 -307 -15
4452 -15 54 -275 -833 -831 -296 168 151 -177 -420 -546 -307 206 483 307 -127 -312 -38 393 645 590 336 -5
4474 -5 -17 324 744 842 389 47 81 356 623 629 480 186 -74 -107 161 450 416 -84 -469 -385 75 145 -59 -170
4498 -170 -376 -519 -497 -170 69 -166 -622 -741 -523 -279 -121 -197 -407 -555 -527 -301 4 28 -137 -318 -268 -134
4520 -134 212 369 189 -21 10 151 252 389 479 440 174 74 355 565 548 358 377 275 246 346 522 465
4542 465 183 -17 33 180 125 174 98 -77 -346 -261 -88 -20 -142 -326 -312 -457 -489 -235 -57 -384 -656 -657 -318
4565 -318 -263 -288 -233 -234 -399 -531 -269 136 143 -156 -308 -202 101 203 347 299 58 -4 67 422 555 530 295 88
4589 88 112 371 643 632 388 95 136 265 384 488 470 58 -298 -164 173 409 142 -170 -388 -391 -258 22
4611 22 188 -222 -589 -765 -477 -60 -27 -233 -525 -658 -545 -225 48 6 -338 -599 -555 -145 258 291 -21 -420
4633 -420 -405 64 394 451 275 28 -114 -45 385 755 684 251 -75 104 479 758 676 329 -26 -66 181 564
4655 564 630 329 -192 -377 -191 275 525 184 -393 -595 -455 -81 178 71 -307 -712 -809 -398 41 189 -329
4676 -329 -756 -749 -436 -48 164 -15 -398 -682 -515 -46 425 359 -136 -600 -326 244 645 531 152 -116 -213
4697 -213 17 621 1048 642 -171 -363 226 738 769 524 173 -185 -268 294 831 742 -47 -522 -306 122 394
4718 394 475 44 -516 -824 -411 226 343 -69 -642 -875 -715 -189 324 91 -535 -992 -768 -126 214 187 -246
4739 -246 -721 -886 -222 512 590 39 -576 -517 -192 397 860 637 -152 -584 -93 670 918 662 254 -237 -416
4760 -416 320 1184 1095 145 -492 -242 345 532 679 601 -203 -829 -483 649 921 39 -600 -656 -467 -99 263
4781 263 405 -259 -1186 -1100 -93 478 172 -403 -873 -993 -546 246 582 -12 -849 -1040 -350 380 591 419
4801 419 -230 -753 -536 380 992 710 -81 -449 -284 312 823 1084 514 -355 -548 283 963 1035 421 -204
4821 -204 -413 -154 579 993 731 -215 -726 -429 226 651 459 -178 -787 -856 -226 545 489 -289 -961 -881 -562
4842 -562 52 430 145 -710 -1266 -708 291 592 -52 -561 -768 -589 -126 587 670 -24 -876 -726 239 811
4862 811 690 210 -239 -505 -86 737 1133 632 -164 -390 -98 597 998 964 169 -488 -461 418 950 587 115
4883 115 -282 -515 -263 465 811 217 -777 -827 -276 133 149 50 -387 -877 -870 -161 484 132 -554 -871 -703 -272
4905 -272 173 388 -77 -775 -778 -187 356 419 152 -168 -507 -433 373 985 603 -150 -463 -7 453 765 798 419
4927 419 -234 -469 235 865 910 319 -172 -198 -78 494 749 509 -193 -554 -289 165 480 320 -167 -570 -700
4948 -700 -257 324 250 -269 -657 -530 -420 -129 179 86 -480 -787 -604 69 234 -135 -343 -443 -467 -136 183
4969 183 349 65 -297 -274 16 438 544 362 22 -133 145 548 678 455 225 52 53 387 745 697 143
4990 143 -180 -35 282 411 414 255 -69 -289 -242 187 327 63 -382 -445 -316 -133 53 18 -283 -535 -440 -259
5012 -259 -97 -163 -265 -437 -526 -351 -27 51 -122 -315 -296 -116 -161 40 191 87 -95 -128 101 284 372 277 243
5035 243 103 186 361 402 346 335 342 296 203 202 466 351 61 52 286 220 -18 53 321 92 -325 -219 170 167 -290
5060 -290 -312 -75 -174 -378 -251 62 -130 -651 -526 -143 -74 -192 -223 -276 -371 -482 -181 80 46 -197 -272 -195 -108
5083 -108 231 424 201 -66 -181 54 301 457 464 223 -11 10 343 525 567 323 59 -72 89 492 620
5104 620 274 -129 -243 -22 185 389 291 -124 -477 -526 13 392 99 -459 -538 -488 -415 -27 186 -58 -626 -924
5126 -924 -449 24 164 -127 -527 -699 -524 99 402 169 -287 -536 -449 38 552 611 49 -438 -316 270 605
5147 605 640 430 35 -328 -31 677 1075 548 -96 -337 42 441 749 680 91 -437 -463 212 672 555 24
5168 24 -502 -635 -291 349 537 2 -700 -782 -467 -11 287 80 -389 -951 -828 -156 365 232 -408 -801 -712
5189 -712 -256 347 469 72 -557 -719 -167 515 748 405 -266 -597 -216 575 1017 579 -62 -354 -206 386
5209 386 889 924 350 -453 -440 274 918 800 229 -354 -560 -163 404 771 392 -433 -871 -579 164 667 287
5230 287 -370 -934 -730 -180 358 315 -230 -800 -991 -442 272 547 2 -726 -921 -445 222 545 271 -366
5250 -366 -687 -547 123 761 737 15 -587 -472 172 865 854 332 -309 -465 -1 737 1010 653 -126 -520 -228
5271 -228 567 968 650 7 -516 -431 90 649 765 -28 -714 -846 -230 529 576 70 -773 -1001 -485 153 480
5292 480 132 -575 -972 -800 -50 482 331 -361 -900 -897 -180 564 562 -32 -625 -622 -198 447 720 487 -213 -667
5314 -667 -270 589 1033 657 -59 -345 -179 267 833 916 372 -405 -527 129 845 895 254 -275 -493 -184 434
5335 434 765 422 -302 -820 -559 119 610 371 -384 -927 -797 -154 394 283 -258 -741 -862 -450 165 475
5355 475 168 -700 -966 -395 243 429 244 -205 -653 -576 110 774 661 -25 -550 -380 155 606 786 491
5375 491 -182 -410 47 716 904 430 -93 -184 -111 288 740 732 -9 -591 -374 299 487 334 8 -341 -529
5396 -529 -324 218 569 -17 -712 -841 -336 32 166 -29 -380 -734 -614 -114 226 152 -280 -609 -566 -192 273
5417 273 343 14 -381 -334 -59 272 415 346 11 -269 -149 366 673 344 10 -39 134 192 427 593 398 -79
5439 -79 -279 189 520 436 183 -4 -153 -159 73 329 183 -127 -306 -217 -42 15 29 -116 -405 -566 -360 76
5461 76 -67 -305 -358 -243 -298 -332 -98 51 -208 -493 -358 -3 123 15 -73 -77 -44 -165 159 290 207 -1 -22
5484 -22 210 230 240 280 251 128 74 166 292 264 253 265 104 17 145 371 237 -9 -42 146 -11 -105 0 85 -105
5509 -105 -280 -328 -94 36 -196 -215 -208 -198 -310 -290 -76 -161 -298 -369 -231 -157 -93 -51 -68 -266 -294 -38 192 78
5533 78 79 46 -86 -61 167 366 324 92 -11 112 265 316 379 393 161 -38 101 449 480 195 42 4 85 134
5557 134 240 196 46 -191 -211 -27 107 76 -104 -246 -375 -266 -48 15 -252 -349 -321 -279 -229 -87 -33 -211 -462
5580 -462 -429 -63 83 8 -160 -296 -274 -61 149 207 86 -116 -223 -11 269 425 358 1 -184 22 374 441
5602 441 401 291 34 -123 50 498 660 142 -229 -136 190 227 202 257 -3 -387 -359 146 286 86 -304 -374
5624 -374 -356 -196 80 113 -281 -547 -460 -216 -61 36 -120 -307 -605 -377 158 319 -45 -359 -309 -144 -22 298
5646 298 328 -21 -363 -215 376 483 319 255 14 -178 129 587 705 256 -133 -26 187 302 540 521 102
5667 102 -430 -208 364 614 200 -86 -308 -323 -160 260 441 -57 -533 -663 -227 191 194 -73 -423 -726 -397
5688 -397 12 313 -5 -302 -626 -513 -95 417 297 -248 -608 -355 122 326 361 188 -288 -425 -60 554
5708 554 723 183 -270 -169 124 481 571 539 21 -342 -160 382 696 498 95 -394 -301 113 551 538 -53
5729 -53 -437 -416 -119 175 420 195 -488 -765 -402 118 331 49 -426 -699 -667 -112 332 228 -373 -620 -586
5750 -586 -183 176 383 142 -452 -787 -155 536 442 94 -185 -223 -254 207 786 670 -67 -465 -104 483 653
5771 653 479 155 -137 -348 88 608 760 176 -270 -315 4 404 632 293 -284 -601 -242 260 376 172
5791 172 -197 -565 -692 -184 316 246 -285 -724 -570 -244 125 278 72 -508 -698 -349 125 355 96 -243
5811 -243 -549 -365 83 556 399 -21 -329 -198 82 426 601 353 -167 -333 71 580 721 263 -37 -162
5831 -162 -25 274 591 528 37 -302 -202 217 446 442 -1 -421 -377 -33 278 245 -47 -356 -506 -340 -7 211
5853 211 73 -383 -679 -432 -81 95 28 -212 -475 -478 -179 218 258 -104 -367 -345 -178 200 373 137 -120 -231
5875 -231 -18 200 368 399 160 -91 -148 309 531 439 64 -86 20 156 280 323 343 14 -245 -87 198 366
5897 366 211 -163 -265 -141 -2 100 82 -142 -298 -405 -270 -45 84 -106 -414 -374 -193 -115 -23 -65 -239 -407
5919 -407 -282 -96 76 -12 -101 -207 -180 -40 192 221 154 -84 -24 41 284 256 175 118 18 52 288 418 323 108
5943 108 75 177 216 237 231 191 50 -95 65 67 188 78 -66 -152 -115 -21 -57 -106 -173 -191 -219 -244 -209 -92 -150 -294
5969 -294 -268 -165 -150 -227 -219 -58 -152 -244 -183 50 14 -78 -88 47 21 -47 45 128 192 64 -5 130 226 163 252 209 240
5996 240 70 40 335 294 165 142 100 109 130 251 261 128 -93 -29 95 107 45 -54 -63 -248 -161 -43 153 -66 -317
6021 -317 -302 -250 -142 -69 -85 -251 -314 -345 -151 38 5 -94 -282 -287 -110 100 189 47 -203 -208 26 129 203 258 205
6046 205 -74 -58 228 491 389 29 -22 166 168 202 330 364 79 -242 5 409 367 113 -99 -109 -108 -76 131 183
6070 183 -118 -458 -312 32 104 12 -181 -410 -484 -277 47 147 -119 -441 -457 -181 -29 132 42 -193 -399 -215
6092 -215 109 227 83 -64 -172 -162 71 315 413 152 -106 -232 120 429 491 245 -100 -68 59 379 522
6113 522 339 -10 -107 -98 106 323 427 39 -316 -291 43 236 217 -49 -261 -363 -281 89 169 21 -356 -533
6135 -533 -266 -10 81 -21 -255 -475 -419 -71 205 171 -107 -408 -335 -36 270 283 -18 -215 -196 -43 267 389
6157 389 295 6 -104 -68 354 514 416 6 -255 15 295 383 434 172 -66 -137 15 304 416 207 -184 -323
6179 -323 -134 234 229 51 -187 -418 -335 8 189 174 -196 -430 -492 -161 120 63 -75 -355 -441 -207 79 168 73
6202 73 -254 -381 -246 71 262 220 -89 -288 -126 192 313 359 138 -28 -219 76 367 535 334 -133 -225
6223 -225 65 371 458 310 -10 -150 -118 67 301 321 38 -264 -319 -82 231 264 -32 -334 -401 -119 -4 152
6245 152 71 -232 -487 -396 -48 168 13 -301 -376 -318 -156 116 159 -21 -292 -416 -130 239 329 48 -177 -194
6267 -194 26 134 374 419 69 -145 -119 246 425 350 102 -42 -59 132 393 352 147 -138 -80 48 186 220
6289 220 236 -25 -227 -235 82 265 111 -202 -347 -289 -82 90 63 -60 -346 -439 -258 -3 102 37 -274 -401
6311 -401 -262 -33 101 70 -122 -357 -300 -4 257 261 38 -202 -127 68 244 325 220 5 -3 70 168 393 330 115
6335 115 -120 13 208 285 262 137 56 -27 38 158 275 133 -148 -191 -4 121 21 7 -154 -274 -268 -117 69
6358 69 -65 -218 -334 -240 -172 -76 -26 -134 -237 -333 -175 36 38 7 -61 -97 -206 13 175 186 46 -127 -2 113
6382 113 186 194 199 129 54 116 187 260 236 27 -2 61 188 278 251 32 3 15 46 107 167 161 17 -254 -153 52 65 -86
6410 -86 -150 -150 -230 -220 -127 -5 -127 -273 -244 -111 -138 -206 -109 -181 -180 -138 -163 38 5 -96 -106 -77 -28 80 139 38 65
6437 65 10 93 173 184 214 113 34 52 195 249 258 133 31 98 116 261 169 88 7 9 30 40 144 100 -92 -227 -95
6464 -95 -35 37 -97 -86 -177 -246 -177 -32 46 -128 -278 -202 -155 -52 -42 -91 -126 -232 -241 -94 64 95 -55 -157 -50
6489 -50 41 86 105 27 56 51 120 149 142 225 206 -18 38 176 275 200 116 113 129 179 213 169 114 24 35 6 64 136 61 -69
6519 -69 -190 -81 -45 -15 -28 -154 -230 -232 -177 -80 -53 -97 -304 -250 -129 -11 -100 -119 -116 -207 -221 -38 68 15 -94 -170 -15
6546 -15 154 120 139 3 0 76 119 175 253 210 -2 -7 72 240 304 234 65 -49 53 198 166 240 25 -69 -70 22 185
6573 185 155 32 -201 -185 -108 99 56 -73 -222 -292 -186 -88 -1 -40 -179 -344 -281 -115 82 14 -197 -206 -168 -130 -64
6598 -64 166 83 -79 -251 -90 247 275 79 -48 -95 48 75 273 331 133 -61 -42 198 375 243 152 -38 -69
6621 -69 58 164 365 155 -117 -111 -42 87 215 115 -160 -332 -164 -26 95 79 -164 -256 -350 -113 107 80 -82
6644 -82 -375 -398 -117 40 58 -45 -210 -313 -224 21 219 119 -109 -198 -168 -5 239 407 63 -181 -148 168
6666 168 333 291 146 47 -77 -26 309 446 354 -21 -180 -35 227 347 289 10 -239 -235 34 208 200 42 -268
6689 -268 -310 -126 149 134 -26 -367 -396 -285 -66 133 106 -211 -461 -391 -59 217 125 -141 -375 -293 -93 159
6711 159 274 35 -153 -301 -96 265 367 212 -147 -137 -81 227 425 314 -10 -132 -53 143 421 374 169
6732 169 -161 -223 23 318 362 205 -167 -280 -36 98 282 150 -114 -342 -202 52 203 171 -131 -405 -313
6753 -313 -134 87 92 -37 -321 -407 -167 104 244 -67 -262 -277 -175 96 262 169 -71 -242 -161 120 254 340
6775 340 72 -149 -120 105 336 370 201 -25 -129 89 228 368 299 -22 -108 -73 148 367 274 39 -147 -225
6797 -225 -53 173 237 8 -197 -309 -126 28 151 -26 -243 -261 -212 -88 121 67 -182 -352 -273 -73 123 71
6819 71 -95 -221 -240 -76 132 154 26 -106 -197 -1 114 224 149 53 -94 -14 200 270 270 106 -24 18 107 240
6843 240 277 192 4 -79 22 189 185 104 26 -142 -126 45 160 93 -124 -250 -166 -49 -11 59 -58 -217 -299 -153
6867 -153 -15 -32 -88 -165 -246 -193 -42 28 -47 -149 -263 -114 -5 50 39 9 -8 -79 45 176 285 84 -34 -13
6891 -13 125 160 164 141 172 75 49 132 229 143 55 -2 -3 28 130 149 -22 16 -42 9 38 49 -16 -62 -77 -115 -68 -61 -42 -156
6921 -156 -180 -174 -152 -163 -100 -148 -147 -117 -115 14 -77 -79 -120 -60 -47 1 -15 -33 25 -14 10 24 59 196 174 53 48 62 157 174 105
6952 105 257 185 78 46 114 202 149 19 0 53 31 60 24 36 -43 -147 -87 11 53 -73 -187 -162 -155 -149 -95 16 -123
6979 -123 -175 -249 -106 -43 -19 -72 -42 -198 -144 -13 -49 32 -56 -52 -74 -73 141 130 134 -42 -42 50 205 236 204 113 -7 104
7007 104 232 262 226 77 23 -39 150 223 212 -5 -142 -15 94 183 116 -18 -60 -158 -140 60 88 21 -173 -207 -125
7032 -125 -38 -28 -81 -163 -268 -227 -148 82 7 -77 -237 -277 -51 114 81 3 -174 -189 -77 56 274 130 -17 -163
7056 -163 33 201 244 276 75 -52 26 152 220 289 171 -10 14 67 202 274 147 -51 -116 -63 184 123 76 -70
7080 -70 -208 -146 -54 104 29 -152 -305 -221 -61 12 42 -98 -256 -245 -181 10 103 -85 -241 -274 -198 79 168 41
7104 41 -163 -239 -44 84 216 219 25 -38 -107 54 316 342 120 -88 14 62 243 338 160 -35 -59 66 168
7127 168 245 173 -2 -154 -167 43 173 188 -10 -269 -206 -99 81 113 -32 -194 -415 -220 12 60 -60 -219
7149 -219 -286 -242 -69 94 49 6 -331 -306 -33 144 147 -61 -141 -236 -40 153 278 110 -1 -158 6 169 338
7172 338 293 -16 -157 1 167 365 276 72 -52 -73 31 298 202 80 -172 -156 -18 112 201 67 -106 -223
7194 -223 -203 31 141 -13 -203 -310 -262 -118 82 -41 -130 -262 -284 -94 0 62 -48 -150 -280 -148 53 160
7216 160 121 -81 -250 -62 78 130 163 124 -47 -125 49 251 251 154 -32 -56 81 207 252 246 30 -83 -22 131
7240 131 256 193 31 -181 -38 61 123 87 -9 -152 -188 -97 9 104 -76 -253 -285 -140 11 -35 -89 -153 -199 -206 -106
7265 -106 85 24 -202 -200 -111 -65 66 80 -14 -101 -110 47 197 203 136 21 -34 18 136 169 215 83 -29 77 165 198
7291 198 128 57 28 2 111 165 165 32 -19 -45 4 141 46 -17 -61 -49 -102 -22 -5 -3 -116 -196 -164 -54 61 -97 -235
7318 -235 -194 -129 -92 -84 -65 -42 -90 -154 -63 9 31 9 -73 -63 -6 120 130 38 39 80 30 49 108 121 187 86 149 120 185 106
7348 106 148 95 103 62 17 108 73 93 -4 -28 18 -56 -3 -27 -119 11 -67 -124 -68 -24 -54 -143 -138 -60 -40 -37 -88 -120 -77 -155 -141
7379 -141 -136 -8 8 -18 -74 25 12 -35 -20 61 70 58 78 47 121 60 7 16 78 53 146 72 94 126 98 126 128 155 100 70 9
7410 9 12 102 85 -14 -24 -53 -1 59 8 -33 -49 -180 -143 -50 -34 -72 -184 -177 -138 -22 -58 -85 -70 -109 -159 -107 -23 10 49 -72
7440 -72 -75 -9 3 73 55 47 -30 30 64 103 145 85 -4 27 62 169 216 50 91 66 103 106 163 91 55 -54 24 114 101 14
7470 14 -1 6 -93 -34 27 79 -48 -117 -186 -118 43 77 -45 -157 -175 -102 -65 9 -68 -183 -149 -97 -48 1 -19 -3 -183 -123
7498 -123 3 89 68 -15 -53 -3 42 85 210 99 -14 43 91 185 259 112 48 9 14 178 180 78 76 -47 -106 49 68
7525 68 140 36 -42 -91 -23 -15 55 -7 -73 -148 -209 -12 78 28 -206 -313 -199 -62 12 30 -52 -186 -199 -94 80 115
7551 115 -47 -193 -165 -128 93 188 117 -31 -203 -54 203 226 98 66 8 -41 138 284 205 99 -124 -59 76
7574 76 276 320 65 -113 -159 -23 103 218 43 -77 -221 -129 40 197 74 -129 -251 -240 -57 101 67 -32
7596 -32 -320 -345 -144 86 63 -34 -174 -260 -209 24 218 138 -122 -227 -157 85 180 156 81 -111 -162 85 255 256 98
7621 98 -75 -134 96 256 367 227 -7 -134 -24 145 310 182 -12 -131 -111 71 202 220 -53 -182 -176 -8
7643 -8 72 160 -35 -231 -228 -147 29 25 25 -188 -337 -251 -2 102 60 -202 -292 -207 -108 56 121 -1 -163 -251 -6 193
7669 193 224 63 -96 -148 -28 122 268 217 58 -112 20 133 268 242 42 -72 -70 99 251 254 75 -68 -158
7692 -158 0 96 228 83 -108 -229 -101 67 96 -6 -13 -234 -247 -124 39 77 -20 -243 -298 -139 46 108 -41
7715 -41 -279 -249 -159 19 77 21 -82 -160 -165 64 181 227 -60 -80 -12 17 227 193 126 3 -84 98 186 245 143 -2
7741 -2 -22 39 155 255 157 25 -67 -43 41 91 137 20 -184 -145 -18 11 16 -97 -141 -147 -107 -35 33 -45 -78 -180 -190 -84
7769 -84 6 -22 -99 -132 -128 -17 24 -38 -14 4 -107 -67 43 119 78 -44 -76 60 153 101 130 89 37 44 59 163 108 25
7797 25 52 4 56 57 112 117 -15 -6 -12 3 5 40 46 -105 -105 -65 8 -42 -139 -119 -178 -125 -111 20 -64 -126 -118 -68 -51 -87 -15 -29 -110
7830 -110 -105 -2 62 -11 -104 -13 -46 8 6 7 121 -27 50 71 67 101 79 78 136 55 69 128 143 61 45 49 50 88 44 91 63 38
7862 38 16 -76 -25 54 37 -96 -74 -18 -26 -31 -3 -78 -112 -117 -209 -112 -83 -84 -130 -109 -91 -56 -102 -50 4 -52 -54 -42 -24 22 -13 18
7894 18 9 -1 32 118 124 57 72 76 110 147 130 46 81 117 88 171 146 101 38 48 48 98 52 57 59 -46 -38 43 70 40 -13 -120 -62
7927 -62 -73 -38 -36 -78 -144 -105 -84 -31 9 -57 -128 -150 -82 -17 33 -40 -153 -108 -49 57 66 25 34 -103 -41 106 168 112 -11
7956 -11 -38 -39 38 92 168 82 -37 -18 129 249 180 119 28 -43 -30 84 183 87 17 -113 -69 -2 69 52 -66 -129 -163 -52
7984 -52 68 -11 -82 -119 -161 -121 -8 6 -43 -169 -222 -153 -77 30 5 -131 -133 -145 -11 70 42 -17 -94 -159 -2 146 214
8011 214 -15 -40 -33 23 159 170 145 -3 -110 -105 161 241 126 5 -82 -21 51 87 159 71 -102 -64 -71 83 174 91 -147
8038 -147 -150 -134 40 69 -2 -168 -186 -141 -118 19 19 -86 -248 -221 -55 47 25 -86 -71 -115 -109 16 121 69 -46 -112
8064 -112 -97 64 165 89 58 -38 31 83 171 146 47 26 -113 46 164 225 119 13 21 12 177 85 81 -25 -97 -147 1
8091 1 109 109 -55 -176 -216 -70 63 93 -53 -173 -175 -116 34 -27 -2 -123 -217 -188 -16 101 3 -87 -111 -84 -36 55
8117 55 42 -29 2 -93 38 146 196 35 -32 -75 12 99 154 134 72 -89 0 37 230 211 66 -79 -52 76 148 130
8143 130 12 -83 -79 -12 -12 91 54 -122 -141 -148 -44 54 -77 -147 -142 -176 -155 -9 -13 -84 -186 -180 -40 57 55 -12 -94 -57 -23
8172 -23 47 128 124 -24 -131 -45 55 131 151 113 -15 8 45 75 135 118 68 -16 4
8191D
$$ Imaginary data points
##PAGE= N=2
##DATA TABLE= (X++(I..I)), XYDATA
0 0 0 0 0 0 0 0 0 0 0 0 0 0 0 0 0 -5 5 -6 8 -8 8 -8 8 -11 13 -14 16 -16 21 -21 22 -29 29 -34 37 -42 47 -51 56 -62
40 -62 69 -76 83 -91 105 -117 127 -147 164 -188 217 -254 299 -367 461 -600 835 -1267 2241 -5332
60 -5332 33513 195757 93291 -71188 -34501 21357 -52027 -48385 103910 128665 -45442 -119777
72 -119777 2479 73993 19475 19757 67129 -5323 -109779 -39608 100347 78340 -30271 -25081
84 -25081 29233 -8638 -44409 26890 69968 -15222 -73094 1984 61101 6229 -34408 5283
96 5283 8329 -45868 -26424 53509 36517 -58369 -60357 22804 37038 -11058 -6399 13698 -37360
109 -37360 -71728 6812 82516 33077 -44210 -35789 -8600 -21602 2808 69311 50527 -53348
121 -53348 -80209 2432 54346 30889 16881 15905 -29740 -62880 -2752 74646 58051 -8620
133 -8620 -31878 -24548 -20068 11639 58433 42117 -29545 -54303 -10407 23386 22039 22539 13236
146 13236 -31135 -54931 -9077 42367 27118 -13604 -18861 -12692 -21539 -9183 27127 23083 -27281
159 -27281 -44133 -4681 21088 5651 -4265 1596 -12247 -28438 -3488 29786 14259 -20638
171 -20638 -17028 4482 3108 2169 20540 15513 -22396 -28427 15613 39142 12678 -8041 -401
184 -401 -2636 -11890 10994 39418 18395 -22776 -20219 8457 14093 10834 21310 12381 -25402 -32492
198 -32492 9867 35567 11751 -11771 -8566 -10755 -19612 -652 27091 12345 -26186 -29335 -3283
211 -3283 5375 301 7020 6125 -19991 -32826 -5237 20963 8833 -12446 -10792 -4828 -9706 -4603
225 -4603 12321 9935 -11789 -16193 1096 9109 3796 5237 7459 -4863 -12293 5029 20972 9573
239 9573 -5990 -278 9158 4591 3275 12895 10487 -5938 -7339 9171 13713 2890 234 4616
253 4616 -1598 -7973 2942 13776 2897 -11848 -7572 2504 1196 -1537 1896 -1465 -11709 -10648
267 -10648 451 1603 -5602 -4839 -1578 -8398 -12611 -855 8031 -2760 -13676 -5994 3408 -1631
281 -1631 -5683 1882 4380 -5224 -7265 3244 6397 -1293 -1121 7158 4621 -4081 838 11636 7222
296 7222 -2879 2237 11666 5274 -4137 2543 11229 4830 -2484 3365 7065 -971 -2938 7337 8395
311 8395 -4874 -8138 3325 5945 -3976 -4356 4431 791 -11850 -9528 3799 3867 -7399 -9384 -3629
326 -3629 -4220 -6052 181 2746 -7536 -13706 -4045 4291 -1211 -5518 57 335 -9128 -7951 7291
341 7291 11952 -2246 -11242 -2311 6931 5346 3684 6394 2873 -5046 -2387 9705 13205 4814 -1770
356 -1770 -1193 1153 4334 10022 10842 2158 -6511 -4879 3566 9449 8693 1618 -7600 -9486 -185 8735
372 8735 6157 -2457 -6680 -7592 -7603 -1767 7402 5792 -8803 -17548 -9380 2872 5634 1236 -5167
387 -5167 -12469 -13788 -2717 10013 7768 -5002 -10737 -6875 -2357 2643 10255 9264 -5768 -16088
401 -16088 -4832 13842 16252 4348 -4310 -5333 -2813 4281 14456 15413 2473 -9514 -6702 5848
415 5848 14552 13344 3993 -7000 -10094 -969 11106 13785 5387 -6369 -12734 -7654 6343 14908
429 14908 6262 -10210 -15793 -7612 1656 5836 5947 -748 -14173 -19530 -6024 11427 11023 -4389
443 -4389 -15351 -13788 -5325 5092 11462 5250 -10227 -16921 -6584 7570 11975 7438 -1156 -10871
457 -10871 -12388 1703 18577 16905 -966 -12397 -7229 4388 12779 15171 8326 -5825 -12709
470 -12709 -2562 13647 17965 8272 -4532 -11180 -7336 5536 16182 11967 -3844 -14556 -11333
483 -11333 715 11154 11953 -46 -15592 -18085 -4200 9441 9246 -724 -10415 -15273 -12054 768
497 768 12368 7651 -9895 -20084 -12532 2537 11049 8520 -2614 -14171 -14012 -716 11788 11585
511 11585 1977 -7221 -10925 -5380 8603 18698 10634 -7450 -13625 -2390 10687 14487 10917 2067
525 2067 -8650 -9569 4635 18371 14504 -650 -9282 -7433 -465 8683 14515 7087 -9405 -16117
539 -16117 -4739 9572 11748 3623 -7067 -14414 -11780 2054 13096 7352 -8098 -15719 -11303
552 -11303 -2453 5555 9173 1563 -13373 -18513 -5497 10400 12099 1302 -9331 -12760 -7410 4637
566 4637 13814 9661 -3867 -11557 -6816 3900 12094 12964 4510 -7627 -10663 467 14076 15959
580 15959 5767 -5053 -7930 -1605 8352 13087 7976 -1942 -7934 -5556 2974 10999 9998 -924
594 -924 -10631 -8298 1396 6829 5664 640 -7230 -12483 -5704 7700 9114 -4046 -12370 -7626 -2365
609 -2365 -1850 2535 6331 -3287 -16935 -11254 7197 11288 -573 -6929 -4998 -5953 -4086 8944 15823
624 15823 1146 -14161 -7226 7485 8609 5145 7985 3972 -10109 -9463 11180 20738 6078 -6425
638 -6425 -2233 1153 -1146 6744 17518 7371 -12643 -10143 7955 10097 247 2035 6299 -5959
652 -5959 -15263 833 16784 4226 -13359 -7100 3843 -2865 -7248 4388 6773 -10223 -15419
665 -15419 1892 8834 -5480 -10186 1875 2065 -10347 -5873 9860 4695 -13176 -9434 8750
678 8750 8115 -4821 -2754 5564 -1195 -7802 4750 15360 3537 -9306 -1827 7615 3305 1866
692 1866 10355 8049 -7453 -9001 7521 14167 4100 -959 2216 -1698 -6857 2724 13765 5347
706 5347 -8648 -6068 2285 -900 -3514 5736 7687 -7738 -15562 -1933 8311 -258 -7316 -907
720 -907 764 -8553 -9239 2577 5204 -4826 -7702 -487 188 -5576 -3154 4013 1488 -5296 -2883
735 -2883 3036 694 -3344 811 5666 2684 -1393 544 2648 1383 2098 5215 4702 867 195 2267
751 2267 2767 3136 4917 4233 299 -1209 1012 2154 1969 3345 3045 -2025 -4850 -368 3261 -237
767 -237 -3045 277 751 -5625 -7215 550 4153 -2472 -6900 -3034 -1003 -4743 -4313 1463 1370 -4817
783 -4817 -5876 -1655 -1602 -3471 163 3631 -1344 -6105 -1750 3505 1112 -553 3731 3766 -3280 -4206
799 -4206 4205 7752 2607 570 3603 1282 -3247 1816 10187 6943 -2314 -2685 2733 2731 1008 4609
815 4609 5966 -1400 -6540 -1382 4417 2528 -112 304 -2343 -6683 -3184 4279 2878 -5178 -6471
830 -6471 -1406 -1022 -4007 -1716 1822 -2374 -7941 -4701 1889 1145 -3349 -3442 -1631 -2057 -957 2354
846 2354 1559 -3317 -3650 1186 3290 1599 1588 1864 -1049 -2079 3532 8137 4463 -1244 -934 1405 1878
863 1878 4662 8199 4558 -3675 -4379 2847 6797 4670 2440 332 -4014 -4802 2190 7810 3769 -3120
879 -3120 -4995 -4463 -3577 1557 6670 1596 -9378 -10382 -1138 3560 422 -1089 -1199 -6158 -9771 -2487
895 -2487 7145 4534 -5370 -7809 -3297 -757 1008 5016 3676 -5241 -8566 189 8074 5266 200
910 200 36 -708 -2901 1777 10155 8343 -2301 -5734 944 5830 5350 5693 4494 -2761 -6507 1634
926 1634 10649 7067 -1810 -3713 -1781 -1783 1257 7332 5385 -5703 -10530 -3251 4098 3663 1038 -1683
942 -1683 -7366 -10035 -2059 7544 4779 -5741 -9131 -4992 -2278 -159 4598 4312 -5443 -12084 -4786
957 -4786 6310 7109 821 -3078 -4312 -4809 5 8674 9337 -500 -7247 -3087 3959 6430 6670 5073
973 5073 -1178 -6428 -1691 8589 11064 3620 -3052 -3984 -1559 3048 8112 7075 -1489 -7801 -4369
988 -4369 2959 5785 3938 125 -5268 -8445 -3685 4924 6539 -1001 -8309 -8309 -3492 1427 3955 1798
1004 1798 -4928 -9735 -6579 1238 5248 2356 -3248 -6821 -6194 -1151 4829 6140 784 -6004 -6652
1019 -6652 -484 6278 7364 2884 -2805 -4456 -768 4849 7886 5832 356 -4110 -2884 3444 8619
1034 8619 7062 767 -3809 -3277 1042 5758 7108 2571 -4229 -5941 -732 4760 4531 717 -2827
1049 -2827 -5293 -5287 -713 4771 3677 -3927 -8772 -5589 145 2353 1106 -1845 -5487 -7029 -3425 2612
1065 2612 4089 -469 -5358 -5700 -2290 1603 3841 2578 -1601 -4705 -3006 2360 5947 4669 87
1080 87 -3107 -2031 2346 5785 5417 2017 -953 -1345 942 4264 6167 4083 -640 -3114 -559 3785
1096 3785 5171 2931 -705 -3083 -2390 948 3561 2248 -1516 -3766 -3285 -1554 453 1740 -33
1111 -33 -4426 -6356 -3238 1108 1317 -1707 -3875 -4206 -3490 -1133 1499 1144 -2439 -4604 -2902 224
1127 224 1758 1674 234 -1870 -2621 -187 3271 3798 1314 -755 -787 746 3069 4636 3442 296 -822
1144 -822 1257 3409 3384 2582 1904 473 -1052 507 3710 3861 335 -2319 -1308 774 1291 848 -23
1161 -23 -1606 -2819 -2013 -231 221 -1010 -2256 -3186 -3461 -1928 254 -7 -2783 -4213 -2565 -656 -621
1178 -621 -1066 -920 -1608 -2647 -1691 967 1763 -121 -1578 -629 774 1059 1448 2191 1630 -114 64 2490
1196 2490 3976 2588 728 848 2009 2273 2108 2604 2314 876 2 1155 2263 1796 627 269 -79
1213 -79 -841 -127 1342 785 -1918 -2664 -602 167 -1676 -2332 -891 -895 -3064 -3366 -910 -117 -2489 -3445
1231 -3445 -1639 -921 -2005 -2000 -516 -731 -2080 -1302 476 -100 -1207 -79 1329 341 -644 1041 2247
1248 2247 760 134 2329 2919 746 411 3042 3215 557 789 3696 2924 -764 127 4032 3010 -1314
1265 -1314 -686 3025 1964 -1776 -594 2557 533 -3053 -1260 1870 -320 -3373 -1467 678 -2197
1280 -2197 -3986 -510 932 -3202 -5165 -895 1419 -2290 -4112 -827 372 -2980 -3171 1191 1889
1295 1889 -2449 -3357 526 1966 -205 -81 2022 551 -2057 268 4447 3567 -8 -170 1863 1580
1311 1580 1192 3442 4177 801 -1600 783 3484 2840 1604 1593 208 -1894 -499 3188 3212 -864 -2816
1328 -2816 -1159 -61 -498 -70 602 -1246 -4008 -3375 -245 1019 -837 -2945 -3427 -2822 -1557 -165
1344 -165 39 -1649 -3350 -3127 -976 1083 919 -854 -2100 -1668 -337 1058 2300 1985 -390 -2276
1360 -2276 -527 3368 4497 2117 -145 -202 613 1749 3884 4765 2002 -1631 -1370 2298 4083 3244
1376 3244 1738 -129 -2232 -1643 2316 4626 1636 -2845 -3492 -1228 379 1232 1351 -1007 -4550 -4741
1392 -4741 -1005 1768 561 -2112 -3768 -4475 -3142 548 2351 -588 -4559 -4458 -1540 610 1394 1308
1408 1308 -994 -3930 -3150 1476 3992 2085 -425 -1233 -1251 -24 3508 5431 2409 -2064 -1876 2029
1424 2029 4247 3678 2680 1075 -1206 -1159 2491 5107 3297 -540 -2017 -1092 751 2816 3243 269
1440 269 -3588 -3678 -384 2086 1525 -572 -2895 -4555 -3324 544 2414 -130 -3876 -4912 -3429 -772
1456 -772 1553 1670 -1854 -5314 -4495 -228 2514 1891 -244 -2618 -3748 -1572 2912 4480 1487 -1802
1472 -1802 -1957 -274 1711 4165 4576 957 -2853 -1329 3515 5038 2838 1006 169 -797 119 3672
1488 3672 4908 1489 -2308 -1790 578 1677 2164 1926 -1060 -4261 -2754 1703 2798 -366 -2718 -2733
1504 -2733 -2858 -2309 722 2312 -1270 -5626 -4511 -522 854 -97 -450 -1821 -4346 -3713 1067 3757
1520 3757 584 -2824 -2523 -884 213 2342 3694 1042 -2839 -1979 2374 3966 2663 1746 916 -1258
1536 -1258 -854 3823 6249 2326 -2034 -921 2082 2164 1925 3186 1851 -2447 -3059 1540 4235 1455
1552 1455 -1684 -1870 -1522 -1692 210 2357 244 -4119 -4355 -903 679 -525 -1199 -1548 -3303 -3966 -1050
1569 -1050 1829 266 -3008 -3363 -1361 -425 87 1000 399 -2123 -2740 230 2842 2057 136 -577 -268
1586 -268 478 1991 3217 2377 364 -454 627 2316 3416 3047 956 -1017 -223 2216 3293 1930
1602 1930 474 -320 -658 -245 1388 2347 775 -1936 -2624 -1057 606 748 -272 -1873 -2893 -2448 -829
1619 -829 182 -406 -1904 -3028 -2789 -1444 -51 -41 -1313 -2442 -2186 -1067 80 650 86 -1058 -1533
1636 -1533 -404 1271 1586 823 35 11 418 1336 2313 2112 956 327 907 1855 2150 2125 1696 669 38
1655 38 1019 2503 2135 489 -269 310 652 427 595 633 -307 -1515 -1274 -84 200 -575 -1479 -1866 -1827 -1232
1675 -1232 -586 -942 -1784 -2201 -1725 -1323 -1174 -864 -794 -1513 -1968 -1072 -24 -83 -711 -662 -239 -262 -84 828 1216
1696 1216 447 -160 679 1703 1409 841 1251 1654 1265 980 1561 2003 1376 827 1129 1605 1296 797 885 807
1716 807 463 371 635 371 -323 -527 -146 -118 -580 -1018 -990 -972 -1167 -1236 -1033 -1210 -1614 -1825 -1486 -1072 -1030 -1348
1738 -1348 -1689 -1552 -1138 -691 -583 -793 -949 -909 -459 134 456 269 -119 -113 415 1014 1329 1251 965 628 664
1759 664 1411 2229 2074 1094 547 960 1612 1878 1668 1251 548 96 498 1280 1459 559 -441 -758 -455 74
1779 74 437 80 -1139 -1848 -1634 -607 -183 -557 -1556 -2209 -2221 -1428 -438 -272 -1219 -2207 -2200 -1319 -226 156
1799 156 -204 -1285 -1829 -1147 551 1354 696 -544 -781 -52 971 1745 1946 1244 -45 -183 1189 2663
1817 2663 2755 1588 299 32 950 2146 2617 1833 216 -645 -68 1214 1967 1430 -65 -1297 -1368 -11
1835 -11 1203 943 -668 -2093 -2283 -1211 -3 373 -598 -2372 -3151 -2133 -226 350 -645 -2023 -2630
1852 -2630 -2236 -867 647 818 -920 -2475 -1961 53 1432 1320 372 -798 -1333 -33 2093 2882 1539
1869 1539 -283 -344 584 1771 2857 2881 1125 -969 -541 2108 3503 2352 388 -317 -236 215 1542
1886 1542 2658 1299 -1512 -2343 -530 1319 1294 -50 -1298 -2323 -2399 -646 1088 567 -1994 -3411
1902 -3411 -2592 -941 183 171 -968 -2640 -3159 -1540 620 1124 -202 -1745 -2227 -1359 638 2118 1408
1919 1408 -703 -1721 -538 1490 2511 2115 802 -516 -655 1041 2979 3133 1412 -275 -470 805
1935 805 2425 3125 1804 -382 -1269 19 1800 2171 1171 -240 -1466 -1578 -102 1545 1287 -1064
1951 -1064 -2812 -2216 -644 310 140 -732 -2206 -3195 -2182 68 922 -584 -2501 -2815 -1586 -203 637
1968 637 419 -873 -2150 -1780 75 1697 1495 95 -1165 -970 474 2001 2319 1176 -166 -267 767
1985 767 1991 2680 2044 722 -387 132 1745 2733 1938 424 -559 -199 830 1615 1426 224 -1014
2002 -1014 -1289 -276 723 773 -402 -1539 -2063 -1380 -142 281 -616 -1988 -2489 -1807 -816 -151 -342 -1392
2020 -1392 -2307 -2042 -674 332 145 -729 -1434 -1275 -396 584 962 478 -372 -676 76 1251 1888 1328 296
2039 296 -30 722 1675 2021 1597 1137 595 388 1072 1987 2062 890 -191 -42 777 1164 989 569 -211 -839
2059 -839 -635 329 632 -142 -1125 -1364 -1099 -859 -528 -394 -959 -1915 -1961 -1038 -557 -779 -1189 -1282 -1450 -1411 -606
2080 -606 59 -429 -1246 -973 -198 125 10 334 417 -105 -200 741 1523 1017 318 578 1012 1143 1282 1547 1394
2101 1394 577 470 1334 1734 1250 751 795 544 199 676 1325 751 -518 -686 147 288 -231 -226 -200 -939 -1514
2122 -1514 -835 -96 -640 -1497 -1329 -985 -1333 -1409 -662 -499 -1385 -1756 -936 -307 -685 -901 -375 -247 -731 -533
2142 -533 362 439 -169 -20 723 612 287 718 1312 906 458 1009 1665 1243 616 1072 1599 1034 606 1078
2162 1078 1400 700 210 741 1058 396 -51 344 397 -279 -449 -34 -12 -709 -989 -627 -550 -932 -1102 -931 -974
2183 -974 -1334 -1262 -991 -1031 -1183 -1144 -1017 -1034 -935 -674 -623 -841 -678 -237 -73 -292 -133 234 344 268 441 596
2205 596 580 688 975 1119 990 924 938 1007 1133 1315 1356 1029 633 710 1095 1106 996 523 217 58 147 478 446
2228 446 118 -430 -761 -666 -291 -179 -484 -1038 -1279 -1150 -972 -871 -658 -853 -1446 -1729 -955 -338 -690 -1219
2248 -1219 -1030 -626 -679 -662 -14 322 -470 -837 -139 931 788 182 328 629 538 712 1386 1492 748 313
2268 313 841 1461 1390 1287 1222 669 190 616 1472 1483 551 12 -8 116 362 667 521 -455 -1143 -924 -113
2289 -113 88 -303 -921 -1361 -1539 -1148 -403 -250 -894 -1670 -1753 -1299 -517 -109 -450 -1241 -1571 -892 -139 220
2309 220 123 -309 -689 -605 135 1072 1096 376 -215 91 873 1427 1523 1070 459 308 760 1445 1802 1408 614
2330 614 147 429 1281 1590 959 167 -306 -136 373 739 713 -32 -1076 -1231 -474 246 20 -757 -1370 -1528
2350 -1528 -1269 -572 -145 -487 -1477 -1975 -1493 -640 -115 -248 -922 -1528 -1436 -477 400 343 -288 -676 -700 -90 648
2371 648 1270 905 -18 -434 318 1282 1639 1273 684 310 389 1129 1763 1681 832 181 132 735 1332 1407 685
2392 685 -186 -406 6 568 661 177 -530 -1061 -946 -227 230 -120 -1077 -1648 -1406 -783 -357 -418 -966 -1592 -1682
2413 -1682 -1134 -352 -47 -590 -1309 -1388 -760 52 383 53 -447 -695 -396 337 1018 1037 491 -83 67 837
2433 837 1504 1537 945 397 357 872 1430 1638 1261 552 159 454 1075 1340 991 247 -299 -246 218 711 466
2454 466 -200 -847 -980 -497 -47 -148 -642 -1333 -1493 -1030 -517 -411 -699 -1293 -1588 -1306 -625 -184 -434 -987
2474 -987 -1334 -993 -336 173 250 -187 -549 -573 135 708 929 509 145 145 461 1060 1529 1274 540 288 682
2495 682 1297 1506 1209 775 444 346 708 1208 1118 464 -140 -131 202 407 406 98 -531 -947 -752 -180 -31 -419
2517 -419 -1076 -1336 -1140 -757 -439 -596 -1110 -1415 -1319 -930 -449 -362 -674 -1085 -1180 -502 95 105 -206 -379 -221
2538 -221 -23 326 793 873 324 41 399 1088 1263 1019 846 714 616 843 1336 1511 925 393 519 792 1034
2559 1034 887 628 252 -84 -93 346 566 97 -473 -703 -517 -418 -280 -361 -752 -1158 -1241 -820 -487 -633 -1056
2580 -1056 -1191 -1110 -964 -675 -553 -489 -748 -1014 -714 -91 141 -110 -321 -289 99 280 464 651 564 346 327
2601 327 749 1227 1081 746 709 793 946 984 1124 1046 733 442 532 853 818 605 309 196 106 192 212 95 -266
2624 -266 -391 -504 -576 -454 -468 -535 -886 -1115 -945 -639 -681 -1016 -1025 -885 -950 -951 -717 -607 -663 -828 -682 -341 -349 -255
2648 -255 -165 -95 -78 4 284 453 454 442 576 624 640 701 999 934 668 774 973 946 734 791 943 750 423 453 786
2673 786 537 201 118 275 194 -172 -268 -107 -223 -635 -667 -487 -553 -740 -785 -827 -852 -979 -792 -811 -912 -874 -832 -799
2697 -799 -859 -778 -438 -397 -760 -689 -201 81 -207 -55 249 256 1 294 793 852 514 417 733 827 845 959 1090
2720 1090 909 550 624 1051 992 760 600 545 412 244 604 637 134 -247 -84 -44 -226 -190 -195 -418 -932 -846 -404
2743 -404 -390 -812 -1087 -870 -902 -1045 -828 -504 -713 -1087 -1047 -584 -427 -460 -464 -426 -518 -403 97 445 137 -28 83
2766 83 262 426 685 996 782 300 322 957 1250 1064 822 703 605 625 905 1283 1031 311 60 386 623
2787 623 619 424 125 -277 -438 -127 118 88 -394 -934 -1068 -778 -314 -139 -623 -1172 -1252 -975 -675 -419 -507 -894
2809 -894 -1226 -1053 -556 -109 -85 -419 -748 -672 -138 386 516 213 -47 -103 197 663 986 862 483 191 502
2830 502 1084 1226 1075 782 530 397 677 1221 1176 500 114 165 393 547 700 403 -258 -761 -316 284 246
2851 246 -345 -754 -918 -1046 -661 -22 -190 -1060 -1636 -1227 -488 -374 -463 -656 -1108 -1389 -868 73 351 -282
2871 -282 -937 -824 -284 231 647 507 -57 -482 -111 730 1152 972 593 214 133 836 1400 1352 797 386 400
2892 400 632 949 1177 997 197 -179 288 817 641 199 -60 -326 -463 -114 397 170 -722 -1114 -833 -424
2912 -424 -338 -344 -610 -1174 -1486 -824 -191 -249 -820 -1081 -1061 -848 -323 113 -5 -629 -954 -457 255 501 444 116
2934 116 -264 -189 460 1082 1072 624 252 216 516 1112 1465 989 354 132 717 1016 1005 926 510 -43 -116 536
2956 536 1056 482 -327 -429 -195 -145 -152 52 -204 -998 -1198 -547 -103 -359 -814 -1019 -1097 -989 -516 -196 -524
2977 -524 -1093 -1144 -653 -336 -256 -222 -282 -693 -683 -19 576 401 -13 -46 63 313 715 1041 836 233 54 638
2999 638 1168 1135 911 682 471 384 715 1147 938 364 69 136 355 523 566 196 -387 -530 -134 183 -53
3020 -53 -433 -578 -772 -804 -529 -230 -330 -947 -1181 -994 -554 -334 -599 -794 -986 -864 -583 -172 -173 -342 -630
3041 -630 -526 -181 248 425 210 -19 -62 311 651 805 799 411 348 531 839 1032 991 664 384 473 749 954
3063 954 775 504 252 289 267 415 581 256 -214 -467 -214 123 -9 -425 -567 -678 -704 -610 -402 -438 -759 -1047
3085 -1047 -1019 -696 -451 -538 -720 -842 -780 -624 -374 -201 -229 -337 -439 -258 57 366 242 118 80 326 511
3106 511 622 663 535 453 470 694 860 840 726 622 542 666 792 815 565 312 323 356 328 294 271 107 -215 -308
3130 -308 -152 -49 -310 -598 -635 -568 -533 -547 -620 -663 -736 -812 -726 -644 -648 -634 -738 -795 -538 -372 -371 -458 -298 -99 -90 -182 -4
3157 -4 117 186 241 300 568 505 357 431 718 763 646 598 755 777 635 698 819 659 500 443 440 600 476 240 108
3182 108 71 146 107 41 -114 -386 -542 -574 -381 -326 -454 -645 -824 -771 -631 -562 -441 -714 -950 -880 -606 -280 -333
3205 -333 -548 -554 -578 -495 -107 244 87 -257 -277 90 458 568 470 397 273 263 590 1132 1058 531 282 496 781
3228 781 986 912 723 370 188 441 714 836 399 -64 -261 -17 297 380 48 -455 -630 -614 -383 -169 -167 -576
3250 -576 -1095 -1112 -602 -150 -360 -755 -991 -991 -813 -347 -51 -262 -779 -1058 -535 104 218 129 -162 -395 -347 185
3272 185 918 834 290 -89 201 605 941 1065 901 274 101 486 1087 1212 739 285 159 250 528 890 846
3293 846 166 -589 -341 303 535 198 -207 -703 -787 -572 16 189 -514 -1023 -1182 -792 -425 -137 -331 -887
3313 -887 -1311 -944 -282 73 -192 -647 -908 -792 -371 349 530 0 -590 -484 226 762 712 536 168 -122
3333 -122 142 844 1407 1044 276 22 372 956 1147 1050 540 -7 -78 393 990 901 300 -291 -400 -164 467
3354 467 619 73 -678 -1025 -580 -88 21 -161 -772 -1220 -1137 -547 62 -154 -893 -1271 -974 -551 -72 57
3374 57 -264 -845 -1103 -512 311 576 92 -426 -476 -76 430 916 821 202 -273 89 730 1171 999 585 186
3395 186 20 532 1144 1265 621 -28 -9 451 793 776 586 82 -486 -375 277 732 274 -518 -911 -637 -220
3416 -220 28 -3 -520 -1152 -1266 -625 -19 -105 -549 -1141 -1247 -821 -186 152 -260 -759 -956 -614 -15 422 413
3437 413 -141 -688 -403 388 953 745 217 -20 67 395 904 1245 837 110 -192 503 1101 1158 709 266 -58
3458 -58 27 634 1002 733 -9 -399 -257 177 537 320 -97 -741 -854 -357 90 99 -449 -946 -1000 -781 -300 -80
3480 -80 -336 -849 -1107 -884 -300 -8 -81 -659 -889 -654 -98 281 197 -82 -337 -439 1 695 842 374 -116
3501 -116 -36 490 867 869 849 470 41 118 863 1304 910 273 56 148 445 754 740 352 -297 -346 58 320 233
3524 233 -28 -372 -823 -622 -122 57 -330 -837 -845 -620 -566 -405 -236 -570 -1048 -948 -299 -4 -446 -617 -436
3545 -436 -446 -501 -6 342 21 -512 -329 396 458 314 356 463 62 33 678 1134 747 157 336 640 593 523
3567 523 856 780 205 -49 410 802 454 43 109 93 -186 -95 230 158 -384 -567 -349 -258 -368 -416 -410 -594 -789
3590 -789 -626 -415 -472 -701 -684 -578 -584 -526 -340 -343 -461 -498 -196 -42 -178 -132 47 41 26 187 445 368 184 259 530
3615 530 495 458 452 582 552 566 631 590 489 408 486 530 516 355 263 217 181 229 183 54 -184 -304 -160 -26 -186 -349
3641 -349 -457 -553 -482 -471 -380 -479 -682 -786 -690 -411 -343 -463 -616 -562 -550 -345 -67 22 -209 -419 -282 59 297
3664 297 304 202 99 8 168 544 738 606 403 225 374 627 793 828 487 123 224 583 781 683 371 60
3686 60 2 27 387 551 248 -391 -528 -314 -39 -1 -97 -431 -863 -804 -408 -72 -181 -636 -962 -934 -606 -167
3708 -167 13 -463 -876 -882 -511 13 136 81 -380 -669 -385 345 728 501 -27 -151 40 389 733 979 585
3729 585 -37 -118 441 1060 1064 595 83 23 249 787 909 670 48 -343 -119 356 624 442 -149 -658 -653 -210
3751 -210 318 251 -352 -950 -924 -592 -144 42 -393 -848 -1110 -818 -242 206 -83 -810 -1045 -720 -39 318 238
3772 238 -205 -629 -667 -62 702 862 210 -380 -345 276 896 996 734 151 -173 42 820 1279 1030 227 -305
3793 -305 15 648 1055 853 225 -297 -344 56 666 772 101 -678 -861 -360 284 415 -147 -741 -1104 -847
3813 -847 -120 223 -52 -754 -1232 -960 -316 113 134 -502 -1044 -1045 -339 366 379 -152 -586 -714 -230 471 909
3834 909 503 -184 -447 -5 761 1162 844 291 -123 93 660 1169 1049 417 -140 -139 375 1007 1064 515 -300
3855 -300 -419 66 571 616 273 -363 -746 -657 -10 508 157 -715 -1229 -850 -158 84 -70 -498 -992 -1137 -652
3876 -652 114 297 -395 -1050 -1013 -328 165 298 70 -365 -696 -415 306 859 508 -96 -374 -119 516 990
3896 990 966 368 -108 4 557 1031 930 516 50 -76 200 766 1049 572 -194 -452 -7 373 549 319
3916 319 -206 -639 -630 -68 378 169 -404 -919 -903 -544 -15 31 -455 -957 -1078 -613 -61 1 -226 -622 -930 -693
3938 -693 4 431 194 -413 -643 -293 186 367 527 323 -167 -274 318 958 919 377 36 124 438 721 938
3959 938 776 194 -52 151 762 776 551 130 -171 -214 130 555 450 -149 -556 -429 -132 9 48 -121 -671
3980 -671 -860 -601 -113 -28 -424 -701 -711 -664 -418 -170 -55 -544 -935 -683 -131 75 -2 -234 -363 -290 -131 263
4002 263 423 266 -106 -92 240 558 677 603 321 80 238 592 780 574 371 251 251 357 603 608 329 -86
4024 -86 -101 166 339 243 37 -194 -283 -363 -100 -5 -186 -429 -501 -469 -390 -318 -292 -443 -719 -644 -332 -260 -360 -475
4048 -475 -439 -448 -410 -211 -11 -69 -334 -243 53 217 63 103 278 188 163 262 539 611 324 228 481 580 456 377 439
4073 439 466 353 322 445 442 304 155 202 198 147 47 -55 15 -20 -123 -253 -301 -252 -325 -426 -353 -311 -457 -573 -529
4098 -529 -328 -295 -465 -565 -481 -420 -408 -228 -87 -263 -449 -236 43 127 6 99 124 -153 -89 451 659 376 25
4121 25 211 442 445 548 690 488 101 64 552 888 561 265 169 140 238 443 578 180 -263 -330 -40 81 103
4144 103 25 -320 -755 -577 -7 155 -350 -695 -573 -593 -539 -206 76 -296 -1049 -902 -90 221 -193 -382 -248
4165 -248 -533 -462 206 718 183 -488 -430 104 411 526 671 354 -227 -170 697 1119 755 252 111 125 200 667
4187 667 1110 635 -326 -394 223 619 529 381 -69 -458 -576 155 678 286 -537 -831 -572 -289 104 221 -321
4208 -321 -1093 -1028 -307 138 -77 -382 -612 -924 -772 35 546 64 -817 -918 -208 318 427 365 53 -476 -506
4229 -506 247 1019 929 192 -279 -167 366 921 1061 741 5 -276 78 747 1105 766 89 -375 -261 464
4249 464 827 620 41 -553 -579 -79 487 451 -136 -720 -856 -491 -3 369 -37 -854 -1132 -691 25 233 -119
4270 -119 -643 -1000 -967 -290 497 377 -439 -944 -675 26 418 503 179 -394 -677 -42 928 994 397 -136 -278
4291 -278 25 661 1230 991 50 -410 -51 692 967 833 381 -204 -526 6 969 964 81 -644 -541 -192 126
4312 126 481 237 -515 -1119 -711 131 323 -31 -568 -927 -1004 -432 258 199 -474 -1032 -859 -289 105 247 132
4333 132 -548 -1065 -422 501 719 186 -325 -430 -153 220 850 1052 270 -503 -301 612 1069 931 470 -24
4353 -24 -323 46 925 1188 615 -208 -415 -34 466 814 575 -199 -766 -506 189 563 309 -288 -708 -867
4373 -867 -403 313 326 -349 -1020 -1023 -478 -32 131 -33 -732 -1104 -711 81 385 57 -437 -712 -515 -17 600
4394 600 714 -1 -602 -374 308 710 688 435 16 -318 -8 831 1174 592 -1 -205 208 587 842 804 290
4415 290 -267 -400 216 827 647 58 -458 -549 -170 274 336 33 -601 -845 -635 -55 235 62 -559 -1117 -772
4436 -772 -183 152 5 -421 -742 -827 -398 231 423 -68 -617 -677 -150 368 479 303 -36 -381 -166 431 774
4457 774 605 142 -79 6 484 793 848 508 -27 -61 377 683 644 313 51 -142 67 294 556 308 -209
4478 -209 -455 -318 64 197 44 -358 -552 -542 -384 -158 12 -253 -694 -817 -505 -36 -1 -229 -437 -464 -483
4499 -483 -231 19 82 -113 -529 -380 -6 317 318 126 6 18 106 339 587 518 317 94 212 444 665 637
4521 637 303 72 234 454 464 397 335 222 -25 -34 273 379 107 -197 -121 -103 -117 -157 -30 -107 -471 -546 -326 -163
4545 -163 -167 -283 -442 -495 -574 -401 -162 -179 -391 -458 -300 -344 -260 54 127 -114 -331 -142 177 295 146 148 215 105
4569 105 93 326 681 504 140 63 315 539 536 495 357 193 50 269 473 486 260 -50 -156 -30 164 296
4591 296 173 -208 -372 -318 -99 -29 -47 -230 -577 -676 -430 -92 -52 -342 -655 -643 -407 -274 -32 -95 -388 -571
4613 -571 -531 -16 280 137 -176 -301 -172 133 387 431 293 -1 -150 128 523 665 584 88 -84 156 533
4634 533 766 537 244 23 1 214 559 614 252 -232 -314 17 402 382 78 -304 -475 -500 -60 170 -10 -460
4656 -460 -760 -635 -282 37 61 -346 -729 -815 -380 38 146 -169 -518 -652 -428 143 423 306 -222 -463 -332
4677 -332 270 665 498 114 -208 -208 249 782 876 491 -151 -270 173 776 876 463 20 -109 -27 300 685
4698 685 738 107 -539 -500 238 579 268 -173 -516 -665 -376 43 382 10 -747 -957 -461 24 119 -128 -517
4719 -517 -882 -792 -171 398 238 -387 -855 -626 -170 360 618 129 -590 -623 5 636 686 395 -94 -342 -184
4740 -184 555 1047 806 -28 -343 -34 496 890 871 346 -281 -453 306 899 814 154 -345 -487 -352 358 837
4761 837 343 -671 -1052 -365 212 298 -13 -281 -789 -1096 -453 547 508 -546 -1172 -732 -169 99 150 137
4781 137 -575 -1105 -562 421 859 143 -527 -570 -293 251 840 827 48 -607 -323 531 981 840 319 -225 -384
4802 -384 115 979 1145 475 -431 -478 53 638 873 625 -131 -766 -580 334 874 392 -406 -883 -636 -165
4822 -165 380 435 -138 -997 -1106 -352 314 404 -133 -760 -1052 -672 81 579 200 -631 -988 -536 129 554 453
4843 453 -8 -665 -743 162 984 894 -20 -531 -276 237 625 927 775 -77 -626 -117 915 1159 593 -103
4863 -103 -428 -251 243 875 788 -8 -689 -628 124 652 527 107 -618 -976 -447 375 596 -35 -667 -843 -630
4884 -630 -202 310 328 -519 -1171 -854 -4 335 133 -250 -512 -665 -461 393 657 163 -564 -565 -26 440 682
4905 682 506 15 -442 -154 590 906 634 181 -162 -206 161 808 1028 346 -488 -487 192 661 609 312 -64
4926 -64 -595 -541 240 701 350 -380 -703 -509 -130 201 308 -169 -848 -980 -339 202 177 -192 -563 -796 -591
4947 -591 -15 363 42 -523 -683 -333 -14 305 272 84 -390 -511 91 708 565 95 -154 -41 187 465
4967 465 620 533 137 -191 21 439 712 561 163 -153 -155 286 542 447 61 -180 -330 -105 206 350 104
4988 104 -401 -630 -346 48 83 -169 -409 -559 -628 -413 58 85 -422 -670 -514 -174 -50 30 -99 -368 -436 -191
5010 -191 136 225 124 -102 -178 -140 127 418 404 129 -73 173 404 413 421 403 316 106 225 376 404 320 181 112
5034 112 114 112 257 258 25 -8 13 -27 -188 -72 119 -81 -442 -371 -59 -107 -367 -295 -61 -250 -567 -470 -21 -36 -445
5059 -445 -469 -166 -139 -294 -161 118 -47 -380 -277 192 299 39 22 35 27 51 297 483 367 97 83 120 347
5082 347 514 471 262 -14 39 261 421 411 234 9 -88 2 283 374 141 -186 -337 -270 -31 233 146 -316 -626
5105 -626 -545 -208 65 -50 -193 -497 -772 -447 168 281 -176 -655 -582 -266 -19 223 223 -203 -599 -479 215
5126 215 612 424 -53 -281 -257 179 666 711 311 -126 -183 154 625 869 576 -21 -348 44 634 705 394
5147 394 -8 -260 -324 79 617 631 -56 -731 -492 -73 342 356 -66 -526 -798 -518 110 399 -61 -643 -869
5168 -869 -581 -136 329 240 -418 -910 -680 -57 406 309 -67 -464 -711 -267 461 833 323 -389 -536 -65 596
5189 596 745 599 -12 -377 -226 493 959 744 200 -391 -385 222 868 863 215 -492 -518 -65 453 672 256 -441
5211 -441 -788 -546 297 659 235 -554 -878 -684 -163 374 343 -283 -905 -1008 -301 397 497 -135 -812 -937
5231 -937 -354 303 574 194 -354 -686 -425 231 828 649 -101 -601 -483 307 844 891 222 -253 -439 102
5251 102 769 1057 587 -181 -573 -146 696 1000 593 -202 -582 -388 274 727 590 -54 -792 -723 -127 532
5271 532 464 -74 -749 -936 -492 176 451 95 -592 -1097 -750 23 559 341 -529 -1009 -754 2 498 458 -29
5292 -29 -664 -662 -177 600 833 323 -393 -589 -150 617 1064 686 -141 -486 -162 508 928 813 251 -342 -472
5313 -472 204 951 945 146 -537 -565 -65 529 660 398 -350 -839 -599 231 649 297 -507 -872 -667 -86 377
5334 377 292 -214 -853 -938 -320 318 557 -59 -700 -909 -416 450 593 138 -435 -665 -395 142 669 704 42
5355 42 -617 -463 315 815 698 202 -151 -180 -12 651 946 516 -204 -503 19 584 790 515 -15 -490 -435
5376 -435 208 687 506 -257 -623 -449 -139 215 418 99 -627 -909 -431 363 309 -208 -533 -622 -547 -217 311
5397 311 362 -299 -871 -585 35 434 251 -79 -300 -368 -65 396 590 268 -178 -278 0 480 682 514 51
5418 51 -218 56 432 611 444 259 -37 -179 34 559 587 138 -290 -166 103 164 289 204 -81 -434 -435 29
5440 29 369 -60 -341 -482 -366 -269 -75 86 -193 -584 -503 -222 8 -62 -118 -225 -341 -358 -4 300 53 -236
5462 -236 -259 10 165 67 213 361 78 -183 63 489 478 112 86 167 169 165 392 356 242 26 40 260 240 203
5486 203 160 75 -43 -45 -1 89 17 -70 -139 -187 -219 -88 -6 -177 -359 -325 -123 -198 -298 -188 -102 -197 -481 -293 -12
5511 -12 7 -178 -282 -160 -60 -49 30 110 35 -116 -25 57 304 240 234 170 107 74 377 404 259 191 111 183 140 335
5537 335 371 314 -4 -81 173 262 162 165 91 -112 -321 -57 238 90 -249 -384 -280 -100 -84 -162 -121 -250 -434
5560 -434 -382 -100 -21 -108 -367 -356 -367 -92 78 69 -204 -314 -140 -6 49 134 99 -123 -182 -2 391 353 244 -8
5584 -8 -76 142 322 448 386 177 6 62 264 432 448 128 -155 -237 112 433 304 68 -88 -169 -236 -14 339
5607 339 174 -344 -631 -299 27 57 -98 -181 -320 -611 -391 135 94 -202 -444 -494 -211 -24 236 0 -302
5628 -302 -435 -155 204 294 196 -22 -192 -177 118 574 509 -32 -161 -12 242 352 527 411 -2 -193 123
5649 123 566 564 168 -70 -113 -110 209 515 425 -167 -442 -280 25 209 148 -18 -400 -630 -301 268 311 -238 -576
5672 -576 -439 -269 -129 183 190 -293 -779 -528 107 393 139 -247 -473 -415 35 475 486 92 -278 -301 -6 361
5694 361 618 397 -216 -317 138 560 630 378 86 -152 -62 232 725 593 -54 -396 -190 271 379 349 51
5715 51 -334 -508 -119 364 420 -47 -461 -593 -369 106 335 21 -530 -689 -372 -49 226 182 -218 -636 -666
5736 -666 -130 427 353 -181 -532 -479 -233 238 632 213 -344 -426 -91 322 597 470 73 -370 -327 297 858
5757 858 619 20 -186 -69 111 455 697 415 -309 -616 29 609 546 25 -269 -416 -312 58 427 335 -327
5778 -327 -772 -479 9 357 209 -267 -711 -692 -185 277 116 -187 -493 -577 -356 137 449 153 -407 -602 -213
5799 -213 292 469 231 -74 -319 -332 162 628 583 127 -122 -244 98 455 705 431 -103 -281 39 378 610
5820 610 396 23 -331 -245 205 572 330 -152 -398 -259 -44 263 287 -5 -471 -640 -299 126 253 4 -458
5841 -458 -689 -381 17 210 39 -336 -447 -421 -133 242 272 -59 -442 -421 -8 343 369 106 -196 -298 -95
5862 -95 303 471 333 -12 -124 41 336 564 499 112 -117 -54 236 417 442 210 -148 -164 -50 380 395 129
5884 129 -211 -336 -203 31 130 32 -92 -329 -435 -170 106 145 -176 -423 -387 -159 18 4 -130 -319 -320 -210
5906 -210 -59 162 53 -126 -324 -210 49 211 218 5 -21 -42 76 292 346 194 -59 87 168 286 408 264
5928 264 148 -2 40 285 297 194 33 65 -80 34 198 231 39 -188 -139 -69 -6 -61 -143 -116 -271 -316 -174 -74
5952 -74 -161 -217 -339 -275 -156 -131 -146 -194 -229 -104 -123 -154 -35 82 -24 -112 -141 85 130 16 54 148 170 77 136 255
5978 255 280 103 106 150 227 150 163 232 255 112 -14 102 229 163 -24 51 45 -25 48 45 114 -85 -218 -105 -134 -76 -65
6005 -65 -24 -265 -353 -211 -81 -51 -274 -245 -246 -259 -227 -79 24 -85 -321 -291 -57 56 76 2 -104 -140 -26 178
6029 178 309 193 -18 -60 12 215 358 351 129 -65 54 236 318 237 139 128 -62 -64 322 435 125 -249 -176 26
6053 26 99 48 -10 -26 -226 -315 -131 245 36 -272 -347 -275 -137 -94 50 -59 -364 -487 -268 131 134 -130 -251 -315
6077 -315 -192 -7 262 175 -133 -280 -155 230 388 235 105 -41 -176 90 421 482 155 -85 -81 157 330
6098 330 436 322 4 -206 -77 234 350 263 -33 -219 -204 79 282 205 -97 -335 -365 -155 21 165 20
6119 20 -365 -533 -264 33 170 -108 -283 -464 -307 -72 143 133 -114 -428 -342 -3 250 254 14 -193 -201 -90
6141 -90 243 457 203 -42 -192 26 376 475 352 80 -131 -5 211 481 446 116 -112 -153 52 298 418
6162 418 105 -257 -259 -5 284 225 47 -273 -391 -233 -30 175 47 -176 -498 -463 -116 153 104 -226 -386 -361
6184 -361 -207 63 163 -12 -318 -457 -195 123 295 180 -90 -268 -215 121 436 383 31 -105 -139 138 449
6205 449 444 232 -63 -131 81 405 468 240 17 -141 -15 79 411 323 -14 -270 -281 106 294 128 -155 -310
6227 -310 -405 -201 -8 163 7 -337 -555 -329 34 197 33 -274 -468 -340 -14 159 73 -190 -324 -318 -127
6248 -127 224 371 95 -189 -222 -41 298 356 229 117 -153 -92 294 542 393 -39 -95 -6 213 357 345 195
6270 195 13 -200 -3 292 310 43 -109 -238 -114 35 222 196 -173 -333 -304 -42 18 -37 -95 -313 -499 -240
6292 -240 83 174 -139 -387 -380 -214 6 96 81 -162 -288 -199 56 201 184 -79 -158 -143 71 351 314 179 -45
6315 -45 -106 110 412 465 333 -29 -104 34 281 380 264 114 -91 -71 18 185 227 109 -169 -214 -135 182 145 -47
6339 -47 -190 -267 -201 -119 22 73 -123 -399 -336 -126 7 -69 -185 -283 -235 -235 -39 122 -77 -200 -229 -6 92 121 83
6364 83 118 -84 -61 149 263 177 58 17 80 129 261 355 226 26 -26 112 267 253 141 125 -22 -94 34 119
6388 119 136 39 -141 -181 -49 88 101 23 -210 -169 -186 -109 -95 -98 -100 -221 -299 -192 -43 -56 -143 -214 -109 -167 -65 71
6414 71 -49 -91 -198 -73 55 99 37 69 45 25 59 196 223 163 102 57 115 204 222 191 167 81 95 229 154 164 78
6441 78 27 27 -13 33 155 50 -100 -162 -82 25 72 -102 -165 -224 -234 -122 -163 -30 -134 -244 -324 -122 -38 -78 -129 -149
6467 -149 -223 -184 -112 -1 -37 -114 -122 -45 41 101 87 44 26 -51 103 167 255 179 35 45 125 219 256 200 104 91 65 186
6495 186 126 127 89 54 -48 -47 91 74 16 -96 -173 -104 -20 -28 -19 -204 -257 -233 -117 -43 -32 -121 -259 -279 -119 -31 -117 -142
6523 -142 -134 -239 -157 20 57 62 -83 -110 -76 36 137 99 69 -3 33 48 214 264 175 21 -73 149 266 266 154 103
6549 103 60 88 192 187 181 -17 -55 -127 -10 157 55 -60 -140 -205 -54 -22 -60 -56 -137 -312 -200 -110 -54 -53 -187 -293
6575 -293 -242 -31 17 -75 -135 -288 -217 -39 137 68 -34 -141 -144 -61 149 305 111 -4 -29 95 140 161 271 132
6599 132 -15 -83 170 423 330 40 -78 35 60 167 248 179 -21 -244 -83 206 197 55 -180 -191 -151 -22 115
6622 115 -2 -198 -372 -277 -94 28 -12 -124 -337 -346 -167 49 88 -116 -256 -253 -149 53 247 145 -137 -280
6644 -280 -122 92 269 228 115 -113 -120 107 298 350 109 -87 -107 24 309 412 300 15 -192 -39 341 402
6666 402 177 15 -128 -144 -26 208 258 -6 -282 -329 -130 166 120 -51 -306 -381 -274 63 129 10 -310 -411
6688 -411 -306 -36 154 102 -232 -374 -271 -8 208 202 25 -181 -298 -31 256 377 176 -142 -175 21 268
6709 268 343 266 69 -148 -21 240 483 322 93 -146 -114 114 344 339 76 -181 -243 -71 177 251 138 -193
6731 -193 -378 -234 11 254 101 -151 -468 -362 -77 171 77 -143 -348 -447 -151 104 121 -40 -233 -350 -163
6752 -163 121 199 140 -59 -247 -192 130 360 215 -27 -199 -86 171 365 322 147 -33 -121 30 332 397 318
6774 318 6 -151 -37 188 371 177 -45 -278 -121 45 175 211 -22 -232 -297 -104 94 156 21 -376 -331
6795 -331 -215 -68 61 -34 -193 -385 -243 -78 130 36 -116 -275 -223 -30 117 208 37 -195 -230 -27 190 285
6817 285 170 -33 -78 28 224 285 207 109 -34 -32 146 267 257 179 -51 -80 64 295 286 120 -78 -117 -75 18 110
6842 110 136 -123 -253 -198 -44 71 33 -80 -175 -285 -141 -19 37 -119 -272 -277 -122 -16 -5 7 -124 -202 -172 35
6866 35 83 62 -62 -137 -22 24 133 254 119 -16 -18 75 276 220 171 72 104 -35 116 248 267 60 -56 6 160
6891 160 101 68 29 -13 -71 -62 47 53 -48 -164 -85 -170 -104 -79 -41 -100 -213 -138 -97 -42 -63 -139 -180 -155 -109 -5 -73 -62
6919 -62 -91 -124 -41 -4 10 33 10 -5 -37 52 109 116 62 107 59 144 80 147 136 173 135 139 30 126 213 221 84 42 69 43 76
6950 76 34 75 -24 -26 -83 -6 42 -46 -202 -119 -81 -67 -59 -86 -140 -228 -259 -147 -21 22 -136 -168 -140 -89 -74 -13 5 -60 -158
6979 -158 -85 15 109 126 72 9 -93 96 119 224 89 64 22 53 117 204 216 114 -16 -14 153 209 112 84 -5 -121
7005 -121 25 94 120 51 -108 -83 -155 0 110 -33 -103 -265 -167 18 14 -52 -228 -259 -245 -130 9 22 -116 -290
7029 -290 -234 -75 50 95 1 -102 -173 -80 97 223 62 -13 -177 -24 217 359 165 -58 -73 30 131 206 282
7052 282 101 -91 -84 100 271 273 106 -145 -165 -88 109 184 78 -64 -203 -132 39 85 54 -121 -305 -337 -80 61
7076 61 69 -129 -296 -286 -189 -25 90 -97 -232 -294 -168 97 174 20 -74 -114 -132 54 257 152 -1 -110 -51 107
7100 107 227 271 140 -117 -92 119 237 248 142 -12 -40 -28 176 255 152 -79 -158 -104 107 205 131 -69 -201
7123 -201 -201 -53 97 16 -69 -225 -259 -210 -22 75 -20 -199 -324 -205 -26 87 34 -130 -328 -282 33 89 126 -9
7147 -9 -191 -150 -56 167 248 134 -56 -130 21 240 334 203 59 -110 59 224 276 233 42 -88 -38 95 255
7170 255 241 81 -118 -96 -12 126 215 30 -142 -269 -106 21 156 38 -166 -339 -262 -112 44 22 -78 -306
7192 -306 -297 -92 90 144 -39 -225 -224 -117 54 168 28 -146 -184 -110 176 187 109 33 -57 -34 170 293 310 98
7216 98 -157 -57 108 283 285 193 -8 -95 -16 148 313 216 -60 -144 -86 33 169 77 -55 -181 -176 -154 145 90 -46
7241 -46 -247 -256 -148 51 -13 -75 -226 -241 -180 -118 28 35 -101 -291 -226 -18 105 98 -40 -108 -71 47 120 254 136
7266 136 -21 -36 58 189 164 152 47 22 -10 161 298 206 16 -29 21 143 168 186 86 -52 -68 -32 122 78 -16
7291 -16 -91 -79 -153 -20 64 -37 -159 -171 -180 -74 22 -68 -185 -166 -97 -90 6 -21 -31 -125 -143 -75 64 111 -24 -26 -97 -7
7319 -7 81 103 52 43 65 18 168 183 154 154 76 24 134 88 135 70 107 31 111 46 112 107 41 -47 7 -18 12 -35 -16 -69 -98
7350 -98 -73 13 -49 -91 -48 -119 -145 -95 -112 -120 -102 -41 -133 -131 -54 -132 24 10 -64 -76 8 -42 11 -38 16 50 28 24 96 141 102
7381 102 61 -8 71 127 164 86 158 97 55 123 76 114 49 30 22 72 76 -6 58 -2 -100 -40 38 -52 8 -77 -145 -67 -79 -67 -59
7412 -59 -137 -105 -174 -89 -68 -118 -142 -82 -161 -165 -34 29 31 -162 -75 -58 71 25 50 88 41 -62 21 131 144 83 21 73 107
7441 107 176 137 122 38 44 101 143 143 130 69 -14 23 2 103 29 -19 -98 21 31 27 29 7 -159 -187 -62 -29 56 -118 -193
7470 -193 -187 -51 -53 -59 -12 -221 -146 -124 -82 -9 -3 -59 -111 -75 -12 105 82 -31 -51 27 29 36 119 105 35 -38 72 182 222 111
7500 111 4 -3 73 126 142 181 64 -48 -25 43 117 112 -19 -94 -92 10 56 123 -3 -119 -153 -125 15 50 -51 -214
7526 -214 -226 -166 -41 28 -12 -163 -212 -181 -138 41 89 -68 -151 -200 24 113 152 20 -92 -128 -3 211 251 236 0
7551 0 -96 -41 151 229 242 100 -127 -110 128 264 208 35 -77 -96 -20 158 230 102 -110 -199 -169 83 177 38 -115
7576 -115 -285 -221 -116 94 70 -127 -287 -277 -85 86 90 -80 -190 -186 -105 12 100 101 -165 -235 -177 89 307 94
7600 94 -35 -166 -37 85 244 234 57 -89 -113 8 259 326 154 -65 -124 18 196 316 176 -47 -197 -93
7622 -93 98 314 215 9 -180 -195 -15 169 140 27 -225 -267 -124 146 142 -13 -221 -412 -171 19 132 24
7644 24 -146 -252 -240 0 90 124 -49 -196 -166 -23 170 258 46 -135 -174 23 168 219 133 28 -85 -103 206
7667 206 338 272 -8 -125 -23 66 314 200 77 -96 -174 10 159 223 41 -173 -258 -151 121 79 69 -134
7689 -134 -243 -252 -130 125 40 -71 -276 -315 -109 124 128 -55 -219 -158 -94 -20 133 101 -51 -197 -82 99 193 185
7713 185 19 -171 -90 104 233 195 77 -51 1 55 255 212 180 -6 -81 44 154 198 161 21 -206 -117 62
7736 62 191 146 -2 -134 -168 -9 69 26 -134 -203 -184 -160 -7 35 -26 -122 -312 -243 22 43 -20 -143 -152 -123 -75 -9
7762 -9 72 -40 -31 -161 -12 75 96 123 -64 -81 26 151 156 68 107 39 -13 52 161 189 80 -112 0 119 89 134
7788 134 131 36 -38 -26 116 124 45 -66 -115 -27 -34 39 -30 -25 -129 -148 -111 -72 -68 -48 -133 -229 -178 -34 71 -73 -152 -137 -122
7817 -122 -20 60 -51 16 -121 -48 -12 59 13 69 65 -6 105 131 59 57 53 51 132 77 131 71 145 31 34 104 152 27 10
7846 10 104 45 -13 34 40 113 -27 -45 -56 -88 19 -14 -115 -17 -38 -69 -100 -185 -31 -67 -133 -138 -76 -25 -125 -59 -61 -64 -34 -35
7876 -35 -10 62 -13 0 50 65 61 -5 10 55 78 78 104 68 162 86 110 65 119 128 93 101 42 62 35 135 99 70 -16 -36 -17 32
7908 32 24 9 -14 -48 -115 15 -25 -31 -96 -108 -157 -110 -14 40 -26 -157 -195 -51 -7 -2 -65 -19 -82 -84 36 88 53 -51 -145 -67
7938 -67 66 122 98 30 -4 -27 128 161 123 158 13 -17 40 154 150 72 35 -24 47 103 89 126 -9 -88 -85 78 129 10
7966 10 -97 -95 -79 -72 -15 -29 -49 -202 -255 -102 -41 24 -81 -157 -208 -182 8 72 18 -128 -154 -72 31 60 38 51 -42 -123
7994 -123 -1 125 178 48 -71 -55 63 134 228 193 6 -29 13 154 260 177 91 -16 -46 35 169 133 6 -106
8018 -106 -79 26 121 92 20 -104 -80 -38 -22 16 -45 -182 -179 -214 -42 11 0 -102 -193 -178 -60 88 89 -103 -141 -169 -52
8045 -52 1 70 63 -8 -142 -65 130 174 206 37 -1 -43 74 165 184 28 13 -50 100 178 226 99 -95 -62 107 183
8071 183 113 49 -53 -89 -108 -41 121 38 -83 -241 -132 39 68 -15 -76 -133 -167 -125 -33 -5 -42 -207 -211 -110 14 65
8097 65 33 -80 -143 -126 -1 174 93 -53 -70 -86 -19 137 170 121 -33 -94 2 169 126 101 12 -65 30 72 160 198 63
8124 63 -86 -93 22 145 142 29 -39 -138 -98 127 -3 -20 -117 -209 -97 19 91 -38 -196 -142 -72 -106 -20 -17 -51 -186
8150 -186 -238 -75 88 39 -48 -156 -67 -82 16 90 111 38 -112 -61 73 145 111 -25 -45 18 20 149 136 54 30 -32 10
8177 10 89 198 102 -22 -71 -7 51 173 29 -33 -45 -90 -15 20
8191B0
##END NTUPLES=NMR FID
##END=
